@startuml

title __NFA035-EXAM's Class Diagram__\n

  namespace fr.cnam.foad.nfa035.exam {
    class fr.cnam.foad.nfa035.exam.Nfa035ExamConfiguration {
    }
  }
  

  namespace fr.cnam.foad.nfa035.exam {
    namespace model {
      class fr.cnam.foad.nfa035.exam.model.MyWhiteExam {
      }
    }
  }
  

  namespace fr.cnam.foad.nfa035.exam {
    namespace pattern {
      class fr.cnam.foad.nfa035.exam.pattern.MyExamDelegate {
      }
    }
  }
  

  namespace fr.cnam.foad.nfa035.exam {
    namespace pattern {
      interface fr.cnam.foad.nfa035.exam.pattern.MyExamDelegateContract {
      }
    }
  }
  

  namespace fr.cnam.foad.nfa035.exam {
    namespace pattern {
      class fr.cnam.foad.nfa035.exam.pattern.MyExamFactory {
      }
    }
  }
  

  fr.cnam.foad.nfa035.exam.pattern.MyExamDelegate .up.|> fr.cnam.foad.nfa035.exam.pattern.MyExamDelegateContract
  fr.cnam.foad.nfa035.exam.pattern.MyExamDelegate o-- fr.cnam.foad.nfa035.exam.model.MyWhiteExam : exam


right footer


PlantUML diagram generated by SketchIt! (https://bitbucket.org/pmesmeur/sketch.it)
For more information about this tool, please contact philippe.mesmeur@gmail.com
endfooter

@enduml
