@startuml

title __BADGES-GUI's Class Diagram__\n

  namespace fr.cnam.foad.nfa035.badges.gui {
    class fr.cnam.foad.nfa035.badges.gui.BadgeWalletApp {
    }
  }
  

  namespace fr.cnam.foad.nfa035.badges.gui {
    namespace components {
      class fr.cnam.foad.nfa035.badges.gui.components.BadgePanel {
      }
    }
  }
  

  namespace fr.cnam.foad.nfa035.badges.gui {
    namespace components {
      class fr.cnam.foad.nfa035.badges.gui.components.BadgesPanelFactory {
      }
    }
  }
  

  namespace fr.cnam.foad.nfa035.badges.gui {
    namespace context {
      class fr.cnam.foad.nfa035.badges.gui.context.ApplicationContextProvider {
      }
    }
  }
  

  namespace fr.cnam.foad.nfa035.badges.gui {
    namespace controller {
      class fr.cnam.foad.nfa035.badges.gui.controller.AddBadgeDialogController {
      }
    }
  }
  

  namespace fr.cnam.foad.nfa035.badges.gui {
    namespace controller {
      class fr.cnam.foad.nfa035.badges.gui.controller.BadgeWalletController {
      }
    }
  }
  

  namespace fr.cnam.foad.nfa035.badges.gui {
    namespace controller {
      class fr.cnam.foad.nfa035.badges.gui.controller.WalletDAOFactory {
      }
    }
  }
  

  namespace fr.cnam.foad.nfa035.badges.gui {
    namespace controller {
      namespace renderer {
        class fr.cnam.foad.nfa035.badges.gui.controller.renderer.BadgeSizeCellRenderer {
        }
      }
    }
  }
  

  namespace fr.cnam.foad.nfa035.badges.gui {
    namespace controller {
      namespace renderer {
        class fr.cnam.foad.nfa035.badges.gui.controller.renderer.DefaultBadgeCellRenderer {
        }
      }
    }
  }
  

  namespace fr.cnam.foad.nfa035.badges.gui {
    namespace controller {
      namespace renderer {
        class fr.cnam.foad.nfa035.badges.gui.controller.WalletDAOFactory {
        }
      }
    }
  }
  

  namespace fr.cnam.foad.nfa035.badges.gui {
    namespace model {
      class fr.cnam.foad.nfa035.badges.gui.model.BadgesModel {
      }
    }
  }
  

  namespace fr.cnam.foad.nfa035.badges.gui {
    namespace model {
      class fr.cnam.foad.nfa035.badges.gui.model.TableModelCreator {
      }
    }
  }
  

  namespace fr.cnam.foad.nfa035.badges.gui {
    namespace view {
      class fr.cnam.foad.nfa035.badges.gui.view.AddBadgeDialog {
      }
    }
  }
  

  namespace fr.cnam.foad.nfa035.badges.gui {
    namespace view {
      class fr.cnam.foad.nfa035.badges.gui.view.BadgeWalletGUI {
      }
    }
  }
  

  namespace fr.cnam.foad.nfa035.badges.gui {
    namespace view {
      class fr.cnam.foad.nfa035.badges.gui.view.DisplayedBadgeHolder {
      }
    }
  }
  

  fr.cnam.foad.nfa035.badges.gui.components.BadgePanel -up-|> javax.swing.JPanel
  fr.cnam.foad.nfa035.badges.gui.components.BadgePanel o-- fr.cnam.foad.nfa035.badges.wallet.model.DigitalBadge : badge
  fr.cnam.foad.nfa035.badges.gui.components.BadgePanel o-- fr.cnam.foad.nfa035.badges.wallet.dao.DirectAccessBadgeWalletDAO : dao
  fr.cnam.foad.nfa035.badges.gui.components.BadgesPanelFactory o-- fr.cnam.foad.nfa035.badges.wallet.dao.DirectAccessBadgeWalletDAO : dao
  fr.cnam.foad.nfa035.badges.gui.components.BadgesPanelFactory o-- fr.cnam.foad.nfa035.badges.gui.view.DisplayedBadgeHolder : displayedBadgeHolder
  fr.cnam.foad.nfa035.badges.gui.context.ApplicationContextProvider .up.|> org.springframework.context.ApplicationContextAware
  fr.cnam.foad.nfa035.badges.gui.controller.AddBadgeDialogController o-- fr.cnam.foad.nfa035.badges.wallet.dao.DirectAccessBadgeWalletDAO : dao
  fr.cnam.foad.nfa035.badges.gui.controller.AddBadgeDialogController o-- fr.cnam.foad.nfa035.badges.gui.view.DisplayedBadgeHolder : displayedBadgeHolder
  fr.cnam.foad.nfa035.badges.gui.controller.BadgeWalletController o-- fr.cnam.foad.nfa035.badges.gui.components.BadgesPanelFactory : badgesPanelFactory
  fr.cnam.foad.nfa035.badges.gui.controller.BadgeWalletController o-- fr.cnam.foad.nfa035.badges.wallet.dao.DirectAccessBadgeWalletDAO : dao
  fr.cnam.foad.nfa035.badges.gui.controller.BadgeWalletController o-- fr.cnam.foad.nfa035.badges.gui.view.DisplayedBadgeHolder : displayedBadgeHolder
  fr.cnam.foad.nfa035.badges.gui.controller.WalletDAOFactory o-- fr.cnam.foad.nfa035.badges.wallet.dao.DirectAccessBadgeWalletDAO : directAccessDao
  fr.cnam.foad.nfa035.badges.gui.controller.WalletDAOFactory o-- fr.cnam.foad.nfa035.badges.wallet.dao.DirectAccessBadgeWalletDAO : jsonBadgeDao
  fr.cnam.foad.nfa035.badges.gui.controller.renderer.BadgeSizeCellRenderer -up-|> javax.swing.table.DefaultTableCellRenderer
  fr.cnam.foad.nfa035.badges.gui.controller.renderer.DefaultBadgeCellRenderer -up-|> javax.swing.table.DefaultTableCellRenderer
  fr.cnam.foad.nfa035.badges.gui.controller.WalletDAOFactory o-- fr.cnam.foad.nfa035.badges.wallet.dao.DirectAccessBadgeWalletDAO : directAccessDao
  fr.cnam.foad.nfa035.badges.gui.controller.WalletDAOFactory o-- fr.cnam.foad.nfa035.badges.wallet.dao.DirectAccessBadgeWalletDAO : jsonBadgeDao
  fr.cnam.foad.nfa035.badges.gui.model.BadgesModel -up-|> javax.swing.table.AbstractTableModel
  fr.cnam.foad.nfa035.badges.gui.view.AddBadgeDialog .up.|> java.beans.PropertyChangeListener
  fr.cnam.foad.nfa035.badges.gui.view.AddBadgeDialog -up-|> javax.swing.JDialog
  fr.cnam.foad.nfa035.badges.gui.view.AddBadgeDialog o-- fr.cnam.foad.nfa035.badges.gui.controller.AddBadgeDialogController : addBadgeController
  fr.cnam.foad.nfa035.badges.gui.view.AddBadgeDialog o-- fr.cnam.foad.nfa035.badges.gui.view.BadgeWalletGUI : badgeWallet
  fr.cnam.foad.nfa035.badges.gui.view.AddBadgeDialog o-- fr.cnam.foad.nfa035.badges.gui.view.DisplayedBadgeHolder : displayedBadgeHolder
  fr.cnam.foad.nfa035.badges.gui.view.BadgeWalletGUI o-- fr.cnam.foad.nfa035.badges.gui.view.AddBadgeDialog : addBadgeDialog
  fr.cnam.foad.nfa035.badges.gui.view.BadgeWalletGUI o-- fr.cnam.foad.nfa035.badges.gui.components.BadgePanel : badgePanel
  fr.cnam.foad.nfa035.badges.gui.view.BadgeWalletGUI o-- fr.cnam.foad.nfa035.badges.gui.controller.BadgeWalletController : badgesWalletController
  fr.cnam.foad.nfa035.badges.gui.view.BadgeWalletGUI o-- fr.cnam.foad.nfa035.badges.gui.model.BadgesModel : tableModel
  fr.cnam.foad.nfa035.badges.gui.view.DisplayedBadgeHolder o-- fr.cnam.foad.nfa035.badges.wallet.model.DigitalBadge : displayedBadge


right footer


PlantUML diagram generated by SketchIt! (https://bitbucket.org/pmesmeur/sketch.it)
For more information about this tool, please contact philippe.mesmeur@gmail.com
endfooter

@enduml
