@startuml

title __DAO's Class Diagram__\n

  namespace fr.cnam.foad.nfa035.badges.wallet.dao {
    namespace impl {
      class fr.cnam.foad.nfa035.badges.wallet.dao.impl.DirectAccessBadgeWalletDAOImpl {
          {static} - LOG : Logger
          - deserializer : ImageStreamingDeserializer<ResumableImageFrameMedia>
          - walletDatabase : File
          + DirectAccessBadgeWalletDAOImpl()
          + addBadge()
          + getBadge()
          + getBadgeFromMetadata()
          + getWalletMetadata()
      }
    }
  }

  namespace fr.cnam.foad.nfa035.badges.wallet.dao {
    interface fr.cnam.foad.nfa035.badges.wallet.dao.DirectAccessBadgeWalletDAO {
        {abstract} + getBadgeFromMetadata()
        {abstract} + getWalletMetadata()
    }
  }

  fr.cnam.foad.nfa035.badges.wallet.dao.impl.DirectAccessBadgeWalletDAOImpl .up.|> fr.cnam.foad.nfa035.badges.wallet.dao.DirectAccessBadgeWalletDAO


right footer


PlantUML diagram generated by SketchIt! (https://bitbucket.org/pmesmeur/sketch.it)
For more information about this tool, please contact philippe.mesmeur@gmail.com
endfooter

@enduml
