@startuml

title __IMPL's Class Diagram__\n

  namespace fr.cnam.foad.nfa035.badges.fileutils.streaming.media {
    namespace impl {
      class fr.cnam.foad.nfa035.badges.fileutils.streaming.media.impl.ImageByteArrayFrame {
          + ImageByteArrayFrame()
          + getEncodedImageInput()
          + getEncodedImageOutput()
      }
    }
  }
  

  namespace fr.cnam.foad.nfa035.badges.fileutils.streaming.media {
    namespace impl {
      class fr.cnam.foad.nfa035.badges.fileutils.streaming.media.impl.ImageFileFrame {
          + ImageFileFrame()
          + getEncodedImageInput()
          + getEncodedImageOutput()
      }
    }
  }
  

  namespace fr.cnam.foad.nfa035.badges.fileutils.streaming.media {
    namespace impl {
      class fr.cnam.foad.nfa035.badges.fileutils.streaming.media.impl.ResumableImageFileFrame {
          - fileOutputStream : FileOutputStream
          - reader : BufferedReader
          + ResumableImageFileFrame()
          + getEncodedImageInput()
          + getEncodedImageOutput()
          + getEncodedImageReader()
      }
    }
  }
  

  namespace fr.cnam.foad.nfa035.badges.fileutils.streaming.media {
    namespace impl {
      class fr.cnam.foad.nfa035.badges.fileutils.streaming.media.impl.WalletFrame {
          ~ numberOfLines : long
          {static} - LOG : Logger
          - fileOutputStream : FileOutputStream
          - reader : BufferedReader
          + WalletFrame()
          + getEncodedImageInput()
          + getEncodedImageOutput()
          + getEncodedImageReader()
          + getNumberOfLines()
          + incrementLines()
          # setNumberOfLines()
      }
    }
  }
  

  fr.cnam.foad.nfa035.badges.fileutils.streaming.media.impl.ImageByteArrayFrame -up-|> fr.cnam.foad.nfa035.badges.fileutils.streaming.media.AbstractImageFrameMedia
  fr.cnam.foad.nfa035.badges.fileutils.streaming.media.impl.ImageFileFrame -up-|> fr.cnam.foad.nfa035.badges.fileutils.streaming.media.AbstractImageFrameMedia
  fr.cnam.foad.nfa035.badges.fileutils.streaming.media.impl.ResumableImageFileFrame .up.|> fr.cnam.foad.nfa035.badges.fileutils.streaming.media.ResumableImageFrameMedia
  fr.cnam.foad.nfa035.badges.fileutils.streaming.media.impl.ResumableImageFileFrame -up-|> fr.cnam.foad.nfa035.badges.fileutils.streaming.media.AbstractImageFrameMedia
  fr.cnam.foad.nfa035.badges.fileutils.streaming.media.impl.WalletFrame .up.|> fr.cnam.foad.nfa035.badges.fileutils.streaming.media.WalletFrameMedia
  fr.cnam.foad.nfa035.badges.fileutils.streaming.media.impl.WalletFrame .up.|> java.lang.AutoCloseable
  fr.cnam.foad.nfa035.badges.fileutils.streaming.media.impl.WalletFrame -up-|> fr.cnam.foad.nfa035.badges.fileutils.streaming.media.AbstractImageFrameMedia


right footer


PlantUML diagram generated by SketchIt! (https://bitbucket.org/pmesmeur/sketch.it)
For more information about this tool, please contact philippe.mesmeur@gmail.com
endfooter

@enduml
