{
  "$schema": "https://developer.microsoft.com/json-schemas/spfx-build/package-solution.schema.json",
  "solution": {
    "name": "signature-generator-client-side-solution",
    "id": "4bb98bef-ea63-4ffe-b56f-bafcef169cea",
    "version": "1.0.3.0",
    "includeClientSideAssets": true,
    "skipFeatureDeployment": true,
    "isDomainIsolated": false,
    "developer": {
      "name": "",
      "websiteUrl": "",
      "privacyUrl": "",
      "termsOfUseUrl": "",
      "mpnId": "Undefined-1.15.2"
    },
    "metadata": {
      "shortDescription": {
        "default": "signature-generator description"
      },
      "longDescription": {
        "default": "signature-generator description"
      },
      "screenshotPaths": [],
      "videoUrl": "",
      "categories": []
    },
    "features": [
      {
        "title": "signature-generator Feature",
        "description": "The feature that activates elements of the signature-generator solution.",
        "id": "87cc5f63-d570-4185-accc-374e8e517348",
        "version": "1.0.3.0"
      }
    ],
    "webApiPermissionRequests": [
      {
        "resource": "Microsoft Graph",
        "scope": "User.Read"
      }
    ]
  },
  "paths": {
    "zippedPackage": "solution/signature-generator.sppkg"
  }
}
