[
  {
    "type": "console.alert-action",
    "properties": {
      "alert": "CephOSDDiskUnavailable",
      "text": "%ceph-storage-plugin~Troubleshoot%",
      "action": {
        "$codeRef": "alert.getDiskAlertActionPath"
      }
    }
  },
  {
    "type": "console.alert-action",
    "properties": {
      "alert": "CephOSDDiskNotResponding",
      "text": "%ceph-storage-plugin~Troubleshoot%",
      "action": {
        "$codeRef": "alert.getDiskAlertActionPath"
      }
    }
  },
  {
    "type": "console.alert-action",
    "properties": {
      "alert": "CephClusterNearFull",
      "text": "%ceph-storage-plugin~Add Capacity%",
      "action": {
        "$codeRef": "alert.launchClusterExpansionModal"
      }
    },
    "flags": {
      "required": ["OCS"]
    }
  },
  {
    "type": "console.alert-action",
    "properties": {
      "alert": "CephClusterCriticallyFull",
      "text": "%ceph-storage-plugin~Add Capacity%",
      "action": {
        "$codeRef": "alert.launchClusterExpansionModal"
      }
    },
    "flags": {
      "required": ["OCS"]
    }
  },
  {
    "type": "console.storage-provider",
    "properties": {
      "name": "ObjectBucketClaim",
      "Component": {
        "$codeRef": "storageProvider"
      }
    },
    "flags": {
      "required": ["OCS"]
    }
  },
  {
    "type": "console.navigation/resource-cluster",
    "properties": {
      "id": "objectbuckets",
      "section": "storage",
      "name": "%ceph-storage-plugin~Object Buckets%",
      "model": {
        "group": "objectbucket.io",
        "kind": "ObjectBucket",
        "version": "v1alpha1"
      }
    },
    "flags": {
      "required": ["MCG"]
    }
  },
  {
    "type": "console.navigation/resource-ns",
    "properties": {
      "id": "objectbucketclaims",
      "section": "storage",
      "name": "%ceph-storage-plugin~Object Bucket Claims%",
      "model": {
        "group": "objectbucket.io",
        "kind": "ObjectBucketClaim",
        "version": "v1alpha1"
      }
    },
    "flags": {
      "required": ["MCG"]
    }
  },
  {
    "type": "console.navigation/href",
    "properties": {
      "id": "ocsdashboards",
      "insertBefore": "persistentvolumes",
      "section": "storage",
      "name": "%ceph-storage-plugin~Overview%",
      "href": "/ocs-dashboards"
    },
    "flags": {
      "required": ["OCS"],
      "disallowed": ["ODF_MANAGED", "ODF_MODEL"]
    }
  },
  {
    "type": "console.navigation/href",
    "properties": {
      "id": "ocsdashboards",
      "insertBefore": "persistentvolumes",
      "section": "storage",
      "name": "%ceph-storage-plugin~Overview%",
      "href": "/ocs-dashboards"
    },
    "flags": {
      "required": ["MCG"],
      "disallowed": ["OCS", "ODF_MODEL"]
    }
  },
  {
    "type": "console.page/route",
    "properties": {
      "exact": true,
      "path": "/odf/system/ocs.openshift.io~v1~StorageCluster/:systemName/ceph.rook.io~v1~CephBlockPool/create/~new",
      "component": {
        "$codeRef": "blockPoolCreatePage.default"
      }
    },
    "flags": {
      "required": ["OCS"]
    }
  },
  {
    "type": "console.page/route",
    "properties": {
      "exact": false,
      "path": "/odf/system/ocs.openshift.io~v1~StorageCluster/:systemName/ceph.rook.io~v1~CephBlockPool/:poolName",
      "component": {
        "$codeRef": "blockPoolDetailsPage.default"
      }
    },
    "flags": {
      "required": ["OCS"]
    }
  },
  {
    "type": "console.page/route",
    "properties": {
      "path": "/odf/resource/noobaa.io~v1alpha1~BackingStore/create/~new",
      "exact": true,
      "component": {
        "$codeRef": "bsCreate.default"
      }
    }
  },
  {
    "type": "console.page/route",
    "properties": {
      "path": "/odf/resource/noobaa.io~v1alpha1~NamespaceStore/create/~new",
      "exact": true,
      "component": {
        "$codeRef": "nssCreate.default"
      }
    }
  },
  {
    "type": "console.page/route",
    "properties": {
      "path": "/odf/resource/noobaa.io~v1alpha1~BucketClass/create/~new",
      "exact": true,
      "component": {
        "$codeRef": "bcCreate.default"
      }
    }
  },
  {
    "type": "console.page/route",
    "properties": {
      "path": "/odf/resource/:resourceKind/:resourceName",
      "exact": false,
      "component": {
        "$codeRef": "resourceDetailsPage.GenericDetailsPage"
      }
    }
  },
  {
    "type": "console.page/route",
    "properties": {
      "path": "/odf/system/ocs.openshift.io~v1~StorageCluster/:systemName",
      "exact": false,
      "component": {
        "$codeRef": "odfSystemDashboard.default"
      }
    }
  }
]
