{
	"game": {
		"width": 710,
		"height": 620,
		"duration": 60.0,
		"borders": [{
			"xmin": -355.0,
			"xmax": 355.0,
			"ymin": -310.0,
			"ymax": 310.0
		}],
		"players": [
			{
				"id": 0,
				"x": -230.0,
				"y": 0.0,
				"angle": 90.0,
				"turn_rate": 240.0,
				"max_speed": 180.0,
				"acceleration": 90.0,
				"respawn_delay": 2.0,
				"missile_speed": 300.0,
				"missile_duration": 0.5,
				"drag": 0.05
			},
			{
				"id": 1,
				"x": 230.0,
				"y": 0.0,
				"angle": 270.0,
				"turn_rate": 240.0,
				"max_speed": 180.0,
				"acceleration": 90.0,
				"respawn_delay": 2.0,
				"missile_speed": 300.0,
				"missile_duration": 0.5,
				"drag": 0.05				
			}
		],
		"fortresses": [
			{
				"id": 0,
				"x": 0.0,
				"y": 0.0,
				"angle": 90.0,
				"turn_rate": 30.0,
				"no_target_turn_rate": 7.5,
				"lock_time": 0.75,
				"cooldown_time": 1.0,
				"sector_size": 10.0,
				"respawn_delay": 2.0,
				"activation_region": {
					"radius": 200.0
				},
				"shield": {
					"radius": 40.0
				},
				"shell_speed": 24.0,
				"shell_duration": 6.0,
				"color": {
					"r": 1.0,
					"g": 1.0,
					"b": 0.0
				}				
			}
		],
		"scores": 
		{
			"kill_fortress": 100,
			"player_death": -100,
			"missile_penalty": -10
		}
	},
	"clock": {
		"type": "callback_fps",
		"framerate": 30.0
	}
}
