Age,Job,Marital status,Avg yearly balance,Housing loan,# of times customer was contacted,Term deposit subscription
30,11,1,1787,0,1,0
33,8,1,4789,1,1,0
35,5,2,1350,1,1,0
30,5,1,1476,1,4,0
59,2,1,0,1,1,0
35,5,2,747,0,2,0
36,7,1,307,1,1,0
39,10,1,147,1,2,0
41,3,1,221,1,2,0
43,8,1,-88,1,1,0
39,8,1,9374,1,1,0
43,1,1,264,1,2,0
36,10,1,1109,0,2,0
20,9,2,502,0,1,1
31,2,1,360,1,1,0
40,5,1,194,0,2,0
56,10,1,4073,0,5,0
37,1,2,2317,1,1,0
25,2,2,-221,1,1,0
31,8,1,132,0,1,0
38,5,3,0,1,2,0
42,5,3,16,0,3,0
44,8,2,106,0,2,0
44,3,1,93,0,2,0
26,4,1,543,0,3,0
41,5,1,5883,0,2,0
55,2,1,627,1,1,0
67,6,1,696,0,1,0
56,7,1,784,0,2,0
53,1,1,105,0,2,0
68,6,3,4189,0,2,1
31,10,1,171,0,3,0
59,5,1,42,0,1,0
32,5,2,2536,1,6,1
49,10,1,1235,0,3,1
42,1,3,1811,1,1,0
78,6,3,229,0,1,1
32,2,1,2089,1,1,1
33,5,1,3935,1,1,1
23,8,2,363,1,18,0
38,5,2,11971,1,2,0
36,5,2,553,0,2,0
52,2,1,1117,1,1,0
32,10,1,396,1,3,0
32,10,2,2204,1,4,0
34,5,2,872,1,2,0
55,2,1,145,0,3,0
26,2,1,0,1,1,0
32,3,2,-849,1,1,0
61,1,1,4629,1,1,1
45,2,3,844,0,3,1
37,10,2,228,1,2,0
38,10,2,50,0,2,0
34,10,1,1539,1,1,1
53,2,1,2231,1,3,0
48,1,1,3064,1,2,0
57,5,1,82,0,1,0
33,7,2,2155,0,1,0
36,6,2,101,1,1,0
54,10,3,784,1,1,0
41,2,1,-516,0,3,0
63,6,1,415,1,1,0
48,5,1,5887,0,2,0
48,8,1,1355,0,2,0
56,1,1,16873,0,1,0
51,2,3,203,1,1,0
31,8,1,338,1,1,0
29,10,1,444,1,4,0
41,5,1,0,0,3,0
32,10,2,360,0,2,0
37,5,1,0,0,2,1
42,3,3,2,1,1,0
31,5,2,6248,1,2,0
41,8,1,412,1,5,0
56,6,1,344,1,1,0
54,5,3,3222,0,2,0
41,2,3,174,1,2,0
40,10,2,591,0,6,0
50,2,3,388,0,1,0
40,11,1,219,1,2,0
27,1,3,451,1,1,1
60,6,1,5,0,2,0
28,1,2,177,1,1,0
52,8,1,657,0,2,1
37,5,1,1315,0,1,1
51,2,1,1466,1,2,0
41,10,2,879,0,4,0
35,2,2,293,1,2,0
38,1,1,424,1,1,0
34,2,1,1831,1,2,0
39,2,1,111,0,2,0
34,2,1,455,1,3,0
27,8,2,-195,1,1,1
32,5,2,3616,0,2,0
57,2,1,14093,0,5,0
41,12,2,1567,0,2,0
41,1,1,5426,1,2,0
30,1,2,261,0,1,0
36,2,3,2843,0,1,0
31,11,2,406,0,1,1
36,2,1,0,1,1,0
38,5,2,493,1,1,0
49,10,1,5996,0,2,0
57,8,2,3777,1,2,0
34,5,2,524,0,1,0
32,5,2,574,1,2,0
37,2,1,427,1,3,0
33,7,1,483,1,2,0
56,11,1,3391,0,1,1
27,4,1,0,1,3,0
21,9,2,2488,0,6,1
58,5,1,1517,1,5,0
32,7,1,217,1,5,0
33,2,2,22,0,2,0
25,9,2,331,0,4,1
25,10,2,505,0,2,1
30,8,1,1808,1,2,0
22,1,2,4111,0,1,0
39,2,1,52,0,1,0
46,5,3,25,0,2,0
31,1,3,1890,1,1,0
45,2,1,419,0,4,0
32,10,1,2693,1,1,0
36,2,1,-231,0,2,0
51,5,2,-55,1,2,0
34,7,2,462,0,3,1
24,11,2,119,0,1,0
45,10,2,586,0,3,0
32,2,2,228,0,1,0
77,6,3,4659,0,1,1
41,2,1,168,1,3,0
37,2,1,0,1,1,0
43,2,1,-715,1,3,0
48,1,1,0,1,1,0
27,10,2,769,1,2,0
33,5,2,0,0,10,0
29,1,2,428,1,1,0
34,5,2,0,0,1,0
52,5,1,-970,1,1,1
60,5,1,6313,0,2,0
32,5,3,948,0,2,0
32,5,2,0,1,2,0
56,8,3,1877,1,1,0
31,5,2,874,1,2,0
42,1,1,323,1,2,0
35,5,1,106,0,2,0
56,6,1,1906,0,9,0
48,10,1,1152,1,5,0
46,1,1,179,1,4,0
37,10,2,391,1,3,0
41,3,1,89,1,2,0
36,5,2,442,1,3,0
45,11,3,-249,1,1,0
55,3,1,8104,0,2,0
39,10,1,501,0,1,0
35,10,3,308,0,2,0
55,1,1,602,0,3,1
55,10,1,273,1,3,0
27,7,2,50,0,1,0
34,10,1,1641,1,1,0
34,2,1,20,0,1,0
25,1,2,4590,1,2,0
41,1,2,-256,0,3,0
43,8,1,978,1,2,0
28,5,2,80,0,2,1
31,1,2,2104,1,1,0
78,4,1,499,0,4,0
45,2,3,1269,1,2,0
48,10,1,310,0,1,0
32,2,2,1143,1,1,0
42,10,1,2980,0,3,0
37,5,2,37,0,2,0
40,1,2,462,1,1,0
32,1,1,1031,1,1,0
42,5,1,9009,0,2,0
43,1,1,-465,1,1,0
44,1,1,5181,1,7,0
37,1,1,176,1,2,0
37,12,1,1699,0,1,0
37,1,1,0,1,2,0
28,10,2,172,1,2,0
32,8,2,0,0,2,0
34,1,2,6979,1,5,0
40,1,3,6,0,1,0
34,8,1,-62,1,3,0
34,7,1,1972,1,2,0
34,1,1,899,1,3,0
37,8,2,21,1,1,0
36,10,1,23,1,2,0
56,6,1,-1206,1,2,1
49,2,1,0,1,6,0
33,7,1,215,1,12,0
30,5,2,1372,0,2,0
36,8,1,1981,0,2,0
23,9,2,9216,0,2,0
57,6,3,39,1,3,0
27,2,2,5563,1,2,0
38,8,1,1,0,2,0
42,10,1,782,0,1,0
75,6,1,3771,0,1,1
34,10,2,992,1,1,0
48,10,1,1526,0,2,0
35,10,2,2658,1,2,1
39,5,3,1315,1,4,0
29,2,2,455,0,1,1
45,10,2,0,1,2,0
42,10,1,2030,1,1,0
29,10,1,1599,1,1,0
38,8,2,-196,1,1,0
56,6,1,1333,0,14,0
36,10,2,9149,1,3,0
25,2,2,-350,1,3,0
38,10,1,432,1,2,0
57,7,1,11494,0,1,0
31,5,1,-253,0,4,0
42,5,1,372,1,2,1
45,10,1,1410,0,2,0
30,2,1,975,1,2,0
49,2,1,305,1,10,0
49,8,1,400,0,3,0
53,6,1,-22,1,3,0
37,10,1,4030,1,5,0
49,2,1,365,0,2,0
41,7,1,204,0,7,0
54,5,1,1691,1,1,0
32,8,2,406,1,1,0
33,10,1,-204,0,3,0
33,10,1,359,1,1,0
36,2,1,123,1,1,0
35,10,1,0,1,1,0
52,12,1,142,0,6,0
40,3,1,3571,0,3,0
44,10,2,33,1,3,0
45,2,2,0,1,2,0
30,9,2,3096,0,1,0
48,10,3,20,0,3,0
33,2,1,3576,1,1,0
57,10,1,206,1,3,0
57,4,1,7082,0,3,0
51,11,1,1634,1,4,0
34,1,2,1,1,7,0
50,7,1,4012,0,3,0
44,5,1,3762,0,12,0
27,1,1,-247,1,2,0
50,2,1,606,1,2,0
36,5,1,0,1,1,0
42,5,1,-189,1,2,0
32,11,2,0,0,2,0
42,5,1,484,1,2,0
43,10,1,0,0,2,0
31,5,1,395,1,3,0
32,5,1,2349,0,5,0
55,2,3,410,0,2,0
58,6,1,3401,1,3,0
46,2,1,222,0,2,0
55,2,1,989,1,4,0
34,5,1,415,0,2,0
28,11,2,16,0,4,0
42,10,3,7190,1,2,0
29,2,2,482,0,3,1
54,4,1,209,1,1,0
32,10,2,0,0,2,0
39,10,2,5803,0,3,0
53,3,1,624,0,4,0
58,10,1,883,0,1,0
40,7,1,1516,1,1,0
29,9,2,872,1,1,0
33,10,1,-988,1,3,0
38,1,2,902,1,13,0
56,8,3,1007,0,6,0
40,8,1,0,1,1,0
24,2,2,174,1,1,1
46,5,1,12186,0,3,0
35,7,1,524,1,4,0
35,2,2,0,1,4,0
34,10,1,4,1,1,0
35,4,1,11219,0,2,0
38,10,2,0,0,2,0
50,2,1,5776,0,3,0
51,2,3,37,1,1,0
59,7,1,593,0,2,0
32,2,1,1148,1,1,0
37,2,2,3561,1,1,0
42,1,3,63,0,6,0
40,9,1,260,0,6,0
28,10,2,2269,1,1,0
47,1,1,1060,1,3,0
27,7,1,-220,1,2,0
41,5,1,49,1,5,0
34,1,1,69,0,3,1
50,2,1,4108,1,2,1
47,2,1,480,1,2,0
53,8,1,4994,0,6,0
53,10,3,0,1,5,0
47,5,1,3681,0,2,0
49,3,3,-701,1,2,1
29,5,1,451,0,1,0
45,2,3,-311,1,1,1
38,3,1,593,1,24,1
32,2,1,759,1,5,1
70,6,3,4531,0,1,0
65,6,3,1840,0,2,0
56,2,1,345,1,1,0
35,2,1,1287,1,2,0
56,5,1,353,0,2,0
56,10,1,205,0,2,0
49,3,1,687,1,1,1
38,11,1,1147,1,5,0
35,5,1,4286,1,1,0
38,1,1,605,0,2,0
49,2,1,8545,1,7,0
55,5,1,559,0,2,0
43,2,2,2,1,3,0
43,5,1,2,0,2,0
25,1,2,760,1,3,1
30,2,1,1317,1,2,0
46,2,1,182,0,1,0
50,1,1,276,0,6,0
35,3,1,2971,0,4,1
26,11,2,1064,0,1,0
45,1,1,1783,0,11,0
37,2,1,-67,0,1,0
60,7,2,179,0,4,0
38,5,1,1199,0,1,1
47,2,1,214,1,1,0
33,10,1,6699,0,1,0
51,11,1,1760,0,1,0
35,3,2,145,1,2,1
35,11,1,978,0,3,1
48,1,2,1150,1,1,0
37,1,1,121,0,6,0
29,10,2,828,1,3,0
34,1,1,244,1,4,0
32,8,1,228,1,6,1
30,5,2,424,0,4,1
47,5,3,447,0,1,0
33,2,1,-195,0,1,0
33,5,2,1410,1,1,0
63,6,1,1084,0,1,0
51,7,3,10924,0,2,0
41,5,1,832,1,1,0
56,6,1,478,0,1,0
60,5,2,0,0,1,0
41,7,2,3950,1,2,0
37,5,2,504,1,1,0
36,2,2,219,1,2,0
57,5,1,1602,0,3,0
55,5,1,2587,0,2,1
44,1,1,0,1,1,0
47,7,1,2303,1,2,0
31,2,1,1660,1,1,0
35,5,1,32,1,1,0
39,5,1,278,0,3,0
50,5,1,4,0,1,0
29,5,1,318,1,2,0
30,8,2,209,1,2,0
46,8,1,271,1,4,0
27,5,2,3196,0,2,0
48,1,3,4099,0,2,1
26,9,2,2572,1,1,0
36,5,2,339,0,6,0
42,2,1,0,1,2,0
50,4,1,395,1,2,0
49,2,1,2039,1,2,0
45,5,1,5450,0,2,0
23,9,2,780,0,1,0
38,10,2,0,1,2,0
32,5,2,8436,1,1,0
60,10,2,11262,0,1,1
30,3,1,946,1,1,0
58,4,1,497,0,5,0
60,6,1,55,0,1,0
38,8,1,-140,0,3,0
51,10,1,-379,1,1,0
42,1,1,-396,1,1,0
30,8,2,0,1,6,0
40,5,1,733,1,7,0
37,5,1,393,1,3,1
53,10,3,7290,1,1,0
27,8,2,468,1,1,0
39,2,1,0,1,1,0
39,2,1,3705,1,1,0
59,6,1,9676,0,2,1
37,8,1,1328,1,2,0
41,2,1,8,1,2,0
45,2,1,61,0,1,0
48,5,1,6613,0,3,0
48,10,1,302,1,3,0
32,2,1,1005,0,1,0
35,8,1,109,1,3,0
33,5,2,1240,1,2,0
28,2,2,0,1,4,0
64,6,1,2923,0,1,0
35,10,1,0,0,4,0
33,2,1,43,1,2,0
41,10,1,288,1,4,0
34,1,1,613,1,1,0
37,10,2,6101,0,5,0
38,2,1,168,1,3,0
39,2,1,7685,1,3,0
35,10,3,4515,1,2,0
28,2,2,517,0,1,1
27,2,2,148,0,1,0
48,6,1,-285,0,1,0
50,2,1,887,0,1,0
45,7,1,3098,1,2,0
41,10,1,744,1,1,0
39,10,1,130,0,2,0
44,5,1,438,1,3,0
54,1,1,0,0,1,1
49,5,1,322,0,4,0
34,2,2,186,0,1,0
75,6,3,3810,1,1,1
42,5,1,0,0,2,0
53,2,1,4380,0,7,0
49,5,3,755,0,4,1
31,8,2,2070,0,2,0
45,2,2,999,0,2,0
39,7,1,167,1,1,0
46,10,1,1322,1,1,0
42,1,3,1076,1,1,0
37,5,1,502,1,1,0
26,10,2,1216,1,2,0
37,5,2,876,1,4,0
36,8,2,342,1,1,0
29,2,2,950,1,3,0
36,2,1,973,1,1,0
26,10,1,3825,1,1,0
32,2,1,2366,1,2,0
40,5,1,542,1,1,0
53,5,1,995,0,3,0
29,5,1,20,1,1,0
34,10,2,228,1,4,0
43,2,1,130,0,1,0
56,5,1,217,0,2,0
55,3,3,0,0,2,0
31,7,1,259,1,1,0
27,1,2,619,1,5,0
36,5,1,644,1,2,0
44,5,1,22,1,2,0
37,1,3,4303,1,1,0
30,1,2,239,1,3,0
42,10,2,275,0,8,0
30,5,1,1221,1,4,1
62,6,1,816,0,2,0
24,2,1,1222,1,1,0
31,10,1,2363,1,1,0
66,6,1,2262,0,1,0
47,1,1,2,0,1,0
39,3,1,2,1,1,0
35,10,1,4508,1,1,1
35,1,3,-402,1,1,0
27,10,1,1577,1,2,0
32,2,1,34,1,2,0
44,5,1,795,0,24,0
42,2,1,117,1,1,0
34,7,2,5462,0,1,1
25,8,2,402,0,1,0
40,10,2,641,0,6,0
43,5,3,36,0,1,0
55,11,1,383,0,3,0
50,2,1,283,1,3,0
45,5,3,0,0,1,0
35,2,3,3102,1,1,0
32,2,1,889,1,1,1
59,4,1,0,0,1,0
34,7,1,-370,1,1,0
39,5,1,-606,1,1,0
40,5,2,10378,1,3,0
36,2,2,1313,1,10,0
40,5,1,8969,1,1,0
55,7,1,-196,1,2,0
38,3,1,15,1,1,0
61,1,1,4608,0,1,1
41,5,1,666,1,3,0
57,2,1,452,1,4,0
48,2,1,149,1,1,0
77,6,1,7802,0,1,1
35,8,1,1453,1,1,0
54,2,1,1480,1,1,0
37,5,2,715,1,2,0
56,5,2,237,1,4,0
40,10,1,694,1,4,0
40,5,1,0,0,8,0
54,5,1,55,1,2,0
55,4,1,136,1,10,0
55,8,3,-404,1,3,0
52,2,1,779,1,3,0
55,2,2,1187,1,2,0
33,5,1,641,1,2,0
52,2,1,826,1,2,0
33,8,3,991,1,1,0
53,1,1,1796,0,1,1
46,1,1,22,0,6,1
44,10,2,244,1,4,1
48,5,3,1328,1,1,0
50,4,1,7317,1,1,0
34,10,2,4943,1,2,0
38,10,2,258,0,2,0
42,5,2,515,1,2,0
32,5,2,12607,0,5,0
58,1,1,2,1,9,0
31,5,1,13,0,5,0
19,9,2,103,0,2,1
41,5,1,3872,0,1,0
31,11,1,296,1,3,0
52,7,2,217,0,6,0
42,7,3,360,1,5,0
41,2,2,428,1,1,0
30,2,2,315,0,1,1
38,2,1,121,1,1,0
32,5,1,820,1,3,0
52,10,1,195,1,1,1
48,5,3,108,1,2,0
36,5,1,-381,1,29,0
45,11,3,757,0,1,0
34,10,1,691,1,1,0
36,2,1,1925,1,2,1
34,5,1,902,1,1,0
61,6,1,5207,0,1,0
54,8,1,0,0,1,0
50,3,1,665,0,1,0
43,1,3,738,1,4,0
47,2,1,233,0,3,0
45,8,1,-839,1,1,0
57,6,1,5799,0,1,0
27,1,1,1033,1,1,0
49,11,3,66,0,3,0
43,8,1,2567,1,1,0
40,5,1,1584,1,1,0
32,8,2,182,1,1,0
58,5,1,76,1,4,0
34,1,2,663,1,1,0
46,10,3,3455,1,2,0
29,2,1,15,0,1,0
52,2,1,1054,0,1,0
45,5,1,1529,0,1,0
26,5,2,63,0,4,0
40,10,1,0,0,1,0
41,1,1,920,1,1,0
47,1,2,3696,0,2,1
27,10,2,59,0,4,0
27,8,1,0,1,13,0
48,2,1,157,1,1,0
49,1,1,2465,0,3,0
35,2,1,0,1,6,0
47,7,1,2,0,2,0
54,5,1,0,0,5,0
39,5,2,12437,0,1,0
28,9,2,378,1,1,0
54,2,1,211,0,2,0
34,10,1,-228,1,3,0
63,6,1,2747,0,1,0
42,7,1,1932,1,32,0
43,10,2,11269,0,1,0
37,1,1,1314,1,2,0
55,2,1,2275,0,9,0
43,5,2,1304,0,2,1
41,2,1,720,0,1,1
47,10,3,2914,1,13,0
34,10,1,1464,1,1,0
28,9,2,11555,0,2,0
36,8,1,-302,1,2,0
50,10,1,2497,1,1,0
35,2,1,-339,1,2,0
40,10,1,56,1,1,0
26,7,2,211,0,3,0
36,5,3,3611,1,3,0
59,11,1,0,0,2,0
28,9,2,459,0,13,0
46,3,1,242,1,2,0
50,7,1,1138,0,10,0
53,5,1,1319,1,1,0
81,6,1,1,0,5,0
35,8,3,67,1,2,0
58,6,1,937,0,1,0
44,8,1,0,1,1,0
38,5,1,-558,1,1,0
49,2,1,171,0,3,0
33,10,2,696,0,1,0
29,5,1,361,1,3,0
28,10,2,227,0,1,1
31,1,1,236,1,3,0
33,5,2,-53,0,2,0
52,10,1,192,1,2,0
43,5,3,38,1,6,0
32,7,2,518,1,7,0
36,7,1,16,1,4,0
41,2,1,-256,1,2,0
43,2,1,105,0,2,0
45,7,1,334,0,2,0
39,10,1,1048,0,1,0
41,8,1,108,1,7,0
31,10,1,660,0,1,0
37,11,2,0,1,1,0
28,3,1,1034,0,1,0
47,4,1,201,1,2,0
37,4,1,189,0,4,0
60,6,3,-49,1,1,0
43,10,3,1413,1,3,0
58,6,3,264,1,3,0
52,3,1,54,1,1,0
50,2,1,12519,1,2,0
32,8,2,2881,0,1,1
42,2,1,0,1,1,0
31,1,1,88,1,2,0
28,2,1,1020,1,1,0
36,10,3,119,0,8,0
51,11,2,1594,0,1,0
46,10,1,342,1,1,0
50,8,2,72,0,2,0
32,2,1,14,1,1,0
26,3,2,81,0,3,0
41,7,1,231,0,2,1
39,10,1,1161,1,1,0
31,2,1,-45,1,1,0
28,5,2,231,1,2,0
31,5,2,36,0,2,0
30,10,1,1570,1,1,0
35,10,1,7050,0,3,1
33,2,1,3704,1,2,0
30,10,2,6619,1,8,0
32,2,2,-84,1,1,0
40,5,2,1509,0,1,0
31,7,1,1134,0,2,0
36,10,1,146,1,2,0
33,5,2,9449,1,1,0
57,6,1,374,1,1,0
45,10,1,88,0,2,0
59,5,1,2764,0,1,0
30,5,2,2,1,8,1
33,10,1,8023,0,1,0
52,2,1,289,1,13,0
83,6,1,0,0,10,0
58,7,3,1382,0,1,1
33,5,3,280,0,1,0
41,2,3,2195,1,5,0
31,7,1,33,0,4,0
35,2,3,275,0,5,0
27,5,2,703,1,3,1
57,1,3,887,0,8,0
56,12,1,0,0,2,0
53,1,2,1178,1,2,0
39,5,1,2763,1,2,1
32,3,2,890,1,10,0
46,7,1,548,0,4,1
56,10,1,272,0,2,0
46,5,3,6269,1,3,0
29,3,1,178,1,4,0
60,5,1,252,1,2,0
33,4,2,23663,1,2,0
27,3,2,81,0,1,0
50,7,3,59,1,2,0
45,8,1,1343,0,1,0
58,6,1,225,0,6,0
59,6,1,0,1,7,0
58,6,3,2538,1,6,0
64,6,1,43,0,1,0
47,10,1,57,0,1,0
40,5,1,-117,1,2,0
36,10,3,666,1,1,0
28,5,2,0,1,5,1
38,10,2,25,1,2,1
53,3,1,1034,1,2,0
46,2,2,324,1,6,0
54,10,1,0,0,1,0
32,5,1,0,0,1,0
55,5,1,621,0,1,0
55,6,3,138,0,1,0
56,10,1,4063,0,4,0
40,2,1,11084,0,1,0
44,10,1,310,1,1,0
32,3,1,73,1,1,0
33,5,1,1808,1,4,0
41,11,3,1281,0,3,0
37,10,1,64,1,4,0
58,5,2,2,1,3,0
52,2,1,60,0,2,0
49,8,2,133,0,6,0
44,4,1,3706,0,3,0
28,1,2,174,0,1,0
31,10,1,251,0,2,0
37,7,1,4153,1,16,0
30,10,2,985,1,2,0
28,8,2,168,0,3,1
46,8,1,1550,1,2,0
47,5,1,7708,1,5,0
35,2,1,-12,1,5,0
80,5,1,6483,0,1,0
30,10,2,60,1,5,0
55,10,2,3339,1,1,0
22,9,2,1161,0,1,0
33,2,2,599,1,1,0
53,3,1,28,0,2,0
49,5,1,1430,0,2,0
51,6,1,35,0,4,0
41,7,1,6000,1,1,0
34,10,1,0,1,1,0
36,2,2,340,0,3,0
35,3,1,0,0,1,0
29,8,1,3,1,1,0
40,10,2,445,1,1,0
32,5,3,874,0,6,1
48,2,1,705,0,2,0
59,6,1,1033,0,1,1
35,7,3,1354,1,2,1
33,10,2,123,0,1,0
55,6,1,8894,0,1,0
41,2,1,429,1,1,0
42,4,1,14752,0,2,0
46,2,1,67,0,1,0
35,4,3,39,0,2,0
28,10,2,102,0,2,0
25,9,2,1790,0,1,0
56,5,2,15311,0,6,0
30,1,2,-635,0,1,0
45,2,1,115,0,4,0
40,5,1,10786,0,3,0
40,2,1,498,1,2,0
39,2,1,1045,1,13,0
48,3,1,810,0,1,0
31,10,2,-162,1,1,0
32,5,1,55,0,3,0
34,8,1,586,1,2,0
26,10,2,455,0,1,0
31,5,1,1010,1,3,0
37,5,2,509,1,1,0
29,9,2,2929,0,1,0
57,10,1,3071,1,3,0
47,5,2,153,1,2,0
38,7,2,1146,1,2,0
48,2,1,1092,0,1,0
50,5,1,3463,0,1,1
33,1,1,1158,1,2,0
28,1,2,26,1,2,0
30,8,2,566,0,1,0
52,10,3,204,0,2,0
36,10,1,480,0,1,1
36,10,2,1855,1,1,0
46,8,1,1034,0,2,0
57,5,1,3250,0,3,0
28,5,2,1633,0,1,1
46,8,1,0,1,1,0
55,6,1,3334,0,4,1
33,5,1,4020,1,1,0
53,5,1,66,0,1,0
41,10,2,-41,1,1,0
60,2,1,322,1,1,0
35,3,1,2643,0,1,0
43,2,3,49,1,1,0
57,1,3,1,0,10,0
46,1,1,3098,1,9,0
31,2,1,352,1,9,0
53,10,1,65,0,2,0
35,2,1,1949,1,3,0
32,1,2,739,1,3,0
48,5,1,1167,1,1,1
50,1,1,231,1,2,0
40,2,1,1136,1,1,0
42,3,1,233,0,1,0
59,1,1,817,0,1,0
27,2,2,1128,1,4,0
32,5,2,1831,1,2,0
35,10,2,450,1,1,0
28,8,1,0,1,2,0
37,5,3,414,0,2,0
57,5,1,1052,1,4,0
42,1,2,1022,1,2,0
55,1,1,343,1,3,0
52,5,1,1944,1,3,0
26,2,2,-32,1,6,0
52,10,1,1781,1,2,0
26,5,2,350,0,1,0
33,11,1,2,1,1,0
24,2,2,111,1,4,0
37,5,3,168,1,1,0
28,10,2,3,0,8,0
30,10,2,102,1,2,0
33,2,1,0,1,1,0
55,12,1,159,0,1,0
33,2,1,1134,1,2,0
42,2,1,352,1,3,0
37,5,1,865,1,1,0
59,2,1,179,1,3,0
27,2,2,5,1,3,0
23,9,1,-230,1,2,0
51,5,3,0,0,2,0
50,2,1,3924,1,2,0
43,10,1,764,1,5,0
37,2,3,511,1,1,0
34,5,2,4348,1,8,0
41,5,1,3016,1,3,0
26,9,2,279,0,3,0
49,5,3,1405,0,1,0
29,2,2,908,1,1,1
30,5,2,162,1,4,0
38,8,3,792,0,1,0
58,5,1,111,0,2,0
34,9,2,1281,0,1,0
53,8,3,1012,1,2,0
50,5,1,2881,0,2,0
30,2,2,445,1,1,0
40,5,1,643,1,2,0
57,4,2,254,0,1,0
40,5,1,-1212,1,2,0
41,10,1,2125,1,3,0
53,10,3,629,1,1,0
48,2,1,-202,1,4,0
32,10,2,271,1,2,0
34,5,1,703,1,1,1
46,2,1,-216,1,3,0
45,8,3,88,0,1,0
51,1,2,16,1,1,0
31,5,1,466,1,1,0
47,10,1,-75,1,1,0
32,2,1,456,0,1,0
41,10,1,77,1,1,0
37,8,2,-244,0,1,0
27,2,2,1209,0,1,0
27,8,1,58,1,1,0
50,5,1,421,0,5,0
31,5,2,112,1,2,0
40,7,1,13669,0,1,0
43,5,1,1429,1,1,1
39,10,1,794,0,1,0
31,3,2,1957,0,3,0
48,10,1,454,1,1,0
32,2,2,882,0,8,0
47,11,1,168,1,1,0
35,5,2,714,1,22,0
42,5,2,0,0,1,0
47,2,1,1996,0,2,1
59,6,1,163,0,1,0
38,1,1,3190,1,2,0
50,11,1,1772,0,4,0
27,8,2,-151,0,2,0
55,4,1,16,0,1,0
39,8,2,7066,1,3,1
31,10,2,454,0,3,0
37,3,1,4798,1,2,0
28,10,2,-298,1,7,0
42,10,1,439,0,2,0
40,8,3,1927,1,1,0
59,5,2,671,1,2,0
40,8,2,65,1,3,0
43,10,1,-932,1,1,0
38,10,2,4366,1,2,0
54,6,1,0,1,2,0
41,2,1,4900,1,2,0
55,4,3,976,0,1,1
33,5,1,148,0,1,0
46,2,1,5,0,3,0
36,5,1,-148,0,2,0
48,10,3,113,0,1,0
42,5,1,-105,1,2,0
46,5,3,624,0,2,1
49,10,1,-1680,1,4,0
36,2,1,-461,0,2,0
34,10,2,144,1,1,0
51,3,3,4,1,5,0
58,2,1,309,0,2,0
48,5,1,866,0,2,0
41,1,2,1020,1,1,1
49,7,1,489,1,4,0
43,5,1,8167,1,2,0
32,2,2,-255,0,3,0
54,6,1,3671,0,3,0
33,2,3,636,1,11,0
35,10,1,141,1,2,0
56,10,1,150,1,6,0
57,10,1,839,0,1,0
31,4,2,26965,0,2,1
33,10,2,716,1,2,0
29,10,2,2485,0,6,0
38,5,2,15030,1,1,0
37,1,1,11303,0,2,0
33,3,1,595,0,2,0
30,5,2,19358,0,2,0
31,7,2,203,0,1,0
28,10,2,183,1,2,0
26,1,2,255,0,1,1
31,10,2,102,1,2,0
50,4,3,94,1,4,0
45,3,1,58,1,3,0
48,5,1,606,0,6,0
41,10,1,0,0,1,0
60,10,1,65,1,2,1
41,2,1,338,1,1,0
43,2,1,757,1,4,0
36,5,1,9269,1,2,0
40,2,1,1206,0,5,0
28,5,2,882,0,1,0
27,9,2,5291,0,2,1
49,5,2,61,1,2,0
37,10,1,0,1,1,0
31,2,1,1407,1,3,0
31,10,2,25,0,1,0
31,2,1,1354,1,2,0
35,2,1,793,1,1,0
51,2,3,10287,1,1,0
33,10,2,5235,0,3,0
30,10,2,3,1,2,0
58,10,2,409,0,2,0
34,1,1,35,1,1,0
45,5,1,-459,0,6,0
28,8,2,198,0,2,1
31,2,1,99,1,2,0
40,5,1,60,0,6,0
30,8,2,3485,0,2,0
34,3,1,-139,1,2,0
40,2,1,952,0,1,0
59,6,1,1427,0,2,0
43,10,2,1017,1,2,0
41,5,1,-29,0,2,0
33,10,3,9,0,2,0
33,5,1,4040,1,2,0
36,2,1,13,0,1,0
32,7,2,1259,0,2,0
25,1,1,18,1,1,0
25,2,1,-76,1,3,0
38,10,2,221,0,3,0
34,5,1,136,1,1,0
67,2,1,16353,0,2,0
32,2,1,-63,1,1,0
45,4,1,7353,0,2,0
33,2,1,511,1,2,0
38,1,1,3913,1,2,0
32,10,3,1097,1,2,0
54,6,3,6102,1,6,0
51,1,3,340,1,1,0
42,2,1,-119,1,3,0
41,1,1,2993,1,12,0
39,5,3,3575,0,3,0
38,2,1,361,1,1,0
39,5,1,1072,1,2,0
46,2,1,2904,0,2,0
50,3,3,1790,0,3,0
33,2,1,86,1,1,0
37,10,1,1633,1,3,0
31,5,1,8312,0,13,0
34,2,3,172,0,1,1
34,5,1,0,1,1,1
36,5,1,222,1,1,0
40,10,1,109,0,22,0
40,2,1,1451,0,1,1
41,10,1,1066,0,3,1
52,5,1,3163,0,6,0
40,8,2,888,1,2,0
48,2,2,428,1,1,0
33,5,3,106,0,3,0
44,10,3,0,0,2,0
55,5,1,979,0,1,0
51,1,1,2662,0,2,0
34,5,2,84,0,1,0
58,6,3,5920,1,1,0
39,5,2,816,1,3,0
27,11,2,3276,0,1,0
55,5,3,2,1,1,0
35,10,2,-51,0,2,0
37,10,2,3315,1,2,0
52,10,1,196,1,1,0
41,2,1,552,1,1,0
52,1,1,2347,0,3,0
34,2,2,3723,1,5,0
53,5,3,255,0,1,0
33,5,2,3143,0,2,1
47,7,1,0,0,8,0
35,2,1,6411,1,1,0
33,5,2,1909,0,2,0
55,2,1,3873,0,1,0
58,7,1,1013,1,1,1
44,1,1,262,1,1,0
25,8,2,3217,1,1,0
37,10,2,5436,1,11,0
41,2,1,2067,1,7,0
34,2,2,215,0,3,1
36,8,3,1594,0,3,0
44,7,1,134,0,4,0
34,3,3,262,0,1,0
56,2,3,3021,0,2,0
43,5,3,388,1,2,1
28,2,2,3412,1,4,0
54,2,1,1291,1,1,0
37,10,3,79,0,1,0
59,7,1,2013,0,4,1
58,2,3,543,0,3,0
56,5,3,1016,1,5,0
32,2,2,604,0,3,0
42,5,2,525,0,2,0
52,6,3,353,0,4,0
46,5,1,964,1,1,0
37,1,1,3913,1,1,1
39,2,1,879,1,2,0
31,1,1,314,1,1,0
59,4,1,0,0,11,0
38,2,1,1370,1,2,0
58,5,1,37,0,11,0
34,5,2,673,1,1,0
40,8,1,-342,1,1,0
20,9,2,291,0,5,0
34,10,1,209,1,2,0
31,10,2,438,1,2,0
39,1,2,1242,1,3,0
34,3,1,355,1,1,0
24,2,1,204,1,3,0
41,5,1,10758,1,1,0
40,5,1,5,1,3,0
45,10,2,410,1,4,1
36,5,1,605,1,1,0
53,5,1,4,0,6,0
23,9,2,8494,0,2,0
42,3,1,198,1,1,0
48,2,1,841,1,1,0
34,5,1,8,0,4,0
36,1,1,470,1,4,0
43,6,1,520,1,13,0
36,2,1,439,1,5,0
49,2,1,-454,1,1,1
55,6,1,466,0,4,0
53,6,1,665,1,2,1
42,10,1,994,1,1,1
45,1,1,5346,1,1,1
31,2,1,1243,1,1,0
32,1,1,0,1,1,0
36,2,1,2357,1,2,0
56,6,1,1044,0,2,1
46,1,1,1069,1,2,0
41,4,2,231,0,2,0
31,1,1,0,1,2,0
32,10,1,266,1,2,0
38,5,1,-70,1,1,0
49,6,2,25824,0,1,0
46,5,2,538,0,3,0
29,10,2,534,1,1,0
36,1,1,2323,0,1,0
38,1,1,1852,1,2,0
53,10,1,2647,1,1,0
43,5,1,2767,1,7,0
41,5,1,176,1,1,0
42,5,2,9720,0,2,0
55,2,3,1613,1,1,1
39,1,3,2903,1,2,0
30,1,2,81,1,6,0
41,2,1,780,1,3,0
44,11,1,178,0,2,0
58,5,1,299,0,4,0
35,6,1,285,1,1,0
27,2,1,872,1,3,0
34,8,1,1337,0,2,1
25,8,1,72,1,2,0
36,2,1,0,0,3,0
38,2,1,-388,1,1,0
30,1,1,11,1,1,0
47,2,3,-535,1,2,0
41,8,3,787,1,2,0
36,5,2,3343,0,1,0
63,3,1,3904,0,2,1
23,5,2,736,1,1,0
32,5,1,1390,0,2,0
57,6,1,808,0,1,0
48,5,1,1147,0,1,1
49,8,1,1122,0,1,0
50,10,1,-568,1,2,0
33,2,1,1165,1,2,0
53,8,3,-905,1,1,0
30,11,1,0,1,1,0
38,10,1,740,0,3,0
44,5,1,8262,1,16,0
39,1,2,14,1,9,0
45,10,2,7108,1,1,0
36,2,1,1049,1,4,1
38,2,1,0,1,5,0
36,4,1,419,1,1,0
30,5,2,726,1,1,0
28,10,3,594,1,3,0
26,11,1,454,1,18,0
54,12,1,2206,0,1,1
38,1,1,1988,0,2,1
50,1,3,202,0,1,0
43,2,1,667,1,3,0
48,1,1,112,0,5,0
57,4,1,50,0,3,0
64,4,1,768,0,2,0
26,8,3,74,1,6,0
33,2,1,661,1,1,1
50,7,1,3025,0,3,0
47,7,1,751,0,14,0
39,5,2,416,0,4,0
52,8,1,14,0,5,0
31,2,2,-502,1,4,0
50,2,1,0,0,5,0
47,10,1,599,1,3,0
30,5,2,-218,1,15,0
32,10,2,1012,0,1,0
36,10,1,300,0,1,0
46,10,1,217,1,1,0
45,5,3,2096,0,1,0
37,10,2,0,0,2,0
58,4,1,5278,1,4,0
59,5,1,1831,0,1,0
28,5,1,1480,1,1,0
48,5,1,7289,1,3,0
55,2,1,1665,0,2,0
37,2,2,851,1,1,0
41,5,1,2885,0,1,0
35,2,1,137,0,1,0
34,2,2,1239,1,1,0
43,5,2,146,0,1,0
59,10,1,1,0,2,1
50,2,3,-10,0,6,0
37,10,1,480,0,2,1
35,10,1,2789,1,2,0
50,10,2,3897,0,1,0
36,10,3,487,0,3,0
41,1,1,5110,1,1,0
28,5,1,318,1,4,0
42,10,2,-411,1,5,0
60,6,1,4820,0,1,0
28,5,2,4937,1,3,0
48,3,1,725,0,1,0
51,3,1,5403,0,1,0
32,10,1,4089,0,7,0
35,10,1,188,0,2,0
37,10,1,189,0,1,1
38,2,3,2998,1,1,0
77,6,1,610,0,3,0
32,5,2,787,0,1,0
43,10,3,167,0,3,0
36,5,2,243,1,2,0
29,5,1,877,0,3,0
32,1,2,2817,1,1,0
41,5,3,4567,1,1,0
26,8,2,127,1,3,0
34,2,1,176,0,1,0
57,6,1,0,1,1,1
36,8,2,1482,1,2,0
42,2,1,3052,1,1,0
35,10,3,56,0,12,0
52,3,3,278,1,2,0
36,5,2,3875,1,5,0
46,10,1,-337,1,1,0
60,5,3,366,0,1,1
57,4,1,501,1,2,0
48,5,1,998,1,3,0
59,7,1,0,1,2,0
39,5,1,246,0,2,0
44,2,1,-182,1,10,0
27,5,2,446,0,3,0
59,6,1,1173,0,2,0
36,10,3,5957,1,2,0
44,1,1,205,0,1,1
50,1,1,0,0,4,0
41,5,3,369,1,3,0
47,1,1,1934,0,1,0
32,10,2,259,0,4,0
38,2,1,284,1,6,0
55,2,1,23,0,2,0
38,5,2,1373,0,4,0
31,5,2,62,1,1,0
38,2,3,157,0,5,0
29,11,2,991,0,1,0
55,8,1,186,1,1,0
35,11,1,977,1,4,0
40,7,2,2893,0,3,0
34,2,1,1897,1,1,0
32,10,2,5514,0,1,1
33,2,1,889,1,1,0
33,5,1,273,1,1,1
37,1,1,1193,0,2,0
58,5,1,2729,0,1,0
36,1,2,0,0,1,0
42,2,1,230,1,7,0
34,10,2,2729,1,1,0
35,5,1,317,1,3,0
60,4,1,517,0,3,0
50,5,1,-470,1,2,0
28,7,2,4579,0,2,1
27,2,3,1,1,3,0
37,5,1,5106,0,1,1
31,10,1,636,1,4,1
34,8,1,1076,0,1,1
38,5,1,126,1,2,0
32,7,1,-33,1,3,0
37,10,1,430,0,4,0
33,1,1,-6,1,2,0
71,10,1,383,0,2,0
27,10,1,130,1,3,0
38,2,1,2569,0,1,0
34,10,2,201,0,2,0
54,6,3,0,0,1,1
30,2,1,6,1,3,0
35,3,2,475,0,4,0
33,2,2,706,1,1,0
36,5,1,1825,1,1,0
59,7,1,185,0,5,0
72,2,1,4415,0,1,0
64,5,1,679,0,3,0
53,10,3,320,0,1,0
35,5,2,2988,1,1,0
58,7,1,1407,1,1,0
40,10,1,1270,0,2,0
41,8,3,654,1,2,0
48,6,1,5173,1,8,0
44,3,1,3463,1,3,0
39,2,1,0,0,1,0
61,5,1,6016,0,3,1
36,3,1,177,1,5,0
28,5,1,3694,0,2,0
58,6,2,1640,0,6,0
60,1,3,174,1,1,0
66,1,2,10177,0,4,0
36,5,2,490,0,8,1
49,7,1,2576,1,6,0
40,8,1,0,0,2,0
23,10,2,598,0,1,0
29,5,2,15459,0,3,0
44,2,1,271,1,1,0
54,12,1,2508,0,8,0
47,2,1,320,0,2,0
33,1,1,640,0,1,0
30,7,1,1772,1,4,0
27,1,2,15,0,1,0
49,5,3,2370,1,1,0
27,8,2,201,1,2,0
51,2,1,160,1,1,0
32,1,3,5,1,3,0
30,2,2,75,1,1,0
33,1,1,4902,1,1,0
27,2,2,-79,1,5,0
75,6,3,1341,0,7,1
37,8,3,490,1,1,0
36,10,2,1521,1,2,0
37,2,1,131,1,2,0
35,5,1,8,1,4,0
32,8,1,-632,1,5,0
32,1,2,116,0,2,0
35,1,1,189,1,1,0
31,2,1,2,1,1,0
28,2,2,4229,1,2,0
27,8,1,54,1,1,0
22,9,2,549,0,1,0
35,2,1,298,1,2,0
69,6,1,579,0,1,0
37,3,2,1467,1,1,0
45,1,2,0,1,1,0
47,5,1,109,1,1,0
52,5,1,-11,1,4,0
33,8,1,90,1,2,0
60,2,1,493,0,4,1
33,5,3,1897,1,1,0
44,1,1,2403,1,2,0
38,3,1,868,0,2,0
54,3,1,653,1,1,0
32,11,3,0,0,4,0
33,10,1,0,1,2,0
55,8,3,218,1,2,0
51,2,1,5050,0,7,0
48,2,1,741,1,1,0
37,8,2,1050,1,3,0
33,8,2,-56,0,5,0
30,2,1,1,1,2,0
43,2,1,-98,1,2,0
49,10,1,4667,1,2,0
54,11,1,541,1,3,0
31,11,1,7744,0,8,0
54,12,1,895,0,1,1
36,11,1,-129,1,3,0
30,1,1,0,0,5,0
27,10,2,158,0,2,1
30,1,1,122,1,1,0
30,2,1,673,1,2,0
35,10,3,0,0,4,0
33,8,3,411,1,1,0
43,2,3,-97,1,4,0
41,2,1,-217,1,1,0
41,5,3,5037,0,9,1
46,1,3,2232,0,1,1
54,2,1,-932,1,1,0
32,5,1,913,1,1,0
30,10,2,236,1,1,0
40,3,1,0,1,2,0
30,2,1,2581,0,2,0
27,1,1,639,0,3,0
41,2,1,849,1,1,0
54,8,1,386,1,2,0
32,5,2,1218,1,2,0
31,5,1,2603,1,4,1
42,2,1,-921,1,2,0
48,1,1,607,0,2,0
34,2,1,79,1,2,0
55,10,3,61,1,3,0
49,10,1,1091,0,2,0
46,5,3,743,0,2,0
47,3,1,209,1,2,0
24,5,2,172,0,2,0
58,3,1,2,0,1,0
32,5,2,41,0,5,1
25,9,2,1116,1,3,0
49,2,1,-55,0,3,0
59,6,3,5845,0,2,1
30,5,2,329,1,16,0
46,2,1,494,1,1,0
42,5,1,1519,0,1,1
37,3,1,2685,0,2,0
44,2,1,-14,1,4,0
49,8,1,5673,0,3,0
41,2,1,1459,0,1,0
48,10,1,0,0,15,0
31,5,1,625,1,1,0
37,9,1,0,0,1,0
51,8,1,867,1,2,0
80,6,1,8304,0,1,1
32,5,2,151,1,1,0
48,8,1,-583,1,7,0
49,2,1,1784,0,1,0
30,5,1,3134,1,1,0
27,7,2,49,1,2,0
34,10,1,-346,0,4,0
49,5,1,1623,1,2,1
48,5,1,60,0,2,0
40,8,1,17,0,1,0
38,2,1,2008,1,1,0
46,2,1,91,1,1,0
41,3,1,171,1,1,0
28,5,2,1027,1,1,0
51,8,1,5801,1,2,0
33,2,3,142,1,2,0
26,5,2,205,0,1,0
34,1,2,852,0,2,0
27,2,1,-584,1,2,0
42,7,1,97,0,2,0
45,1,1,204,1,2,1
31,10,2,628,1,2,0
32,5,2,311,0,2,1
39,2,1,1564,0,1,0
26,2,2,856,1,5,0
40,5,2,1509,0,2,0
52,8,1,-888,0,1,0
40,10,2,226,0,2,0
48,10,1,127,0,5,0
31,8,1,413,1,1,0
27,1,1,710,1,1,1
47,10,1,1233,1,1,1
28,5,2,171,0,1,1
40,5,3,69,1,2,0
34,1,1,1499,1,1,0
29,7,1,751,1,2,0
36,5,1,61,0,2,0
83,6,1,425,0,1,1
55,8,3,2923,1,2,0
43,5,3,99,0,3,0
23,9,2,1021,0,9,0
44,10,1,1146,0,2,0
58,2,1,781,1,2,0
29,1,2,1448,0,1,0
30,5,2,604,0,1,0
29,1,2,-194,1,1,0
35,4,1,0,1,3,0
31,10,2,1014,1,4,0
27,1,2,73,0,1,0
47,8,1,2597,1,1,0
53,7,1,2627,1,30,0
34,5,1,1906,1,3,0
34,2,1,-319,1,4,0
36,5,1,-296,1,3,0
40,10,1,169,1,4,0
37,7,2,556,0,2,0
65,6,3,300,0,2,0
53,10,3,751,1,4,0
28,10,2,126,0,1,0
33,10,3,-386,1,1,0
56,2,1,379,0,5,0
45,7,1,706,0,2,0
39,10,1,9121,0,1,0
28,5,2,1466,1,1,0
36,2,1,0,1,2,0
41,2,1,951,1,4,0
46,1,1,368,0,1,1
41,2,1,121,1,6,0
59,8,1,204,0,2,0
24,1,1,299,1,1,0
34,5,1,4170,1,1,0
40,2,1,-335,1,1,0
42,1,1,3165,1,4,0
50,8,1,254,1,2,0
25,5,2,553,1,4,0
51,8,3,518,1,1,0
50,5,1,85,0,1,0
37,2,1,603,1,2,0
21,8,2,361,0,1,0
52,2,1,-98,1,1,0
55,6,1,4424,0,4,0
26,10,2,2610,1,1,0
38,10,1,3234,0,2,1
32,2,1,687,1,1,0
31,2,1,631,1,4,0
34,10,2,341,0,1,0
33,10,2,316,0,3,0
35,10,1,2,0,3,0
44,5,1,415,1,7,0
48,5,3,507,1,1,0
29,2,1,912,1,1,0
50,5,1,0,0,5,0
37,2,1,37,1,2,0
44,1,2,2524,0,1,0
36,11,2,9019,1,3,0
49,2,3,39,1,5,0
31,2,1,0,1,1,0
49,10,3,265,1,6,0
35,2,2,0,1,1,1
57,1,3,4012,0,1,0
42,2,1,1520,1,1,0
36,2,3,-140,1,2,0
75,6,3,852,0,1,0
38,2,2,578,1,2,0
40,2,1,0,1,2,0
38,8,2,2253,1,3,1
34,5,2,1171,1,1,0
29,10,2,452,1,1,0
28,1,1,-97,1,1,0
79,6,1,4738,0,5,0
51,1,3,467,1,1,0
32,9,2,0,0,5,0
36,5,1,495,0,3,1
38,3,1,157,0,11,0
49,7,1,358,1,3,0
42,8,1,292,1,3,0
43,2,1,7343,1,4,0
34,2,1,-563,1,1,0
59,6,2,351,1,5,1
35,12,1,365,0,2,0
33,2,2,13494,1,25,0
34,1,2,846,1,2,0
64,6,1,1574,0,3,1
34,3,1,-28,1,1,0
77,6,1,0,0,1,1
57,6,1,2927,0,5,0
30,2,1,501,1,1,0
56,4,3,1238,0,1,1
49,12,1,301,0,2,0
73,6,1,1388,0,3,0
39,10,2,102,1,2,0
57,10,3,13,1,2,0
32,7,1,413,1,2,0
32,10,2,4665,1,2,1
45,1,1,638,1,9,0
32,2,1,101,1,4,0
31,5,1,1224,1,2,1
49,7,1,1103,0,2,0
29,8,1,3748,0,3,0
55,10,1,955,1,1,0
30,1,1,518,1,1,0
45,8,2,1893,1,6,1
39,10,1,14,0,2,0
36,1,1,-423,1,1,0
33,5,1,3696,0,1,0
36,5,1,2987,1,1,1
31,10,2,433,0,2,0
36,10,1,756,0,3,0
38,10,2,0,1,1,0
33,12,1,2727,0,3,0
40,10,1,93,1,2,0
31,2,1,1766,0,2,1
39,8,1,124,1,5,0
33,1,1,69,0,2,0
53,8,3,0,0,2,1
38,5,1,0,1,5,0
59,10,1,259,0,1,1
55,2,1,4103,0,1,0
38,10,2,744,1,1,0
48,8,1,116,1,4,0
53,2,1,70,1,2,0
44,1,3,432,0,3,0
57,5,1,1172,0,1,0
29,2,2,9,1,3,0
31,8,1,428,1,1,0
35,10,2,7546,1,1,0
31,2,1,620,0,1,0
35,7,1,8647,0,2,0
40,5,2,192,1,11,0
43,10,2,27733,1,7,0
44,3,1,276,1,1,0
29,10,2,113,0,2,1
40,10,1,782,1,2,0
33,3,1,82,1,2,0
46,5,1,1008,0,13,0
27,12,2,6421,0,4,0
26,1,2,443,0,3,0
41,10,1,351,1,1,0
34,10,1,5060,1,21,0
39,10,2,-41,0,15,0
27,8,2,-124,0,1,0
31,2,1,79,1,11,0
44,11,2,3945,0,1,0
55,6,1,197,0,1,0
51,2,3,837,0,2,0
50,5,1,-94,0,1,0
30,8,1,1743,1,4,0
46,10,1,57,0,1,1
49,1,1,635,0,3,0
56,6,1,-113,1,2,0
47,1,3,225,0,4,1
30,1,1,124,0,2,0
36,3,2,475,0,3,0
40,5,1,-7,0,1,0
37,10,2,375,0,2,0
42,1,3,936,0,1,1
45,10,1,1415,1,1,0
34,11,2,0,0,2,0
27,1,2,3638,0,5,0
30,2,1,-99,1,5,0
32,10,1,167,1,3,0
46,4,1,19,1,1,0
29,7,1,242,1,4,0
53,12,1,13,0,1,0
32,10,1,286,0,1,0
49,11,1,769,1,1,0
35,5,1,93,0,2,0
38,2,1,1663,1,3,0
39,3,1,238,1,1,0
34,10,2,2178,1,1,0
42,2,1,792,1,2,0
35,2,2,871,1,3,0
60,1,1,1025,0,8,0
57,10,3,63,1,1,0
31,2,2,16,0,1,0
29,5,2,417,0,1,0
41,8,1,3992,1,2,0
46,2,1,2749,1,1,0
33,10,1,133,0,1,1
32,2,2,1721,1,2,0
54,5,3,2171,1,1,1
37,8,1,4760,1,2,0
32,10,2,2979,0,1,0
43,5,1,690,1,3,0
50,2,3,203,1,1,0
34,2,1,322,1,3,0
31,1,3,1210,0,1,0
43,7,1,634,1,1,0
49,3,1,273,0,1,0
22,9,2,47,0,3,0
35,5,1,1100,0,2,0
56,1,1,0,1,2,0
53,2,1,0,0,4,0
54,3,1,1544,0,7,0
32,8,2,6145,1,1,0
41,7,1,28,1,1,0
40,2,1,1012,1,1,0
33,2,1,245,1,3,0
33,5,2,1998,0,1,0
34,2,1,3990,1,7,0
36,8,1,1328,1,4,0
34,3,1,412,1,1,0
55,5,1,229,0,3,0
28,9,2,1562,0,4,1
29,1,2,3432,1,2,0
31,1,2,144,1,11,0
52,5,1,1339,1,5,0
54,8,1,386,0,1,0
43,2,1,7727,1,8,0
55,3,1,204,0,13,0
28,2,3,101,1,4,0
45,11,3,728,1,1,0
45,3,1,2418,1,1,0
51,5,1,2934,1,4,0
42,10,2,0,1,4,0
43,12,2,181,0,1,0
34,5,1,176,0,4,0
36,2,1,49,1,2,0
37,2,1,2023,1,1,0
50,2,1,372,1,1,0
42,5,3,7702,0,2,1
34,2,2,464,1,1,0
48,5,1,117,1,1,0
47,1,1,104,1,2,0
40,5,1,1041,1,1,0
37,5,1,539,0,2,0
38,2,1,0,1,2,0
29,10,2,406,1,1,0
46,2,1,2558,1,1,0
26,2,1,484,1,2,0
30,8,2,3516,1,4,0
42,2,1,5639,1,2,0
42,5,2,100,0,2,0
31,1,2,1306,1,5,0
37,5,2,815,1,1,0
26,2,1,245,1,11,0
54,2,1,191,0,2,0
70,6,1,2815,0,2,0
29,7,2,3672,1,1,0
50,8,1,1572,1,1,0
60,11,3,385,1,1,0
32,10,2,29,0,2,0
32,10,1,84,0,3,0
34,7,2,876,1,2,0
48,8,2,1499,1,7,0
25,9,1,0,1,1,0
32,5,1,6217,1,2,0
32,2,1,329,1,1,0
47,1,3,162,1,4,0
32,10,1,14533,0,3,0
49,5,2,151,1,3,1
53,8,1,-2,1,2,0
41,2,2,4684,0,6,0
47,5,3,1149,0,2,0
35,2,1,11,1,4,0
33,5,2,8004,0,3,0
49,2,1,1019,1,5,0
46,5,3,1297,0,3,1
29,5,3,415,1,4,0
58,7,1,671,1,3,0
40,1,2,2378,1,1,0
34,5,1,417,1,1,0
60,6,1,71,0,3,0
43,5,1,1188,0,2,0
50,2,1,8139,1,6,0
33,2,1,249,1,4,0
37,2,1,689,1,2,0
55,7,1,203,1,5,0
45,2,2,-183,0,4,0
47,2,1,3451,0,2,0
58,10,1,116,0,3,0
36,8,1,1746,1,1,0
55,10,1,0,1,2,0
31,2,1,897,1,2,0
38,10,1,821,1,2,0
42,2,1,130,1,1,0
32,5,3,1,1,4,0
39,2,1,8,0,3,0
41,10,1,55,1,4,0
59,2,1,699,0,1,0
42,11,3,759,0,1,0
33,2,1,687,1,2,0
53,6,1,4968,0,1,0
43,2,1,1211,1,3,0
39,7,2,426,0,1,1
27,3,2,376,1,1,0
39,5,1,12,1,1,0
27,2,2,23,0,2,0
33,1,1,353,1,2,0
29,8,3,330,1,2,0
33,5,3,0,0,2,0
41,3,1,353,0,2,0
38,10,2,2273,1,1,0
30,5,1,0,1,1,0
58,11,1,744,0,1,0
37,8,2,608,0,3,0
36,1,3,356,1,3,0
45,2,1,1291,1,17,0
23,10,2,-306,1,2,0
53,2,1,306,0,3,1
44,2,1,-312,1,3,0
32,10,2,493,0,2,0
32,5,1,71,1,8,0
38,1,1,669,1,2,0
47,2,1,556,1,2,0
34,8,2,84,1,1,0
52,8,1,108,1,12,0
45,1,2,-11,1,1,0
50,2,1,1164,1,2,0
52,2,3,-191,1,1,1
37,2,1,132,0,2,0
51,2,1,2237,1,1,0
32,5,1,4761,1,2,0
33,2,1,-346,1,3,0
28,11,1,655,1,2,0
66,5,1,1048,1,2,0
31,8,2,0,1,2,0
35,2,1,624,1,1,0
47,8,2,1784,0,2,1
36,1,2,1281,0,2,0
32,10,2,569,0,1,0
34,2,1,1666,1,1,0
40,1,1,168,1,2,0
33,7,1,263,0,2,0
39,2,1,-405,1,1,0
38,7,1,279,1,5,0
32,10,2,0,0,4,1
65,12,1,300,0,1,0
34,11,2,415,0,1,0
34,1,2,0,1,4,0
42,2,2,1322,1,1,0
31,8,1,1062,1,1,0
47,10,1,302,1,3,0
44,10,3,809,1,4,0
38,4,1,-278,1,2,0
28,5,2,3238,1,1,0
46,1,2,751,1,2,0
51,2,3,-28,0,2,0
42,5,3,0,0,2,0
37,10,2,2442,0,3,1
58,11,1,1798,1,8,0
43,1,1,132,0,1,1
36,5,2,260,1,1,0
34,2,1,7,1,2,0
31,5,2,3283,0,1,1
49,10,1,323,1,2,0
54,5,1,2960,1,1,0
29,11,2,486,0,1,0
51,6,3,343,1,2,0
40,11,3,507,1,1,0
35,5,2,5958,1,1,1
25,9,2,304,0,2,1
32,2,2,118,1,1,1
30,7,1,123,0,1,0
38,5,1,76,1,3,0
46,1,1,70,1,2,1
43,11,1,960,1,2,0
32,10,2,2185,0,2,0
29,2,2,309,1,3,0
56,2,1,2190,0,2,0
57,10,1,0,0,8,0
38,1,1,3732,1,2,0
51,10,1,1550,0,5,0
35,1,2,62,0,1,0
37,2,1,704,0,7,0
48,5,1,4415,1,3,1
30,2,2,4,1,3,0
60,6,1,262,0,4,0
56,5,1,238,1,1,0
45,2,1,97,1,3,0
38,10,3,410,0,6,0
20,9,2,1191,0,1,0
59,6,1,-47,1,4,0
34,10,1,197,0,3,1
36,2,1,6,0,7,0
53,1,2,2398,1,1,1
51,5,1,630,1,1,0
58,6,1,235,0,4,0
48,5,1,1910,1,2,0
56,5,1,3172,1,1,0
51,2,1,872,0,2,0
35,2,1,407,1,6,0
40,1,2,100,1,1,1
59,4,1,345,0,1,0
44,5,3,2058,0,1,0
49,4,1,889,0,1,1
35,1,1,0,1,7,0
41,5,1,51,0,8,0
55,6,1,150,0,1,0
51,7,1,34,0,1,0
27,8,2,795,0,3,0
57,2,1,282,0,12,0
51,5,2,2139,0,2,0
38,5,1,-469,1,12,0
49,1,1,197,1,1,1
40,10,2,825,1,1,0
47,4,2,3232,0,1,0
48,5,3,1598,1,1,0
47,8,1,871,0,9,0
56,8,1,83,0,11,0
29,5,2,1445,0,2,1
38,10,1,226,1,3,1
32,5,1,-55,1,4,0
42,1,2,243,1,5,0
30,2,1,-336,0,6,0
26,1,2,3672,1,5,0
35,10,1,0,1,1,1
35,10,1,251,1,3,0
35,7,2,44,0,2,0
57,2,1,2887,0,10,1
29,1,2,1992,0,1,0
32,2,2,2,0,2,0
51,5,2,297,1,4,1
31,10,2,1094,1,8,0
50,7,1,-84,1,1,0
38,2,2,-1,1,1,0
37,5,1,347,1,1,0
35,5,1,1253,1,2,0
37,11,1,4565,0,1,0
28,5,2,781,0,6,0
38,5,1,7124,0,6,0
43,5,1,17555,0,14,0
43,5,1,5172,1,3,0
56,5,1,15520,0,1,0
32,10,2,13711,1,1,0
58,5,3,1533,0,2,0
47,5,1,286,0,7,0
31,2,2,-219,1,2,0
38,5,1,0,1,1,0
50,2,1,810,1,14,0
32,2,1,300,0,2,0
37,8,2,1175,1,1,0
39,5,1,0,1,2,0
40,8,1,113,1,1,0
41,2,1,641,1,1,0
45,10,1,1477,1,1,0
54,8,1,8,1,1,0
39,1,3,399,1,2,0
56,1,3,-435,1,2,0
35,1,2,2830,0,12,0
34,5,1,15,0,7,0
31,10,2,125,0,2,0
38,10,1,45,0,4,0
41,10,1,13,0,2,0
44,3,1,0,1,1,0
49,2,1,579,1,1,0
30,8,2,432,1,3,0
31,8,2,1987,1,2,0
34,5,1,857,1,6,0
70,6,1,15834,0,3,0
45,5,1,3370,0,3,0
31,5,1,6290,0,2,0
57,1,1,808,0,3,0
40,8,1,4075,1,3,0
28,2,1,373,1,9,0
44,1,2,-101,1,1,0
49,8,3,3250,0,3,0
46,5,1,1375,1,3,0
34,5,1,180,0,3,0
58,10,1,175,0,4,0
52,8,1,381,0,12,0
27,2,1,2171,1,1,0
48,10,1,340,1,2,0
33,10,3,10,1,5,0
46,1,1,4958,1,3,0
51,4,1,21244,0,2,0
31,5,1,156,0,7,1
35,10,3,473,1,4,0
37,1,2,781,0,1,0
60,3,1,0,0,1,0
40,10,1,1819,0,2,0
50,5,1,4374,1,2,0
34,3,1,456,1,8,0
32,10,1,253,1,3,0
36,8,2,774,1,2,0
32,1,2,-59,0,1,0
40,8,3,-81,0,1,0
57,5,1,0,1,1,0
46,5,1,-3,0,2,0
31,2,2,2488,1,1,0
39,10,3,3,0,1,1
35,5,1,839,1,3,0
32,2,1,103,0,1,0
44,10,3,316,1,3,0
41,10,2,1680,1,2,0
59,6,3,7179,0,1,0
39,8,1,247,1,2,0
54,5,1,8295,0,1,1
27,8,2,261,1,1,0
51,7,1,95,1,4,1
33,10,2,291,0,6,0
38,2,1,2240,1,1,0
52,3,1,0,0,3,0
54,5,3,1295,1,10,0
33,2,1,324,1,2,0
50,10,1,669,1,1,0
39,2,2,4143,1,1,0
34,5,2,2646,0,1,1
41,10,2,618,0,1,0
48,5,3,541,1,1,0
38,8,1,434,1,1,0
34,2,1,622,1,1,0
32,2,1,0,1,2,0
48,5,1,99,1,1,0
28,8,2,290,1,1,0
47,2,1,1230,1,1,1
32,1,2,45,1,3,0
32,1,1,923,1,4,0
38,5,1,950,0,2,0
86,6,1,1503,0,3,0
47,10,1,65,0,8,0
42,5,1,-679,1,1,0
44,5,1,773,0,1,0
25,9,2,10788,0,2,0
34,8,3,991,1,1,0
34,1,1,247,0,2,1
53,2,1,4143,0,3,0
42,2,1,-406,1,5,0
30,2,2,180,0,1,0
26,2,2,-887,1,2,1
40,8,1,4157,1,1,0
34,10,2,1386,1,6,0
34,8,1,2211,0,1,0
40,5,1,-495,0,2,0
36,5,1,27359,1,2,0
34,10,2,440,1,2,0
32,2,2,135,1,2,0
39,10,1,-735,1,5,0
36,10,1,60,0,2,0
39,10,3,902,1,2,1
33,5,1,18347,1,1,0
34,2,2,-72,1,5,0
42,5,1,1205,0,2,1
46,10,1,499,1,10,0
32,5,2,656,1,2,0
27,8,1,100,0,2,0
35,10,3,69,1,3,0
53,10,1,619,0,6,0
29,8,2,192,0,4,0
35,5,2,0,0,6,0
49,5,1,87,0,1,0
58,5,1,3228,0,2,0
40,5,2,1361,0,1,1
19,9,2,0,0,3,0
30,9,2,34,1,1,0
34,10,2,318,0,5,0
60,6,1,197,0,1,0
28,9,2,0,0,2,1
46,5,1,273,1,2,1
49,2,3,15,1,7,0
59,5,3,7813,1,1,0
44,10,2,-27,1,3,0
33,10,1,75,0,4,0
54,6,1,1139,1,1,0
26,2,1,115,1,3,0
54,2,1,0,0,1,0
48,4,1,7195,0,2,1
30,8,2,-477,0,2,1
29,5,2,1026,0,1,1
51,3,1,3921,1,1,0
53,11,1,980,1,1,1
43,2,1,-179,1,6,0
34,1,1,2552,1,1,0
40,3,1,1729,1,1,0
43,10,1,434,1,1,0
33,1,2,-300,1,1,0
66,6,1,4785,0,3,0
44,10,3,-329,1,1,0
33,8,1,0,1,8,0
31,10,2,391,0,2,0
71,6,1,4657,0,5,1
22,9,2,3472,0,1,1
46,11,2,705,0,1,0
32,8,1,255,1,2,0
45,2,1,4365,0,2,0
32,5,1,350,1,2,0
49,2,1,474,1,3,0
27,10,2,489,1,4,1
46,3,1,757,0,3,0
37,5,2,695,0,1,0
30,11,2,-770,1,1,0
44,7,3,80,1,2,0
45,10,1,315,1,1,0
27,9,2,213,0,1,1
57,4,1,0,0,2,0
66,5,1,2169,0,1,0
40,1,3,212,0,1,0
48,2,1,333,1,6,0
33,2,2,4404,1,3,0
42,8,3,257,1,2,1
47,11,1,3188,1,3,0
27,10,2,3083,1,2,0
78,6,1,226,0,1,0
50,8,1,1260,0,1,0
46,3,2,1410,1,1,0
41,1,3,6046,1,6,1
36,1,2,980,0,4,0
49,6,1,-37,0,2,0
46,5,3,-154,1,2,0
77,6,1,680,0,2,0
30,10,2,799,1,18,0
43,5,2,-1164,1,4,0
44,2,1,2523,1,2,0
40,2,1,98,1,5,0
38,2,1,3419,1,5,0
25,11,2,343,0,1,1
49,5,1,852,1,1,0
33,2,1,50,1,2,0
40,5,2,0,0,7,0
44,2,1,10,1,1,0
32,2,1,950,1,4,0
52,5,1,0,1,1,0
35,5,1,175,1,2,0
35,10,1,-259,1,1,0
42,10,1,-1310,1,1,0
59,2,1,139,0,1,0
44,10,2,7138,0,2,1
50,1,3,1111,1,1,0
27,2,2,113,0,17,0
55,5,3,-612,0,2,0
54,2,1,310,1,4,0
31,11,2,-186,1,3,0
56,1,1,2038,0,1,0
51,7,1,833,0,3,0
61,2,1,625,1,2,0
34,10,2,105,1,2,0
56,2,1,551,0,1,0
29,9,2,145,0,1,0
34,5,2,618,1,4,0
35,8,2,1063,1,1,0
56,1,3,985,0,2,0
45,2,1,2926,1,3,0
31,1,2,-449,1,2,0
37,3,3,66,0,2,1
43,1,1,0,1,3,0
40,5,1,419,1,1,0
44,5,1,4758,1,6,1
38,1,2,-23,0,2,0
58,5,3,1573,1,1,0
24,2,2,77,1,2,0
53,8,1,1378,1,2,0
36,2,1,-73,1,8,0
28,2,1,60,1,1,0
45,2,1,137,1,19,0
32,1,2,1583,1,1,0
46,1,1,-121,1,4,0
28,2,2,1065,1,1,0
51,11,1,-13,1,1,0
51,2,1,1869,0,3,0
30,10,2,4787,1,2,0
39,10,1,-183,1,2,0
28,2,1,702,1,2,0
31,5,2,1494,0,12,0
31,2,1,0,1,4,0
38,5,1,46,0,4,0
31,2,2,609,1,1,0
74,6,3,4079,0,3,1
40,5,2,0,1,2,1
43,10,1,7876,1,2,0
34,10,2,925,1,1,1
54,5,3,7010,0,2,0
51,2,1,42,1,2,0
33,2,1,285,0,1,0
33,5,2,3170,0,2,0
48,1,1,8,0,1,0
42,7,3,216,1,3,0
35,5,2,2975,0,2,0
25,1,1,894,1,1,0
38,2,2,490,1,1,0
45,3,1,245,1,3,0
59,5,3,0,1,8,0
47,5,1,150,0,1,0
33,5,1,4,1,5,0
59,5,1,1727,0,4,1
41,2,3,664,0,5,1
42,10,1,473,1,5,0
51,10,3,0,0,7,0
45,5,1,-192,1,3,0
30,5,1,1942,1,2,1
33,2,2,5137,1,1,0
43,5,1,13044,0,4,0
37,2,1,1053,0,3,0
73,6,1,154,0,1,0
43,2,1,625,1,1,0
52,11,1,255,0,3,0
44,5,1,529,1,4,0
56,5,1,318,0,3,0
21,8,2,1903,1,2,0
43,12,1,1937,0,1,0
54,5,1,3859,0,3,0
59,10,1,4198,0,1,1
52,2,1,230,1,2,0
31,1,2,747,1,2,1
53,1,1,263,0,7,0
24,10,2,-46,1,1,0
57,6,1,0,0,2,0
48,10,1,568,1,2,1
57,10,1,1469,1,1,0
51,10,1,18,0,6,0
50,5,3,201,1,1,0
34,2,1,1412,1,2,0
43,2,1,-93,1,2,0
31,8,1,-331,1,5,0
29,2,1,486,1,1,0
39,2,1,694,1,1,0
36,5,2,2806,1,4,0
38,11,2,0,0,2,0
56,5,3,2959,1,1,0
41,4,3,22,1,3,0
47,10,1,1167,1,1,1
38,5,2,35,1,1,0
80,6,1,8304,0,1,0
44,5,2,-1313,1,10,0
33,2,2,697,0,2,1
53,10,1,230,0,2,0
69,6,1,473,0,1,0
46,10,1,1427,1,3,0
30,5,2,201,1,2,1
31,7,2,1086,0,1,0
38,5,3,4335,1,1,0
34,8,3,44,0,1,0
48,12,1,286,0,2,0
46,2,3,216,0,1,0
42,1,1,214,1,24,0
41,2,1,343,1,7,0
33,2,1,-77,1,3,0
39,2,1,1046,0,4,0
27,9,2,1566,0,5,0
26,5,2,592,0,2,0
38,5,2,104,1,3,1
48,2,1,0,1,1,0
54,8,1,-22,0,1,0
51,8,1,0,0,3,0
47,10,1,72,0,1,0
53,10,1,100,0,4,0
35,2,1,319,1,1,0
58,5,1,9339,1,3,0
52,5,3,50,1,3,0
57,6,1,32,1,3,0
52,5,1,6922,0,1,0
35,5,2,633,1,3,0
48,10,1,4265,1,2,0
46,3,1,2262,0,14,0
39,8,1,1970,1,1,0
38,7,3,1513,0,1,0
34,3,1,4659,1,1,0
47,3,1,668,0,1,0
35,5,3,649,0,1,0
46,2,3,452,1,4,0
27,1,2,-145,1,8,0
31,2,1,-498,1,1,0
31,5,2,0,0,16,0
46,1,1,22,1,4,0
31,1,1,2304,1,2,0
33,5,1,1412,1,1,1
42,4,1,145,0,2,0
33,5,2,4897,1,1,0
40,4,1,1832,0,4,0
51,2,1,3726,0,12,0
31,11,1,591,0,2,0
62,6,3,0,0,2,1
24,9,2,508,1,3,0
48,11,1,817,0,1,1
41,10,3,348,1,2,0
43,5,1,291,1,2,0
52,10,1,3554,0,1,0
54,2,1,781,1,2,0
32,10,3,267,0,1,0
38,2,1,1327,1,1,0
41,1,1,-306,1,1,1
31,2,2,864,1,2,0
35,4,1,1265,1,5,1
26,1,1,0,0,1,0
52,10,1,214,0,3,0
58,6,1,425,1,1,0
57,4,1,3,0,2,0
34,5,1,0,1,2,0
59,2,1,0,0,2,0
27,10,2,282,0,5,0
42,3,1,0,0,1,0
47,4,2,3727,0,6,1
33,2,1,0,1,12,0
31,8,2,864,1,1,0
37,5,1,4089,1,2,1
29,2,1,-478,0,2,0
38,11,1,-363,0,2,0
35,7,1,8883,0,3,0
31,10,2,1970,0,3,0
62,5,1,1859,0,3,1
32,10,2,1059,1,1,0
31,8,1,388,1,2,0
51,2,3,602,1,1,0
29,8,2,0,0,1,0
43,2,1,255,1,1,0
36,2,1,63,1,8,0
34,7,1,712,1,3,0
29,8,1,57,1,9,0
57,6,1,523,0,6,0
43,5,1,422,0,1,0
33,8,1,386,0,1,1
60,5,1,3387,0,2,0
51,10,1,260,0,2,0
40,1,2,-1,0,1,0
51,10,1,1490,1,2,0
38,8,1,497,1,5,0
35,10,1,1707,1,3,0
47,10,1,826,1,3,0
45,2,1,907,0,8,0
40,8,1,1836,1,2,1
29,3,2,404,0,3,0
52,5,3,907,1,2,0
26,10,1,18,1,1,0
31,2,2,-495,1,2,0
55,8,1,1210,1,1,0
35,8,1,819,1,14,0
56,5,3,442,0,3,0
28,2,2,-46,1,1,1
27,9,2,671,1,2,0
30,10,1,371,0,2,0
51,10,1,-3,0,9,0
33,5,1,11,1,3,0
32,2,2,33,1,1,0
43,3,1,104,1,3,1
46,2,1,174,0,1,0
32,5,1,3107,1,1,0
40,8,1,1438,1,1,0
39,2,1,1367,0,1,0
51,2,1,-11,0,4,0
46,1,2,1693,1,1,0
43,2,1,778,1,5,0
36,10,1,837,0,6,0
48,5,1,363,0,1,0
26,1,2,236,1,2,0
39,1,2,0,1,1,0
47,5,1,-50,0,1,0
23,3,2,4,1,2,1
54,5,3,26306,1,1,0
38,1,1,46,1,1,0
33,10,1,575,0,2,0
35,1,3,148,0,1,0
52,8,1,431,0,17,0
25,10,2,777,1,1,0
29,5,1,199,1,4,1
35,10,2,3552,0,1,0
49,8,1,47,0,2,0
41,1,3,3823,0,10,0
32,5,1,138,0,4,0
29,1,2,1117,1,2,0
28,2,1,1325,1,1,0
59,6,1,0,0,4,0
34,3,1,4343,0,4,0
55,5,3,1598,0,4,0
34,5,1,3301,1,2,1
24,9,2,822,0,1,1
42,10,3,-280,1,1,0
34,5,2,1534,1,1,0
34,1,1,1671,0,1,0
51,7,1,2007,0,1,0
58,2,1,0,1,25,0
44,10,1,2776,1,1,1
33,2,1,139,1,2,1
34,5,1,573,0,1,0
34,1,1,475,1,1,0
42,2,3,47,1,1,0
46,5,2,2154,1,4,0
31,7,2,96,0,1,0
39,3,1,83,1,2,0
34,5,2,6766,0,5,0
47,10,1,3973,0,2,0
42,8,3,372,1,2,0
48,2,2,-552,0,2,0
30,7,2,48,0,1,0
38,10,1,7696,1,2,0
24,8,1,4500,1,2,1
34,10,1,1,1,1,0
46,5,2,46,0,1,0
32,1,3,-18,1,3,0
46,8,1,451,1,4,0
26,7,1,479,1,3,0
42,2,1,0,1,6,0
50,10,1,1130,1,2,0
41,2,1,389,1,6,0
34,1,2,10,0,1,0
32,8,1,401,1,2,0
58,4,2,145,1,2,0
45,10,1,115,1,1,0
28,1,2,89,1,2,0
35,10,1,94,1,5,0
39,8,1,1438,1,2,0
49,11,3,780,0,1,0
50,5,1,207,1,1,0
37,5,1,238,0,1,1
45,2,1,2433,0,2,0
30,4,2,1924,0,1,0
48,11,1,-471,1,7,0
36,5,2,1531,1,3,0
41,5,2,764,0,2,0
55,2,1,383,0,1,0
70,6,1,3782,0,1,0
41,5,1,326,1,1,1
47,8,3,691,0,6,0
34,10,2,0,0,2,0
33,5,2,99,0,1,0
58,6,1,502,1,2,0
51,5,1,-15,0,2,0
45,5,1,1929,1,15,0
55,1,1,0,0,2,0
30,2,2,185,0,1,0
33,5,2,-424,1,1,0
27,8,2,0,1,7,0
59,6,1,319,1,3,0
34,5,2,171,1,1,0
47,10,3,-1148,1,2,0
44,2,1,-11,1,1,0
35,1,2,0,1,1,1
45,5,1,-206,1,2,0
42,2,1,704,1,10,0
38,10,1,1931,0,1,0
34,10,2,943,0,4,0
35,10,1,327,1,3,0
29,5,2,-105,1,3,0
58,6,1,983,0,1,0
44,2,2,787,1,2,0
45,3,1,0,1,3,0
43,2,1,3060,1,2,0
44,8,1,5780,1,2,0
30,10,2,790,0,3,0
38,11,1,1449,0,6,0
50,10,1,1412,0,3,0
21,9,2,681,0,1,0
38,3,1,228,1,1,0
42,1,1,0,0,1,0
45,10,2,2087,0,14,0
34,3,1,2,1,1,0
48,10,1,197,0,2,0
34,8,1,0,0,4,0
32,2,1,1905,1,2,1
35,10,1,118,0,2,0
39,3,1,2644,1,1,0
36,7,1,16430,1,3,0
35,10,1,13,0,2,0
57,8,3,14,0,2,0
28,10,2,769,1,1,0
43,1,1,3485,0,1,0
57,5,1,139,0,1,0
34,8,3,202,1,1,0
36,10,1,6,1,1,0
47,5,3,2515,0,3,0
36,5,3,5195,1,25,0
33,5,1,2098,0,1,0
57,5,1,320,0,2,0
57,5,1,3431,1,1,0
34,1,1,50,1,2,0
51,4,3,370,1,3,0
54,2,3,-182,0,1,0
52,7,2,1623,1,17,0
43,3,1,13342,1,1,0
58,6,2,6570,0,3,0
53,1,1,225,1,1,0
44,5,1,-665,0,3,0
29,5,2,0,0,25,0
27,8,2,54,1,2,1
35,2,1,46,0,3,0
40,7,1,2,0,5,0
34,2,1,103,1,2,0
38,1,2,883,1,1,0
32,8,1,55,1,9,0
41,1,1,8238,1,4,0
25,2,2,913,1,4,0
38,2,3,595,1,3,0
26,10,2,7,1,2,0
37,10,2,1661,0,5,0
30,5,1,102,1,7,1
36,8,1,338,0,1,0
33,5,1,3132,1,5,0
33,1,2,490,1,1,0
35,5,1,2682,1,1,0
24,8,1,0,1,1,0
29,11,1,596,0,2,0
54,2,1,2059,1,4,0
27,1,1,132,0,2,0
34,5,1,0,0,1,0
39,2,1,385,1,4,0
38,5,1,223,0,1,0
37,5,1,0,1,13,0
26,8,2,512,1,5,0
36,3,1,1169,1,2,0
35,5,2,71,1,12,0
30,5,2,940,0,2,0
25,10,2,-80,1,1,0
34,10,1,0,1,4,0
52,12,1,1317,0,1,0
39,1,1,179,0,1,0
34,5,1,1007,1,2,0
34,5,2,0,0,4,0
30,8,1,1286,1,1,0
33,8,1,804,1,1,0
30,9,2,4,0,2,0
51,2,1,0,1,1,0
36,8,2,417,1,10,0
48,2,1,1678,0,2,0
37,8,3,532,1,1,0
58,5,1,407,1,2,0
56,5,3,659,0,1,0
34,2,1,393,1,9,0
33,1,3,661,1,1,0
26,8,2,0,0,23,0
40,5,2,838,1,3,0
35,8,1,195,1,1,0
45,3,1,68,1,1,0
37,10,2,-242,1,6,1
35,5,3,321,1,1,0
43,8,2,3403,1,2,1
28,2,1,8,1,1,0
32,2,3,739,1,1,0
26,11,2,622,0,2,1
35,8,1,152,1,1,1
35,10,2,2,0,4,0
39,2,1,1439,1,6,0
42,2,3,1491,1,2,0
32,10,2,6402,1,1,0
30,11,1,1210,0,4,0
26,5,2,122,0,1,0
30,9,2,0,1,1,0
32,5,1,62,1,1,0
47,8,1,3333,1,2,0
33,10,1,16992,1,1,0
57,2,1,23,1,8,0
35,1,1,0,1,2,0
53,10,1,6072,0,4,0
24,6,2,366,0,2,0
54,5,3,0,0,1,0
31,5,1,1343,1,1,0
41,3,1,2105,1,1,0
44,12,1,2319,0,3,0
35,8,2,35,1,1,0
30,5,1,877,0,1,0
43,2,2,30,1,17,0
51,3,1,-2082,0,6,0
60,6,1,89,0,2,0
43,7,1,104,0,1,0
31,5,1,1750,1,3,0
56,5,1,772,1,1,0
42,10,1,1048,1,2,0
52,3,1,592,0,2,0
40,10,1,0,1,2,0
36,8,1,3064,1,4,0
40,8,1,33,0,3,0
46,2,1,0,1,2,0
32,1,2,1649,0,2,0
31,4,2,287,1,1,0
41,10,3,0,1,2,0
58,4,1,419,0,3,0
36,8,1,257,1,2,0
52,10,1,118,0,20,0
42,5,1,251,0,2,0
32,5,2,1731,1,3,0
62,5,1,0,0,3,0
31,10,2,23,0,3,0
41,2,2,-386,0,1,1
34,7,1,5498,0,1,0
44,5,2,5063,0,2,1
42,2,1,7041,1,4,0
37,3,2,654,0,2,0
47,5,1,1890,0,1,0
32,11,1,2400,1,3,0
46,2,1,519,1,6,0
39,10,2,1190,0,1,0
28,8,2,229,1,1,0
26,9,2,203,0,1,0
52,10,1,1818,0,2,0
42,11,1,1289,0,4,1
33,10,3,39,0,5,0
73,6,1,796,0,1,1
35,1,2,57,0,2,0
40,5,1,1548,1,3,0
51,10,1,117,0,2,1
37,1,2,0,1,2,0
39,5,1,691,1,1,0
28,2,1,64,1,3,0
49,10,3,0,1,3,0
36,1,1,957,1,1,0
45,10,1,118,1,2,0
29,10,2,218,1,1,0
35,5,1,724,1,2,1
35,4,1,20,1,3,0
30,2,1,-28,1,2,0
46,2,1,665,0,4,0
25,9,2,5,0,1,0
36,5,1,925,0,3,1
42,2,1,2519,1,4,0
57,1,1,3927,0,1,0
42,5,3,401,1,9,0
29,5,1,581,1,2,0
36,10,1,1327,0,2,0
31,11,1,3242,0,2,0
59,10,1,3163,1,2,0
50,11,3,32,0,2,0
47,1,1,310,1,6,0
46,4,1,0,0,1,0
26,2,2,155,1,1,0
31,8,2,11386,1,1,0
30,8,1,1380,1,2,0
47,2,2,2443,0,1,0
23,10,2,1129,1,1,1
44,11,2,4232,0,1,0
42,7,1,5564,0,2,0
32,8,2,-402,1,1,0
28,1,2,1323,1,1,0
57,6,1,1623,1,1,0
38,10,1,1042,1,2,0
22,9,2,2488,0,2,1
54,1,1,865,1,1,0
32,10,1,-1053,1,3,0
32,5,1,1667,1,2,0
59,1,3,975,1,4,0
45,10,1,2571,0,2,0
53,12,1,732,0,2,1
50,1,3,769,0,2,0
34,10,1,-136,1,2,0
35,1,3,3636,0,2,1
30,5,1,931,0,1,0
62,4,1,565,0,3,0
40,2,1,271,1,2,0
26,7,2,1153,0,3,0
34,5,1,-73,1,1,0
50,12,1,558,0,1,1
31,12,3,137,0,9,0
35,10,1,700,1,2,0
55,6,1,-966,0,1,0
34,1,1,96,0,2,0
58,6,1,4007,0,4,0
50,5,2,567,1,8,0
31,10,2,40,0,2,0
47,1,3,136,0,1,0
38,7,2,917,1,1,0
46,5,2,593,1,3,0
42,2,1,505,1,2,0
34,2,1,2542,1,1,0
37,5,1,5355,0,4,1
38,9,2,807,0,2,0
59,6,1,9976,1,2,0
32,1,1,0,0,3,0
55,5,1,540,0,2,0
35,2,1,280,1,50,0
56,5,3,-59,0,6,0
27,1,1,-517,1,3,0
42,11,2,2613,1,6,0
42,9,1,-7,0,6,0
41,2,1,0,1,3,0
53,6,3,-200,0,1,0
67,6,1,2301,0,1,0
53,4,1,104,0,1,1
33,2,1,191,1,2,0
31,10,2,694,1,2,0
31,1,1,212,1,3,0
30,5,1,1882,1,5,0
48,2,1,131,1,1,0
30,10,2,175,0,4,0
43,10,2,0,0,4,0
38,5,3,4425,1,1,0
46,11,1,3533,1,2,0
59,2,3,3573,0,1,0
44,5,3,476,1,2,0
35,2,1,1257,1,3,0
55,2,1,23,0,1,0
39,5,2,0,1,2,0
36,8,2,398,1,2,0
33,2,1,745,1,4,0
48,5,2,8106,0,1,0
33,5,2,0,0,4,0
67,6,1,696,0,2,0
48,11,3,1266,1,1,0
57,5,1,2416,0,2,0
31,4,1,25,0,5,0
30,9,2,7513,0,2,0
56,3,3,29,0,2,0
26,2,1,5116,1,3,0
44,5,1,-1746,1,1,0
44,10,3,14,0,1,1
31,5,1,4148,1,3,1
47,7,1,14,1,1,0
30,1,2,105,1,1,0
37,5,1,767,0,1,0
56,1,3,0,0,1,0
43,5,2,-228,1,2,0
42,8,1,508,1,1,0
60,5,1,725,1,1,0
34,2,1,41,1,9,0
34,5,2,184,0,4,0
41,5,1,251,0,3,0
38,5,3,-17,0,4,0
23,8,1,-19,1,10,0
33,5,1,1064,1,1,1
36,2,1,777,1,3,0
49,11,1,377,0,1,0
34,1,3,479,1,1,1
40,10,3,-375,1,5,0
72,6,1,796,0,2,0
43,10,1,17,1,4,0
44,2,1,1071,1,3,0
35,1,1,0,1,5,0
46,1,3,7378,0,1,0
55,1,1,865,1,1,0
50,10,3,-701,1,1,0
23,2,2,817,1,1,0
34,9,1,1387,0,1,0
40,2,1,0,1,3,0
61,6,1,2917,0,1,1
53,10,1,4541,1,6,0
57,10,1,0,0,1,0
28,2,1,4287,0,1,0
25,1,1,242,1,12,0
38,2,1,171,1,1,0
27,8,2,259,1,10,0
45,2,1,827,1,5,0
31,8,2,469,0,1,0
39,2,1,2226,1,1,0
42,10,1,0,0,12,0
46,5,1,477,1,6,0
36,8,1,42,1,4,0
30,5,2,775,1,2,0
32,2,1,9,1,2,0
52,10,1,2557,0,5,1
31,5,1,2395,0,1,0
60,5,1,4895,0,1,0
35,2,2,376,1,3,0
38,5,1,389,1,1,0
46,5,3,134,0,2,0
45,3,3,1273,1,3,0
59,8,1,0,1,3,0
34,5,1,2892,1,7,0
33,10,3,0,1,2,0
46,5,2,295,1,6,0
48,1,1,292,1,6,0
31,8,2,85,0,1,0
32,10,1,4,0,2,0
35,2,3,-587,1,1,0
36,2,2,367,0,1,0
52,5,1,-1224,1,4,0
45,5,3,959,0,1,0
34,5,1,0,0,2,0
25,2,1,-589,1,1,0
26,5,2,-8,0,2,0
57,5,1,0,0,1,0
48,5,1,247,1,1,0
48,10,1,5543,0,5,0
32,2,1,642,0,1,0
58,6,1,11,0,1,0
57,5,1,-226,1,1,0
31,3,1,5191,0,2,0
33,2,2,-320,0,2,0
53,3,1,2289,1,1,0
36,1,1,725,1,3,0
32,10,2,705,1,4,0
45,2,1,776,1,4,0
35,11,1,816,1,7,0
41,8,1,171,0,9,0
54,8,1,812,0,6,0
49,8,1,823,0,4,1
28,10,2,1453,1,1,0
24,2,2,431,1,12,0
30,1,2,1009,1,1,0
32,7,1,286,1,1,0
53,3,1,22370,1,1,0
42,2,1,2111,1,2,0
48,2,1,5366,1,3,0
33,10,1,181,1,2,0
31,2,3,-452,1,5,0
56,11,3,1770,0,3,0
58,6,1,0,0,1,0
37,1,2,-296,1,1,0
59,5,1,2358,1,1,0
50,5,2,1200,0,3,1
39,4,2,109,1,3,0
30,10,1,616,1,1,0
47,8,3,4906,1,1,0
44,7,1,313,0,4,0
38,2,1,290,1,1,0
50,5,1,1240,0,2,0
27,1,2,3672,1,2,0
73,6,1,19,0,2,0
46,2,1,143,1,1,0
56,6,3,212,0,1,0
36,5,1,9,0,4,1
33,2,1,3074,0,1,0
40,5,1,1734,1,1,0
52,5,1,575,0,1,0
51,2,1,397,1,2,0
33,2,1,640,1,3,0
54,8,1,158,1,1,0
44,5,1,2984,1,2,0
50,3,1,1011,1,2,0
45,2,2,0,1,1,1
36,5,1,1133,1,1,1
42,10,1,4945,1,2,1
37,10,1,712,1,2,0
28,8,2,-427,1,2,0
56,1,1,2146,0,1,0
59,1,1,92,1,2,0
32,11,1,10,1,4,0
57,6,1,1238,1,1,0
49,1,2,981,1,3,0
56,3,1,575,0,2,0
48,1,3,-70,0,1,0
27,9,2,3733,1,1,1
31,5,2,574,1,2,0
28,2,2,43,0,1,0
36,5,1,428,0,1,0
58,4,1,0,1,1,0
46,1,1,0,1,2,0
32,5,2,474,1,3,0
39,8,1,-540,0,1,0
35,7,1,560,1,1,0
31,5,1,325,1,2,1
29,5,2,437,0,1,1
48,2,1,574,0,1,0
60,6,1,0,0,3,0
74,6,1,935,0,1,0
30,8,1,699,1,1,0
52,1,2,0,0,11,0
24,2,1,-220,1,1,0
29,8,1,11417,1,2,0
33,4,1,212,1,2,0
34,2,1,67,1,3,0
45,1,3,0,0,1,1
31,2,1,0,0,2,0
45,10,1,1673,0,1,0
27,8,1,-1202,1,2,0
30,5,2,4213,0,4,0
45,2,1,0,0,2,0
57,2,1,1521,1,2,0
34,5,1,1310,0,3,0
40,1,1,0,1,1,0
39,5,1,399,0,1,0
46,10,1,405,0,3,0
55,5,3,9756,1,2,1
25,5,2,2506,0,1,1
34,5,1,697,0,1,0
37,2,1,403,1,2,0
64,6,3,890,0,3,0
45,10,3,809,1,2,0
57,4,1,158,1,1,0
21,9,2,137,1,3,0
58,4,1,2705,0,1,0
41,2,2,75,1,9,1
41,5,1,2457,1,1,0
58,5,1,541,1,1,0
33,5,1,287,1,2,0
32,5,1,273,1,3,0
44,8,3,0,1,5,0
47,12,1,677,0,1,0
41,7,1,340,0,3,0
54,10,1,98,0,4,0
47,10,3,477,1,1,0
32,5,2,2629,0,4,0
59,4,1,0,0,2,0
29,10,2,2325,0,1,1
48,8,1,-20,0,2,0
32,10,2,230,1,1,1
46,5,3,-852,0,2,0
31,2,2,-280,0,3,0
53,2,1,25,0,2,1
34,10,2,9851,1,5,0
48,8,2,5095,1,1,0
32,10,1,687,0,4,0
31,5,1,1368,1,4,0
27,2,2,-179,1,2,0
60,1,1,-396,1,1,0
34,2,2,1011,1,1,0
52,7,1,9,0,1,0
48,2,1,1159,1,9,0
45,10,1,-322,0,2,0
54,10,3,1114,1,1,0
52,8,1,2072,0,1,0
47,3,1,459,1,4,0
54,12,1,1157,0,2,0
34,2,1,8309,1,1,0
39,10,2,1043,0,10,0
46,10,1,2098,0,2,0
26,11,2,461,0,1,0
37,10,2,61,1,8,0
47,2,1,1203,1,2,0
35,10,1,1067,0,6,0
57,11,1,0,0,1,0
34,5,1,1657,1,2,0
47,10,1,1219,0,4,1
27,10,1,7,1,2,0
40,2,1,-839,1,2,1
39,10,1,994,0,1,0
36,3,1,6,0,1,0
42,10,2,0,0,2,0
23,2,2,8627,1,1,0
34,5,1,133,1,1,0
34,2,1,247,1,5,0
49,8,1,1114,0,1,0
57,2,1,1592,0,4,0
59,6,1,0,0,6,0
57,1,1,46,0,2,0
34,2,1,1221,1,1,0
61,5,1,985,0,6,1
35,2,3,0,1,1,0
42,5,1,520,0,1,0
57,8,1,10,0,3,0
42,2,1,2157,1,1,0
53,6,1,6095,1,5,0
63,6,1,133,1,2,0
47,7,1,1121,0,6,0
54,8,1,88,1,1,0
45,1,1,0,0,10,0
28,5,2,-328,1,2,0
58,11,1,610,1,2,0
48,5,2,414,0,2,0
35,5,3,0,1,1,1
37,7,1,0,0,1,0
37,2,1,685,1,1,0
37,5,1,22856,0,1,0
25,8,2,-352,0,1,0
58,2,1,602,1,1,0
52,5,1,-588,1,4,0
19,9,2,302,0,1,1
59,2,1,5314,1,3,0
41,10,1,64,1,2,0
34,10,2,632,0,10,0
35,10,2,5731,1,2,0
41,10,1,902,0,6,0
28,2,2,6307,1,1,0
53,5,3,112,0,3,0
35,8,1,0,0,1,0
33,1,2,621,0,1,0
37,10,2,435,1,1,0
32,10,1,782,1,4,0
32,2,1,478,1,1,0
54,8,1,7864,1,4,0
44,2,1,1910,1,1,0
36,10,3,1174,1,2,0
56,1,1,1270,1,2,0
30,5,2,18,0,11,0
36,2,1,141,1,3,0
43,5,1,2886,0,1,0
40,10,1,2715,1,2,0
32,10,2,1100,1,1,0
34,2,1,516,1,1,0
37,8,1,1,0,2,0
28,1,2,775,0,2,0
35,12,1,634,0,2,0
53,2,2,5715,0,2,0
60,1,1,1088,1,1,0
40,3,1,1532,1,7,0
57,6,1,75,0,2,0
29,10,2,103,0,1,0
44,2,1,134,1,1,0
41,1,2,748,0,7,0
47,10,1,1990,1,4,0
43,10,1,192,0,2,0
37,10,2,267,0,1,0
34,10,2,586,1,2,0
30,2,2,648,1,1,0
57,3,3,25,1,1,0
26,1,2,96,1,2,0
34,5,1,1116,1,5,0
46,10,3,-90,0,1,1
38,3,1,170,1,1,1
37,10,2,3665,0,3,1
28,5,2,2380,0,2,0
57,2,1,179,0,3,0
39,5,1,763,1,7,1
49,8,1,320,0,4,1
38,10,1,1960,1,2,0
27,2,1,818,1,5,0
30,1,1,2678,1,5,0
38,1,1,1980,0,2,0
36,5,1,1582,0,2,0
38,6,2,62,0,1,0
59,4,1,235,0,2,0
37,5,1,489,1,5,0
29,7,1,3931,1,4,0
43,2,1,699,1,2,1
33,10,1,58,1,2,0
54,4,3,1327,0,2,0
55,8,1,557,0,1,0
32,10,2,741,1,1,0
48,5,1,3230,1,3,0
33,5,2,1439,1,2,0
46,1,1,120,1,11,0
44,5,1,1058,0,3,1
47,2,1,881,1,1,0
38,10,1,6728,0,1,1
80,6,1,462,0,2,0
40,7,1,167,1,4,0
43,3,1,1574,1,3,0
32,10,2,1625,0,1,1
39,5,1,562,0,2,0
33,10,1,9305,1,2,0
31,10,2,35,0,1,0
36,5,2,0,0,2,0
35,5,2,2486,1,1,0
25,8,2,368,0,1,0
33,5,2,1558,1,1,0
31,5,2,2590,0,2,0
36,5,1,0,1,3,0
44,10,2,900,1,2,0
31,5,2,385,1,1,0
55,2,1,1649,1,3,0
51,4,3,9228,0,4,1
36,1,1,0,1,2,0
27,11,2,1,0,2,0
40,8,1,771,1,4,0
49,8,1,280,1,3,0
59,6,1,46,0,2,0
32,5,1,2431,1,5,1
42,6,2,308,0,2,0
35,5,3,160,1,6,0
29,2,2,555,1,4,0
29,10,2,778,1,2,0
37,2,2,48,0,2,0
49,1,1,169,1,3,0
51,8,3,12,1,1,0
61,4,1,848,0,1,0
43,5,1,481,1,1,0
42,8,1,12223,1,1,0
24,2,1,-254,1,2,0
46,7,1,1148,0,2,0
23,1,2,5,0,1,0
26,8,2,50,1,1,0
43,2,3,92,1,2,0
35,10,2,470,1,13,1
38,10,1,0,0,4,0
56,11,3,109,0,4,0
31,8,1,440,1,3,0
32,5,2,0,0,4,1
28,8,2,2685,0,1,0
26,1,3,-3,1,5,0
49,5,1,7007,0,2,0
33,1,1,220,1,1,0
80,6,1,1548,0,2,0
40,2,1,326,1,1,0
42,10,3,0,1,6,0
46,2,1,123,0,3,0
32,5,2,697,0,1,0
37,8,2,223,1,1,0
32,9,1,1694,1,1,0
53,5,1,4446,1,1,0
39,5,1,894,1,1,0
31,10,3,202,1,1,0
34,5,2,0,0,2,0
44,10,1,1707,0,3,0
35,10,1,13658,1,2,0
39,1,1,406,0,5,0
55,8,1,96,0,2,0
34,4,1,0,1,1,1
39,10,1,-276,0,4,0
58,6,1,413,0,5,0
37,2,1,655,1,2,0
56,6,3,694,0,1,1
32,1,2,10218,1,2,0
41,10,2,1646,1,1,1
29,1,2,14,0,1,0
44,5,1,7635,0,5,0
24,2,1,9,1,7,0
43,5,2,1029,1,1,0
26,1,1,2855,0,3,0
39,1,1,260,1,1,0
49,2,1,2039,1,1,1
52,2,3,-97,1,4,0
33,2,1,1465,0,4,0
30,2,1,125,1,2,0
32,10,2,930,0,7,0
27,5,2,0,1,4,0
58,2,1,73,0,1,0
46,6,1,-35,1,3,0
28,5,2,1351,0,1,0
39,8,1,1601,1,2,0
41,8,1,88,1,1,0
38,8,1,435,1,2,0
50,11,3,717,1,1,0
56,8,1,705,1,2,0
34,10,1,1553,0,2,0
33,2,3,-131,1,1,0
61,10,1,1191,0,4,1
36,1,2,47,0,6,0
34,10,1,544,1,2,0
36,2,1,688,1,2,0
45,5,1,242,0,1,1
27,9,2,118,0,1,0
45,1,1,-388,1,2,0
40,7,1,1603,0,1,0
36,5,2,1511,1,1,1
46,2,1,147,1,2,0
37,3,1,836,1,2,0
36,10,1,55,1,2,0
37,1,1,1123,0,1,0
22,9,2,691,0,1,1
49,10,1,12531,0,8,0
35,5,1,552,1,2,0
50,4,1,0,0,2,0
31,8,1,309,1,1,0
47,8,2,33,1,1,0
59,2,1,681,1,2,0
32,2,1,1787,1,4,0
71,6,1,14220,1,1,1
31,5,2,12569,0,1,1
41,2,1,4,0,5,0
35,2,1,3587,1,4,0
36,5,1,254,0,3,0
46,2,3,1712,0,1,0
46,2,1,4855,1,1,0
47,10,1,2408,0,1,0
35,5,2,252,1,2,0
37,2,1,346,1,1,0
56,1,1,45,0,1,1
46,1,1,556,1,3,1
44,5,3,-710,1,1,0
48,10,2,-551,1,2,0
28,2,2,56,1,1,0
38,3,1,1514,0,3,0
34,5,2,178,1,2,0
56,10,1,359,1,4,0
55,6,3,1580,0,1,1
44,2,3,221,0,13,0
38,10,1,1161,1,1,0
53,6,1,1278,1,3,0
41,1,2,982,0,1,0
34,10,2,16,0,1,1
34,5,2,1,0,1,0
35,8,1,128,1,1,0
38,3,2,2543,0,1,1
42,3,1,42045,0,2,0
56,2,1,828,1,1,0
37,5,3,0,1,6,0
47,4,1,3940,1,2,0
29,2,1,125,1,1,0
41,5,1,140,1,3,0
43,10,2,593,1,1,0
38,7,1,746,0,3,0
31,10,1,589,1,1,0
32,5,2,2343,0,1,0
40,5,1,294,1,5,0
45,1,1,644,0,1,0
43,5,1,-26,1,1,0
27,8,2,3354,1,5,0
33,5,2,23,0,3,0
37,1,1,7,1,7,0
60,1,1,3735,0,1,1
51,7,1,2094,0,6,1
44,2,1,508,1,1,0
48,5,1,0,1,1,0
57,2,1,93,1,1,0
29,10,2,0,1,2,0
50,8,1,26394,0,4,0
36,8,1,-11,1,28,0
49,10,1,523,1,2,1
49,10,1,-74,1,1,0
35,5,1,0,0,1,0
39,10,2,122,1,1,0
34,2,1,351,0,11,0
57,7,1,35,0,3,0
37,10,3,2610,1,1,0
25,8,2,64,0,11,0
43,2,1,60,0,2,0
37,2,1,342,1,2,0
36,2,2,1830,0,1,0
49,5,3,1904,0,2,0
38,5,2,16957,1,1,0
39,5,3,26,0,5,0
40,5,1,0,0,1,1
34,1,1,79,1,1,0
39,2,1,2303,1,3,1
53,2,1,65,0,18,0
44,5,1,332,1,5,0
32,10,3,-399,1,1,0
50,10,3,-54,1,2,1
29,8,1,-102,0,1,0
55,11,1,4809,1,2,0
73,6,1,279,0,3,1
52,10,1,11,1,1,0
49,8,1,2201,1,3,0
63,6,1,8044,0,1,0
34,1,1,2374,1,1,1
32,1,2,92,1,1,0
49,4,1,443,0,6,0
40,2,1,1397,1,2,0
53,3,1,7,0,1,0
53,10,1,3177,0,2,0
43,2,1,232,0,1,0
35,5,2,81,1,1,0
35,8,2,414,1,5,0
25,9,2,1433,1,1,0
31,10,2,187,0,1,0
48,5,1,0,0,16,0
40,4,1,4610,0,2,0
46,2,1,1429,1,1,0
30,8,2,334,0,2,0
47,8,1,2,0,15,0
23,8,2,500,1,3,0
29,10,1,43,1,2,0
38,10,1,4030,1,2,0
56,4,1,306,0,1,0
52,1,1,0,0,2,0
55,6,1,168,0,2,0
43,3,1,210,0,2,0
34,2,1,518,1,1,0
43,5,2,1696,1,1,1
55,8,1,-31,0,2,0
34,2,1,856,1,1,0
34,5,2,318,1,2,0
43,7,1,64,0,2,0
39,2,1,800,1,6,0
39,10,2,75,0,1,0
34,10,2,347,1,2,0
55,5,1,2366,1,4,0
67,6,1,701,0,2,1
34,3,1,475,1,1,0
47,2,1,3285,0,5,0
33,2,1,925,0,3,0
45,3,1,128,0,2,0
36,2,1,1587,1,2,0
59,10,3,879,1,1,0
33,8,1,478,0,2,1
52,10,3,280,0,5,0
53,2,1,1868,0,4,0
41,11,1,819,0,3,0
45,2,1,4646,1,1,0
60,7,2,27,0,2,0
32,2,1,736,1,3,0
28,5,2,224,1,3,0
31,10,2,2544,0,1,1
53,2,1,427,0,4,0
58,5,1,2764,0,1,0
38,2,1,376,1,1,0
46,5,1,523,1,4,0
53,3,1,71,0,1,0
56,6,1,3948,0,1,0
52,8,2,1810,0,1,0
38,10,1,994,0,1,0
37,8,1,52,1,1,0
37,2,1,11,0,8,0
37,10,1,0,0,1,0
66,6,1,747,0,3,0
44,2,1,2657,1,2,0
61,6,1,313,0,1,0
34,1,1,61,0,1,0
33,1,2,2557,1,1,0
30,8,3,0,1,1,0
27,8,3,10,1,1,0
37,8,1,658,1,1,0
38,2,1,1679,1,18,0
35,5,2,0,0,4,0
50,10,1,841,1,2,0
39,5,1,0,1,3,0
35,5,1,1160,1,3,0
36,1,3,-37,1,1,0
28,8,2,94,1,1,0
39,7,1,585,1,1,0
39,7,1,235,0,1,0
30,2,2,2145,1,2,1
32,8,1,1464,1,1,0
28,10,1,232,1,1,0
47,10,1,187,1,1,0
53,5,1,12,0,10,0
57,2,1,318,1,2,0
47,8,1,405,0,2,1
56,5,1,334,1,2,0
38,1,1,0,1,32,0
52,2,1,2,0,3,0
46,10,1,966,1,2,0
57,2,1,195,0,4,0
42,2,3,0,0,2,0
51,4,1,260,0,5,0
53,7,1,451,1,1,0
37,2,1,3242,1,1,0
47,7,3,8515,1,7,0
48,5,1,1808,1,1,1
39,2,1,20,1,1,0
42,2,1,3068,1,2,0
36,5,1,23,0,11,0
34,10,2,1076,0,2,0
61,6,1,1060,1,1,0
32,1,2,678,1,1,1
35,2,2,1147,1,1,0
54,2,1,-630,0,1,0
31,5,1,459,0,14,0
45,10,3,976,1,1,0
32,4,1,357,1,2,0
52,11,1,-9,0,1,0
36,1,2,1927,1,1,0
31,8,1,500,1,18,0
53,10,1,9146,0,4,0
43,3,1,59,0,2,0
47,4,1,0,0,2,0
46,2,1,328,1,8,0
34,5,3,291,0,2,0
55,10,2,-703,1,3,0
23,1,2,589,1,1,0
75,2,1,6053,0,2,0
58,1,1,1142,0,3,0
35,1,1,725,1,7,0
27,5,1,802,0,1,1
24,10,1,556,1,2,1
48,1,1,191,1,3,0
31,10,2,373,0,5,0
57,10,1,6164,0,2,0
53,5,1,37,0,9,0
42,2,1,1156,1,1,0
50,3,1,806,1,8,0
59,1,1,2381,0,2,0
38,8,1,-314,1,2,0
39,2,1,285,1,1,0
28,2,2,1199,1,20,0
55,5,3,481,1,2,0
33,10,2,137,0,4,0
36,2,2,168,1,1,0
38,1,3,156,1,3,0
28,1,2,4745,0,1,1
32,5,2,11797,1,2,0
35,1,1,786,0,1,0
58,10,1,4015,0,3,0
30,8,1,0,1,1,0
33,2,1,331,1,7,0
36,2,1,1554,1,4,0
32,8,1,132,1,2,0
34,5,2,5086,0,4,1
42,1,1,529,1,3,0
41,5,1,4824,0,7,0
63,6,1,474,0,1,1
38,1,3,86,1,1,0
54,2,1,2281,1,1,0
39,8,1,186,1,1,0
46,2,1,137,0,3,0
37,10,1,6968,0,1,0
76,6,3,86,0,1,0
28,5,2,81,0,1,0
33,8,1,6904,0,2,0
46,7,1,137,1,1,0
30,9,2,25,0,1,0
60,5,1,759,0,2,0
56,4,1,1922,1,2,0
24,9,2,3298,1,1,0
58,6,1,764,0,4,0
79,6,1,8556,0,2,1
32,2,1,3514,1,2,0
33,8,1,0,1,2,0
77,6,1,680,0,4,0
60,4,1,0,0,1,0
54,5,1,2819,0,3,0
30,2,1,-518,1,6,0
50,8,1,60,0,8,0
50,5,1,732,0,7,0
37,10,1,2707,1,1,0
41,10,1,177,1,2,0
49,1,1,13229,0,2,0
41,2,1,-204,1,1,0
40,10,1,990,1,3,0
38,2,1,648,1,1,0
34,10,1,50,0,3,0
49,3,1,1916,0,3,0
72,6,1,763,0,2,1
34,2,1,470,1,1,0
31,10,1,0,0,4,0
33,2,2,5739,1,1,0
31,5,1,0,0,1,0
55,5,1,-375,0,2,1
25,11,1,157,1,31,0
34,5,1,1518,1,2,0
53,5,1,1343,0,4,0
39,5,2,-401,1,4,0
41,5,1,5310,1,1,1
32,2,2,2285,1,2,0
29,1,1,22171,1,1,0
56,5,1,856,1,4,0
19,9,2,1169,0,18,0
39,5,2,3797,0,2,0
32,2,2,53,1,1,0
43,2,1,2519,1,2,0
32,3,1,795,0,3,0
53,1,3,0,1,2,0
52,2,1,2087,1,1,1
43,10,2,34,0,1,0
48,10,1,5,0,6,0
27,10,2,15,1,3,0
27,5,2,390,0,1,0
51,5,1,712,0,2,0
39,1,2,2600,1,1,0
33,2,1,-241,1,1,0
50,2,3,1545,1,1,0
59,6,3,1026,0,1,1
58,4,1,435,1,6,0
54,10,1,876,0,3,1
60,2,1,1801,0,1,0
38,5,1,2278,1,1,0
39,2,1,157,1,6,0
40,1,1,1327,1,2,0
55,2,1,284,0,4,0
31,1,2,1588,1,1,0
38,8,1,0,1,2,0
52,5,1,428,1,1,0
45,1,1,542,0,5,0
32,2,1,66,0,1,0
58,2,3,314,0,2,0
35,5,1,24,1,1,0
36,5,2,613,0,2,0
55,6,1,1467,0,2,0
45,2,1,192,1,5,0
49,5,1,321,0,3,0
44,2,1,788,1,1,0
37,2,3,48,1,2,0
35,2,1,262,0,2,0
36,2,1,4438,1,1,1
44,8,2,5045,1,6,0
32,2,2,3014,1,2,0
56,5,1,21664,0,8,0
32,5,1,5878,0,2,0
35,3,1,2723,1,4,0
44,5,1,576,1,3,0
59,3,1,0,0,2,0
31,2,2,2197,1,3,0
60,2,1,104,1,1,0
33,10,2,1279,1,2,0
45,1,1,295,1,1,0
45,2,1,2128,1,4,0
57,1,1,367,0,2,0
36,5,1,1477,0,2,0
30,2,2,71,1,6,0
30,1,2,127,1,6,0
59,11,3,2921,0,1,0
58,5,1,16264,0,3,0
49,6,1,1672,0,3,0
48,10,1,9207,0,3,0
28,10,2,356,0,2,0
59,5,3,133,1,1,0
40,5,1,1217,1,1,0
32,10,3,202,1,1,0
58,2,1,590,0,1,0
28,7,2,442,0,3,1
27,10,2,808,1,1,0
38,5,2,427,1,3,0
53,10,1,431,1,1,0
60,8,1,4256,1,3,1
33,5,3,0,1,8,0
52,8,3,238,1,1,0
64,6,1,846,0,1,1
40,2,2,3,0,1,1
52,1,1,693,0,1,0
28,9,2,0,1,3,0
49,5,1,362,1,2,0
28,10,2,618,1,1,0
29,10,2,2893,1,1,0
87,6,1,230,0,1,1
37,5,3,1287,1,1,0
36,8,1,179,0,1,0
35,7,1,980,0,2,0
33,1,1,79,1,2,1
60,1,1,3043,0,3,0
25,5,2,808,0,2,1
69,6,1,745,0,1,0
41,9,1,1309,0,4,0
48,5,2,290,1,2,0
35,2,3,1792,1,6,1
30,2,2,178,1,5,0
59,5,1,0,0,4,0
32,5,2,537,0,3,0
28,2,2,416,1,2,0
60,2,1,1472,0,4,0
36,5,1,3953,1,1,0
32,5,2,112,1,1,0
34,5,3,13204,1,2,0
58,2,1,0,0,5,0
53,5,1,2240,1,2,1
31,5,1,22546,1,6,0
33,1,1,0,1,7,1
46,11,3,23,0,1,0
29,2,1,228,1,8,0
37,7,1,215,1,1,0
58,2,1,23,1,6,0
34,5,1,293,1,3,0
34,2,3,0,0,1,0
49,3,1,199,0,2,0
53,1,1,459,0,1,1
42,11,1,8131,1,1,0
40,8,1,-378,1,1,0
30,2,2,395,0,1,0
31,10,3,10787,1,2,0
36,5,1,340,1,2,0
31,2,2,1882,0,2,0
26,5,1,265,0,2,0
31,1,1,389,1,1,0
49,1,1,0,1,7,0
54,5,1,384,1,7,0
47,5,3,94,1,19,0
61,5,1,1471,0,2,0
49,2,1,937,1,1,0
51,10,1,500,1,6,0
53,2,1,25,1,3,0
35,5,1,365,0,2,0
25,11,2,34,0,1,0
79,6,1,429,0,2,1
53,10,1,6839,1,1,0
21,9,2,6,0,1,0
33,2,1,467,1,2,0
40,7,3,1876,0,1,0
34,3,1,1847,1,3,0
52,12,1,247,0,6,0
27,1,1,897,0,1,1
57,8,3,4664,0,4,0
51,7,3,1291,1,2,0
31,9,2,64,0,1,0
49,11,1,-471,1,3,0
32,5,2,1160,1,2,0
28,1,2,14,0,1,0
33,2,1,26,1,3,0
50,2,1,452,0,2,0
42,2,2,382,1,1,0
45,1,1,2033,0,1,0
34,11,1,0,1,1,0
56,1,3,789,1,1,0
33,2,2,142,1,1,0
34,1,1,645,1,1,0
37,2,1,897,1,2,0
37,2,1,103,1,1,0
35,1,2,847,1,2,0
38,12,2,0,0,3,1
32,2,1,517,1,1,0
52,10,2,1308,1,1,0
49,8,1,66,1,4,0
46,5,3,361,1,7,0
42,3,1,66,1,1,0
36,2,1,70,1,4,0
32,8,1,180,1,2,0
49,10,1,279,1,4,0
46,8,1,4,0,1,1
40,3,1,1416,1,2,0
36,1,1,465,1,1,0
36,1,1,998,1,2,0
34,10,1,550,0,1,0
46,5,1,1285,1,1,0
32,8,1,4908,0,2,0
32,11,2,336,1,1,0
32,5,2,131,0,3,0
43,5,1,348,0,3,0
25,7,2,453,1,1,0
55,1,1,1102,1,2,0
24,1,2,926,1,1,0
40,5,3,502,1,4,0
38,5,2,8669,1,3,0
48,2,2,316,0,2,0
36,5,1,9324,1,8,0
57,5,1,0,0,4,0
45,1,1,72,1,2,0
33,7,2,61,0,3,1
38,10,2,173,0,4,0
26,8,2,-162,1,2,0
30,5,2,47,0,17,0
55,8,3,1983,1,1,0
34,2,1,326,1,2,0
60,1,1,2552,0,2,0
36,5,2,1283,0,5,0
65,4,1,2179,1,7,0
39,7,1,1047,0,1,1
52,2,1,36,0,2,0
55,10,1,-308,0,1,1
26,5,2,1177,0,1,0
40,7,1,2077,1,1,0
52,3,1,0,0,2,0
29,7,1,1,0,3,0
41,2,1,7735,1,1,0
30,10,2,1922,1,1,0
28,9,2,153,0,2,1
26,2,1,2770,1,1,0
58,5,1,139,0,1,0
29,5,2,21,1,4,0
48,10,1,178,1,4,0
35,2,1,444,1,3,0
26,8,2,209,1,2,0
49,2,1,3096,0,2,0
34,1,1,5320,0,6,0
32,8,1,4885,1,2,0
31,1,1,0,1,3,0
48,11,1,5462,0,4,0
40,2,1,6767,1,2,0
42,10,3,2974,1,5,0
48,10,1,427,0,1,0
38,8,1,8876,0,1,0
53,5,1,146,0,1,0
59,6,3,319,0,1,0
28,11,2,304,0,1,0
41,2,1,389,1,2,0
50,5,2,766,0,2,0
31,1,1,0,1,5,0
30,10,2,3107,1,2,0
59,1,3,174,1,1,0
33,10,3,-305,0,1,0
35,7,1,670,0,1,0
30,5,2,6164,1,11,0
71,6,1,2850,0,1,1
30,8,2,79,1,1,0
24,8,1,110,1,1,0
34,10,2,5039,0,6,0
34,2,1,360,1,1,0
52,1,1,199,0,2,0
33,7,2,238,1,5,0
38,2,1,5092,1,6,0
41,1,3,1088,1,1,0
42,5,3,221,1,2,0
38,2,3,889,0,1,0
48,2,1,750,1,6,0
34,10,2,0,1,1,0
46,2,1,1291,1,3,0
33,10,1,1844,1,3,0
40,5,1,89,1,6,0
36,1,1,4280,0,6,0
33,2,1,625,1,1,0
55,10,1,574,1,2,0
58,5,1,320,1,2,0
25,10,2,468,1,1,0
47,8,1,440,1,1,0
40,11,1,0,1,1,0
59,6,1,5706,1,2,0
40,5,1,7780,0,1,0
30,5,1,-559,1,1,0
25,3,2,16874,1,2,0
58,6,1,1987,0,4,0
39,3,1,98,1,3,0
40,7,1,642,0,3,0
38,2,1,526,1,2,0
66,5,2,6483,0,1,0
47,5,1,2306,0,4,1
37,2,1,954,1,9,0
36,5,2,-679,1,1,0
50,2,1,-1,0,2,0
76,6,1,2590,0,12,0
58,5,2,331,0,3,0
42,1,1,4209,1,6,0
58,8,3,462,0,1,1
28,7,2,0,1,1,0
41,10,1,0,0,2,0
30,5,1,151,0,4,0
32,5,3,883,1,1,1
27,8,2,266,0,1,0
48,5,1,0,0,5,0
36,10,1,491,1,3,0
54,5,1,3,0,1,0
36,2,1,198,1,2,0
52,4,1,14363,0,1,0
34,10,3,0,1,16,0
43,10,1,136,0,7,1
32,5,2,28,0,2,0
33,5,2,335,0,4,0
51,4,1,174,0,3,0
39,11,1,270,1,1,0
44,5,2,1206,0,2,0
49,4,3,198,1,3,0
25,10,1,914,1,2,0
39,7,1,31,1,2,0
54,10,1,0,0,2,0
32,5,2,347,1,1,0
36,5,1,860,1,15,0
54,10,1,89,1,3,0
31,10,1,0,1,1,0
45,8,1,0,0,7,0
31,1,2,68,1,2,0
45,10,1,-149,1,2,0
33,8,3,2411,1,1,1
46,5,3,225,1,1,0
43,12,2,2731,0,7,0
50,5,1,112,1,5,0
44,5,3,0,0,2,0
42,8,1,3620,1,16,0
26,2,2,179,0,3,0
47,1,2,1544,1,1,0
48,2,1,199,0,2,0
60,2,1,231,1,2,0
27,1,3,76,1,1,0
30,11,2,302,0,3,1
28,1,2,189,1,2,0
58,6,1,565,0,1,1
37,3,1,310,0,1,0
39,10,1,6,1,3,0
52,11,1,-110,0,1,0
55,6,1,2749,1,2,0
30,5,2,6495,0,3,0
36,2,2,35,1,3,0
39,1,1,-650,0,2,0
47,2,1,292,0,3,0
42,4,2,5774,1,2,0
42,5,1,2416,1,4,0
58,6,1,35,0,7,0
68,6,1,19317,1,1,1
43,10,1,50,0,1,0
44,2,1,-674,1,1,0
49,10,1,3726,0,2,1
57,6,1,1180,1,2,0
61,7,3,6610,0,2,1
36,1,2,319,1,2,0
31,2,1,1545,1,1,0
51,10,1,1315,0,2,0
31,10,2,424,0,2,0
56,2,1,151,0,1,0
30,10,2,-970,0,2,0
38,8,1,-762,1,2,0
35,8,1,181,1,3,0
31,2,1,-120,1,2,0
39,1,3,1022,1,3,0
50,5,1,78,1,3,0
39,10,1,209,0,2,0
26,1,1,2469,0,8,0
55,10,1,0,0,1,0
43,2,3,328,0,1,0
34,4,1,0,0,1,0
51,7,1,307,1,2,0
31,5,1,1384,1,2,0
32,5,1,0,0,9,0
53,10,1,719,1,1,0
44,5,3,0,0,1,0
38,3,1,6704,1,2,0
47,7,1,4543,1,1,0
36,5,1,0,1,2,0
30,5,2,149,1,2,0
46,2,1,-1400,1,3,0
33,3,1,-118,1,3,0
43,2,1,2160,0,1,1
38,5,1,3452,0,2,0
27,10,2,842,0,1,0
38,5,1,3576,0,2,1
41,11,1,1666,0,3,0
29,10,1,0,1,6,0
39,8,1,0,1,2,0
42,2,2,1628,1,1,0
47,8,1,51,1,1,0
30,2,2,447,0,6,0
34,1,1,396,1,3,0
45,4,1,4994,0,1,0
43,1,1,3215,1,3,0
59,2,1,2814,0,3,0
50,10,1,0,0,2,0
39,2,1,293,1,3,0
36,10,1,474,1,1,0
44,2,1,16178,1,1,0
36,10,1,0,0,2,0
27,5,2,88,0,1,0
29,8,1,308,1,1,0
70,6,1,1164,0,3,0
44,5,1,13893,0,2,0
55,5,1,0,1,2,0
36,10,3,-435,1,8,0
28,10,2,389,1,7,0
50,5,3,356,0,2,0
49,10,1,2718,0,2,0
71,6,3,261,0,2,0
31,1,2,757,0,2,0
45,5,2,16,0,2,0
42,2,1,-422,0,1,0
45,1,1,248,0,2,0
47,10,1,145,1,6,0
60,6,3,598,0,1,0
35,5,1,949,1,2,0
31,10,2,614,0,4,0
33,2,1,1209,1,1,0
50,7,1,202,1,1,0
51,2,1,1840,1,3,0
34,10,1,114,1,1,0
56,8,1,-229,0,10,0
29,8,1,182,1,3,0
31,2,1,401,0,3,0
44,10,3,759,1,1,0
55,6,1,4194,0,3,0
35,9,2,0,0,3,0
36,10,1,629,1,1,0
54,6,1,153,1,1,0
32,5,1,553,1,1,0
36,5,3,1057,0,2,0
60,6,1,78,1,3,0
32,10,2,-28,0,1,0
57,5,1,929,0,8,0
34,2,1,428,1,2,0
27,9,2,268,1,1,0
52,5,2,83,0,6,1
45,1,3,998,1,2,0
58,1,2,2223,0,2,0
39,2,2,6,1,2,0
48,2,2,312,1,2,0
36,5,2,0,0,5,0
31,10,2,691,1,1,0
41,5,1,771,1,8,0
30,7,2,192,0,1,0
57,6,1,0,0,4,0
29,1,2,1070,1,1,1
29,8,3,84,1,2,1
30,5,2,2,0,1,0
44,5,1,1242,1,6,0
33,9,2,5969,0,2,0
56,1,3,3337,1,3,0
26,8,2,1347,0,6,1
52,10,1,64,0,2,0
32,5,2,249,1,1,0
36,10,2,0,0,6,0
26,2,1,128,0,1,0
37,2,1,196,1,3,0
34,10,1,351,1,1,0
26,8,2,5533,1,2,0
32,8,1,38,1,1,1
30,5,2,35,0,4,0
27,10,2,235,1,5,0
42,1,2,30,1,1,0
33,2,2,92,1,1,0
37,2,1,67,0,2,0
45,2,1,4022,1,3,0
36,3,1,3057,0,4,1
39,5,2,0,1,4,0
33,5,2,349,0,1,0
47,8,1,2322,0,1,0
49,3,1,167,1,3,0
46,5,3,558,0,6,0
31,8,1,-230,1,1,0
43,11,3,4094,1,1,0
30,2,2,239,1,1,1
43,5,3,497,0,1,0
42,2,1,179,1,1,0
30,1,2,305,0,1,1
33,5,2,-67,1,1,0
41,1,1,4539,0,3,0
29,2,2,770,1,1,0
38,11,1,-673,1,1,0
29,10,1,858,1,7,0
80,4,1,0,0,1,1
38,5,2,5244,0,4,0
36,2,3,117,1,4,0
38,7,1,846,0,1,0
44,5,1,0,1,2,0
31,5,1,1331,0,1,1
31,8,2,31,1,2,0
57,1,3,179,1,1,0
37,2,1,543,1,1,0
50,2,1,253,1,2,0
60,6,1,71188,0,1,0
51,5,1,5108,1,1,0
48,2,1,1738,1,1,0
42,2,1,-97,1,4,0
36,2,1,199,1,1,0
43,5,1,489,1,1,0
31,1,1,355,1,6,0
49,10,2,-97,1,2,0
35,5,3,473,0,2,0
44,3,1,6649,1,2,0
34,7,1,263,0,1,0
46,2,1,781,0,1,0
49,2,1,1032,1,5,0
32,2,1,119,0,5,0
35,5,3,434,1,1,0
51,1,1,2967,0,2,0
57,6,3,-331,1,1,0
59,5,1,1585,0,5,0
40,8,3,4384,1,1,0
49,5,2,588,0,9,0
51,5,1,3180,1,1,0
35,1,1,0,0,3,0
29,7,1,-76,1,2,0
32,8,2,152,1,2,1
37,4,3,1040,1,1,0
49,11,1,-384,1,1,0
45,10,1,473,1,1,0
34,10,2,475,1,8,0
53,10,1,0,0,9,0
42,3,1,149,0,2,0
43,10,1,3285,1,2,1
52,6,1,424,0,1,0
34,2,2,79,0,1,0
34,10,3,674,1,2,1
27,8,1,0,1,13,1
43,11,1,58,1,4,0
41,10,1,532,1,1,0
72,6,1,4130,0,1,0
35,2,1,422,1,1,0
41,5,1,437,1,21,0
36,2,3,-308,1,1,1
51,4,1,30,1,2,0
37,7,1,137,0,6,0
42,1,2,-247,1,1,1
26,1,2,321,1,7,0
23,8,2,250,1,1,0
37,2,1,140,1,1,0
35,5,1,2793,0,2,0
37,5,1,410,0,2,0
79,6,3,2628,0,7,0
39,10,1,116,0,2,0
47,8,1,0,1,1,0
44,2,1,878,1,1,0
36,5,2,2944,0,8,1
33,2,2,3975,1,1,0
42,8,1,96,1,3,0
35,10,2,2288,0,2,0
31,2,1,472,1,2,0
58,8,1,65,0,1,0
46,5,1,0,0,2,0
41,1,2,400,1,6,0
58,10,1,7495,1,1,0
33,2,1,137,0,12,0
31,11,1,24,1,1,0
55,10,3,3450,0,1,1
38,10,2,311,1,2,0
55,4,1,139,0,2,0
47,5,2,0,0,3,0
51,4,1,492,1,3,0
46,5,2,334,1,6,0
61,5,1,997,0,1,1
47,5,2,440,0,4,0
34,10,1,47,0,6,0
34,2,1,1298,1,1,0
41,5,3,3355,0,2,0
36,2,3,-11,0,2,0
26,2,2,396,1,1,0
35,5,1,8,0,3,1
36,2,1,1409,0,2,0
26,5,2,170,0,1,1
58,5,1,2769,1,2,0
50,2,1,2320,1,1,0
61,6,1,76,1,7,0
28,10,2,2034,1,1,0
49,2,2,3018,1,1,0
74,6,1,921,0,2,1
53,2,1,483,1,3,0
46,7,1,390,1,2,0
47,5,1,0,0,1,1
42,2,2,92,0,2,0
56,8,1,22196,1,1,0
42,10,1,2,0,2,0
49,4,1,249,1,1,0
43,11,2,3274,1,1,0
39,8,1,5731,1,2,0
66,6,1,206,0,1,1
30,10,2,2325,0,3,0
38,5,2,0,0,1,0
31,2,1,1664,1,1,0
32,10,1,3333,0,4,0
48,10,1,7020,0,2,0
34,1,1,37,0,1,0
28,9,2,28,0,2,0
40,1,2,1670,1,2,0
36,3,1,134,0,1,0
52,6,1,603,0,1,0
46,1,1,276,1,2,0
25,10,2,2157,1,1,0
52,2,1,161,1,2,0
40,2,1,3658,1,1,0
26,5,3,-402,0,2,0
26,2,2,3342,1,4,0
35,7,2,1732,0,3,0
40,1,2,263,1,1,0
31,5,1,623,1,2,0
32,1,1,3540,1,1,0
33,1,1,95,1,1,1
53,8,3,765,1,3,1
46,10,3,-824,1,3,1
28,5,2,5549,0,6,0
31,2,1,191,1,1,0
44,2,1,420,1,2,0
35,1,1,0,0,1,0
50,10,3,2706,1,3,0
32,10,1,4,1,8,0
51,1,1,423,1,1,0
51,5,1,-892,1,2,0
31,2,1,-120,1,3,0
41,1,3,-365,1,10,0
57,10,1,27069,0,3,0
34,5,2,8038,1,3,0
47,10,1,-938,1,2,0
47,1,3,1139,1,2,0
36,7,1,189,1,1,0
29,4,2,19,0,2,1
39,10,1,3663,0,3,0
53,2,2,0,0,7,0
47,2,1,-614,1,2,0
51,10,3,2323,1,10,0
48,2,1,425,1,2,0
32,10,1,5122,0,1,0
36,5,3,608,0,2,0
50,12,1,341,1,4,1
39,1,1,607,1,2,1
31,2,1,1495,1,3,0
49,1,1,381,0,2,0
33,11,3,385,0,28,0
26,5,2,1274,1,1,0
27,2,1,362,1,2,0
51,2,1,377,1,4,0
26,1,2,802,0,1,0
45,1,1,194,0,4,0
54,10,1,-315,0,1,1
49,10,1,1843,1,1,0
47,10,1,-9,0,2,0
42,4,1,83,0,1,0
50,3,1,433,1,4,0
37,1,1,-107,1,2,0
54,2,1,4503,0,3,0
40,8,1,51,1,1,0
50,8,1,961,0,4,0
57,6,1,49,1,4,0
33,10,1,3470,0,2,0
49,10,1,-147,1,1,0
35,8,1,0,1,2,0
28,2,2,0,1,1,0
58,5,1,172,0,7,0
31,1,2,-407,0,1,0
36,5,3,649,0,2,0
49,2,2,1040,0,2,0
30,11,1,142,1,4,0
29,8,2,209,1,7,0
50,5,1,3304,0,2,0
26,9,2,294,0,1,1
27,4,1,4848,1,3,0
32,2,2,1670,1,1,0
62,12,1,367,0,5,0
34,2,2,13683,1,3,0
25,1,2,1420,0,2,0
34,5,2,340,1,28,0
44,10,2,1679,0,1,1
38,5,1,1198,1,1,0
57,1,1,169,0,1,0
36,7,1,506,0,1,0
41,3,1,1249,1,1,0
36,5,2,678,0,3,0
27,5,2,212,1,1,0
37,10,3,23,0,2,0
47,5,2,4402,0,1,1
31,8,3,459,1,1,1
39,7,1,4722,1,1,0
35,1,3,1555,1,2,0
40,2,1,61,1,3,0
38,5,2,0,1,2,0
31,10,1,3706,1,1,0
36,2,1,1177,0,1,1
53,5,1,2096,0,1,0
59,2,1,748,0,1,0
29,5,2,3357,0,3,0
30,1,2,3809,1,4,0
52,1,1,395,1,3,0
55,2,1,1011,1,2,0
56,2,1,420,1,1,0
32,1,1,76,1,2,0
24,2,1,0,0,1,0
51,2,1,844,1,3,0
36,5,1,1318,1,2,0
36,10,1,167,1,1,0
42,5,1,2187,1,3,1
49,1,1,14440,1,1,0
48,5,1,2294,1,11,0
36,5,1,80,1,3,0
48,5,1,2537,0,6,0
30,10,1,569,0,12,1
27,5,2,0,0,1,0
38,3,1,0,1,3,0
36,10,2,12,0,2,1
45,10,1,49,0,2,0
44,4,1,460,0,1,0
42,10,1,613,1,2,0
37,3,1,7944,0,1,0
48,2,1,1143,1,1,0
57,6,1,-464,1,1,0
44,8,1,1989,1,2,0
48,10,1,17,1,1,0
56,6,1,-1,0,23,0
37,5,1,1698,1,2,0
47,2,1,5306,1,1,0
54,4,1,0,0,5,0
51,6,3,1679,0,1,1
47,1,1,3676,0,1,1
25,5,1,-242,1,4,1
39,8,2,471,0,1,0
40,5,1,8902,1,5,0
38,5,2,1704,0,1,0
34,5,1,3050,1,1,1
53,4,1,2581,0,1,0
32,8,1,162,1,2,0
35,2,1,243,1,3,0
24,9,2,1847,0,1,0
58,2,1,0,1,2,0
49,5,1,3371,0,2,1
45,8,2,1757,1,3,0
55,5,1,171,1,6,0
42,3,1,157,1,1,0
28,1,1,934,1,2,0
48,2,1,-19,0,1,0
51,5,2,-55,1,6,0
38,4,1,21,0,2,0
27,2,2,14,0,2,0
50,10,2,246,1,1,0
44,2,1,887,1,2,0
40,5,1,51,0,2,0
29,8,2,-287,1,1,0
34,8,1,0,1,4,0
44,7,2,2734,1,4,1
50,3,1,52,0,8,0
34,5,1,2594,1,3,0
54,6,3,22,0,4,0
34,10,1,1611,1,2,0
34,1,2,18,1,1,1
52,2,1,1331,1,2,0
60,12,1,7337,0,1,0
39,5,2,835,1,4,0
58,6,1,5092,0,6,0
41,10,3,52,0,2,0
48,10,1,10655,0,3,0
58,5,1,1831,0,1,0
40,7,1,92,1,1,0
48,5,1,586,1,2,0
52,2,3,1758,1,1,0
50,7,1,2061,1,2,0
25,10,2,959,0,5,0
54,6,1,208,0,1,0
34,8,1,-315,1,2,0
48,5,1,-13,1,6,0
37,1,1,801,0,7,0
66,6,1,1948,0,1,1
32,5,2,751,1,1,0
45,2,1,784,1,1,0
43,2,2,24,0,1,0
41,5,1,72,1,3,0
40,10,3,1871,1,1,0
44,8,2,1378,1,2,0
43,2,1,188,1,3,0
30,12,2,6836,0,3,0
32,8,1,61,1,5,0
57,1,1,-967,1,7,0
31,2,2,462,1,1,0
49,12,1,0,0,2,0
31,1,2,5527,1,1,0
41,1,1,1287,0,1,0
44,5,1,17361,0,1,0
54,3,1,1956,0,5,0
37,2,3,0,1,4,1
34,5,1,-294,1,2,0
43,10,1,275,0,6,0
44,5,1,724,1,2,0
44,8,1,27,0,1,0
53,1,3,26,1,1,0
36,10,1,191,0,1,0
58,10,3,-123,0,2,0
26,9,2,-147,0,2,0
34,10,2,179,0,3,0
55,2,1,1086,1,1,0
55,2,1,471,1,2,0
34,3,1,105,1,2,0
41,3,3,1588,1,8,0
38,4,3,70,0,3,1
28,2,2,2700,0,4,0
41,10,1,1602,1,1,0
30,1,1,0,1,2,0
39,10,1,839,0,2,0
41,1,1,21515,1,1,0
36,10,1,5902,1,4,0
37,5,1,547,1,1,0
59,7,1,3800,0,1,0
26,10,2,261,1,2,0
43,10,1,0,1,8,0
42,5,1,-34,0,1,0
46,2,1,9328,1,3,1
31,1,1,5,1,7,0
43,11,1,3529,0,2,0
48,2,2,2330,1,1,0
41,2,1,1334,1,5,0
32,7,1,3601,0,15,0
45,10,1,265,0,3,0
52,1,2,2227,0,2,1
37,7,1,487,0,15,0
38,2,3,0,1,1,0
36,8,2,174,1,2,0
58,6,1,14412,0,1,0
37,5,1,3288,0,2,0
30,10,2,57,0,2,0
47,10,1,2246,1,1,0
40,10,1,4441,1,2,0
71,12,1,353,0,1,0
54,2,1,448,1,1,0
53,3,1,27,1,3,1
33,2,3,474,0,2,0
30,10,2,1185,1,1,0
39,8,3,282,1,1,0
32,2,1,2,1,9,0
34,10,2,60,0,2,0
39,7,2,3972,0,3,0
75,6,1,26452,0,2,0
33,1,3,818,1,3,0
40,8,1,9374,1,8,0
37,10,1,47,0,3,0
69,6,1,279,0,1,0
52,11,1,20,1,1,0
31,1,3,360,0,1,0
28,10,2,1532,0,1,0
29,5,2,1673,0,2,0
46,8,1,2420,0,2,0
28,2,1,100,1,2,0
41,1,1,0,0,1,0
42,10,3,1533,0,1,0
34,1,2,296,0,4,0
28,2,1,2788,1,2,1
43,5,2,109,1,3,0
32,10,1,485,0,14,0
33,10,2,125,0,2,0
70,6,1,616,0,2,0
36,8,1,3064,1,3,0
53,10,1,206,0,6,0
30,2,2,6900,0,1,0
45,8,3,-179,0,2,0
31,8,2,481,1,2,0
28,1,1,12,1,3,0
45,2,1,0,0,5,0
51,5,1,176,1,1,0
53,5,1,4086,0,3,0
40,10,1,257,1,4,0
53,2,1,53,1,1,0
31,2,3,6,1,1,0
30,5,1,562,0,4,0
53,3,1,-118,1,3,0
40,2,1,2805,1,6,0
26,5,2,565,1,11,0
47,2,1,0,1,1,0
51,5,1,1612,0,1,0
45,11,1,180,1,2,0
35,5,1,0,1,3,0
36,5,2,876,1,2,0
57,1,1,2137,0,7,0
42,2,1,260,1,2,0
32,2,1,-53,1,1,1
30,5,1,944,0,2,1
36,10,1,2394,0,2,0
43,10,1,297,1,3,0
69,6,2,2144,0,1,1
31,10,2,969,0,1,0
35,10,1,0,0,2,0
26,3,1,37,1,1,0
46,10,1,410,0,5,0
30,10,1,1211,1,1,0
33,5,2,71,0,6,0
34,5,1,436,1,1,0
48,2,1,559,1,2,0
31,5,1,1170,0,4,0
40,8,1,1325,0,2,0
39,3,1,0,0,7,0
33,10,2,647,1,1,0
50,2,1,2142,1,2,0
84,6,3,639,0,3,1
40,2,1,177,1,4,0
55,5,1,236,0,1,0
40,8,3,1959,1,1,0
46,1,1,96,0,2,0
43,7,2,0,0,1,0
34,2,1,250,1,6,0
35,10,2,126,0,2,0
57,6,1,1621,1,1,0
25,9,2,8,0,2,1
32,7,1,189,1,2,0
52,6,2,316,0,3,0
31,7,2,-282,1,3,0
34,5,1,-308,1,2,0
42,10,3,248,0,4,0
47,2,3,126,1,2,1
50,7,3,13,1,1,1
30,10,1,-393,1,1,1
33,8,2,358,1,1,0
56,10,2,917,0,1,0
34,1,3,1268,1,3,0
33,10,1,-163,1,2,0
32,5,2,473,1,2,0
34,5,1,4831,1,1,0
37,10,1,1063,1,2,0
30,5,1,0,1,3,0
29,2,1,424,1,2,0
56,11,3,802,0,2,0
31,5,1,430,1,16,0
59,12,1,3940,0,2,0
36,4,1,2880,0,1,0
51,2,3,1069,1,2,0
54,7,3,4382,1,4,0
37,5,1,0,0,4,0
32,10,1,3939,0,2,0
42,7,1,753,0,1,0
29,2,1,358,0,5,0
52,2,1,1141,1,5,0
40,10,1,1259,0,5,0
30,8,1,227,0,1,0
55,3,3,538,1,2,1
49,5,1,92,1,2,0
32,8,2,2478,0,1,0
21,9,2,6844,0,3,0
42,10,1,440,1,5,0
56,7,1,800,0,1,0
39,12,2,914,0,1,0
30,3,2,638,0,6,0
55,6,1,159,0,1,0
43,2,1,483,1,3,0
53,11,1,94,0,1,1
57,6,1,1044,0,1,1
39,7,2,0,0,11,0
56,10,3,401,1,1,0
29,8,2,33,0,1,0
38,2,1,506,1,1,0
59,5,1,1881,0,2,0
42,10,2,344,1,7,0
46,2,1,0,1,9,0
31,1,1,3,1,12,0
35,8,3,221,1,1,0
50,7,1,36,0,10,0
42,2,1,969,1,1,0
36,8,2,760,0,13,0
25,1,2,220,0,1,0
42,5,2,10907,0,3,0
27,9,2,-148,1,3,0
32,2,1,415,1,4,1
57,5,1,1341,1,2,0
48,2,1,865,1,2,0
34,2,3,-566,1,2,0
33,8,1,210,1,1,0
26,10,2,1275,1,9,0
50,2,1,579,0,4,0
60,10,2,2934,0,2,0
47,5,1,6637,1,2,0
31,5,1,271,0,1,0
52,10,1,0,0,3,0
36,8,1,472,1,1,0
43,2,1,487,1,2,0
30,10,2,699,1,4,0
32,2,1,150,0,1,0
31,5,2,1130,1,3,0
29,5,2,584,1,19,0
48,8,3,3186,0,1,0
32,8,2,133,0,1,1
30,4,2,868,0,2,0
48,2,1,480,1,1,1
51,2,1,1883,1,1,0
34,5,1,606,0,1,1
35,2,1,603,1,2,0
49,5,2,548,0,6,0
36,11,1,-872,1,1,0
37,2,3,33,1,2,0
37,5,1,1689,1,2,0
49,2,1,902,0,2,0
44,8,3,0,1,1,0
40,9,1,260,0,1,0
57,10,1,589,1,1,0
39,10,1,626,1,2,0
38,8,1,0,0,6,0
51,2,3,78,1,2,0
27,2,2,3792,0,2,1
38,2,2,14058,0,20,0
30,10,2,-522,1,2,1
36,9,2,386,0,2,0
37,11,1,1978,0,1,1
53,1,1,459,0,6,0
38,11,1,2812,1,1,1
48,5,1,5057,0,1,0
26,4,1,-759,1,1,0
33,2,2,-416,1,2,1
47,10,1,2106,1,1,0
45,5,3,220,1,4,0
32,2,3,0,1,2,0
69,6,1,426,0,1,1
65,12,1,4717,0,1,1
37,2,1,395,1,2,0
45,2,3,0,1,2,0
36,2,1,-206,1,2,0
62,7,3,6,1,1,1
37,5,1,4039,0,2,0
39,8,3,687,1,1,1
38,10,2,-242,1,3,1
31,5,1,582,1,2,0
58,2,3,8218,1,10,0
44,5,2,1424,1,2,0
31,2,1,92,1,1,1
33,10,2,2085,0,2,1
36,10,2,197,0,1,1
31,10,2,2305,0,1,0
45,1,1,-547,1,2,0
30,10,2,411,0,1,0
34,2,1,584,1,2,0
34,5,1,997,1,1,0
39,1,3,83,1,6,0
41,5,1,6563,0,8,0
32,8,2,0,1,13,0
32,5,2,0,0,6,0
36,2,1,398,1,1,0
35,1,1,1145,1,2,0
32,5,2,2,1,2,1
33,5,2,201,1,1,0
49,3,1,563,0,1,0
35,5,1,3161,0,2,0
31,10,1,0,0,6,0
42,5,1,1331,0,2,0
34,4,1,2929,0,2,1
32,8,1,-220,1,2,0
29,5,2,5980,1,1,0
32,8,2,48,1,3,0
50,4,2,0,0,8,0
58,6,1,3382,0,2,0
59,10,1,2308,0,1,1
25,9,1,10,1,4,1
57,8,1,162,1,1,0
30,2,2,1073,1,4,0
26,8,2,1700,1,5,0
50,8,2,148,1,2,0
39,8,1,0,1,1,0
45,2,1,185,1,3,0
37,5,3,896,0,2,0
47,2,3,1279,1,2,0
50,10,1,199,1,2,0
40,5,1,99,0,5,0
35,2,1,378,1,3,0
53,5,1,15,0,2,1
35,1,1,147,1,1,0
54,10,1,2225,0,2,0
35,1,2,1810,1,2,0
31,4,1,-6,0,2,0
46,10,3,435,1,3,0
52,5,1,335,0,1,1
34,1,3,-251,0,1,1
46,8,3,5,1,2,0
54,7,1,641,1,1,0
37,1,1,0,1,1,0
39,1,1,722,0,1,0
50,10,1,3337,1,14,0
44,10,3,0,0,5,0
56,1,1,1504,1,2,0
40,8,1,35,0,4,0
36,8,1,895,1,1,0
33,5,1,752,1,4,0
33,2,2,1925,1,2,0
42,8,1,-246,1,1,0
30,7,2,901,1,1,0
33,1,2,894,0,2,0
26,2,2,592,1,1,0
26,1,2,3529,0,2,0
37,8,1,0,1,2,0
59,6,1,0,0,2,1
49,2,1,371,1,44,0
33,2,2,1,1,1,0
46,10,2,834,1,2,0
55,3,1,298,1,3,0
49,8,1,306,1,7,0
51,10,1,143,1,1,0
27,1,1,186,1,2,0
44,10,1,5597,0,3,0
40,8,2,1547,1,2,0
36,5,1,1852,0,1,0
46,1,2,1790,1,5,0
30,8,2,20,1,6,0
35,1,1,8652,1,6,0
31,10,2,1626,0,2,0
37,1,1,749,0,1,0
49,2,1,51,1,1,0
27,8,2,-1,0,2,0
32,2,1,-32,1,1,0
70,6,3,6850,0,3,0
22,10,2,333,0,1,0
58,2,1,-27,0,13,0
33,2,1,932,1,1,0
83,6,3,0,0,1,0
50,5,3,100,1,1,0
53,2,1,-626,1,1,0
37,5,2,9,0,2,0
55,8,3,653,0,1,0
49,1,1,3608,1,1,1
41,2,1,293,1,1,0
40,5,2,36,1,3,0
48,5,1,263,1,2,0
27,9,2,8366,0,2,0
30,5,2,2186,1,1,0
37,3,2,20453,1,1,0
37,8,2,105,0,4,0
40,2,1,440,1,2,0
73,6,1,519,0,1,1
50,5,1,19447,1,1,0
53,2,1,225,0,7,0
47,2,1,2548,1,1,0
33,10,3,0,0,8,0
50,2,1,2284,1,17,1
51,2,1,40,1,1,0
42,4,3,364,0,1,0
34,10,2,174,0,4,0
44,10,1,10888,1,1,0
32,1,1,0,1,2,0
60,6,1,225,0,2,0
60,6,3,2131,0,6,0
29,2,2,-20,0,1,1
39,5,2,36,0,2,0
47,2,1,2642,0,2,0
30,1,1,400,1,1,0
31,10,2,1214,0,1,0
34,5,2,-292,1,6,0
51,1,1,1415,1,3,0
38,2,1,213,1,15,0
47,1,2,2540,0,5,0
46,4,2,3232,0,2,0
33,5,1,296,0,2,0
30,5,1,42,0,6,0
40,10,1,697,0,2,0
38,2,2,13156,1,4,0
63,6,3,1490,0,1,1
33,5,1,150,0,2,0
59,6,1,0,0,1,1
29,5,2,4210,1,1,0
54,8,3,1012,1,3,0
57,10,1,16063,1,3,0
57,2,1,5431,1,1,0
28,8,2,317,1,3,0
30,10,2,4787,1,1,0
28,2,1,225,1,2,0
45,8,3,3854,1,3,0
29,8,3,92,1,1,0
42,2,1,-10,1,4,0
31,2,1,-617,1,2,0
59,4,3,195,0,2,0
41,2,1,1172,1,1,0
43,8,3,0,0,4,0
30,8,3,-94,1,2,0
26,1,2,609,0,1,0
52,5,2,4,0,9,0
32,3,3,1121,1,3,0
39,5,3,355,1,5,0
31,2,1,3653,1,1,0
83,6,3,1097,0,1,1
34,5,1,436,0,4,0
40,2,1,4795,1,1,0
39,7,1,266,0,2,0
50,11,1,3357,0,4,1
30,10,1,101,1,3,0
43,2,1,10910,1,2,0
49,2,1,1568,0,6,0
41,6,2,0,0,1,0
35,2,1,305,1,7,0
57,6,1,31,0,2,0
29,3,1,452,1,1,0
48,1,1,5,1,2,0
38,3,3,7929,0,3,0
41,3,1,39,1,2,1
39,4,1,267,0,5,0
31,5,1,4945,0,1,0
51,10,1,463,1,5,0
35,11,2,2116,1,2,0
45,1,3,59,1,8,1
28,2,1,131,1,5,0
57,6,1,107,0,2,0
36,11,1,-35,0,3,0
49,10,1,230,1,1,0
34,5,2,2679,1,1,0
65,6,1,493,0,1,0
26,8,2,256,1,2,0
52,2,1,-133,0,2,0
32,2,2,811,1,1,1
33,11,1,302,1,1,0
43,5,1,3529,1,3,0
26,10,2,75,1,1,0
45,10,1,999,1,6,0
30,5,2,7845,1,1,0
37,8,3,260,1,2,0
45,5,2,2048,1,1,1
34,5,1,1557,1,1,0
35,8,1,505,1,2,0
41,1,1,1536,0,2,0
42,7,1,0,0,6,0
48,2,1,439,1,1,0
45,12,1,44,0,1,0
47,5,1,295,1,1,0
37,2,1,190,1,1,0
32,5,1,3935,1,2,0
40,5,1,-17,1,1,1
35,10,2,175,1,1,0
31,10,2,4888,1,4,0
36,10,2,40,0,3,0
44,5,1,4460,0,2,0
52,1,3,98,0,1,0
28,9,2,330,0,1,0
45,2,1,13117,0,2,0
38,5,1,12877,0,3,0
39,2,1,1506,1,2,0
28,5,2,0,0,2,0
31,10,2,775,0,1,0
46,2,1,258,1,1,0
22,9,2,246,1,1,0
49,2,2,2146,1,2,1
44,11,1,304,1,2,0
31,7,2,360,1,4,0
53,2,1,3316,1,6,0
55,5,1,6880,0,2,0
35,10,1,2189,0,3,0
35,2,1,5304,1,1,0
37,5,2,102,1,2,0
50,2,1,181,1,2,0
37,5,1,3953,1,2,0
37,2,2,6969,1,1,0
29,5,2,572,0,1,1
31,1,2,223,1,1,0
40,10,1,-396,1,1,0
47,8,3,164,0,1,0
55,7,1,2678,0,12,0
33,10,2,920,1,1,0
53,8,3,4554,0,6,0
38,5,2,623,0,4,1
61,5,1,967,0,1,0
43,11,3,1577,1,1,0
42,4,1,1,1,5,0
36,5,3,0,0,4,0
31,10,2,1166,1,1,0
59,5,1,3534,0,4,0
29,2,1,200,1,2,0
33,10,1,4790,1,1,0
44,2,1,-237,1,1,0
43,2,1,1335,1,2,0
42,5,1,603,1,5,0
32,5,2,577,0,2,0
43,5,1,0,1,1,0
39,1,2,163,1,2,0
23,2,1,1158,1,1,0
43,8,1,642,0,2,0
46,1,1,466,1,1,0
31,10,1,119,1,1,0
38,5,1,3436,0,4,1
53,2,1,238,1,2,0
37,2,1,378,1,1,0
49,3,3,32,0,1,0
31,11,2,315,0,1,0
45,5,1,6945,0,5,0
58,1,1,3496,1,4,0
35,2,2,0,1,1,0
32,10,2,309,1,1,0
28,10,2,0,1,6,0
26,10,2,668,1,3,1
48,5,1,1175,1,3,0
30,2,2,363,0,3,0
31,3,2,38,0,2,0
31,5,1,1183,1,6,0
45,2,3,942,0,1,0
38,1,1,4196,1,2,0
34,5,1,297,1,4,0
42,8,1,-91,1,1,0
60,7,1,362,0,6,1
42,2,2,1080,1,3,1
32,1,2,620,1,3,1
42,11,3,-166,0,4,0
33,8,1,288,1,1,0
42,1,1,642,1,2,0
51,10,1,2506,0,3,0
36,10,3,566,1,2,0
46,2,1,668,1,2,1
40,2,1,1100,1,2,0
49,2,1,322,0,2,0
38,2,1,1205,1,4,0
32,8,2,473,1,5,0
33,8,1,-333,1,5,0
57,7,1,-3313,1,1,0
57,10,1,295,0,11,0
28,2,1,1137,0,4,0
44,3,2,1136,1,2,0
