\relax 
\babel@aux{english}{}
\@writefile{toc}{\contentsline {section}{\numberline {1}Motivations}{2}\protected@file@percent }
\newlabel{motivations}{{1}{2}}
\@writefile{toc}{\contentsline {section}{\numberline {2}Calculating GDD}{3}\protected@file@percent }
\newlabel{core tasks}{{2}{3}}
\@writefile{toc}{\contentsline {section}{\numberline {3}Results}{4}\protected@file@percent }
\newlabel{data analysis}{{3}{4}}
\@writefile{toc}{\contentsline {subsection}{\numberline {3.1}Task 1.2}{4}\protected@file@percent }
\@writefile{lof}{\contentsline {figure}{\numberline {1}{\ignorespaces \relax \fontsize  {8}{9.5}\selectfont  Annual cycle of min/max daily temperatures for Montreal, Toronto, and Victoria}}{4}\protected@file@percent }
\newlabel{minmax_all}{{1}{4}}
\@writefile{toc}{\contentsline {subsection}{\numberline {3.2}Task 1.4}{5}\protected@file@percent }
\@writefile{lof}{\contentsline {figure}{\numberline {2}{\ignorespaces \relax \fontsize  {8}{9.5}\selectfont  Accumulated GDD for Montreal}}{5}\protected@file@percent }
\newlabel{accuGDD_1}{{2}{5}}
\@writefile{lof}{\contentsline {figure}{\numberline {3}{\ignorespaces \relax \fontsize  {8}{9.5}\selectfont  Accumulated GDD for Toronto}}{6}\protected@file@percent }
\newlabel{accuGDD_2}{{3}{6}}
\@writefile{lof}{\contentsline {figure}{\numberline {4}{\ignorespaces \relax \fontsize  {8}{9.5}\selectfont  Accumulated GDD for Victoria}}{7}\protected@file@percent }
\newlabel{accuGDD_3}{{4}{7}}
\@writefile{toc}{\contentsline {subsection}{\numberline {3.3}Task 2.1}{8}\protected@file@percent }
\@writefile{lof}{\contentsline {figure}{\numberline {5}{\ignorespaces \relax \fontsize  {8}{9.5}\selectfont  GDD for Montreal with 5-95\% and 25-75\% percentiles}}{8}\protected@file@percent }
\newlabel{GDDwCI}{{5}{8}}
\@writefile{toc}{\contentsline {subsection}{\numberline {3.4}Task 2.4}{9}\protected@file@percent }
\@writefile{lof}{\contentsline {figure}{\numberline {6}{\ignorespaces \relax \fontsize  {8}{9.5}\selectfont  Bokeh plot of accumulative GDD for Montreal in 2017 (Static snapshot)}}{9}\protected@file@percent }
\newlabel{bokeh}{{6}{9}}
\@writefile{toc}{\contentsline {subsection}{\numberline {3.5}Task 2.6}{10}\protected@file@percent }
\@writefile{lof}{\contentsline {figure}{\numberline {7}{\ignorespaces \relax \fontsize  {8}{9.5}\selectfont  Statistical analysis of GDD year-over year for Ottawa}}{10}\protected@file@percent }
\newlabel{GDDregression}{{7}{10}}
\@writefile{toc}{\contentsline {subsection}{\numberline {3.6}Optional Task 1.1}{11}\protected@file@percent }
\@writefile{lof}{\contentsline {figure}{\numberline {8}{\ignorespaces \relax \fontsize  {8}{9.5}\selectfont  Maximum and minimum temperatures through the month of April in Montreal}}{12}\protected@file@percent }
\newlabel{Aprilmaxmin}{{8}{12}}
\@writefile{toc}{\contentsline {subsection}{\numberline {3.7}Optional Task 1.2}{13}\protected@file@percent }
\@writefile{lof}{\contentsline {figure}{\numberline {9}{\ignorespaces \relax \fontsize  {8}{9.5}\selectfont  Histograms of temperature trends in Montreal for 2014}}{13}\protected@file@percent }
\newlabel{hist2014}{{9}{13}}
\@writefile{lof}{\contentsline {figure}{\numberline {10}{\ignorespaces \relax \fontsize  {8}{9.5}\selectfont  Histograms of temperature trends in Montreal for 2015}}{14}\protected@file@percent }
\newlabel{hist2015}{{10}{14}}
\@writefile{lof}{\contentsline {figure}{\numberline {11}{\ignorespaces \relax \fontsize  {8}{9.5}\selectfont  Histograms of temperature trends in Montreal for 2016}}{15}\protected@file@percent }
\newlabel{hist2016}{{11}{15}}
\@writefile{lof}{\contentsline {figure}{\numberline {12}{\ignorespaces \relax \fontsize  {8}{9.5}\selectfont  Histograms of temperature trends in Montreal for 2017}}{16}\protected@file@percent }
\newlabel{hist2017}{{12}{16}}
\bibstyle{abbrv}
\bibdata{main}
\bibcite{GovCan}{1}
\bibcite{GDD MSU}{2}
\bibcite{farmwest}{3}
