\relax 
\babel@aux{english}{}
\@writefile{toc}{\contentsline {section}{\numberline {1}Motivations}{3}\protected@file@percent }
\newlabel{motivations}{{1}{3}}
\@writefile{toc}{\contentsline {section}{\numberline {2}Black Friday dataset insight plot}{4}\protected@file@percent }
\newlabel{}{{2}{4}}
\@writefile{lof}{\contentsline {figure}{\numberline {1}{\ignorespaces \relax \fontsize  {8}{9.5}\selectfont  Black Friday dataset insight plot}}{4}\protected@file@percent }
\newlabel{minmax_all}{{1}{4}}
\@writefile{toc}{\contentsline {section}{\numberline {3}Correlation matrix}{5}\protected@file@percent }
\newlabel{Correlation matrix}{{3}{5}}
\@writefile{lof}{\contentsline {figure}{\numberline {2}{\ignorespaces \relax \fontsize  {8}{9.5}\selectfont  Correlation matrix to understand predictors that would have high impact on product purchase during Black Friday shopping}}{5}\protected@file@percent }
\newlabel{minmax_all}{{2}{5}}
\@writefile{toc}{\contentsline {section}{\numberline {4}Buyers' purchase amount distribution }{6}\protected@file@percent }
\newlabel{Buyers' purchase amount distribution}{{4}{6}}
\@writefile{lof}{\contentsline {figure}{\numberline {3}{\ignorespaces \relax \fontsize  {8}{9.5}\selectfont  Buyers' purchase amount distribution}}{6}\protected@file@percent }
\newlabel{accuGDD_1}{{3}{6}}
\@writefile{toc}{\contentsline {section}{\numberline {5}Consumer behaviours plot}{6}\protected@file@percent }
\newlabel{Consumer behaviours plot}{{5}{6}}
\@writefile{toc}{\contentsline {subsection}{\numberline {5.1}Consumer purchase behaviour based on their occupation}{6}\protected@file@percent }
\@writefile{lof}{\contentsline {figure}{\numberline {4}{\ignorespaces \relax \fontsize  {8}{9.5}\selectfont  Consumer purchase behaviour based on their occupation}}{7}\protected@file@percent }
\newlabel{minmax_all}{{4}{7}}
\@writefile{toc}{\contentsline {subsection}{\numberline {5.2}Box Plot: Consumer purchase habits across all occupation types}{8}\protected@file@percent }
\@writefile{lof}{\contentsline {figure}{\numberline {5}{\ignorespaces \relax \fontsize  {8}{9.5}\selectfont  Consumer purchase habits across all occupation types}}{8}\protected@file@percent }
\newlabel{accuGDD_1}{{5}{8}}
\@writefile{toc}{\contentsline {subsection}{\numberline {5.3}Box Plot: Consumer purchase behaviour across various categories}{8}\protected@file@percent }
\@writefile{lof}{\contentsline {figure}{\numberline {6}{\ignorespaces \relax \fontsize  {8}{9.5}\selectfont  Consumer purchase behaviour across various categories}}{9}\protected@file@percent }
\newlabel{accuGDD_1}{{6}{9}}
\@writefile{toc}{\contentsline {subsection}{\numberline {5.4}BAR Plot: Consumer purchase behaviour across various categories}{9}\protected@file@percent }
\@writefile{lof}{\contentsline {figure}{\numberline {7}{\ignorespaces \relax \fontsize  {8}{9.5}\selectfont  Consumer purchase behaviour across various categories}}{10}\protected@file@percent }
\newlabel{accuGDD_1}{{7}{10}}
\@writefile{toc}{\contentsline {subsection}{\numberline {5.5}Point Plots: Consumer purchase behaviour based on their age and city they live in}{11}\protected@file@percent }
\@writefile{lof}{\contentsline {figure}{\numberline {8}{\ignorespaces \relax \fontsize  {8}{9.5}\selectfont  Consumer purchase behaviour across various categories}}{11}\protected@file@percent }
\newlabel{accuGDD_1}{{8}{11}}
\@writefile{toc}{\contentsline {subsection}{\numberline {5.6}Pie Plot: Consumer average purchase behaviour based on their age categories}{12}\protected@file@percent }
\@writefile{lof}{\contentsline {figure}{\numberline {9}{\ignorespaces \relax \fontsize  {8}{9.5}\selectfont  Consumer average purchase behaviour based on their age categories}}{12}\protected@file@percent }
\newlabel{accuGDD_1}{{9}{12}}
\bibstyle{abbrv}
\bibdata{main}
\bibcite{GovCan}{1}
\bibcite{GDD MSU}{2}
