\babel@toc {english}{}
\contentsline {section}{\numberline {1}Motivations}{2}% 
\contentsline {section}{\numberline {2}Calculating GDD}{3}% 
\contentsline {section}{\numberline {3}Results}{4}% 
\contentsline {subsection}{\numberline {3.1}Task 1.2}{4}% 
\contentsline {subsection}{\numberline {3.2}Task 1.4}{5}% 
\contentsline {subsection}{\numberline {3.3}Task 2.1}{8}% 
\contentsline {subsection}{\numberline {3.4}Task 2.4}{9}% 
\contentsline {subsection}{\numberline {3.5}Task 2.6}{10}% 
\contentsline {subsection}{\numberline {3.6}Optional Task 1.1}{11}% 
\contentsline {subsection}{\numberline {3.7}Optional Task 1.2}{13}% 
