cn,description,directReports,displayName,givenName,mail,manager,mobile,sn,telephoneNumber,userPrincipalName,manager_name
user0000,VP of Customer Success,"['user0002','user0003','user0004','user0005','user0006','user0007','user0008','user0009','user0010']",Big Boss,Big,Big.Boss@myfakecompany.com,user0000,1-700-554-1212,Boss,1-800-555-1212,user0000@mylocaldomain.home,Big Boss
user0001,Sales Manager,"['user0002','user0003','user0004','user0005','user0006','user0007','user0008','user0009','user0010']",Mike Jones,Mike,Mike.Jones@myfakecompany.com,user0000,1-700-554-1213,Jones,1-800-555-1213,user0001@mylocaldomain.home,Big Boss
user0002,Sales Executive,[],Jane Smith,Jane,Jane.Smith@myfakecompany.com,user0001,1-700-554-1214,Smith,1-800-555-1214,user0002@mylocaldomain.home,Mike Jones
user0003,Sales Executive,[],Joe Williams,Joe,Joe.Williams@myfakecompany.com,user0001,1-700-554-1215,Williams,1-800-555-1215,user0003@mylocaldomain.home,Mike Jones
user0004,Sales Executive,[],Robert James,Robert,Robert.James@myfakecompany.com,user0001,1-700-554-1216,James,1-800-555-1216,user0004@mylocaldomain.home,Mike Jones
user0005,Sales Executive,[],William Richards,William,William.Richards@myfakecompany.com,user0001,1-700-554-1217,Richards,1-800-555-1217,user0005@mylocaldomain.home,Mike Jones
user0006,Sales Executive,[],Keith Tomlinson,Keith,Keith.Tomlinson@myfakecompany.com,user0001,1-700-554-1218,Tomlinson,1-800-555-1218,user0006@mylocaldomain.home,Mike Jones
user0007,Sales Executive,[],Mike Kerry,Mike,Mike.Kerry@myfakecompany.com,user0001,1-700-554-1219,Kerry,1-800-555-1219,user0007@mylocaldomain.home,Mike Jones
user0008,Sales Executive,[],Sarah Roberts,Sarah,Sarah.Roberts@myfakecompany.com,user0001,1-700-554-1220,Roberts,1-800-555-1220,user0008@mylocaldomain.home,Mike Jones
user0009,Sales Executive,[],Margaret Lee,Margaret,Margaret.Lee@myfakecompany.com,user0001,1-700-554-1221,Lee,1-800-555-1221,user0009@mylocaldomain.home,Mike Jones
user0010,Sales Executive,[],Archie Nixon,Archie,Archie.Nixon@myfakecompany.com,user0001,1-700-554-1222,Nixon,1-800-555-1222,user0010@mylocaldomain.home,Mike Jones
user0011,Support Manager,"['user00012','user0013','user0014','user0015','user0016','user0017','user008','user0019','user020']",Mike Martin,Mike,Mike.Martin@myfakecompany.com,user0000,1-700-554-1223,Martin,1-800-555-1223,user0011@mylocaldomain.home,Big Boss
user0012,Support Technician,[],Jane Simpson,Jane,Jane.Simpson@myfakecompany.com,user0011,1-700-554-1224,Simpson,1-800-555-1224,user0012@mylocaldomain.home,Mike Martin
user0013,Support Technician,[],Joe Christiansen,Joe,Joe.Christiansen@myfakecompany.com,user0011,1-700-554-1225,Christiansen,1-800-555-1225,user0013@mylocaldomain.home,Mike Martin
user0014,Support Technician,[],Robert Jones,Robert,Robert.Jones@myfakecompany.com,user0011,1-700-554-1226,Jones,1-800-555-1226,user0014@mylocaldomain.home,Mike Martin
user0015,Support Technician,[],William Smith,William,William.Smith@myfakecompany.com,user0011,1-700-554-1227,Smith,1-800-555-1227,user0015@mylocaldomain.home,Mike Martin
user0016,Support Technician,[],Keith Williams,Keith,Keith.Williams@myfakecompany.com,user0011,1-700-554-1228,Williams,1-800-555-1228,user0016@mylocaldomain.home,Mike Martin
user0017,Support Technician,[],Mike James,Mike,Mike.James@myfakecompany.com,user0011,1-700-554-1229,James,1-800-555-1229,user0017@mylocaldomain.home,Mike Martin
user0018,Support Technician,[],Sarah Richards,Sarah,Sarah.Richards@myfakecompany.com,user0011,1-700-554-1230,Richards,1-800-555-1230,user0018@mylocaldomain.home,Mike Martin
user0019,Support Technician,[],Margaret Tomlinson,Margaret,Margaret.Tomlinson@myfakecompany.com,user0011,1-700-554-1231,Tomlinson,1-800-555-1231,user0019@mylocaldomain.home,Mike Martin
user0020,Consulting Manager,"['user0022','user0023','user0024','user0025','user0026','user0027','user0028','user0029','user0030']",Archie Kerry,Archie,Archie.Kerry@myfakecompany.com,user0000,1-700-554-1232,Kerry,1-800-555-1232,user0020@mylocaldomain.home,Big Boss
user0021,Consultant,[],Mike Roberts,Mike,Mike.Roberts@myfakecompany.com,user0020,1-700-554-1233,Roberts,1-800-555-1233,user0021@mylocaldomain.home,Archie Kerry
user0022,Consultant,[],Jane Lee,Jane,Jane.Lee@myfakecompany.com,user0020,1-700-554-1234,Lee,1-800-555-1234,user0022@mylocaldomain.home,Archie Kerry
user0023,Consultant,[],Joe Nixon,Joe,Joe.Nixon@myfakecompany.com,user0020,1-700-554-1235,Nixon,1-800-555-1235,user0023@mylocaldomain.home,Archie Kerry
user0024,Consultant,[],Robert Martin,Robert,Robert.Martin@myfakecompany.com,user0020,1-700-554-1236,Martin,1-800-555-1236,user0024@mylocaldomain.home,Archie Kerry
user0025,Consultant,[],William Simpson,William,William.Simpson@myfakecompany.com,user0020,1-700-554-1237,Simpson,1-800-555-1237,user0025@mylocaldomain.home,Archie Kerry
user0026,Consultant,[],Keith Christiansen,Keith,Keith.Christiansen@myfakecompany.com,user0020,1-700-554-1238,Christiansen,1-800-555-1238,user0026@mylocaldomain.home,Archie Kerry
user0027,Consultant,[],Chris Jones,Chris,Chris.Jones@myfakecompany.com,user0020,1-700-554-1239,Jones,1-800-555-1239,user0027@mylocaldomain.home,Archie Kerry
user0028,Consultant,[],Sarah Smith,Sarah,Sarah.Smith@myfakecompany.com,user0020,1-700-554-1240,Smith,1-800-555-1240,user0028@mylocaldomain.home,Archie Kerry
user0029,Consultant,[],Margaret Williams,Margaret,Margaret.Williams@myfakecompany.com,user0020,1-700-554-1241,Williams,1-800-555-1241,user0029@mylocaldomain.home,Archie Kerry
