Division,WeightClassKg,Place,Name,Team,BodyweightKg,Best3SquatKg,Best3BenchKg,Best3DeadliftKg,TotalKg,Equipment,Event,Sex
Boys,51.71,1,Austin Cuthbertson,Van Alstyne,50.89,149.69,77.11,124.74,351.53,Single-ply,SBD,M
Boys,51.71,2,Destin Warr,Callisburg,49.71,117.93,63.5,124.74,306.17,Single-ply,SBD,M
Boys,51.71,3,Jack Lifsey,Tom Bean,50.44,113.4,52.16,120.2,285.76,Single-ply,SBD,M
Boys,51.71,4,Justin Baque,Tom Bean,51.17,102.06,49.9,113.4,265.35,Single-ply,SBD,M
Boys,51.71,5,Eric Tapia,Gunter,50.17,86.18,58.97,102.06,247.21,Single-ply,SBD,M
Boys,55.79,1,Carter McFadden,Anna,54.79,158.76,79.38,161.03,399.16,Single-ply,SBD,M
Boys,55.79,2,Ignacio Salas,Whitesboro,55.61,142.88,90.72,156.49,390.09,Single-ply,SBD,M
Boys,55.79,3,Riley Fish,Pottsboro,55.16,117.93,90.72,127.01,335.66,Single-ply,SBD,M
Boys,55.79,4,Lance Jones,Van Alstyne,54.98,129.27,74.84,124.74,328.85,Single-ply,SBD,M
Boys,55.79,5,Conner Jacobs,Whitesboro,55.25,113.4,61.23,131.54,306.17,Single-ply,SBD,M
Boys,55.79,6,Dustin Hickman,Tom Bean,55.16,74.84,40.82,122.47,238.14,Single-ply,SBD,M
Boys,59.87,1,Manuel Labrada,Whitesboro,59.87,151.95,90.72,167.83,410.5,Single-ply,SBD,M
Boys,59.87,2,Asher Contreras,Whitesboro,59.51,140.61,81.65,165.56,387.82,Single-ply,SBD,M
Boys,59.87,3,Keane Ortega,Sadler S & S Cons,58.97,122.47,74.84,165.56,362.87,Single-ply,SBD,M
Boys,59.87,4,Kolten Pulliam,Blue Ridge,59.6,138.35,83.91,131.54,353.8,Single-ply,SBD,M
Boys,59.87,5,Jimmy Rollins,Van Alstyne,57.15,113.4,63.5,136.08,312.98,Single-ply,SBD,M
Boys,59.87,6,Allen Pierson,Blue Ridge,59.24,111.13,65.77,133.81,310.71,Single-ply,SBD,M
Boys,59.87,7,Chris Harmon,Tom Bean,59.6,95.25,72.57,115.67,283.5,Single-ply,SBD,M
Boys,59.87,8,Cole Bynum,Pottsboro,57.88,108.86,61.23,108.86,278.96,Single-ply,SBD,M
Boys,59.87,DQ,Kason Huschke,Bells,58.6,142.88,,,,Single-ply,SBD,M
Boys,59.87,DQ,David Fogleman,Whitewright,59.06,,,,,Single-ply,SBD,M
Boys,67.13,1,Mike Acevedo,Anna,65.95,215.46,136.08,190.51,542.04,Single-ply,SBD,M
Boys,67.13,2,Cameron Washington,Sherman,66.32,183.7,90.72,195.04,469.47,Single-ply,SBD,M
Boys,67.13,3,Ethan Sanders,Tom Bean,66.13,147.42,95.25,165.56,408.23,Single-ply,SBD,M
Boys,67.13,4,Brett Long,Van Alstyne,66.95,149.69,74.84,161.03,385.55,Single-ply,SBD,M
Boys,67.13,5,Colin Manning,Van Alstyne,65.14,149.69,72.57,158.76,381.02,Single-ply,SBD,M
Boys,67.13,6,Juan Gallegos,Princeton,61.96,145.15,86.18,131.54,362.87,Single-ply,SBD,M
Boys,67.13,7,Jack Hill,Whitewright,66.41,131.54,83.91,142.88,358.34,Single-ply,SBD,M
Boys,67.13,8,Lance Tumey,Howe,66.04,138.35,74.84,142.88,356.07,Single-ply,SBD,M
Boys,67.13,9,Colten Manning,Van Alstyne,63.14,142.88,72.57,131.54,347,Single-ply,SBD,M
Boys,67.13,10,Shelby Price,Callisburg,66.77,131.54,79.38,129.27,340.19,Single-ply,SBD,M
Boys,67.13,11,Austin Puyear,Pottsboro,66.86,113.4,68.04,147.42,328.85,Single-ply,SBD,M
Boys,67.13,12,Joe Ballard,Anna,63.87,122.47,68.04,127.01,317.51,Single-ply,SBD,M
Boys,67.13,13,John Carlson,Anna,62.14,102.06,61.23,127.01,290.3,Single-ply,SBD,M
Boys,67.13,14,Grant Robinson,Sherman Texoma Christian School,61.78,79.38,54.43,79.38,213.19,Single-ply,SBD,M
Boys,67.13,DQ,Colin Branch,Pottsboro,65.95,127.01,,,,Single-ply,SBD,M
Boys,74.84,1,Micah Justice,Sherman,74.66,190.51,115.67,210.92,517.1,Single-ply,SBD,M
Boys,74.84,2,Victor Martinez,Anna,73.3,190.51,111.13,206.38,508.02,Single-ply,SBD,M
Boys,74.84,3,Cody Hunter,Sherman,70.03,179.17,120.2,204.12,503.49,Single-ply,SBD,M
Boys,74.84,4,Keatyn Eitelman,Pottsboro,70.94,195.04,106.59,181.44,483.08,Single-ply,SBD,M
Boys,74.84,5,Tony Karleskint,Tom Bean,73.57,183.7,99.79,197.31,480.81,Single-ply,SBD,M
Boys,74.84,6,Joseph Oliver,Princeton,74.48,174.63,97.52,183.7,455.86,Single-ply,SBD,M
Boys,74.84,7,Gage Moore,Sadler S & S Cons,73.94,165.56,104.33,181.44,451.32,Single-ply,SBD,M
Boys,74.84,8,Joey Baggs,Sadler S & S Cons,69.13,136.08,90.72,181.44,408.23,Single-ply,SBD,M
Boys,74.84,9,Shawn Lukash,Howe,74.39,129.27,83.91,185.97,399.16,Single-ply,SBD,M
Boys,74.84,10,Gabe Clark,Anna,68.22,147.42,74.84,170.1,392.36,Single-ply,SBD,M
Boys,74.84,11,Ethan Keller,Sherman Texoma Christian School,73.84,145.15,90.72,136.08,371.95,Single-ply,SBD,M
Boys,74.84,12,Jacob Parish,Gunter,69.67,136.08,97.52,124.74,358.34,Single-ply,SBD,M
Boys,74.84,13,Gabe Gibson,Bells,72.48,111.13,70.31,142.88,324.32,Single-ply,SBD,M
Boys,74.84,14,Broc Armstrong,Blue Ridge,70.67,124.74,72.57,115.67,312.98,Single-ply,SBD,M
Boys,74.84,15,Brennan Bates,Sherman,68.4,120.2,61.23,129.27,310.71,Single-ply,SBD,M
Boys,74.84,DQ,Eli Godwin,Gunter,71.21,88.45,,,,Single-ply,SBD,M
Boys,74.84,DQ,Josué Hernández,Anna,71.67,,,,,Single-ply,SBD,M
Boys,74.84,DQ,Dillon Moncier,Princeton,73.84,181.44,115.67,,,Single-ply,SBD,M
Boys,82.1,1,Chris Gidney,Blue Ridge,81.65,210.92,142.88,215.46,569.26,Single-ply,SBD,M
Boys,82.1,2,Trevor Coglon,Bells,80.92,204.12,133.81,208.65,546.58,Single-ply,SBD,M
Boys,82.1,3,Seth Baucum,Callisburg,80.74,183.7,115.67,222.26,521.63,Single-ply,SBD,M
Boys,82.1,4,Jake Taylor,Van Alstyne,79.38,201.85,108.86,208.65,519.36,Single-ply,SBD,M
Boys,82.1,5,Cade Joyce,Anna,82.1,204.12,104.33,181.44,489.88,Single-ply,SBD,M
Boys,82.1,6,Conner Smith,Sadler S & S Cons,75.39,167.83,99.79,176.9,444.52,Single-ply,SBD,M
Boys,82.1,7,Slater James,Blue Ridge,75.57,158.76,83.91,165.56,408.23,Single-ply,SBD,M
Boys,82.1,8,Blake Reyes,Princeton,79.11,140.61,108.86,149.69,399.16,Single-ply,SBD,M
Boys,82.1,9,Kody Langham,Whitewright,82.1,145.15,88.45,154.22,387.82,Single-ply,SBD,M
Boys,82.1,10,Lane Dophied,Gunter,81.28,147.42,86.18,149.69,383.29,Single-ply,SBD,M
Boys,82.1,11,Jacob Cates,Blue Ridge,75.75,120.2,83.91,138.35,342.46,Single-ply,SBD,M
Boys,82.1,12,Andrew Burdett,Pottsboro,78.93,136.08,77.11,124.74,337.93,Single-ply,SBD,M
Boys,82.1,13,Jax Gage,Whitewright,78.83,102.06,58.97,108.86,269.89,Single-ply,SBD,M
Boys,82.1,DQ,Brendon Muisyo,Anna,75.98,,,,,Single-ply,SBD,M
Boys,89.81,1,Graham Ledbetter,Whitesboro,87.91,238.14,145.15,256.28,639.57,Single-ply,SBD,M
Boys,89.81,2,Austin Dickson,Anna,85.37,240.4,158.76,204.12,603.28,Single-ply,SBD,M
Boys,89.81,3,Markos Morales,Whitesboro,87.54,213.19,124.74,229.06,566.99,Single-ply,SBD,M
Boys,89.81,4,Luke Porter,Bonham,88.72,222.26,122.47,219.99,564.72,Single-ply,SBD,M
Boys,89.81,5,Hunter Griffin,Van Alstyne,83.37,215.46,127.01,204.12,546.58,Single-ply,SBD,M
Boys,89.81,6,Gabe Rivera,Bells,86.64,188.24,97.52,176.9,462.66,Single-ply,SBD,M
Boys,89.81,7,Martin Grijalva,Sherman,88.9,161.03,111.13,183.7,455.86,Single-ply,SBD,M
Boys,89.81,8,Shane Davis,Whitewright,85.64,161.03,115.67,172.37,449.06,Single-ply,SBD,M
Boys,89.81,9,Jacob Lopez,Princeton,87.18,156.49,99.79,142.88,399.16,Single-ply,SBD,M
Boys,89.81,10,Julius Carraway,Whitewright,86.36,142.88,83.91,156.49,383.29,Single-ply,SBD,M
Boys,89.81,11,Michael Pruitt,Callisburg,82.64,136.08,79.38,142.88,358.34,Single-ply,SBD,M
Boys,89.81,DQ,Hoaky DeAnda,Callisburg,87,,,,,Single-ply,SBD,M
Boys,89.81,DQ,Spencer Max,Anna,82.83,195.04,131.54,,,Single-ply,SBD,M
Boys,89.81,DQ,Garrett Kemp,Whitesboro,84.28,,,,,Single-ply,SBD,M
Boys,89.81,DQ,Lawson Moore,Whitewright,85.46,,,,,Single-ply,SBD,M
Boys,89.81,DQ,Gauge Cunningham,Tom Bean,89.45,174.63,97.52,,,Single-ply,SBD,M
Boys,89.81,DQ,Kaleb Graham,Tom Bean,82.64,199.58,,,,Single-ply,SBD,M
Boys,89.81,DQ,Sam Whittenburg,Sadler S & S Cons,88.27,183.7,120.2,,,Single-ply,SBD,M
Boys,99.79,1,Radley Hamm,Whitewright,94.26,215.46,136.08,192.78,544.31,Single-ply,SBD,M
Boys,99.79,2,Brandon Woods,Whitewright,98.79,210.92,131.54,201.85,544.31,Single-ply,SBD,M
Boys,99.79,3,Edgar Aguilar,Sadler S & S Cons,95.8,185.97,117.93,219.99,523.9,Single-ply,SBD,M
Boys,99.79,4,Brandon Hubert,Pottsboro,95.98,204.12,102.06,217.72,523.9,Single-ply,SBD,M
Boys,99.79,5,Jacob Kennedy,Bonham,98.52,201.85,99.79,199.58,501.22,Single-ply,SBD,M
Boys,99.79,6,Ben Branam,Bells,94.08,188.24,113.4,176.9,478.54,Single-ply,SBD,M
Boys,99.79,7,Kody Kerr,Sadler S & S Cons,90.17,181.44,111.13,181.44,474,Single-ply,SBD,M
Boys,99.79,8,Worth Lacy,Bonham,98.61,167.83,99.79,151.95,419.57,Single-ply,SBD,M
Boys,99.79,9,Jackson Adkins,Howe,95.07,163.29,102.06,129.27,394.63,Single-ply,SBD,M
Boys,109.77,1,Daniel Dowling,Bonham,108.68,306.17,226.8,238.14,771.11,Single-ply,SBD,M
Boys,109.77,2,Brady Wiggins,Blue Ridge,101.6,226.8,165.56,197.31,589.67,Single-ply,SBD,M
Boys,109.77,3,Blake Peters,Bells,107.41,226.8,131.54,204.12,562.45,Single-ply,SBD,M
Boys,109.77,4,Armando Chavez,Sherman,105.96,183.7,124.74,204.12,512.56,Single-ply,SBD,M
Boys,109.77,5,William Mack,Princeton,109.32,181.44,108.86,190.51,480.81,Single-ply,SBD,M
Boys,109.77,6,Jake Smallwood,Van Alstyne,103.06,174.63,99.79,165.56,439.98,Single-ply,SBD,M
Boys,109.77,7,Jacob Craig,Princeton,108.41,165.56,92.99,158.76,417.3,Single-ply,SBD,M
Boys,109.77,8,Joel Byler,Pottsboro,106.59,136.08,77.11,158.76,371.95,Single-ply,SBD,M
Boys,109.77,DQ,Aiden Carter,Princeton,106.5,199.58,,,,Single-ply,SBD,M
Boys,124.74,1,Reagan Spencer,Gunter,118.57,215.46,115.67,181.44,512.56,Single-ply,SBD,M
Boys,124.74,2,Dj Johnson,Princeton,120.47,181.44,122.47,185.97,489.88,Single-ply,SBD,M
Boys,124.74,3,Matt Billmeier,Sadler S & S Cons,109.95,174.63,142.88,170.1,487.61,Single-ply,SBD,M
Boys,124.74,4,Dayne Kelley,Sherman Texoma Christian School,112.22,185.97,115.67,170.1,471.74,Single-ply,SBD,M
Boys,124.74,5,Mark Garrison #3,Gunter,113.4,124.74,83.91,127.01,335.66,Single-ply,SBD,M
Boys,124.74,DQ,Ethan Thomas,Sadler S & S Cons,122.38,183.7,104.33,,,Single-ply,SBD,M
Boys,124.74,DQ,William Fleming,Howe,123.83,183.7,92.99,,,Single-ply,SBD,M
Boys,124.74+,1,Tekarius Walton,Sherman,139.07,240.4,161.03,254.01,655.44,Single-ply,SBD,M
Boys,124.74+,2,Jake Loganbill,Van Alstyne,128.46,272.16,140.61,231.33,644.1,Single-ply,SBD,M
Boys,124.74+,3,Tyler Smith #2,Sherman,140.89,238.14,124.74,238.14,601.01,Single-ply,SBD,M
Boys,124.74+,4,Sam Porter,Bonham,175.36,199.58,140.61,190.51,530.7,Single-ply,SBD,M
Boys,124.74+,5,Elijah McFarlan,Bonham,182.8,165.56,140.61,172.37,478.54,Single-ply,SBD,M
Boys,124.74+,6,Dylan Williston,Bells,158.94,158.76,95.25,161.03,415.04,Single-ply,SBD,M
Boys,124.74+,DQ,Drake Stephens #2,Bells,141.79,,,,,Single-ply,SBD,M
