{
	"extensionName": {
		"message": "Dark with Reds",
		"description": "Name of the theme."
	},
	"extensionDescription": {
		"message": "Dark theme with red accent colors",
		"description": "Description of the theme."
	}
}
