<?xml version="1.0" encoding="UTF-8" standalone="no"?>
<svg
	version="1.1"
	xmlns="http://www.w3.org/2000/svg"
	viewBox="-32 -32 64 64"
>
	<polygon fill="#0c0c0d" opacity="0.8" points="-16,-32 16,-32 16,32 0,16 -16,32"/>
</svg>
