<?xml version="1.0" encoding="UTF-8" standalone="no"?>
<svg
	version="1.1"
	xmlns="http://www.w3.org/2000/svg"
	viewBox="0 0 64 64"
>
	<g fill="#737373">
		<path d="M16,10 v32 h6 v-13 h8 v13 h6 v-32 h-6 v13 h-8 v-13"/>
		<path d="M40,46 l18,18 h2 l4,-4 v-2 l-18,-18"/>
	</g>
	<circle cx="26" cy="26" r="24" stroke-width="4" stroke="#737373" fill="#7f7fff" fill-opacity=".2"/>
	<circle cx="20" cy="20" r="8" fill="#fff" fill-opacity=".2"/>
</svg>
