<?xml version="1.0" encoding="UTF-8" standalone="no"?>
<svg
	version="1.1"
	xmlns="http://www.w3.org/2000/svg"
	viewBox="0 0 32 32"
>
	<path fill="#f9f9fa" opacity="0.8125" d="M21,24 l8,8 h1 l2,-2 v-1 l-8,-8"/>
	<circle stroke="#f9f9fa"  stroke-opacity="0.8125" cx="14" cy="14" r="12" stroke-width="4" fill="none"/>
</svg>
