<?xml version="1.0" encoding="UTF-8" standalone="no"?>
<svg
	version="1.1"
	xmlns="http://www.w3.org/2000/svg"
	xmlns:xlink="http://www.w3.org/1999/xlink"
	viewBox="0 0 8 8"
>
	<g id="ind" fill="#f9f9fa" opacity="0.8125">
		<polygon points="0,0 2,0 2,1 0,1"/>
		<polygon points="3,0 8,0 8,1 3,1"/>
		<polygon points="3,2 6,2 6,3 3,3"/>
	</g>
	<use xlink:href="#ind" transform="translate(0,4)"/>
</svg>
