<?xml version="1.0" encoding="UTF-8" standalone="no"?>
<svg
	version="1.1"
	xmlns="http://www.w3.org/2000/svg"
	viewBox="0 0 8 8"
>
	<g fill="#0c0c0d" opacity="0.8125">
		<polygon points="3,5 3,4 0,4 4,0 8,4 5,4 5,5"/>
		<polygon points="3,6 5,6 5,8 3,8"/>
		<polygon points="6,6 8,6 8,8 6,8"/>
	</g>
</svg>
