<?xml version="1.0" encoding="UTF-8" standalone="no"?>
<svg
	version="1.1"
	xmlns="http://www.w3.org/2000/svg"
	xmlns:xlink="http://www.w3.org/1999/xlink"
	viewBox="0 0 8 8"
>
	<g id="ind" fill="#ff0039">
		<polygon points="0,0 4,0 4,1 0,1"/>
		<polygon points="7,0 8,0 8,1 7,1"/>
		<polygon points="0,2 4,2 4,3 0,3"/>
		<polygon points="7,2 8,2 8,3 7,3"/>
	</g>
	<use xlink:href="#ind" transform="translate(0,4)"/>
</svg>
