<?xml version="1.0" encoding="UTF-8" standalone="no"?>
<svg
	version="1.1"
	xmlns="http://www.w3.org/2000/svg"
	viewBox="0 0 8 8"
>
	<polygon fill="#737373" points="0,0 2,0 2,4 6,0 8,0 8,8 6,8 2,4 2,8 0,8"/>
</svg>
