<?xml version="1.0" encoding="UTF-8" standalone="no"?>
<svg
	version="1.1"
	xmlns="http://www.w3.org/2000/svg"
	viewBox="0 0 8 8"
>
	<polygon fill="#f9f9fa" opacity="0.8125" points="1,0 3,0 7,4 3,8 1,8"/>
</svg>
