{
    "Version": "2012-10-17",
    "Statement": [
        {
            "Sid": "EC2",
            "Effect": "Allow",
            "Action": [
                "ec2:DescribeInternetGateways",
                "ec2:DescribeNetworkInterfaces",
                "ec2:DescribeVpcs",
                "ec2:DescribeDhcpOptions",
                "ec2:DescribeNatGateways",
                "ec2:DescribeSubnets",
                "ec2:DescribeNetworkAcls",
                "ec2:DescribeRouteTables",
                "ec2:DescribeSecurityGroups",
                "ec2:DescribeEgressOnlyInternetGateways"
            ],
            "Resource": [
                "*"
            ]
        },
        {
            "Sid": "STS",
            "Effect": "Allow",
            "Action": "sts:AssumeRole",
            "Resource": [
                "arn:aws:iam::*:role/${LAMBDA_TAGGING_ROLE_NAME}"
            ]
        },
        {
            "Sid": "RAM",
            "Effect": "Allow",
            "Action": "ram:*",
            "Resource": [
                "arn:aws:ram:*:${NETWORK_ACCOUNT_ID}:resource-share/*"
            ]
        }
    ]
}
