{
    "resources": [
        {
            "function_name": "describe_network_acls",
            "data_key": "NetworkAcls",
            "id_key": "NetworkAclId"
        },
        {
            "function_name": "describe_subnets",
            "data_key": "Subnets",
            "id_key": "SubnetId"
        },
        {
            "function_name": "describe_vpcs",
            "data_key": "Vpcs",
            "id_key": "VpcId"
        },
        {
            "function_name": "describe_dhcp_options",
            "data_key": "DhcpOptions",
            "id_key": "DhcpOptionsId"
        },
        {
            "function_name": "describe_nat_gateways",
            "data_key": "NatGateways",
            "id_key": "NatGatewayId"
        },
        {
            "function_name": "describe_internet_gateways",
            "data_key": "InternetGateways",
            "id_key": "InternetGatewayId"
        },
        {
            "function_name": "describe_egress_only_internet_gateways",
            "data_key": "EgressOnlyInternetGateways",
            "id_key": "EgressOnlyInternetGatewayId"
        },
        {
            "function_name": "describe_network_interfaces",
            "data_key": "NetworkInterfaces",
            "id_key": "NetworkInterfaceId"
        },
        {
            "function_name": "describe_route_tables",
            "data_key": "RouteTables",
            "id_key": "RouteTableId"
        },
        {
            "function_name": "describe_security_groups",
            "data_key": "SecurityGroups",
            "id_key": "GroupId"
        }
    ]
}
