FILENAME,SAMPLINGRATE,BIT,DURATION,CHANNELS,INDEX,WL,ENVT,MSMOOTH,KSMOOTH,LEFT_CHANNEL,RIGHT_CHANNEL
rayol-farm2_2019-03-24_00-00-36.wav,44100,16,60,1,H,512,hil,NULL,NULL,0.886352148043167,NA 
rayol-farm2_2019-03-24_00-02-36.wav,44100,16,60,1,H,512,hil,NULL,NULL,0.880722447471447,NA 
rayol-farm2_2019-03-24_00-04-36.wav,44100,16,60,1,H,512,hil,NULL,NULL,0.889107364718361,NA 
rayol-farm2_2019-03-24_00-06-37.wav,44100,16,60,1,H,512,hil,NULL,NULL,0.889823805538045,NA 
rayol-farm2_2019-03-24_00-08-37.wav,44100,16,60,1,H,512,hil,NULL,NULL,0.884842992512351,NA 
rayol-farm2_2019-03-24_00-10-37.wav,44100,16,60,1,H,512,hil,NULL,NULL,0.890686573456752,NA 
rayol-farm2_2019-03-24_00-12-37.wav,44100,16,60,1,H,512,hil,NULL,NULL,0.888996581793366,NA 
rayol-farm2_2019-03-24_00-14-37.wav,44100,16,60,1,H,512,hil,NULL,NULL,0.884234861395266,NA 
rayol-farm2_2019-03-24_00-16-37.wav,44100,16,60,1,H,512,hil,NULL,NULL,0.883990859714379,NA 
rayol-farm2_2019-03-24_00-18-37.wav,44100,16,60,1,H,512,hil,NULL,NULL,0.887067258925086,NA 
rayol-farm2_2019-03-24_00-20-37.wav,44100,16,60,1,H,512,hil,NULL,NULL,0.88647606191093,NA 
rayol-farm2_2019-03-24_00-22-38.wav,44100,16,60,1,H,512,hil,NULL,NULL,0.887361531922853,NA 
rayol-farm2_2019-03-24_00-24-38.wav,44100,16,60,1,H,512,hil,NULL,NULL,0.889982551883726,NA 
rayol-farm2_2019-03-24_00-26-38.wav,44100,16,60,1,H,512,hil,NULL,NULL,0.890208372087734,NA 
rayol-farm2_2019-03-24_00-28-38.wav,44100,16,60,1,H,512,hil,NULL,NULL,0.890329135675111,NA 
rayol-farm2_2019-03-24_00-30-38.wav,44100,16,60,1,H,512,hil,NULL,NULL,0.891271250232254,NA 
rayol-farm2_2019-03-24_00-32-38.wav,44100,16,60,1,H,512,hil,NULL,NULL,0.889623129649566,NA 
rayol-farm2_2019-03-24_00-34-38.wav,44100,16,60,1,H,512,hil,NULL,NULL,0.890020199058242,NA 
rayol-farm2_2019-03-24_00-36-38.wav,44100,16,60,1,H,512,hil,NULL,NULL,0.888889294928716,NA 
rayol-farm2_2019-03-24_00-38-38.wav,44100,16,60,1,H,512,hil,NULL,NULL,0.886310328433852,NA 
rayol-farm2_2019-03-24_00-40-39.wav,44100,16,60,1,H,512,hil,NULL,NULL,0.886587521421331,NA 
rayol-farm2_2019-03-24_00-42-39.wav,44100,16,60,1,H,512,hil,NULL,NULL,0.886132514743102,NA 
rayol-farm2_2019-03-24_00-44-39.wav,44100,16,60,1,H,512,hil,NULL,NULL,0.888665276107818,NA 
rayol-farm2_2019-03-24_00-46-39.wav,44100,16,60,1,H,512,hil,NULL,NULL,0.889382096358677,NA 
rayol-farm2_2019-03-24_00-48-39.wav,44100,16,60,1,H,512,hil,NULL,NULL,0.890086321571685,NA 
rayol-farm2_2019-03-24_00-50-39.wav,44100,16,60,1,H,512,hil,NULL,NULL,0.886399917558062,NA 
rayol-farm2_2019-03-24_00-52-39.wav,44100,16,60,1,H,512,hil,NULL,NULL,0.888188207649843,NA 
rayol-farm2_2019-03-24_00-54-39.wav,44100,16,60,1,H,512,hil,NULL,NULL,0.88931564643158,NA 
rayol-farm2_2019-03-24_00-56-40.wav,44100,16,60,1,H,512,hil,NULL,NULL,0.888558665988449,NA 
rayol-farm2_2019-03-24_00-58-40.wav,44100,16,60,1,H,512,hil,NULL,NULL,0.889261883014716,NA 
rayol-farm2_2019-03-24_01-00-40.wav,44100,16,60,1,H,512,hil,NULL,NULL,0.889767773454098,NA 
rayol-farm2_2019-03-24_01-02-40.wav,44100,16,60,1,H,512,hil,NULL,NULL,0.887233344019046,NA 
rayol-farm2_2019-03-24_01-04-40.wav,44100,16,60,1,H,512,hil,NULL,NULL,0.88355054858406,NA 
rayol-farm2_2019-03-24_01-06-40.wav,44100,16,60,1,H,512,hil,NULL,NULL,0.887392729340748,NA 
rayol-farm2_2019-03-24_01-08-40.wav,44100,16,60,1,H,512,hil,NULL,NULL,0.889861682543954,NA 
rayol-farm2_2019-03-24_01-10-40.wav,44100,16,60,1,H,512,hil,NULL,NULL,0.886866006065068,NA 
rayol-farm2_2019-03-24_01-12-41.wav,44100,16,60,1,H,512,hil,NULL,NULL,0.887049290299502,NA 
rayol-farm2_2019-03-24_01-14-41.wav,44100,16,60,1,H,512,hil,NULL,NULL,0.888351086327204,NA 
rayol-farm2_2019-03-24_01-16-41.wav,44100,16,60,1,H,512,hil,NULL,NULL,0.887332623756172,NA 
rayol-farm2_2019-03-24_01-18-41.wav,44100,16,60,1,H,512,hil,NULL,NULL,0.887901938038967,NA 
rayol-farm2_2019-03-24_01-20-41.wav,44100,16,60,1,H,512,hil,NULL,NULL,0.887888297246128,NA 
rayol-farm2_2019-03-24_01-22-41.wav,44100,16,60,1,H,512,hil,NULL,NULL,0.890412754349271,NA 
rayol-farm2_2019-03-24_01-24-41.wav,44100,16,60,1,H,512,hil,NULL,NULL,0.890849178368382,NA 
rayol-farm2_2019-03-24_01-26-41.wav,44100,16,60,1,H,512,hil,NULL,NULL,0.887446431024905,NA 
rayol-farm2_2019-03-24_01-28-42.wav,44100,16,60,1,H,512,hil,NULL,NULL,0.887740880330573,NA 
rayol-farm2_2019-03-24_01-30-42.wav,44100,16,60,1,H,512,hil,NULL,NULL,0.889714204015591,NA 
rayol-farm2_2019-03-24_01-32-42.wav,44100,16,60,1,H,512,hil,NULL,NULL,0.889682546916208,NA 
rayol-farm2_2019-03-24_01-34-42.wav,44100,16,60,1,H,512,hil,NULL,NULL,0.888368332414878,NA 
rayol-farm2_2019-03-24_01-36-42.wav,44100,16,60,1,H,512,hil,NULL,NULL,0.890219282056272,NA 
rayol-farm2_2019-03-24_01-38-42.wav,44100,16,60,1,H,512,hil,NULL,NULL,0.890261999670167,NA 
rayol-farm2_2019-03-24_01-40-42.wav,44100,16,60,1,H,512,hil,NULL,NULL,0.889200157006771,NA 
rayol-farm2_2019-03-24_01-42-42.wav,44100,16,60,1,H,512,hil,NULL,NULL,0.8866719424991,NA 
rayol-farm2_2019-03-24_01-44-43.wav,44100,16,60,1,H,512,hil,NULL,NULL,0.888321919687706,NA 
rayol-farm2_2019-03-24_01-46-43.wav,44100,16,60,1,H,512,hil,NULL,NULL,0.88865936843957,NA 
rayol-farm2_2019-03-24_01-48-43.wav,44100,16,60,1,H,512,hil,NULL,NULL,0.888071699354498,NA 
rayol-farm2_2019-03-24_01-50-43.wav,44100,16,60,1,H,512,hil,NULL,NULL,0.890015784342074,NA 
rayol-farm2_2019-03-24_01-52-43.wav,44100,16,60,1,H,512,hil,NULL,NULL,0.889792214692096,NA 
rayol-farm2_2019-03-24_01-54-43.wav,44100,16,60,1,H,512,hil,NULL,NULL,0.889290153202451,NA 
rayol-farm2_2019-03-24_01-56-43.wav,44100,16,60,1,H,512,hil,NULL,NULL,0.888772319057454,NA 
rayol-farm2_2019-03-24_01-58-43.wav,44100,16,60,1,H,512,hil,NULL,NULL,0.890305232168276,NA 
rayol-farm2_2019-03-24_02-00-43.wav,44100,16,60,1,H,512,hil,NULL,NULL,0.888937112521924,NA 
rayol-farm2_2019-03-24_02-02-44.wav,44100,16,60,1,H,512,hil,NULL,NULL,0.886435303106459,NA 
rayol-farm2_2019-03-24_02-04-44.wav,44100,16,60,1,H,512,hil,NULL,NULL,0.888165842346617,NA 
rayol-farm2_2019-03-24_02-06-44.wav,44100,16,60,1,H,512,hil,NULL,NULL,0.891179879267743,NA 
rayol-farm2_2019-03-24_02-08-44.wav,44100,16,60,1,H,512,hil,NULL,NULL,0.891467517493985,NA 
rayol-farm2_2019-03-24_02-10-44.wav,44100,16,60,1,H,512,hil,NULL,NULL,0.877016336831156,NA 
rayol-farm2_2019-03-24_02-12-44.wav,44100,16,60,1,H,512,hil,NULL,NULL,0.887688404594122,NA 
rayol-farm2_2019-03-24_02-14-44.wav,44100,16,60,1,H,512,hil,NULL,NULL,0.888517362049422,NA 
rayol-farm2_2019-03-24_02-16-44.wav,44100,16,60,1,H,512,hil,NULL,NULL,0.88477104453975,NA 
rayol-farm2_2019-03-24_02-18-45.wav,44100,16,60,1,H,512,hil,NULL,NULL,0.884644595042557,NA 
rayol-farm2_2019-03-24_02-20-45.wav,44100,16,60,1,H,512,hil,NULL,NULL,0.886938149863696,NA 
rayol-farm2_2019-03-24_02-22-45.wav,44100,16,60,1,H,512,hil,NULL,NULL,0.891434399173257,NA 
rayol-farm2_2019-03-24_02-24-45.wav,44100,16,60,1,H,512,hil,NULL,NULL,0.862489191921239,NA 
rayol-farm2_2019-03-24_02-26-45.wav,44100,16,60,1,H,512,hil,NULL,NULL,0.878905517143017,NA 
rayol-farm2_2019-03-24_02-28-45.wav,44100,16,60,1,H,512,hil,NULL,NULL,0.890674138760638,NA 
rayol-farm2_2019-03-24_02-30-45.wav,44100,16,60,1,H,512,hil,NULL,NULL,0.869924919929871,NA 
rayol-farm2_2019-03-24_02-32-45.wav,44100,16,60,1,H,512,hil,NULL,NULL,0.86218396489415,NA 
rayol-farm2_2019-03-24_02-34-46.wav,44100,16,60,1,H,512,hil,NULL,NULL,0.860689068061527,NA 
rayol-farm2_2019-03-24_02-36-46.wav,44100,16,60,1,H,512,hil,NULL,NULL,0.862351515596007,NA 
rayol-farm2_2019-03-24_02-38-46.wav,44100,16,60,1,H,512,hil,NULL,NULL,0.86236596251658,NA 
rayol-farm2_2019-03-24_02-40-46.wav,44100,16,60,1,H,512,hil,NULL,NULL,0.861748849203731,NA 
rayol-farm2_2019-03-24_02-42-46.wav,44100,16,60,1,H,512,hil,NULL,NULL,0.860289284390851,NA 
rayol-farm2_2019-03-24_02-44-46.wav,44100,16,60,1,H,512,hil,NULL,NULL,0.860229239001611,NA 
rayol-farm2_2019-03-24_02-46-46.wav,44100,16,60,1,H,512,hil,NULL,NULL,0.860878900313564,NA 
rayol-farm2_2019-03-24_02-48-46.wav,44100,16,60,1,H,512,hil,NULL,NULL,0.860076568864429,NA 
rayol-farm2_2019-03-24_02-50-47.wav,44100,16,60,1,H,512,hil,NULL,NULL,0.860898949913685,NA 
rayol-farm2_2019-03-24_02-52-47.wav,44100,16,60,1,H,512,hil,NULL,NULL,0.859664456593361,NA 
rayol-farm2_2019-03-24_02-54-47.wav,44100,16,60,1,H,512,hil,NULL,NULL,0.885140034189743,NA 
rayol-farm2_2019-03-24_02-56-47.wav,44100,16,60,1,H,512,hil,NULL,NULL,0.888223122267407,NA 
rayol-farm2_2019-03-24_02-58-47.wav,44100,16,60,1,H,512,hil,NULL,NULL,0.886718366270467,NA 
rayol-farm2_2019-03-24_03-00-47.wav,44100,16,60,1,H,512,hil,NULL,NULL,0.887800611537219,NA 
rayol-farm2_2019-03-24_03-02-47.wav,44100,16,60,1,H,512,hil,NULL,NULL,0.886614148830661,NA 
rayol-farm2_2019-03-24_03-04-47.wav,44100,16,60,1,H,512,hil,NULL,NULL,0.888122808876452,NA 
rayol-farm2_2019-03-24_03-06-48.wav,44100,16,60,1,H,512,hil,NULL,NULL,0.886969832196114,NA 
rayol-farm2_2019-03-24_03-08-48.wav,44100,16,60,1,H,512,hil,NULL,NULL,0.884936254676276,NA 
rayol-farm2_2019-03-24_03-10-48.wav,44100,16,60,1,H,512,hil,NULL,NULL,0.885859559709909,NA 
rayol-farm2_2019-03-24_03-12-48.wav,44100,16,60,1,H,512,hil,NULL,NULL,0.888008239483293,NA 
rayol-farm2_2019-03-24_03-14-48.wav,44100,16,60,1,H,512,hil,NULL,NULL,0.891391737840341,NA 
rayol-farm2_2019-03-24_03-16-48.wav,44100,16,60,1,H,512,hil,NULL,NULL,0.889450283232501,NA 
rayol-farm2_2019-03-24_03-18-48.wav,44100,16,60,1,H,512,hil,NULL,NULL,0.888455288572085,NA 
rayol-farm2_2019-03-24_03-20-48.wav,44100,16,60,1,H,512,hil,NULL,NULL,0.886365078498309,NA 
rayol-farm2_2019-03-24_03-22-48.wav,44100,16,60,1,H,512,hil,NULL,NULL,0.887626613687038,NA 
rayol-farm2_2019-03-24_03-24-49.wav,44100,16,60,1,H,512,hil,NULL,NULL,0.886444776584949,NA 
rayol-farm2_2019-03-24_03-26-49.wav,44100,16,60,1,H,512,hil,NULL,NULL,0.890373444449551,NA 
rayol-farm2_2019-03-24_03-28-49.wav,44100,16,60,1,H,512,hil,NULL,NULL,0.888839218163155,NA 
rayol-farm2_2019-03-24_03-30-49.wav,44100,16,60,1,H,512,hil,NULL,NULL,0.840383623298188,NA 
rayol-farm2_2019-03-24_03-32-49.wav,44100,16,60,1,H,512,hil,NULL,NULL,0.887509020063835,NA 
rayol-farm2_2019-03-24_03-34-49.wav,44100,16,60,1,H,512,hil,NULL,NULL,0.887893545117503,NA 
rayol-farm2_2019-03-24_03-36-49.wav,44100,16,60,1,H,512,hil,NULL,NULL,0.886501535708168,NA 
rayol-farm2_2019-03-24_03-38-49.wav,44100,16,60,1,H,512,hil,NULL,NULL,0.889770541407299,NA 
rayol-farm2_2019-03-24_03-40-50.wav,44100,16,60,1,H,512,hil,NULL,NULL,0.888479914766264,NA 
rayol-farm2_2019-03-24_03-42-50.wav,44100,16,60,1,H,512,hil,NULL,NULL,0.888799364349938,NA 
rayol-farm2_2019-03-24_03-44-50.wav,44100,16,60,1,H,512,hil,NULL,NULL,0.888957321257353,NA 
rayol-farm2_2019-03-24_03-46-50.wav,44100,16,60,1,H,512,hil,NULL,NULL,0.889089715421795,NA 
rayol-farm2_2019-03-24_03-48-50.wav,44100,16,60,1,H,512,hil,NULL,NULL,0.887565318017099,NA 
rayol-farm2_2019-03-24_03-50-50.wav,44100,16,60,1,H,512,hil,NULL,NULL,0.889195526023782,NA 
rayol-farm2_2019-03-24_03-52-50.wav,44100,16,60,1,H,512,hil,NULL,NULL,0.888901868444299,NA 
rayol-farm2_2019-03-24_03-54-50.wav,44100,16,60,1,H,512,hil,NULL,NULL,0.887291305557564,NA 
rayol-farm2_2019-03-24_03-56-51.wav,44100,16,60,1,H,512,hil,NULL,NULL,0.886131895878159,NA 
rayol-farm2_2019-03-24_03-58-51.wav,44100,16,60,1,H,512,hil,NULL,NULL,0.885672833565883,NA 
rayol-farm2_2019-03-24_04-00-51.wav,44100,16,60,1,H,512,hil,NULL,NULL,0.883534816440799,NA 
rayol-farm2_2019-03-24_04-02-51.wav,44100,16,60,1,H,512,hil,NULL,NULL,0.884390780573663,NA 
rayol-farm2_2019-03-24_04-04-51.wav,44100,16,60,1,H,512,hil,NULL,NULL,0.88684055001794,NA 
rayol-farm2_2019-03-24_04-06-51.wav,44100,16,60,1,H,512,hil,NULL,NULL,0.887484837902363,NA 
rayol-farm2_2019-03-24_04-08-51.wav,44100,16,60,1,H,512,hil,NULL,NULL,0.887173156620343,NA 
rayol-farm2_2019-03-24_04-10-51.wav,44100,16,60,1,H,512,hil,NULL,NULL,0.890617757725884,NA 
rayol-farm2_2019-03-24_04-12-52.wav,44100,16,60,1,H,512,hil,NULL,NULL,0.89085549032918,NA 
rayol-farm2_2019-03-24_04-14-52.wav,44100,16,60,1,H,512,hil,NULL,NULL,0.878499658049869,NA 
rayol-farm2_2019-03-24_04-16-52.wav,44100,16,60,1,H,512,hil,NULL,NULL,0.863542994040557,NA 
rayol-farm2_2019-03-24_04-18-52.wav,44100,16,60,1,H,512,hil,NULL,NULL,0.886887172777314,NA 
rayol-farm2_2019-03-24_04-20-52.wav,44100,16,60,1,H,512,hil,NULL,NULL,0.887987648651807,NA 
rayol-farm2_2019-03-24_04-22-52.wav,44100,16,60,1,H,512,hil,NULL,NULL,0.889228622534699,NA 
rayol-farm2_2019-03-24_04-24-52.wav,44100,16,60,1,H,512,hil,NULL,NULL,0.889105216904453,NA 
rayol-farm2_2019-03-24_04-26-52.wav,44100,16,60,1,H,512,hil,NULL,NULL,0.885923006534615,NA 
rayol-farm2_2019-03-24_04-28-52.wav,44100,16,60,1,H,512,hil,NULL,NULL,0.885756291554405,NA 
rayol-farm2_2019-03-24_04-30-53.wav,44100,16,60,1,H,512,hil,NULL,NULL,0.873759799593441,NA 
rayol-farm2_2019-03-24_04-32-53.wav,44100,16,60,1,H,512,hil,NULL,NULL,0.861249693246827,NA 
rayol-farm2_2019-03-24_04-34-53.wav,44100,16,60,1,H,512,hil,NULL,NULL,0.861295926076907,NA 
rayol-farm2_2019-03-24_04-36-53.wav,44100,16,60,1,H,512,hil,NULL,NULL,0.885802775525406,NA 
rayol-farm2_2019-03-24_04-38-53.wav,44100,16,60,1,H,512,hil,NULL,NULL,0.861954497603726,NA 
rayol-farm2_2019-03-24_04-40-53.wav,44100,16,60,1,H,512,hil,NULL,NULL,0.855855543898867,NA 
rayol-farm2_2019-03-24_04-42-53.wav,44100,16,60,1,H,512,hil,NULL,NULL,0.864426284474351,NA 
rayol-farm2_2019-03-24_04-44-53.wav,44100,16,60,1,H,512,hil,NULL,NULL,0.870172660217798,NA 
rayol-farm2_2019-03-24_04-46-54.wav,44100,16,60,1,H,512,hil,NULL,NULL,0.863779474947067,NA 
rayol-farm2_2019-03-24_04-48-54.wav,44100,16,60,1,H,512,hil,NULL,NULL,0.861201138280231,NA 
rayol-farm2_2019-03-24_04-50-54.wav,44100,16,60,1,H,512,hil,NULL,NULL,0.860337503867694,NA 
rayol-farm2_2019-03-24_04-52-54.wav,44100,16,60,1,H,512,hil,NULL,NULL,0.861000662175441,NA 
rayol-farm2_2019-03-24_04-54-54.wav,44100,16,60,1,H,512,hil,NULL,NULL,0.861376578022592,NA 
rayol-farm2_2019-03-24_04-56-54.wav,44100,16,60,1,H,512,hil,NULL,NULL,0.861848796790598,NA 
rayol-farm2_2019-03-24_04-58-54.wav,44100,16,60,1,H,512,hil,NULL,NULL,0.861237170297991,NA 
rayol-farm2_2019-03-24_05-00-54.wav,44100,16,60,1,H,512,hil,NULL,NULL,0.861913059246803,NA 
rayol-farm2_2019-03-24_05-02-55.wav,44100,16,60,1,H,512,hil,NULL,NULL,0.861226087344141,NA 
rayol-farm2_2019-03-24_05-04-55.wav,44100,16,60,1,H,512,hil,NULL,NULL,0.86104074308129,NA 
rayol-farm2_2019-03-24_05-06-55.wav,44100,16,60,1,H,512,hil,NULL,NULL,0.861299252487299,NA 
rayol-farm2_2019-03-24_05-08-55.wav,44100,16,60,1,H,512,hil,NULL,NULL,0.860596118268927,NA 
rayol-farm2_2019-03-24_05-10-55.wav,44100,16,60,1,H,512,hil,NULL,NULL,0.86026952895944,NA 
rayol-farm2_2019-03-24_05-12-55.wav,44100,16,60,1,H,512,hil,NULL,NULL,0.859968977954228,NA 
rayol-farm2_2019-03-24_05-14-55.wav,44100,16,60,1,H,512,hil,NULL,NULL,0.860572623144305,NA 
rayol-farm2_2019-03-24_05-16-55.wav,44100,16,60,1,H,512,hil,NULL,NULL,0.862597985895437,NA 
rayol-farm2_2019-03-24_05-18-56.wav,44100,16,60,1,H,512,hil,NULL,NULL,0.863106045841791,NA 
rayol-farm2_2019-03-24_05-20-56.wav,44100,16,60,1,H,512,hil,NULL,NULL,0.863837377039981,NA 
rayol-farm2_2019-03-24_05-22-56.wav,44100,16,60,1,H,512,hil,NULL,NULL,0.864092361988127,NA 
rayol-farm2_2019-03-24_05-24-56.wav,44100,16,60,1,H,512,hil,NULL,NULL,0.863505588185308,NA 
rayol-farm2_2019-03-24_05-26-56.wav,44100,16,60,1,H,512,hil,NULL,NULL,0.863326128058056,NA 
rayol-farm2_2019-03-24_05-28-56.wav,44100,16,60,1,H,512,hil,NULL,NULL,0.862857583411363,NA 
rayol-farm2_2019-03-24_05-30-56.wav,44100,16,60,1,H,512,hil,NULL,NULL,0.862400784490334,NA 
rayol-farm2_2019-03-24_05-32-56.wav,44100,16,60,1,H,512,hil,NULL,NULL,0.862546029939101,NA 
rayol-farm2_2019-03-24_05-34-57.wav,44100,16,60,1,H,512,hil,NULL,NULL,0.862413395107402,NA 
rayol-farm2_2019-03-24_05-36-57.wav,44100,16,60,1,H,512,hil,NULL,NULL,0.861589045424877,NA 
rayol-farm2_2019-03-24_05-38-57.wav,44100,16,60,1,H,512,hil,NULL,NULL,0.86123907694642,NA 
rayol-farm2_2019-03-24_05-40-57.wav,44100,16,60,1,H,512,hil,NULL,NULL,0.86688080203647,NA 
rayol-farm2_2019-03-24_05-42-57.wav,44100,16,60,1,H,512,hil,NULL,NULL,0.868786115551038,NA 
rayol-farm2_2019-03-24_05-44-57.wav,44100,16,60,1,H,512,hil,NULL,NULL,0.898303417425668,NA 
rayol-farm2_2019-03-24_05-46-57.wav,44100,16,60,1,H,512,hil,NULL,NULL,0.898288172536601,NA 
rayol-farm2_2019-03-24_05-48-57.wav,44100,16,60,1,H,512,hil,NULL,NULL,0.898585415175085,NA 
rayol-farm2_2019-03-24_05-50-57.wav,44100,16,60,1,H,512,hil,NULL,NULL,0.898626894376728,NA 
rayol-farm2_2019-03-24_05-52-58.wav,44100,16,60,1,H,512,hil,NULL,NULL,0.899073654245227,NA 
rayol-farm2_2019-03-24_05-54-58.wav,44100,16,60,1,H,512,hil,NULL,NULL,0.898878988199171,NA 
rayol-farm2_2019-03-24_05-56-58.wav,44100,16,60,1,H,512,hil,NULL,NULL,0.896111004261695,NA 
rayol-farm2_2019-03-24_05-58-58.wav,44100,16,60,1,H,512,hil,NULL,NULL,0.896156537835998,NA 
rayol-farm2_2019-03-24_06-00-58.wav,44100,16,60,1,H,512,hil,NULL,NULL,0.899488396373556,NA 
rayol-farm2_2019-03-24_06-02-58.wav,44100,16,60,1,H,512,hil,NULL,NULL,0.898893166036285,NA 
rayol-farm2_2019-03-24_06-04-58.wav,44100,16,60,1,H,512,hil,NULL,NULL,0.894086104280049,NA 
rayol-farm2_2019-03-24_06-06-58.wav,44100,16,60,1,H,512,hil,NULL,NULL,0.891419994558481,NA 
rayol-farm2_2019-03-24_06-08-59.wav,44100,16,60,1,H,512,hil,NULL,NULL,0.894286078976986,NA 
rayol-farm2_2019-03-24_06-10-59.wav,44100,16,60,1,H,512,hil,NULL,NULL,0.893409782641365,NA 
rayol-farm2_2019-03-24_06-12-59.wav,44100,16,60,1,H,512,hil,NULL,NULL,0.888997723620921,NA 
rayol-farm2_2019-03-24_06-14-59.wav,44100,16,60,1,H,512,hil,NULL,NULL,0.891908673744764,NA 
rayol-farm2_2019-03-24_06-16-59.wav,44100,16,60,1,H,512,hil,NULL,NULL,0.890335671808106,NA 
rayol-farm2_2019-03-24_06-18-59.wav,44100,16,60,1,H,512,hil,NULL,NULL,0.88992931334877,NA 
rayol-farm2_2019-03-24_06-20-59.wav,44100,16,60,1,H,512,hil,NULL,NULL,0.890428966680821,NA 
rayol-farm2_2019-03-24_06-22-59.wav,44100,16,60,1,H,512,hil,NULL,NULL,0.892184479683743,NA 
rayol-farm2_2019-03-24_06-25-00.wav,44100,16,60,1,H,512,hil,NULL,NULL,0.892655450178955,NA 
rayol-farm2_2019-03-24_06-27-00.wav,44100,16,60,1,H,512,hil,NULL,NULL,0.871820922708004,NA 
rayol-farm2_2019-03-24_06-29-00.wav,44100,16,60,1,H,512,hil,NULL,NULL,0.864596121524215,NA 
rayol-farm2_2019-03-24_06-31-00.wav,44100,16,60,1,H,512,hil,NULL,NULL,0.862285097201565,NA 
rayol-farm2_2019-03-24_06-33-00.wav,44100,16,60,1,H,512,hil,NULL,NULL,0.879582879130043,NA 
rayol-farm2_2019-03-24_06-35-00.wav,44100,16,60,1,H,512,hil,NULL,NULL,0.889311738022571,NA 
rayol-farm2_2019-03-24_06-37-00.wav,44100,16,60,1,H,512,hil,NULL,NULL,0.891687973675636,NA 
rayol-farm2_2019-03-24_06-39-00.wav,44100,16,60,1,H,512,hil,NULL,NULL,0.892300150121623,NA 
rayol-farm2_2019-03-24_06-41-00.wav,44100,16,60,1,H,512,hil,NULL,NULL,0.891960825765207,NA 
rayol-farm2_2019-03-24_06-43-01.wav,44100,16,60,1,H,512,hil,NULL,NULL,0.86629160113223,NA 
rayol-farm2_2019-03-24_06-45-01.wav,44100,16,60,1,H,512,hil,NULL,NULL,0.859960964925226,NA 
rayol-farm2_2019-03-24_06-47-01.wav,44100,16,60,1,H,512,hil,NULL,NULL,0.86459016666064,NA 
rayol-farm2_2019-03-24_06-49-01.wav,44100,16,60,1,H,512,hil,NULL,NULL,0.85180583179598,NA 
rayol-farm2_2019-03-24_06-51-01.wav,44100,16,60,1,H,512,hil,NULL,NULL,0.895114511468654,NA 
rayol-farm2_2019-03-24_06-53-01.wav,44100,16,60,1,H,512,hil,NULL,NULL,0.879722987586095,NA 
rayol-farm2_2019-03-24_06-55-01.wav,44100,16,60,1,H,512,hil,NULL,NULL,0.894706557743447,NA 
rayol-farm2_2019-03-24_06-57-01.wav,44100,16,60,1,H,512,hil,NULL,NULL,0.893198304678403,NA 
rayol-farm2_2019-03-24_06-59-02.wav,44100,16,60,1,H,512,hil,NULL,NULL,0.893798721345383,NA 
rayol-farm2_2019-03-24_07-01-02.wav,44100,16,60,1,H,512,hil,NULL,NULL,0.890888832603761,NA 
rayol-farm2_2019-03-24_07-03-02.wav,44100,16,60,1,H,512,hil,NULL,NULL,0.893033962398286,NA 
rayol-farm2_2019-03-24_07-05-02.wav,44100,16,60,1,H,512,hil,NULL,NULL,0.891587743357507,NA 
rayol-farm2_2019-03-24_07-07-02.wav,44100,16,60,1,H,512,hil,NULL,NULL,0.892736547940608,NA 
rayol-farm2_2019-03-24_07-09-02.wav,44100,16,60,1,H,512,hil,NULL,NULL,0.894192119646072,NA 
rayol-farm2_2019-03-24_07-11-02.wav,44100,16,60,1,H,512,hil,NULL,NULL,0.893599512128084,NA 
rayol-farm2_2019-03-24_07-13-02.wav,44100,16,60,1,H,512,hil,NULL,NULL,0.88399624855467,NA 
rayol-farm2_2019-03-24_07-15-03.wav,44100,16,60,1,H,512,hil,NULL,NULL,0.892075454213869,NA 
rayol-farm2_2019-03-24_07-17-03.wav,44100,16,60,1,H,512,hil,NULL,NULL,0.891142414570801,NA 
rayol-farm2_2019-03-24_07-19-03.wav,44100,16,60,1,H,512,hil,NULL,NULL,0.888235887391052,NA 
rayol-farm2_2019-03-24_07-21-03.wav,44100,16,60,1,H,512,hil,NULL,NULL,0.894073006755372,NA 
rayol-farm2_2019-03-24_07-23-03.wav,44100,16,60,1,H,512,hil,NULL,NULL,0.811316014893273,NA 
rayol-farm2_2019-03-24_07-25-03.wav,44100,16,60,1,H,512,hil,NULL,NULL,0.891188812004561,NA 
rayol-farm2_2019-03-24_07-27-03.wav,44100,16,60,1,H,512,hil,NULL,NULL,0.884528734545793,NA 
rayol-farm2_2019-03-24_07-29-03.wav,44100,16,60,1,H,512,hil,NULL,NULL,0.887359043857258,NA 
rayol-farm2_2019-03-24_07-31-04.wav,44100,16,60,1,H,512,hil,NULL,NULL,0.891299914671558,NA 
rayol-farm2_2019-03-24_07-33-04.wav,44100,16,60,1,H,512,hil,NULL,NULL,0.890862159434737,NA 
rayol-farm2_2019-03-24_07-35-04.wav,44100,16,60,1,H,512,hil,NULL,NULL,0.881479783123031,NA 
rayol-farm2_2019-03-24_07-37-04.wav,44100,16,60,1,H,512,hil,NULL,NULL,0.882640007738484,NA 
rayol-farm2_2019-03-24_07-39-04.wav,44100,16,60,1,H,512,hil,NULL,NULL,0.8909621472864,NA 
rayol-farm2_2019-03-24_07-41-04.wav,44100,16,60,1,H,512,hil,NULL,NULL,0.891854529031183,NA 
rayol-farm2_2019-03-24_07-43-04.wav,44100,16,60,1,H,512,hil,NULL,NULL,0.88930486614061,NA 
rayol-farm2_2019-03-24_07-45-04.wav,44100,16,60,1,H,512,hil,NULL,NULL,0.886489998406662,NA 
rayol-farm2_2019-03-24_07-47-04.wav,44100,16,60,1,H,512,hil,NULL,NULL,0.890744286139596,NA 
rayol-farm2_2019-03-24_07-49-05.wav,44100,16,60,1,H,512,hil,NULL,NULL,0.857597658397496,NA 
rayol-farm2_2019-03-24_07-51-05.wav,44100,16,60,1,H,512,hil,NULL,NULL,0.889400040812124,NA 
rayol-farm2_2019-03-24_07-53-05.wav,44100,16,60,1,H,512,hil,NULL,NULL,0.888309148056379,NA 
rayol-farm2_2019-03-24_07-55-05.wav,44100,16,60,1,H,512,hil,NULL,NULL,0.889266779842664,NA 
rayol-farm2_2019-03-24_07-57-05.wav,44100,16,60,1,H,512,hil,NULL,NULL,0.867269866799439,NA 
rayol-farm2_2019-03-24_07-59-05.wav,44100,16,60,1,H,512,hil,NULL,NULL,0.893361982541351,NA 
rayol-farm2_2019-03-24_08-01-05.wav,44100,16,60,1,H,512,hil,NULL,NULL,0.88478391979567,NA 
rayol-farm2_2019-03-24_08-03-05.wav,44100,16,60,1,H,512,hil,NULL,NULL,0.889870078270213,NA 
rayol-farm2_2019-03-24_08-05-06.wav,44100,16,60,1,H,512,hil,NULL,NULL,0.894166777923827,NA 
rayol-farm2_2019-03-24_08-07-06.wav,44100,16,60,1,H,512,hil,NULL,NULL,0.889192188527915,NA 
rayol-farm2_2019-03-24_08-09-06.wav,44100,16,60,1,H,512,hil,NULL,NULL,0.868417171882018,NA 
rayol-farm2_2019-03-24_08-11-06.wav,44100,16,60,1,H,512,hil,NULL,NULL,0.88522606368242,NA 
rayol-farm2_2019-03-24_08-13-06.wav,44100,16,60,1,H,512,hil,NULL,NULL,0.886206473891089,NA 
rayol-farm2_2019-03-24_08-15-06.wav,44100,16,60,1,H,512,hil,NULL,NULL,0.886308633861838,NA 
rayol-farm2_2019-03-24_08-17-06.wav,44100,16,60,1,H,512,hil,NULL,NULL,0.88943210100001,NA 
rayol-farm2_2019-03-24_08-19-06.wav,44100,16,60,1,H,512,hil,NULL,NULL,0.886860791129024,NA 
rayol-farm2_2019-03-24_08-21-07.wav,44100,16,60,1,H,512,hil,NULL,NULL,0.888791387890249,NA 
rayol-farm2_2019-03-24_08-23-07.wav,44100,16,60,1,H,512,hil,NULL,NULL,0.879583033171202,NA 
rayol-farm2_2019-03-24_08-25-07.wav,44100,16,60,1,H,512,hil,NULL,NULL,0.888809503531813,NA 
rayol-farm2_2019-03-24_08-27-07.wav,44100,16,60,1,H,512,hil,NULL,NULL,0.89302533793988,NA 
rayol-farm2_2019-03-24_08-29-07.wav,44100,16,60,1,H,512,hil,NULL,NULL,0.884834814010612,NA 
rayol-farm2_2019-03-24_08-31-07.wav,44100,16,60,1,H,512,hil,NULL,NULL,0.86731947260674,NA 
rayol-farm2_2019-03-24_08-33-07.wav,44100,16,60,1,H,512,hil,NULL,NULL,0.881373307488631,NA 
rayol-farm2_2019-03-24_08-35-07.wav,44100,16,60,1,H,512,hil,NULL,NULL,0.870746859598263,NA 
rayol-farm2_2019-03-24_08-37-08.wav,44100,16,60,1,H,512,hil,NULL,NULL,0.871218870783261,NA 
rayol-farm2_2019-03-24_08-39-08.wav,44100,16,60,1,H,512,hil,NULL,NULL,0.850604458721259,NA 
rayol-farm2_2019-03-24_08-41-08.wav,44100,16,60,1,H,512,hil,NULL,NULL,0.889188846692954,NA 
rayol-farm2_2019-03-24_08-43-08.wav,44100,16,60,1,H,512,hil,NULL,NULL,0.884588228963734,NA 
rayol-farm2_2019-03-24_08-45-08.wav,44100,16,60,1,H,512,hil,NULL,NULL,0.889539559796507,NA 
rayol-farm2_2019-03-24_08-47-08.wav,44100,16,60,1,H,512,hil,NULL,NULL,0.879330589462275,NA 
rayol-farm2_2019-03-24_08-49-08.wav,44100,16,60,1,H,512,hil,NULL,NULL,0.889550606903701,NA 
rayol-farm2_2019-03-24_08-51-08.wav,44100,16,60,1,H,512,hil,NULL,NULL,0.886742131721,NA 
rayol-farm2_2019-03-24_08-53-08.wav,44100,16,60,1,H,512,hil,NULL,NULL,0.876136154823208,NA 
rayol-farm2_2019-03-24_08-55-09.wav,44100,16,60,1,H,512,hil,NULL,NULL,0.887995113566318,NA 
rayol-farm2_2019-03-24_08-57-09.wav,44100,16,60,1,H,512,hil,NULL,NULL,0.864434431349483,NA 
rayol-farm2_2019-03-24_08-59-09.wav,44100,16,60,1,H,512,hil,NULL,NULL,0.872047428776723,NA 
rayol-farm2_2019-03-24_09-01-09.wav,44100,16,60,1,H,512,hil,NULL,NULL,0.878027015191955,NA 
rayol-farm2_2019-03-24_09-03-09.wav,44100,16,60,1,H,512,hil,NULL,NULL,0.834326446336134,NA 
rayol-farm2_2019-03-24_09-05-09.wav,44100,16,60,1,H,512,hil,NULL,NULL,0.86978420129812,NA 
rayol-farm2_2019-03-24_09-07-09.wav,44100,16,60,1,H,512,hil,NULL,NULL,0.882249701524235,NA 
rayol-farm2_2019-03-24_09-09-09.wav,44100,16,60,1,H,512,hil,NULL,NULL,0.88575411912567,NA 
rayol-farm2_2019-03-24_09-11-10.wav,44100,16,60,1,H,512,hil,NULL,NULL,0.880697234788681,NA 
rayol-farm2_2019-03-24_09-13-10.wav,44100,16,60,1,H,512,hil,NULL,NULL,0.889854264193765,NA 
rayol-farm2_2019-03-24_09-15-10.wav,44100,16,60,1,H,512,hil,NULL,NULL,0.874839069738221,NA 
rayol-farm2_2019-03-24_09-17-10.wav,44100,16,60,1,H,512,hil,NULL,NULL,0.885572483143613,NA 
rayol-farm2_2019-03-24_09-19-10.wav,44100,16,60,1,H,512,hil,NULL,NULL,0.883906491571782,NA 
rayol-farm2_2019-03-24_09-21-10.wav,44100,16,60,1,H,512,hil,NULL,NULL,0.826937774796963,NA 
rayol-farm2_2019-03-24_09-23-10.wav,44100,16,60,1,H,512,hil,NULL,NULL,0.793239597328555,NA 
rayol-farm2_2019-03-24_09-25-10.wav,44100,16,60,1,H,512,hil,NULL,NULL,0.85991968627298,NA 
rayol-farm2_2019-03-24_09-27-11.wav,44100,16,60,1,H,512,hil,NULL,NULL,0.881437707128058,NA 
rayol-farm2_2019-03-24_09-29-11.wav,44100,16,60,1,H,512,hil,NULL,NULL,0.886463567730108,NA 
rayol-farm2_2019-03-24_09-31-11.wav,44100,16,60,1,H,512,hil,NULL,NULL,0.882680551053726,NA 
rayol-farm2_2019-03-24_09-33-11.wav,44100,16,60,1,H,512,hil,NULL,NULL,0.87889336240555,NA 
rayol-farm2_2019-03-24_09-35-11.wav,44100,16,60,1,H,512,hil,NULL,NULL,0.857236705090363,NA 
rayol-farm2_2019-03-24_09-37-11.wav,44100,16,60,1,H,512,hil,NULL,NULL,0.875253281749207,NA 
rayol-farm2_2019-03-24_09-39-11.wav,44100,16,60,1,H,512,hil,NULL,NULL,0.878610418275009,NA 
rayol-farm2_2019-03-24_09-41-11.wav,44100,16,60,1,H,512,hil,NULL,NULL,0.880276684438443,NA 
rayol-farm2_2019-03-24_09-43-11.wav,44100,16,60,1,H,512,hil,NULL,NULL,0.888168898336469,NA 
rayol-farm2_2019-03-24_09-45-12.wav,44100,16,60,1,H,512,hil,NULL,NULL,0.88680684998215,NA 
rayol-farm2_2019-03-24_09-47-12.wav,44100,16,60,1,H,512,hil,NULL,NULL,0.887863456919707,NA 
rayol-farm2_2019-03-24_09-49-12.wav,44100,16,60,1,H,512,hil,NULL,NULL,0.871542554993138,NA 
rayol-farm2_2019-03-24_09-51-12.wav,44100,16,60,1,H,512,hil,NULL,NULL,0.881533466401974,NA 
rayol-farm2_2019-03-24_09-53-12.wav,44100,16,60,1,H,512,hil,NULL,NULL,0.879563246597385,NA 
rayol-farm2_2019-03-24_09-55-12.wav,44100,16,60,1,H,512,hil,NULL,NULL,0.873784207203278,NA 
rayol-farm2_2019-03-24_09-57-12.wav,44100,16,60,1,H,512,hil,NULL,NULL,0.870338013088779,NA 
rayol-farm2_2019-03-24_09-59-12.wav,44100,16,60,1,H,512,hil,NULL,NULL,0.865397795084252,NA 
rayol-farm2_2019-03-24_10-01-13.wav,44100,16,60,1,H,512,hil,NULL,NULL,0.854510659646404,NA 
rayol-farm2_2019-03-24_10-03-13.wav,44100,16,60,1,H,512,hil,NULL,NULL,0.869781599105136,NA 
rayol-farm2_2019-03-24_10-05-13.wav,44100,16,60,1,H,512,hil,NULL,NULL,0.886998918500902,NA 
rayol-farm2_2019-03-24_10-07-13.wav,44100,16,60,1,H,512,hil,NULL,NULL,0.854577807925266,NA 
rayol-farm2_2019-03-24_10-09-13.wav,44100,16,60,1,H,512,hil,NULL,NULL,0.87500256932464,NA 
rayol-farm2_2019-03-24_10-11-13.wav,44100,16,60,1,H,512,hil,NULL,NULL,0.879624900844311,NA 
rayol-farm2_2019-03-24_10-13-13.wav,44100,16,60,1,H,512,hil,NULL,NULL,0.885746182393936,NA 
rayol-farm2_2019-03-24_10-15-13.wav,44100,16,60,1,H,512,hil,NULL,NULL,0.889409112341146,NA 
rayol-farm2_2019-03-24_10-17-14.wav,44100,16,60,1,H,512,hil,NULL,NULL,0.872338334212224,NA 
rayol-farm2_2019-03-24_10-19-14.wav,44100,16,60,1,H,512,hil,NULL,NULL,0.871861314418683,NA 
rayol-farm2_2019-03-24_10-21-14.wav,44100,16,60,1,H,512,hil,NULL,NULL,0.883509336778731,NA 
rayol-farm2_2019-03-24_10-23-14.wav,44100,16,60,1,H,512,hil,NULL,NULL,0.875257183386463,NA 
rayol-farm2_2019-03-24_10-25-14.wav,44100,16,60,1,H,512,hil,NULL,NULL,0.85646174378168,NA 
rayol-farm2_2019-03-24_10-27-14.wav,44100,16,60,1,H,512,hil,NULL,NULL,0.858610193005925,NA 
rayol-farm2_2019-03-24_10-29-14.wav,44100,16,60,1,H,512,hil,NULL,NULL,0.878019790726004,NA 
rayol-farm2_2019-03-24_10-31-14.wav,44100,16,60,1,H,512,hil,NULL,NULL,0.850833382694851,NA 
rayol-farm2_2019-03-24_10-33-14.wav,44100,16,60,1,H,512,hil,NULL,NULL,0.85310426063564,NA 
rayol-farm2_2019-03-24_10-35-15.wav,44100,16,60,1,H,512,hil,NULL,NULL,0.870630269060337,NA 
rayol-farm2_2019-03-24_10-37-15.wav,44100,16,60,1,H,512,hil,NULL,NULL,0.857917225237727,NA 
rayol-farm2_2019-03-24_10-39-15.wav,44100,16,60,1,H,512,hil,NULL,NULL,0.874922390987989,NA 
rayol-farm2_2019-03-24_10-41-15.wav,44100,16,60,1,H,512,hil,NULL,NULL,0.865607464295444,NA 
rayol-farm2_2019-03-24_10-43-15.wav,44100,16,60,1,H,512,hil,NULL,NULL,0.877240757391584,NA 
rayol-farm2_2019-03-24_10-45-15.wav,44100,16,60,1,H,512,hil,NULL,NULL,0.876848831667043,NA 
rayol-farm2_2019-03-24_10-47-15.wav,44100,16,60,1,H,512,hil,NULL,NULL,0.874348376552689,NA 
rayol-farm2_2019-03-24_10-49-15.wav,44100,16,60,1,H,512,hil,NULL,NULL,0.868697889717267,NA 
rayol-farm2_2019-03-24_10-51-16.wav,44100,16,60,1,H,512,hil,NULL,NULL,0.851902765731943,NA 
rayol-farm2_2019-03-24_10-53-16.wav,44100,16,60,1,H,512,hil,NULL,NULL,0.829000700545628,NA 
rayol-farm2_2019-03-24_10-55-16.wav,44100,16,60,1,H,512,hil,NULL,NULL,0.881782862952823,NA 
rayol-farm2_2019-03-24_10-57-16.wav,44100,16,60,1,H,512,hil,NULL,NULL,0.88653787274242,NA 
rayol-farm2_2019-03-24_10-59-16.wav,44100,16,60,1,H,512,hil,NULL,NULL,0.88201614757228,NA 
rayol-farm2_2019-03-24_11-01-16.wav,44100,16,60,1,H,512,hil,NULL,NULL,0.88299756525439,NA 
rayol-farm2_2019-03-24_11-03-16.wav,44100,16,60,1,H,512,hil,NULL,NULL,0.87777492853989,NA 
rayol-farm2_2019-03-24_11-05-16.wav,44100,16,60,1,H,512,hil,NULL,NULL,0.854059075913612,NA 
rayol-farm2_2019-03-24_11-07-17.wav,44100,16,60,1,H,512,hil,NULL,NULL,0.867049586919798,NA 
rayol-farm2_2019-03-24_11-09-17.wav,44100,16,60,1,H,512,hil,NULL,NULL,0.864314580895224,NA 
rayol-farm2_2019-03-24_11-11-17.wav,44100,16,60,1,H,512,hil,NULL,NULL,0.875693103169539,NA 
rayol-farm2_2019-03-24_11-13-17.wav,44100,16,60,1,H,512,hil,NULL,NULL,0.877912573725418,NA 
rayol-farm2_2019-03-24_11-15-17.wav,44100,16,60,1,H,512,hil,NULL,NULL,0.867719242938049,NA 
rayol-farm2_2019-03-24_11-17-17.wav,44100,16,60,1,H,512,hil,NULL,NULL,0.875784423823911,NA 
rayol-farm2_2019-03-24_11-19-17.wav,44100,16,60,1,H,512,hil,NULL,NULL,0.865977587902313,NA 
rayol-farm2_2019-03-24_11-21-17.wav,44100,16,60,1,H,512,hil,NULL,NULL,0.867839472376205,NA 
rayol-farm2_2019-03-24_11-23-18.wav,44100,16,60,1,H,512,hil,NULL,NULL,0.868212999433642,NA 
rayol-farm2_2019-03-24_11-25-18.wav,44100,16,60,1,H,512,hil,NULL,NULL,0.826290598081478,NA 
rayol-farm2_2019-03-24_11-27-18.wav,44100,16,60,1,H,512,hil,NULL,NULL,0.861471115637361,NA 
rayol-farm2_2019-03-24_11-29-18.wav,44100,16,60,1,H,512,hil,NULL,NULL,0.863220048280654,NA 
rayol-farm2_2019-03-24_11-31-18.wav,44100,16,60,1,H,512,hil,NULL,NULL,0.879440982030781,NA 
rayol-farm2_2019-03-24_11-33-18.wav,44100,16,60,1,H,512,hil,NULL,NULL,0.874221565493815,NA 
rayol-farm2_2019-03-24_11-35-18.wav,44100,16,60,1,H,512,hil,NULL,NULL,0.840829169189093,NA 
rayol-farm2_2019-03-24_11-37-18.wav,44100,16,60,1,H,512,hil,NULL,NULL,0.855784532918833,NA 
rayol-farm2_2019-03-24_11-39-18.wav,44100,16,60,1,H,512,hil,NULL,NULL,0.876272102020688,NA 
rayol-farm2_2019-03-24_11-41-19.wav,44100,16,60,1,H,512,hil,NULL,NULL,0.858908203830844,NA 
rayol-farm2_2019-03-24_11-43-19.wav,44100,16,60,1,H,512,hil,NULL,NULL,0.853233716876622,NA 
rayol-farm2_2019-03-24_11-45-19.wav,44100,16,60,1,H,512,hil,NULL,NULL,0.84402384531123,NA 
rayol-farm2_2019-03-24_11-47-19.wav,44100,16,60,1,H,512,hil,NULL,NULL,0.862779591396057,NA 
rayol-farm2_2019-03-24_11-49-19.wav,44100,16,60,1,H,512,hil,NULL,NULL,0.873317263216015,NA 
rayol-farm2_2019-03-24_11-51-19.wav,44100,16,60,1,H,512,hil,NULL,NULL,0.842321126218394,NA 
rayol-farm2_2019-03-24_11-53-19.wav,44100,16,60,1,H,512,hil,NULL,NULL,0.872268476598418,NA 
rayol-farm2_2019-03-24_11-55-19.wav,44100,16,60,1,H,512,hil,NULL,NULL,0.871496664879084,NA 
rayol-farm2_2019-03-24_11-57-20.wav,44100,16,60,1,H,512,hil,NULL,NULL,0.850979466597587,NA 
rayol-farm2_2019-03-24_11-59-20.wav,44100,16,60,1,H,512,hil,NULL,NULL,0.872747808264597,NA 
rayol-farm2_2019-03-24_12-01-20.wav,44100,16,60,1,H,512,hil,NULL,NULL,0.872463268446823,NA 
rayol-farm2_2019-03-24_12-03-20.wav,44100,16,60,1,H,512,hil,NULL,NULL,0.863708083798279,NA 
rayol-farm2_2019-03-24_12-05-20.wav,44100,16,60,1,H,512,hil,NULL,NULL,0.861956051763643,NA 
rayol-farm2_2019-03-24_12-07-20.wav,44100,16,60,1,H,512,hil,NULL,NULL,0.882159123552386,NA 
rayol-farm2_2019-03-24_12-09-20.wav,44100,16,60,1,H,512,hil,NULL,NULL,0.867331502865632,NA 
rayol-farm2_2019-03-24_12-11-20.wav,44100,16,60,1,H,512,hil,NULL,NULL,0.825399832191478,NA 
rayol-farm2_2019-03-24_12-13-21.wav,44100,16,60,1,H,512,hil,NULL,NULL,0.859930013797908,NA 
rayol-farm2_2019-03-24_12-15-21.wav,44100,16,60,1,H,512,hil,NULL,NULL,0.868087617352228,NA 
rayol-farm2_2019-03-24_12-17-21.wav,44100,16,60,1,H,512,hil,NULL,NULL,0.857744064978351,NA 
rayol-farm2_2019-03-24_12-19-21.wav,44100,16,60,1,H,512,hil,NULL,NULL,0.843671192613142,NA 
rayol-farm2_2019-03-24_12-21-21.wav,44100,16,60,1,H,512,hil,NULL,NULL,0.849817522919471,NA 
rayol-farm2_2019-03-24_12-23-21.wav,44100,16,60,1,H,512,hil,NULL,NULL,0.858077774205618,NA 
rayol-farm2_2019-03-24_12-25-21.wav,44100,16,60,1,H,512,hil,NULL,NULL,0.859836437908633,NA 
rayol-farm2_2019-03-24_12-27-21.wav,44100,16,60,1,H,512,hil,NULL,NULL,0.868316454947562,NA 
rayol-farm2_2019-03-24_12-29-22.wav,44100,16,60,1,H,512,hil,NULL,NULL,0.872245683232792,NA 
rayol-farm2_2019-03-24_12-31-22.wav,44100,16,60,1,H,512,hil,NULL,NULL,0.878748808534722,NA 
rayol-farm2_2019-03-24_12-33-22.wav,44100,16,60,1,H,512,hil,NULL,NULL,0.882148966535547,NA 
rayol-farm2_2019-03-24_12-35-22.wav,44100,16,60,1,H,512,hil,NULL,NULL,0.863018480908036,NA 
rayol-farm2_2019-03-24_12-37-22.wav,44100,16,60,1,H,512,hil,NULL,NULL,0.868257015380349,NA 
rayol-farm2_2019-03-24_12-39-22.wav,44100,16,60,1,H,512,hil,NULL,NULL,0.867356091128623,NA 
rayol-farm2_2019-03-24_12-41-22.wav,44100,16,60,1,H,512,hil,NULL,NULL,0.868123860657475,NA 
rayol-farm2_2019-03-24_12-43-22.wav,44100,16,60,1,H,512,hil,NULL,NULL,0.873679166426907,NA 
rayol-farm2_2019-03-24_12-45-22.wav,44100,16,60,1,H,512,hil,NULL,NULL,0.84362559656259,NA 
rayol-farm2_2019-03-24_12-47-23.wav,44100,16,60,1,H,512,hil,NULL,NULL,0.860424712216949,NA 
rayol-farm2_2019-03-24_12-49-23.wav,44100,16,60,1,H,512,hil,NULL,NULL,0.868947686693787,NA 
rayol-farm2_2019-03-24_12-51-23.wav,44100,16,60,1,H,512,hil,NULL,NULL,0.867077315903646,NA 
rayol-farm2_2019-03-24_12-53-23.wav,44100,16,60,1,H,512,hil,NULL,NULL,0.877425515216193,NA 
rayol-farm2_2019-03-24_12-55-23.wav,44100,16,60,1,H,512,hil,NULL,NULL,0.877587877274766,NA 
rayol-farm2_2019-03-24_12-57-23.wav,44100,16,60,1,H,512,hil,NULL,NULL,0.849941999092774,NA 
rayol-farm2_2019-03-24_12-59-23.wav,44100,16,60,1,H,512,hil,NULL,NULL,0.863252261145798,NA 
rayol-farm2_2019-03-24_13-01-23.wav,44100,16,60,1,H,512,hil,NULL,NULL,0.879946422676185,NA 
rayol-farm2_2019-03-24_13-03-24.wav,44100,16,60,1,H,512,hil,NULL,NULL,0.87716126903868,NA 
rayol-farm2_2019-03-24_13-05-24.wav,44100,16,60,1,H,512,hil,NULL,NULL,0.864583851959945,NA 
rayol-farm2_2019-03-24_13-07-24.wav,44100,16,60,1,H,512,hil,NULL,NULL,0.850384239350824,NA 
rayol-farm2_2019-03-24_13-09-24.wav,44100,16,60,1,H,512,hil,NULL,NULL,0.855939343586243,NA 
rayol-farm2_2019-03-24_13-11-24.wav,44100,16,60,1,H,512,hil,NULL,NULL,0.858535757895358,NA 
rayol-farm2_2019-03-24_13-13-24.wav,44100,16,60,1,H,512,hil,NULL,NULL,0.873150167070715,NA 
rayol-farm2_2019-03-24_13-15-24.wav,44100,16,60,1,H,512,hil,NULL,NULL,0.867591428011807,NA 
rayol-farm2_2019-03-24_13-17-24.wav,44100,16,60,1,H,512,hil,NULL,NULL,0.865091693115482,NA 
rayol-farm2_2019-03-24_13-19-24.wav,44100,16,60,1,H,512,hil,NULL,NULL,0.871756498262786,NA 
rayol-farm2_2019-03-24_13-21-25.wav,44100,16,60,1,H,512,hil,NULL,NULL,0.876405602628201,NA 
rayol-farm2_2019-03-24_13-23-25.wav,44100,16,60,1,H,512,hil,NULL,NULL,0.875818392491506,NA 
rayol-farm2_2019-03-24_13-25-25.wav,44100,16,60,1,H,512,hil,NULL,NULL,0.866492340970135,NA 
rayol-farm2_2019-03-24_13-27-25.wav,44100,16,60,1,H,512,hil,NULL,NULL,0.87596260313258,NA 
rayol-farm2_2019-03-24_13-29-25.wav,44100,16,60,1,H,512,hil,NULL,NULL,0.876377649558317,NA 
rayol-farm2_2019-03-24_13-31-25.wav,44100,16,60,1,H,512,hil,NULL,NULL,0.884768003573569,NA 
rayol-farm2_2019-03-24_13-33-25.wav,44100,16,60,1,H,512,hil,NULL,NULL,0.884546353604167,NA 
rayol-farm2_2019-03-24_13-35-25.wav,44100,16,60,1,H,512,hil,NULL,NULL,0.872225040109816,NA 
rayol-farm2_2019-03-24_13-37-26.wav,44100,16,60,1,H,512,hil,NULL,NULL,0.869788895954407,NA 
rayol-farm2_2019-03-24_13-39-26.wav,44100,16,60,1,H,512,hil,NULL,NULL,0.881746615979615,NA 
rayol-farm2_2019-03-24_13-41-26.wav,44100,16,60,1,H,512,hil,NULL,NULL,0.880166616194729,NA 
rayol-farm2_2019-03-24_13-43-26.wav,44100,16,60,1,H,512,hil,NULL,NULL,0.877211857762216,NA 
rayol-farm2_2019-03-24_13-45-26.wav,44100,16,60,1,H,512,hil,NULL,NULL,0.878718946349827,NA 
rayol-farm2_2019-03-24_13-47-26.wav,44100,16,60,1,H,512,hil,NULL,NULL,0.871568413923873,NA 
rayol-farm2_2019-03-24_13-49-26.wav,44100,16,60,1,H,512,hil,NULL,NULL,0.878120812239649,NA 
rayol-farm2_2019-03-24_13-51-26.wav,44100,16,60,1,H,512,hil,NULL,NULL,0.876408406064605,NA 
rayol-farm2_2019-03-24_13-53-27.wav,44100,16,60,1,H,512,hil,NULL,NULL,0.879087181356197,NA 
rayol-farm2_2019-03-24_13-55-27.wav,44100,16,60,1,H,512,hil,NULL,NULL,0.881852461849395,NA 
rayol-farm2_2019-03-24_13-57-27.wav,44100,16,60,1,H,512,hil,NULL,NULL,0.884760069286087,NA 
rayol-farm2_2019-03-24_13-59-27.wav,44100,16,60,1,H,512,hil,NULL,NULL,0.876480169193589,NA 
rayol-farm2_2019-03-24_14-01-27.wav,44100,16,60,1,H,512,hil,NULL,NULL,0.879169355845975,NA 
rayol-farm2_2019-03-24_14-03-27.wav,44100,16,60,1,H,512,hil,NULL,NULL,0.885033702666708,NA 
rayol-farm2_2019-03-24_14-05-27.wav,44100,16,60,1,H,512,hil,NULL,NULL,0.879719490419631,NA 
rayol-farm2_2019-03-24_14-07-27.wav,44100,16,60,1,H,512,hil,NULL,NULL,0.878320235609439,NA 
rayol-farm2_2019-03-24_14-09-27.wav,44100,16,60,1,H,512,hil,NULL,NULL,0.876353013058621,NA 
rayol-farm2_2019-03-24_14-11-28.wav,44100,16,60,1,H,512,hil,NULL,NULL,0.866375908509834,NA 
rayol-farm2_2019-03-24_14-13-28.wav,44100,16,60,1,H,512,hil,NULL,NULL,0.877073870887858,NA 
rayol-farm2_2019-03-24_14-15-28.wav,44100,16,60,1,H,512,hil,NULL,NULL,0.883677339141391,NA 
rayol-farm2_2019-03-24_14-17-28.wav,44100,16,60,1,H,512,hil,NULL,NULL,0.879896134189858,NA 
rayol-farm2_2019-03-24_14-19-28.wav,44100,16,60,1,H,512,hil,NULL,NULL,0.723100671596472,NA 
rayol-farm2_2019-03-24_14-21-28.wav,44100,16,60,1,H,512,hil,NULL,NULL,0.835593539515266,NA 
rayol-farm2_2019-03-24_14-23-28.wav,44100,16,60,1,H,512,hil,NULL,NULL,0.877853547981225,NA 
rayol-farm2_2019-03-24_14-25-28.wav,44100,16,60,1,H,512,hil,NULL,NULL,0.876351927174945,NA 
rayol-farm2_2019-03-24_14-27-29.wav,44100,16,60,1,H,512,hil,NULL,NULL,0.884922723388788,NA 
rayol-farm2_2019-03-24_14-29-29.wav,44100,16,60,1,H,512,hil,NULL,NULL,0.875583779414802,NA 
rayol-farm2_2019-03-24_14-31-29.wav,44100,16,60,1,H,512,hil,NULL,NULL,0.872519914471423,NA 
rayol-farm2_2019-03-24_14-33-29.wav,44100,16,60,1,H,512,hil,NULL,NULL,0.865380802302493,NA 
rayol-farm2_2019-03-24_14-35-29.wav,44100,16,60,1,H,512,hil,NULL,NULL,0.867199651083303,NA 
rayol-farm2_2019-03-24_14-37-29.wav,44100,16,60,1,H,512,hil,NULL,NULL,0.872654582850702,NA 
rayol-farm2_2019-03-24_14-39-29.wav,44100,16,60,1,H,512,hil,NULL,NULL,0.876054267633143,NA 
rayol-farm2_2019-03-24_14-41-29.wav,44100,16,60,1,H,512,hil,NULL,NULL,0.872173889547284,NA 
rayol-farm2_2019-03-24_14-43-30.wav,44100,16,60,1,H,512,hil,NULL,NULL,0.854762006852537,NA 
rayol-farm2_2019-03-24_14-45-30.wav,44100,16,60,1,H,512,hil,NULL,NULL,0.875225711488219,NA 
rayol-farm2_2019-03-24_14-47-30.wav,44100,16,60,1,H,512,hil,NULL,NULL,0.859757498843432,NA 
rayol-farm2_2019-03-24_14-49-30.wav,44100,16,60,1,H,512,hil,NULL,NULL,0.869450195104363,NA 
rayol-farm2_2019-03-24_14-51-30.wav,44100,16,60,1,H,512,hil,NULL,NULL,0.86900141941497,NA 
rayol-farm2_2019-03-24_14-53-30.wav,44100,16,60,1,H,512,hil,NULL,NULL,0.856652023128399,NA 
rayol-farm2_2019-03-24_14-55-30.wav,44100,16,60,1,H,512,hil,NULL,NULL,0.848282861923571,NA 
rayol-farm2_2019-03-24_14-57-30.wav,44100,16,60,1,H,512,hil,NULL,NULL,0.880194888037536,NA 
rayol-farm2_2019-03-24_14-59-30.wav,44100,16,60,1,H,512,hil,NULL,NULL,0.864020298698419,NA 
rayol-farm2_2019-03-24_15-01-31.wav,44100,16,60,1,H,512,hil,NULL,NULL,0.82270393738361,NA 
rayol-farm2_2019-03-24_15-03-31.wav,44100,16,60,1,H,512,hil,NULL,NULL,0.86607591907804,NA 
rayol-farm2_2019-03-24_15-05-31.wav,44100,16,60,1,H,512,hil,NULL,NULL,0.881267648951748,NA 
rayol-farm2_2019-03-24_15-07-31.wav,44100,16,60,1,H,512,hil,NULL,NULL,0.880382548055413,NA 
rayol-farm2_2019-03-24_15-09-31.wav,44100,16,60,1,H,512,hil,NULL,NULL,0.863031573084289,NA 
rayol-farm2_2019-03-24_15-11-31.wav,44100,16,60,1,H,512,hil,NULL,NULL,0.876003546581765,NA 
rayol-farm2_2019-03-24_15-13-31.wav,44100,16,60,1,H,512,hil,NULL,NULL,0.877252113987056,NA 
rayol-farm2_2019-03-24_15-15-31.wav,44100,16,60,1,H,512,hil,NULL,NULL,0.876414063834568,NA 
rayol-farm2_2019-03-24_15-17-32.wav,44100,16,60,1,H,512,hil,NULL,NULL,0.872094872090488,NA 
rayol-farm2_2019-03-24_15-19-32.wav,44100,16,60,1,H,512,hil,NULL,NULL,0.865766793001626,NA 
rayol-farm2_2019-03-24_15-21-32.wav,44100,16,60,1,H,512,hil,NULL,NULL,0.868030901814237,NA 
rayol-farm2_2019-03-24_15-23-32.wav,44100,16,60,1,H,512,hil,NULL,NULL,0.868770711096242,NA 
rayol-farm2_2019-03-24_15-25-32.wav,44100,16,60,1,H,512,hil,NULL,NULL,0.874604078364345,NA 
rayol-farm2_2019-03-24_15-27-32.wav,44100,16,60,1,H,512,hil,NULL,NULL,0.865953019697725,NA 
rayol-farm2_2019-03-24_15-29-32.wav,44100,16,60,1,H,512,hil,NULL,NULL,0.857598730924994,NA 
rayol-farm2_2019-03-24_15-31-32.wav,44100,16,60,1,H,512,hil,NULL,NULL,0.862017035293436,NA 
rayol-farm2_2019-03-24_15-33-33.wav,44100,16,60,1,H,512,hil,NULL,NULL,0.87086327556852,NA 
rayol-farm2_2019-03-24_15-35-33.wav,44100,16,60,1,H,512,hil,NULL,NULL,0.878516246586374,NA 
rayol-farm2_2019-03-24_15-37-33.wav,44100,16,60,1,H,512,hil,NULL,NULL,0.875063433589038,NA 
rayol-farm2_2019-03-24_15-39-33.wav,44100,16,60,1,H,512,hil,NULL,NULL,0.880047233802129,NA 
rayol-farm2_2019-03-24_15-41-33.wav,44100,16,60,1,H,512,hil,NULL,NULL,0.875675837629636,NA 
rayol-farm2_2019-03-24_15-43-33.wav,44100,16,60,1,H,512,hil,NULL,NULL,0.876472373615032,NA 
rayol-farm2_2019-03-24_15-45-33.wav,44100,16,60,1,H,512,hil,NULL,NULL,0.884075579795939,NA 
rayol-farm2_2019-03-24_15-47-33.wav,44100,16,60,1,H,512,hil,NULL,NULL,0.870654098576544,NA 
rayol-farm2_2019-03-24_15-49-34.wav,44100,16,60,1,H,512,hil,NULL,NULL,0.868205212447326,NA 
rayol-farm2_2019-03-24_15-51-34.wav,44100,16,60,1,H,512,hil,NULL,NULL,0.863832673470449,NA 
rayol-farm2_2019-03-24_15-53-34.wav,44100,16,60,1,H,512,hil,NULL,NULL,0.870356422686848,NA 
rayol-farm2_2019-03-24_15-55-34.wav,44100,16,60,1,H,512,hil,NULL,NULL,0.845485499582662,NA 
rayol-farm2_2019-03-24_15-57-34.wav,44100,16,60,1,H,512,hil,NULL,NULL,0.865840112026693,NA 
rayol-farm2_2019-03-24_15-59-34.wav,44100,16,60,1,H,512,hil,NULL,NULL,0.867851779375463,NA 
rayol-farm2_2019-03-24_16-01-34.wav,44100,16,60,1,H,512,hil,NULL,NULL,0.865284241526909,NA 
rayol-farm2_2019-03-24_16-03-34.wav,44100,16,60,1,H,512,hil,NULL,NULL,0.881853254617747,NA 
rayol-farm2_2019-03-24_16-05-34.wav,44100,16,60,1,H,512,hil,NULL,NULL,0.866641711963748,NA 
rayol-farm2_2019-03-24_16-07-35.wav,44100,16,60,1,H,512,hil,NULL,NULL,0.885905007014701,NA 
rayol-farm2_2019-03-24_16-09-35.wav,44100,16,60,1,H,512,hil,NULL,NULL,0.885990686529741,NA 
rayol-farm2_2019-03-24_16-11-35.wav,44100,16,60,1,H,512,hil,NULL,NULL,0.874868559830588,NA 
rayol-farm2_2019-03-24_16-13-35.wav,44100,16,60,1,H,512,hil,NULL,NULL,0.88292232203209,NA 
rayol-farm2_2019-03-24_16-15-35.wav,44100,16,60,1,H,512,hil,NULL,NULL,0.84958343444294,NA 
rayol-farm2_2019-03-24_16-17-35.wav,44100,16,60,1,H,512,hil,NULL,NULL,0.865326440987826,NA 
rayol-farm2_2019-03-24_16-19-35.wav,44100,16,60,1,H,512,hil,NULL,NULL,0.886567785671136,NA 
rayol-farm2_2019-03-24_16-21-35.wav,44100,16,60,1,H,512,hil,NULL,NULL,0.873914963260538,NA 
rayol-farm2_2019-03-24_16-23-36.wav,44100,16,60,1,H,512,hil,NULL,NULL,0.872135507040656,NA 
rayol-farm2_2019-03-24_16-25-36.wav,44100,16,60,1,H,512,hil,NULL,NULL,0.863025109957994,NA 
rayol-farm2_2019-03-24_16-27-36.wav,44100,16,60,1,H,512,hil,NULL,NULL,0.858888077251091,NA 
rayol-farm2_2019-03-24_16-29-36.wav,44100,16,60,1,H,512,hil,NULL,NULL,0.86255626780875,NA 
rayol-farm2_2019-03-24_16-31-36.wav,44100,16,60,1,H,512,hil,NULL,NULL,0.87361090942942,NA 
rayol-farm2_2019-03-24_16-33-36.wav,44100,16,60,1,H,512,hil,NULL,NULL,0.879833035878089,NA 
rayol-farm2_2019-03-24_16-35-36.wav,44100,16,60,1,H,512,hil,NULL,NULL,0.87855346267511,NA 
rayol-farm2_2019-03-24_16-37-36.wav,44100,16,60,1,H,512,hil,NULL,NULL,0.876677536155238,NA 
rayol-farm2_2019-03-24_16-39-37.wav,44100,16,60,1,H,512,hil,NULL,NULL,0.87654093616752,NA 
rayol-farm2_2019-03-24_16-41-37.wav,44100,16,60,1,H,512,hil,NULL,NULL,0.876432236171552,NA 
rayol-farm2_2019-03-24_16-43-37.wav,44100,16,60,1,H,512,hil,NULL,NULL,0.881149671977759,NA 
rayol-farm2_2019-03-24_16-45-37.wav,44100,16,60,1,H,512,hil,NULL,NULL,0.884102931887202,NA 
rayol-farm2_2019-03-24_16-47-37.wav,44100,16,60,1,H,512,hil,NULL,NULL,0.876979595822853,NA 
rayol-farm2_2019-03-24_16-49-37.wav,44100,16,60,1,H,512,hil,NULL,NULL,0.868227866157991,NA 
rayol-farm2_2019-03-24_16-51-37.wav,44100,16,60,1,H,512,hil,NULL,NULL,0.863917549770055,NA 
rayol-farm2_2019-03-24_16-53-37.wav,44100,16,60,1,H,512,hil,NULL,NULL,0.862108405893509,NA 
rayol-farm2_2019-03-24_16-55-38.wav,44100,16,60,1,H,512,hil,NULL,NULL,0.859605746678467,NA 
rayol-farm2_2019-03-24_16-57-38.wav,44100,16,60,1,H,512,hil,NULL,NULL,0.880115717601745,NA 
rayol-farm2_2019-03-24_16-59-38.wav,44100,16,60,1,H,512,hil,NULL,NULL,0.872730241180619,NA 
rayol-farm2_2019-03-24_17-01-38.wav,44100,16,60,1,H,512,hil,NULL,NULL,0.829600032381107,NA 
rayol-farm2_2019-03-24_17-03-38.wav,44100,16,60,1,H,512,hil,NULL,NULL,0.85499487221702,NA 
rayol-farm2_2019-03-24_17-05-38.wav,44100,16,60,1,H,512,hil,NULL,NULL,0.8704286751395,NA 
rayol-farm2_2019-03-24_17-07-38.wav,44100,16,60,1,H,512,hil,NULL,NULL,0.863137425265568,NA 
rayol-farm2_2019-03-24_17-09-38.wav,44100,16,60,1,H,512,hil,NULL,NULL,0.885294594513348,NA 
rayol-farm2_2019-03-24_17-11-38.wav,44100,16,60,1,H,512,hil,NULL,NULL,0.871979527577865,NA 
rayol-farm2_2019-03-24_17-13-39.wav,44100,16,60,1,H,512,hil,NULL,NULL,0.864135812558978,NA 
rayol-farm2_2019-03-24_17-15-39.wav,44100,16,60,1,H,512,hil,NULL,NULL,0.88703526772407,NA 
rayol-farm2_2019-03-24_17-17-39.wav,44100,16,60,1,H,512,hil,NULL,NULL,0.874001900104721,NA 
rayol-farm2_2019-03-24_17-19-39.wav,44100,16,60,1,H,512,hil,NULL,NULL,0.883917634276323,NA 
rayol-farm2_2019-03-24_17-21-39.wav,44100,16,60,1,H,512,hil,NULL,NULL,0.890554252155837,NA 
rayol-farm2_2019-03-24_17-23-39.wav,44100,16,60,1,H,512,hil,NULL,NULL,0.887955480858804,NA 
rayol-farm2_2019-03-24_17-25-39.wav,44100,16,60,1,H,512,hil,NULL,NULL,0.872830632096038,NA 
rayol-farm2_2019-03-24_17-27-39.wav,44100,16,60,1,H,512,hil,NULL,NULL,0.878847795324441,NA 
rayol-farm2_2019-03-24_17-29-40.wav,44100,16,60,1,H,512,hil,NULL,NULL,0.878676532452917,NA 
rayol-farm2_2019-03-24_17-31-40.wav,44100,16,60,1,H,512,hil,NULL,NULL,0.864569575904539,NA 
rayol-farm2_2019-03-24_17-33-40.wav,44100,16,60,1,H,512,hil,NULL,NULL,0.811715596041298,NA 
rayol-farm2_2019-03-24_17-35-40.wav,44100,16,60,1,H,512,hil,NULL,NULL,0.831561800842771,NA 
rayol-farm2_2019-03-24_17-37-40.wav,44100,16,60,1,H,512,hil,NULL,NULL,0.868686166901112,NA 
rayol-farm2_2019-03-24_17-39-40.wav,44100,16,60,1,H,512,hil,NULL,NULL,0.834315932644917,NA 
rayol-farm2_2019-03-24_17-41-40.wav,44100,16,60,1,H,512,hil,NULL,NULL,0.741021900040583,NA 
rayol-farm2_2019-03-24_17-43-40.wav,44100,16,60,1,H,512,hil,NULL,NULL,0.740500749562418,NA 
rayol-farm2_2019-03-24_17-45-41.wav,44100,16,60,1,H,512,hil,NULL,NULL,0.713291690247329,NA 
rayol-farm2_2019-03-24_17-47-41.wav,44100,16,60,1,H,512,hil,NULL,NULL,0.873535060857422,NA 
rayol-farm2_2019-03-24_17-49-41.wav,44100,16,60,1,H,512,hil,NULL,NULL,0.885259506054813,NA 
rayol-farm2_2019-03-24_17-51-41.wav,44100,16,60,1,H,512,hil,NULL,NULL,0.892704485530352,NA 
rayol-farm2_2019-03-24_17-53-41.wav,44100,16,60,1,H,512,hil,NULL,NULL,0.892448836890081,NA 
rayol-farm2_2019-03-24_17-55-41.wav,44100,16,60,1,H,512,hil,NULL,NULL,0.892763159969322,NA 
rayol-farm2_2019-03-24_17-57-41.wav,44100,16,60,1,H,512,hil,NULL,NULL,0.897726754278681,NA 
rayol-farm2_2019-03-24_17-59-41.wav,44100,16,60,1,H,512,hil,NULL,NULL,0.883210511846137,NA 
rayol-farm2_2019-03-24_18-01-42.wav,44100,16,60,1,H,512,hil,NULL,NULL,0.889553808678567,NA 
rayol-farm2_2019-03-24_18-03-42.wav,44100,16,60,1,H,512,hil,NULL,NULL,0.889462014041109,NA 
rayol-farm2_2019-03-24_18-05-42.wav,44100,16,60,1,H,512,hil,NULL,NULL,0.895462588449283,NA 
rayol-farm2_2019-03-24_18-07-42.wav,44100,16,60,1,H,512,hil,NULL,NULL,0.895583499846492,NA 
rayol-farm2_2019-03-24_18-09-42.wav,44100,16,60,1,H,512,hil,NULL,NULL,0.895148646171738,NA 
rayol-farm2_2019-03-24_18-11-42.wav,44100,16,60,1,H,512,hil,NULL,NULL,0.883381666238493,NA 
rayol-farm2_2019-03-24_18-13-42.wav,44100,16,60,1,H,512,hil,NULL,NULL,0.894248471605638,NA 
rayol-farm2_2019-03-24_18-15-42.wav,44100,16,60,1,H,512,hil,NULL,NULL,0.894161654406181,NA 
rayol-farm2_2019-03-24_18-17-43.wav,44100,16,60,1,H,512,hil,NULL,NULL,0.893551713887144,NA 
rayol-farm2_2019-03-24_18-19-43.wav,44100,16,60,1,H,512,hil,NULL,NULL,0.890764797977311,NA 
rayol-farm2_2019-03-24_18-21-43.wav,44100,16,60,1,H,512,hil,NULL,NULL,0.884187790816051,NA 
rayol-farm2_2019-03-24_18-23-43.wav,44100,16,60,1,H,512,hil,NULL,NULL,0.89468723183618,NA 
rayol-farm2_2019-03-24_18-25-43.wav,44100,16,60,1,H,512,hil,NULL,NULL,0.885103702065692,NA 
rayol-farm2_2019-03-24_18-27-43.wav,44100,16,60,1,H,512,hil,NULL,NULL,0.895063677491408,NA 
rayol-farm2_2019-03-24_18-29-43.wav,44100,16,60,1,H,512,hil,NULL,NULL,0.895673449990741,NA 
rayol-farm2_2019-03-24_18-31-43.wav,44100,16,60,1,H,512,hil,NULL,NULL,0.895051474461384,NA 
rayol-farm2_2019-03-24_18-33-43.wav,44100,16,60,1,H,512,hil,NULL,NULL,0.88662895687737,NA 
rayol-farm2_2019-03-24_18-35-44.wav,44100,16,60,1,H,512,hil,NULL,NULL,0.887139648668438,NA 
rayol-farm2_2019-03-24_18-37-44.wav,44100,16,60,1,H,512,hil,NULL,NULL,0.891065877838298,NA 
rayol-farm2_2019-03-24_18-39-44.wav,44100,16,60,1,H,512,hil,NULL,NULL,0.896258496297701,NA 
rayol-farm2_2019-03-24_18-41-44.wav,44100,16,60,1,H,512,hil,NULL,NULL,0.898030530696744,NA 
rayol-farm2_2019-03-24_18-43-44.wav,44100,16,60,1,H,512,hil,NULL,NULL,0.896795849780133,NA 
rayol-farm2_2019-03-24_18-45-44.wav,44100,16,60,1,H,512,hil,NULL,NULL,0.890870762402948,NA 
rayol-farm2_2019-03-24_18-47-44.wav,44100,16,60,1,H,512,hil,NULL,NULL,0.897865397812402,NA 
rayol-farm2_2019-03-24_18-49-44.wav,44100,16,60,1,H,512,hil,NULL,NULL,0.896168947993311,NA 
rayol-farm2_2019-03-24_18-51-45.wav,44100,16,60,1,H,512,hil,NULL,NULL,0.885608642797295,NA 
rayol-farm2_2019-03-24_18-53-45.wav,44100,16,60,1,H,512,hil,NULL,NULL,0.890521788318394,NA 
rayol-farm2_2019-03-24_18-55-45.wav,44100,16,60,1,H,512,hil,NULL,NULL,0.893570044823649,NA 
rayol-farm2_2019-03-24_18-57-45.wav,44100,16,60,1,H,512,hil,NULL,NULL,0.895201110948426,NA 
rayol-farm2_2019-03-24_18-59-45.wav,44100,16,60,1,H,512,hil,NULL,NULL,0.888530956709779,NA 
rayol-farm2_2019-03-24_19-01-45.wav,44100,16,60,1,H,512,hil,NULL,NULL,0.890494245219962,NA 
rayol-farm2_2019-03-24_19-03-45.wav,44100,16,60,1,H,512,hil,NULL,NULL,0.894481578455215,NA 
rayol-farm2_2019-03-24_19-05-45.wav,44100,16,60,1,H,512,hil,NULL,NULL,0.896032393041638,NA 
rayol-farm2_2019-03-24_19-07-46.wav,44100,16,60,1,H,512,hil,NULL,NULL,0.89448514569295,NA 
rayol-farm2_2019-03-24_19-09-46.wav,44100,16,60,1,H,512,hil,NULL,NULL,0.895602564383786,NA 
rayol-farm2_2019-03-24_19-11-46.wav,44100,16,60,1,H,512,hil,NULL,NULL,0.893795506441937,NA 
rayol-farm2_2019-03-24_19-13-46.wav,44100,16,60,1,H,512,hil,NULL,NULL,0.891189006691525,NA 
rayol-farm2_2019-03-24_19-15-46.wav,44100,16,60,1,H,512,hil,NULL,NULL,0.892951698057634,NA 
rayol-farm2_2019-03-24_19-17-46.wav,44100,16,60,1,H,512,hil,NULL,NULL,0.893878742970186,NA 
rayol-farm2_2019-03-24_19-19-46.wav,44100,16,60,1,H,512,hil,NULL,NULL,0.895591620509408,NA 
rayol-farm2_2019-03-24_19-21-46.wav,44100,16,60,1,H,512,hil,NULL,NULL,0.895809772432946,NA 
rayol-farm2_2019-03-24_19-23-47.wav,44100,16,60,1,H,512,hil,NULL,NULL,0.893910956815911,NA 
rayol-farm2_2019-03-24_19-25-47.wav,44100,16,60,1,H,512,hil,NULL,NULL,0.891033821013905,NA 
rayol-farm2_2019-03-24_19-27-47.wav,44100,16,60,1,H,512,hil,NULL,NULL,0.88837458228656,NA 
rayol-farm2_2019-03-24_19-29-47.wav,44100,16,60,1,H,512,hil,NULL,NULL,0.889446577839896,NA 
rayol-farm2_2019-03-24_19-31-47.wav,44100,16,60,1,H,512,hil,NULL,NULL,0.889565247650813,NA 
rayol-farm2_2019-03-24_19-33-47.wav,44100,16,60,1,H,512,hil,NULL,NULL,0.891757124230212,NA 
rayol-farm2_2019-03-24_19-35-47.wav,44100,16,60,1,H,512,hil,NULL,NULL,0.89147297984223,NA 
rayol-farm2_2019-03-24_19-37-47.wav,44100,16,60,1,H,512,hil,NULL,NULL,0.891096130215844,NA 
rayol-farm2_2019-03-24_19-39-48.wav,44100,16,60,1,H,512,hil,NULL,NULL,0.890998086183285,NA 
rayol-farm2_2019-03-24_19-41-48.wav,44100,16,60,1,H,512,hil,NULL,NULL,0.891874208277368,NA 
rayol-farm2_2019-03-24_19-43-48.wav,44100,16,60,1,H,512,hil,NULL,NULL,0.883231954287992,NA 
rayol-farm2_2019-03-24_19-45-48.wav,44100,16,60,1,H,512,hil,NULL,NULL,0.860261658039076,NA 
rayol-farm2_2019-03-24_19-47-48.wav,44100,16,60,1,H,512,hil,NULL,NULL,0.889481546786445,NA 
rayol-farm2_2019-03-24_19-49-48.wav,44100,16,60,1,H,512,hil,NULL,NULL,0.893465486894963,NA 
rayol-farm2_2019-03-24_19-51-48.wav,44100,16,60,1,H,512,hil,NULL,NULL,0.891709223263621,NA 
rayol-farm2_2019-03-24_19-53-48.wav,44100,16,60,1,H,512,hil,NULL,NULL,0.885089576027521,NA 
rayol-farm2_2019-03-24_19-55-49.wav,44100,16,60,1,H,512,hil,NULL,NULL,0.893860858062399,NA 
rayol-farm2_2019-03-24_19-57-49.wav,44100,16,60,1,H,512,hil,NULL,NULL,0.889028881919194,NA 
rayol-farm2_2019-03-24_19-59-49.wav,44100,16,60,1,H,512,hil,NULL,NULL,0.88986036823541,NA 
rayol-farm2_2019-03-24_20-01-49.wav,44100,16,60,1,H,512,hil,NULL,NULL,0.888997966175875,NA 
rayol-farm2_2019-03-24_20-03-49.wav,44100,16,60,1,H,512,hil,NULL,NULL,0.883827974497965,NA 
rayol-farm2_2019-03-24_20-05-49.wav,44100,16,60,1,H,512,hil,NULL,NULL,0.891231786792774,NA 
rayol-farm2_2019-03-24_20-07-49.wav,44100,16,60,1,H,512,hil,NULL,NULL,0.887311333520862,NA 
rayol-farm2_2019-03-24_20-09-49.wav,44100,16,60,1,H,512,hil,NULL,NULL,0.890238799986869,NA 
rayol-farm2_2019-03-24_20-11-50.wav,44100,16,60,1,H,512,hil,NULL,NULL,0.887623216217107,NA 
rayol-farm2_2019-03-24_20-13-50.wav,44100,16,60,1,H,512,hil,NULL,NULL,0.892111052186537,NA 
rayol-farm2_2019-03-24_20-15-50.wav,44100,16,60,1,H,512,hil,NULL,NULL,0.893376427447621,NA 
rayol-farm2_2019-03-24_20-17-50.wav,44100,16,60,1,H,512,hil,NULL,NULL,0.890409946134181,NA 
rayol-farm2_2019-03-24_20-19-50.wav,44100,16,60,1,H,512,hil,NULL,NULL,0.8886992814408,NA 
rayol-farm2_2019-03-24_20-21-50.wav,44100,16,60,1,H,512,hil,NULL,NULL,0.88830291245243,NA 
rayol-farm2_2019-03-24_20-23-50.wav,44100,16,60,1,H,512,hil,NULL,NULL,0.892625823111013,NA 
rayol-farm2_2019-03-24_20-25-50.wav,44100,16,60,1,H,512,hil,NULL,NULL,0.894775156158289,NA 
rayol-farm2_2019-03-24_20-27-50.wav,44100,16,60,1,H,512,hil,NULL,NULL,0.893280192159774,NA 
rayol-farm2_2019-03-24_20-29-51.wav,44100,16,60,1,H,512,hil,NULL,NULL,0.893101324271335,NA 
rayol-farm2_2019-03-24_20-31-51.wav,44100,16,60,1,H,512,hil,NULL,NULL,0.893274463969018,NA 
rayol-farm2_2019-03-24_20-33-51.wav,44100,16,60,1,H,512,hil,NULL,NULL,0.89305666764014,NA 
rayol-farm2_2019-03-24_20-35-51.wav,44100,16,60,1,H,512,hil,NULL,NULL,0.877977797391367,NA 
rayol-farm2_2019-03-24_20-37-51.wav,44100,16,60,1,H,512,hil,NULL,NULL,0.884621174172058,NA 
rayol-farm2_2019-03-24_20-39-51.wav,44100,16,60,1,H,512,hil,NULL,NULL,0.889308447196467,NA 
rayol-farm2_2019-03-24_20-41-51.wav,44100,16,60,1,H,512,hil,NULL,NULL,0.893098529583165,NA 
rayol-farm2_2019-03-24_20-43-51.wav,44100,16,60,1,H,512,hil,NULL,NULL,0.892554929836297,NA 
rayol-farm2_2019-03-24_20-45-52.wav,44100,16,60,1,H,512,hil,NULL,NULL,0.893223239170619,NA 
rayol-farm2_2019-03-24_20-47-52.wav,44100,16,60,1,H,512,hil,NULL,NULL,0.890079144099623,NA 
rayol-farm2_2019-03-24_20-49-52.wav,44100,16,60,1,H,512,hil,NULL,NULL,0.894678893627084,NA 
rayol-farm2_2019-03-24_20-51-52.wav,44100,16,60,1,H,512,hil,NULL,NULL,0.89442015101719,NA 
rayol-farm2_2019-03-24_20-53-52.wav,44100,16,60,1,H,512,hil,NULL,NULL,0.889394672075791,NA 
rayol-farm2_2019-03-24_20-55-52.wav,44100,16,60,1,H,512,hil,NULL,NULL,0.886943427147585,NA 
rayol-farm2_2019-03-24_20-57-52.wav,44100,16,60,1,H,512,hil,NULL,NULL,0.889779514432084,NA 
rayol-farm2_2019-03-24_20-59-52.wav,44100,16,60,1,H,512,hil,NULL,NULL,0.892381727244789,NA 
rayol-farm2_2019-03-24_21-01-53.wav,44100,16,60,1,H,512,hil,NULL,NULL,0.893578233447653,NA 
rayol-farm2_2019-03-24_21-03-53.wav,44100,16,60,1,H,512,hil,NULL,NULL,0.884217557059449,NA 
rayol-farm2_2019-03-24_21-05-53.wav,44100,16,60,1,H,512,hil,NULL,NULL,0.893026384789135,NA 
rayol-farm2_2019-03-24_21-07-53.wav,44100,16,60,1,H,512,hil,NULL,NULL,0.892863021383785,NA 
rayol-farm2_2019-03-24_21-09-53.wav,44100,16,60,1,H,512,hil,NULL,NULL,0.891972943609461,NA 
rayol-farm2_2019-03-24_21-11-53.wav,44100,16,60,1,H,512,hil,NULL,NULL,0.888353563777033,NA 
rayol-farm2_2019-03-24_21-13-53.wav,44100,16,60,1,H,512,hil,NULL,NULL,0.884092344914547,NA 
rayol-farm2_2019-03-24_21-15-53.wav,44100,16,60,1,H,512,hil,NULL,NULL,0.88347669806698,NA 
rayol-farm2_2019-03-24_21-17-53.wav,44100,16,60,1,H,512,hil,NULL,NULL,0.889035449712267,NA 
rayol-farm2_2019-03-24_21-19-54.wav,44100,16,60,1,H,512,hil,NULL,NULL,0.890115136468847,NA 
rayol-farm2_2019-03-24_21-21-54.wav,44100,16,60,1,H,512,hil,NULL,NULL,0.888635305246355,NA 
rayol-farm2_2019-03-24_21-23-54.wav,44100,16,60,1,H,512,hil,NULL,NULL,0.887186665965932,NA 
rayol-farm2_2019-03-24_21-25-54.wav,44100,16,60,1,H,512,hil,NULL,NULL,0.883115717431137,NA 
rayol-farm2_2019-03-24_21-27-54.wav,44100,16,60,1,H,512,hil,NULL,NULL,0.892162119484704,NA 
rayol-farm2_2019-03-24_21-29-54.wav,44100,16,60,1,H,512,hil,NULL,NULL,0.888165486110068,NA 
rayol-farm2_2019-03-24_21-31-54.wav,44100,16,60,1,H,512,hil,NULL,NULL,0.887458791629242,NA 
rayol-farm2_2019-03-24_21-33-54.wav,44100,16,60,1,H,512,hil,NULL,NULL,0.888315191148499,NA 
rayol-farm2_2019-03-24_21-35-55.wav,44100,16,60,1,H,512,hil,NULL,NULL,0.89200757534416,NA 
rayol-farm2_2019-03-24_21-37-55.wav,44100,16,60,1,H,512,hil,NULL,NULL,0.891648393056604,NA 
rayol-farm2_2019-03-24_21-39-55.wav,44100,16,60,1,H,512,hil,NULL,NULL,0.883325846847002,NA 
rayol-farm2_2019-03-24_21-41-55.wav,44100,16,60,1,H,512,hil,NULL,NULL,0.89099994628525,NA 
rayol-farm2_2019-03-24_21-43-55.wav,44100,16,60,1,H,512,hil,NULL,NULL,0.888914808221341,NA 
rayol-farm2_2019-03-24_21-45-55.wav,44100,16,60,1,H,512,hil,NULL,NULL,0.891291779823122,NA 
rayol-farm2_2019-03-24_21-47-55.wav,44100,16,60,1,H,512,hil,NULL,NULL,0.878875534538149,NA 
rayol-farm2_2019-03-24_21-49-55.wav,44100,16,60,1,H,512,hil,NULL,NULL,0.884759823836603,NA 
rayol-farm2_2019-03-24_21-51-56.wav,44100,16,60,1,H,512,hil,NULL,NULL,0.885481878277787,NA 
rayol-farm2_2019-03-24_21-53-56.wav,44100,16,60,1,H,512,hil,NULL,NULL,0.89260599855723,NA 
rayol-farm2_2019-03-24_21-55-56.wav,44100,16,60,1,H,512,hil,NULL,NULL,0.893429533608904,NA 
rayol-farm2_2019-03-24_21-57-56.wav,44100,16,60,1,H,512,hil,NULL,NULL,0.889558952683041,NA 
rayol-farm2_2019-03-24_21-59-56.wav,44100,16,60,1,H,512,hil,NULL,NULL,0.89151957253272,NA 
rayol-farm2_2019-03-24_22-01-56.wav,44100,16,60,1,H,512,hil,NULL,NULL,0.893131565070498,NA 
rayol-farm2_2019-03-24_22-03-56.wav,44100,16,60,1,H,512,hil,NULL,NULL,0.894525168566133,NA 
rayol-farm2_2019-03-24_22-05-56.wav,44100,16,60,1,H,512,hil,NULL,NULL,0.887608659164074,NA 
rayol-farm2_2019-03-24_22-07-57.wav,44100,16,60,1,H,512,hil,NULL,NULL,0.886700850838209,NA 
rayol-farm2_2019-03-24_22-09-57.wav,44100,16,60,1,H,512,hil,NULL,NULL,0.886003301053547,NA 
rayol-farm2_2019-03-24_22-11-57.wav,44100,16,60,1,H,512,hil,NULL,NULL,0.89222783279192,NA 
rayol-farm2_2019-03-24_22-13-57.wav,44100,16,60,1,H,512,hil,NULL,NULL,0.877550982664187,NA 
rayol-farm2_2019-03-24_22-15-57.wav,44100,16,60,1,H,512,hil,NULL,NULL,0.875106834967138,NA 
rayol-farm2_2019-03-24_22-17-57.wav,44100,16,60,1,H,512,hil,NULL,NULL,0.887714132126515,NA 
rayol-farm2_2019-03-24_22-19-57.wav,44100,16,60,1,H,512,hil,NULL,NULL,0.892542169681519,NA 
rayol-farm2_2019-03-24_22-21-57.wav,44100,16,60,1,H,512,hil,NULL,NULL,0.878155491231661,NA 
rayol-farm2_2019-03-24_22-23-57.wav,44100,16,60,1,H,512,hil,NULL,NULL,0.892161053138862,NA 
rayol-farm2_2019-03-24_22-25-58.wav,44100,16,60,1,H,512,hil,NULL,NULL,0.88920102047867,NA 
rayol-farm2_2019-03-24_22-27-58.wav,44100,16,60,1,H,512,hil,NULL,NULL,0.887290984271951,NA 
rayol-farm2_2019-03-24_22-29-58.wav,44100,16,60,1,H,512,hil,NULL,NULL,0.892878549036344,NA 
rayol-farm2_2019-03-24_22-31-58.wav,44100,16,60,1,H,512,hil,NULL,NULL,0.894883149757322,NA 
rayol-farm2_2019-03-24_22-33-58.wav,44100,16,60,1,H,512,hil,NULL,NULL,0.892999088649122,NA 
rayol-farm2_2019-03-24_22-35-58.wav,44100,16,60,1,H,512,hil,NULL,NULL,0.891175356280376,NA 
rayol-farm2_2019-03-24_22-37-58.wav,44100,16,60,1,H,512,hil,NULL,NULL,0.892509467275954,NA 
rayol-farm2_2019-03-24_22-39-58.wav,44100,16,60,1,H,512,hil,NULL,NULL,0.884559525618064,NA 
rayol-farm2_2019-03-24_22-41-59.wav,44100,16,60,1,H,512,hil,NULL,NULL,0.891571680685522,NA 
rayol-farm2_2019-03-24_22-43-59.wav,44100,16,60,1,H,512,hil,NULL,NULL,0.881407654527136,NA 
rayol-farm2_2019-03-24_22-45-59.wav,44100,16,60,1,H,512,hil,NULL,NULL,0.880487563542299,NA 
rayol-farm2_2019-03-24_22-47-59.wav,44100,16,60,1,H,512,hil,NULL,NULL,0.892834354234918,NA 
rayol-farm2_2019-03-24_22-49-59.wav,44100,16,60,1,H,512,hil,NULL,NULL,0.895298506699556,NA 
rayol-farm2_2019-03-24_22-51-59.wav,44100,16,60,1,H,512,hil,NULL,NULL,0.893454338638942,NA 
rayol-farm2_2019-03-24_22-53-59.wav,44100,16,60,1,H,512,hil,NULL,NULL,0.891494339316775,NA 
rayol-farm2_2019-03-24_22-55-59.wav,44100,16,60,1,H,512,hil,NULL,NULL,0.891722600552693,NA 
rayol-farm2_2019-03-24_22-58-00.wav,44100,16,60,1,H,512,hil,NULL,NULL,0.894021529623554,NA 
rayol-farm2_2019-03-24_23-00-00.wav,44100,16,60,1,H,512,hil,NULL,NULL,0.892476569615633,NA 
rayol-farm2_2019-03-24_23-02-00.wav,44100,16,60,1,H,512,hil,NULL,NULL,0.886221223568593,NA 
rayol-farm2_2019-03-24_23-04-00.wav,44100,16,60,1,H,512,hil,NULL,NULL,0.888609820371989,NA 
rayol-farm2_2019-03-24_23-06-00.wav,44100,16,60,1,H,512,hil,NULL,NULL,0.886803966886098,NA 
rayol-farm2_2019-03-24_23-08-00.wav,44100,16,60,1,H,512,hil,NULL,NULL,0.889863756917581,NA 
rayol-farm2_2019-03-24_23-10-00.wav,44100,16,60,1,H,512,hil,NULL,NULL,0.894621494113455,NA 
rayol-farm2_2019-03-24_23-12-00.wav,44100,16,60,1,H,512,hil,NULL,NULL,0.893495579122919,NA 
rayol-farm2_2019-03-24_23-14-01.wav,44100,16,60,1,H,512,hil,NULL,NULL,0.893711733021749,NA 
rayol-farm2_2019-03-24_23-16-01.wav,44100,16,60,1,H,512,hil,NULL,NULL,0.886657067327144,NA 
rayol-farm2_2019-03-24_23-18-01.wav,44100,16,60,1,H,512,hil,NULL,NULL,0.892452537761199,NA 
rayol-farm2_2019-03-24_23-20-01.wav,44100,16,60,1,H,512,hil,NULL,NULL,0.893650870022489,NA 
rayol-farm2_2019-03-24_23-22-01.wav,44100,16,60,1,H,512,hil,NULL,NULL,0.888577710735164,NA 
rayol-farm2_2019-03-24_23-24-01.wav,44100,16,60,1,H,512,hil,NULL,NULL,0.888275336854457,NA 
rayol-farm2_2019-03-24_23-26-01.wav,44100,16,60,1,H,512,hil,NULL,NULL,0.880960104621348,NA 
rayol-farm2_2019-03-24_23-28-01.wav,44100,16,60,1,H,512,hil,NULL,NULL,0.893710454269671,NA 
rayol-farm2_2019-03-24_23-30-01.wav,44100,16,60,1,H,512,hil,NULL,NULL,0.89542436529547,NA 
rayol-farm2_2019-03-24_23-32-02.wav,44100,16,60,1,H,512,hil,NULL,NULL,0.895478765474218,NA 
rayol-farm2_2019-03-24_23-34-02.wav,44100,16,60,1,H,512,hil,NULL,NULL,0.895854461559635,NA 
rayol-farm2_2019-03-24_23-36-02.wav,44100,16,60,1,H,512,hil,NULL,NULL,0.880530536689735,NA 
rayol-farm2_2019-03-24_23-38-02.wav,44100,16,60,1,H,512,hil,NULL,NULL,0.893588609741589,NA 
rayol-farm2_2019-03-24_23-40-02.wav,44100,16,60,1,H,512,hil,NULL,NULL,0.894189265208111,NA 
rayol-farm2_2019-03-24_23-42-02.wav,44100,16,60,1,H,512,hil,NULL,NULL,0.889459790028851,NA 
rayol-farm2_2019-03-24_23-44-02.wav,44100,16,60,1,H,512,hil,NULL,NULL,0.889110090199093,NA 
rayol-farm2_2019-03-24_23-46-02.wav,44100,16,60,1,H,512,hil,NULL,NULL,0.893256855114061,NA 
rayol-farm2_2019-03-24_23-48-03.wav,44100,16,60,1,H,512,hil,NULL,NULL,0.885990755792133,NA 
rayol-farm2_2019-03-24_23-50-03.wav,44100,16,60,1,H,512,hil,NULL,NULL,0.895631506436265,NA 
rayol-farm2_2019-03-24_23-52-03.wav,44100,16,60,1,H,512,hil,NULL,NULL,0.895085971431665,NA 
rayol-farm2_2019-03-24_23-54-03.wav,44100,16,60,1,H,512,hil,NULL,NULL,0.89552163129306,NA 
rayol-farm2_2019-03-24_23-56-03.wav,44100,16,60,1,H,512,hil,NULL,NULL,0.894796726049824,NA 
rayol-farm2_2019-03-24_23-58-03.wav,44100,16,60,1,H,512,hil,NULL,NULL,0.893136846373854,NA
