FILENAME,SAMPLINGRATE,BIT,DURATION,CHANNELS,INDEX,WL,ENVT,MSMOOTH,KSMOOTH,LEFT_CHANNEL,RIGHT_CHANNEL
rayol-farm2_2019-05-12_00-01-00.wav,44100,16,60,1,H,512,hil,NULL,NULL,0.866203380477957,NA 
rayol-farm2_2019-05-12_00-03-00.wav,44100,16,60,1,H,512,hil,NULL,NULL,0.797508790557669,NA 
rayol-farm2_2019-05-12_00-05-00.wav,44100,16,60,1,H,512,hil,NULL,NULL,0.853547064475619,NA 
rayol-farm2_2019-05-12_00-07-00.wav,44100,16,60,1,H,512,hil,NULL,NULL,0.839339964002913,NA 
rayol-farm2_2019-05-12_00-09-00.wav,44100,16,60,1,H,512,hil,NULL,NULL,0.88500377575663,NA 
rayol-farm2_2019-05-12_00-11-00.wav,44100,16,60,1,H,512,hil,NULL,NULL,0.805110464217519,NA 
rayol-farm2_2019-05-12_00-13-00.wav,44100,16,60,1,H,512,hil,NULL,NULL,0.856102130502282,NA 
rayol-farm2_2019-05-12_00-15-00.wav,44100,16,60,1,H,512,hil,NULL,NULL,0.817280944814442,NA 
rayol-farm2_2019-05-12_00-17-01.wav,44100,16,60,1,H,512,hil,NULL,NULL,0.864123590249059,NA 
rayol-farm2_2019-05-12_00-19-01.wav,44100,16,60,1,H,512,hil,NULL,NULL,0.778444710702135,NA 
rayol-farm2_2019-05-12_00-21-01.wav,44100,16,60,1,H,512,hil,NULL,NULL,0.844967159401154,NA 
rayol-farm2_2019-05-12_00-23-01.wav,44100,16,60,1,H,512,hil,NULL,NULL,0.863787090234272,NA 
rayol-farm2_2019-05-12_00-25-01.wav,44100,16,60,1,H,512,hil,NULL,NULL,0.815817427775645,NA 
rayol-farm2_2019-05-12_00-27-01.wav,44100,16,60,1,H,512,hil,NULL,NULL,0.835102215808588,NA 
rayol-farm2_2019-05-12_00-29-01.wav,44100,16,60,1,H,512,hil,NULL,NULL,0.849182783294696,NA 
rayol-farm2_2019-05-12_00-31-01.wav,44100,16,60,1,H,512,hil,NULL,NULL,0.872381224858878,NA 
rayol-farm2_2019-05-12_00-33-02.wav,44100,16,60,1,H,512,hil,NULL,NULL,0.761736880795458,NA 
rayol-farm2_2019-05-12_00-35-02.wav,44100,16,60,1,H,512,hil,NULL,NULL,0.840396470174401,NA 
rayol-farm2_2019-05-12_00-37-02.wav,44100,16,60,1,H,512,hil,NULL,NULL,0.863219954424735,NA 
rayol-farm2_2019-05-12_00-39-02.wav,44100,16,60,1,H,512,hil,NULL,NULL,0.819810021597529,NA 
rayol-farm2_2019-05-12_00-41-02.wav,44100,16,60,1,H,512,hil,NULL,NULL,0.802082633466423,NA 
rayol-farm2_2019-05-12_00-43-02.wav,44100,16,60,1,H,512,hil,NULL,NULL,0.808866619453597,NA 
rayol-farm2_2019-05-12_00-45-02.wav,44100,16,60,1,H,512,hil,NULL,NULL,0.826446183267731,NA 
rayol-farm2_2019-05-12_00-47-02.wav,44100,16,60,1,H,512,hil,NULL,NULL,0.825099433118555,NA 
rayol-farm2_2019-05-12_00-49-02.wav,44100,16,60,1,H,512,hil,NULL,NULL,0.888346521975408,NA 
rayol-farm2_2019-05-12_00-51-03.wav,44100,16,60,1,H,512,hil,NULL,NULL,0.881063078501133,NA 
rayol-farm2_2019-05-12_00-53-03.wav,44100,16,60,1,H,512,hil,NULL,NULL,0.866829914485828,NA 
rayol-farm2_2019-05-12_00-55-03.wav,44100,16,60,1,H,512,hil,NULL,NULL,0.843886271133826,NA 
rayol-farm2_2019-05-12_00-57-03.wav,44100,16,60,1,H,512,hil,NULL,NULL,0.884636199448795,NA 
rayol-farm2_2019-05-12_00-59-03.wav,44100,16,60,1,H,512,hil,NULL,NULL,0.844121035336348,NA 
rayol-farm2_2019-05-12_01-01-03.wav,44100,16,60,1,H,512,hil,NULL,NULL,0.835958976674527,NA 
rayol-farm2_2019-05-12_01-03-03.wav,44100,16,60,1,H,512,hil,NULL,NULL,0.884036566958213,NA 
rayol-farm2_2019-05-12_01-05-03.wav,44100,16,60,1,H,512,hil,NULL,NULL,0.833566257145991,NA 
rayol-farm2_2019-05-12_01-07-04.wav,44100,16,60,1,H,512,hil,NULL,NULL,0.818815966201673,NA 
rayol-farm2_2019-05-12_01-09-04.wav,44100,16,60,1,H,512,hil,NULL,NULL,0.854619950205279,NA 
rayol-farm2_2019-05-12_01-11-04.wav,44100,16,60,1,H,512,hil,NULL,NULL,0.823526802702989,NA 
rayol-farm2_2019-05-12_01-13-04.wav,44100,16,60,1,H,512,hil,NULL,NULL,0.829643275596586,NA 
rayol-farm2_2019-05-12_01-15-04.wav,44100,16,60,1,H,512,hil,NULL,NULL,0.822871877394512,NA 
rayol-farm2_2019-05-12_01-17-04.wav,44100,16,60,1,H,512,hil,NULL,NULL,0.856808459453599,NA 
rayol-farm2_2019-05-12_01-19-04.wav,44100,16,60,1,H,512,hil,NULL,NULL,0.874791438529541,NA 
rayol-farm2_2019-05-12_01-21-04.wav,44100,16,60,1,H,512,hil,NULL,NULL,0.876336905253044,NA 
rayol-farm2_2019-05-12_01-23-04.wav,44100,16,60,1,H,512,hil,NULL,NULL,0.803229472481173,NA 
rayol-farm2_2019-05-12_01-25-05.wav,44100,16,60,1,H,512,hil,NULL,NULL,0.798309258002786,NA 
rayol-farm2_2019-05-12_01-27-05.wav,44100,16,60,1,H,512,hil,NULL,NULL,0.784009272422294,NA 
rayol-farm2_2019-05-12_01-29-05.wav,44100,16,60,1,H,512,hil,NULL,NULL,0.849602463975933,NA 
rayol-farm2_2019-05-12_01-31-05.wav,44100,16,60,1,H,512,hil,NULL,NULL,0.81712133701636,NA 
rayol-farm2_2019-05-12_01-33-05.wav,44100,16,60,1,H,512,hil,NULL,NULL,0.830598283766778,NA 
rayol-farm2_2019-05-12_01-35-05.wav,44100,16,60,1,H,512,hil,NULL,NULL,0.851419087332052,NA 
rayol-farm2_2019-05-12_01-37-05.wav,44100,16,60,1,H,512,hil,NULL,NULL,0.885804089751856,NA 
rayol-farm2_2019-05-12_01-39-05.wav,44100,16,60,1,H,512,hil,NULL,NULL,0.874949641715241,NA 
rayol-farm2_2019-05-12_01-41-06.wav,44100,16,60,1,H,512,hil,NULL,NULL,0.78970357456742,NA 
rayol-farm2_2019-05-12_01-43-06.wav,44100,16,60,1,H,512,hil,NULL,NULL,0.832297548259513,NA 
rayol-farm2_2019-05-12_01-45-06.wav,44100,16,60,1,H,512,hil,NULL,NULL,0.805607990843775,NA 
rayol-farm2_2019-05-12_01-47-06.wav,44100,16,60,1,H,512,hil,NULL,NULL,0.768907973330561,NA 
rayol-farm2_2019-05-12_01-49-06.wav,44100,16,60,1,H,512,hil,NULL,NULL,0.858777557896916,NA 
rayol-farm2_2019-05-12_01-51-06.wav,44100,16,60,1,H,512,hil,NULL,NULL,0.862766858509408,NA 
rayol-farm2_2019-05-12_01-53-06.wav,44100,16,60,1,H,512,hil,NULL,NULL,0.885714175206504,NA 
rayol-farm2_2019-05-12_01-55-06.wav,44100,16,60,1,H,512,hil,NULL,NULL,0.874048641075169,NA 
rayol-farm2_2019-05-12_01-57-06.wav,44100,16,60,1,H,512,hil,NULL,NULL,0.891978050991226,NA 
rayol-farm2_2019-05-12_01-59-07.wav,44100,16,60,1,H,512,hil,NULL,NULL,0.846302119961845,NA 
rayol-farm2_2019-05-12_02-01-07.wav,44100,16,60,1,H,512,hil,NULL,NULL,0.884116237222298,NA 
rayol-farm2_2019-05-12_02-03-07.wav,44100,16,60,1,H,512,hil,NULL,NULL,0.8557169977169,NA 
rayol-farm2_2019-05-12_02-05-07.wav,44100,16,60,1,H,512,hil,NULL,NULL,0.895276442188244,NA 
rayol-farm2_2019-05-12_02-07-07.wav,44100,16,60,1,H,512,hil,NULL,NULL,0.881266826907598,NA 
rayol-farm2_2019-05-12_02-09-07.wav,44100,16,60,1,H,512,hil,NULL,NULL,0.889519608256627,NA 
rayol-farm2_2019-05-12_02-11-07.wav,44100,16,60,1,H,512,hil,NULL,NULL,0.858960301535821,NA 
rayol-farm2_2019-05-12_02-13-07.wav,44100,16,60,1,H,512,hil,NULL,NULL,0.86517627927937,NA 
rayol-farm2_2019-05-12_02-15-08.wav,44100,16,60,1,H,512,hil,NULL,NULL,0.869301151965966,NA 
rayol-farm2_2019-05-12_02-17-08.wav,44100,16,60,1,H,512,hil,NULL,NULL,0.878679859720535,NA 
rayol-farm2_2019-05-12_02-19-08.wav,44100,16,60,1,H,512,hil,NULL,NULL,0.88260052523137,NA 
rayol-farm2_2019-05-12_02-21-08.wav,44100,16,60,1,H,512,hil,NULL,NULL,0.885038230081095,NA 
rayol-farm2_2019-05-12_02-23-08.wav,44100,16,60,1,H,512,hil,NULL,NULL,0.871526283797528,NA 
rayol-farm2_2019-05-12_02-25-08.wav,44100,16,60,1,H,512,hil,NULL,NULL,0.885198776987039,NA 
rayol-farm2_2019-05-12_02-27-08.wav,44100,16,60,1,H,512,hil,NULL,NULL,0.868748322674979,NA 
rayol-farm2_2019-05-12_02-29-08.wav,44100,16,60,1,H,512,hil,NULL,NULL,0.865955323890317,NA 
rayol-farm2_2019-05-12_02-31-09.wav,44100,16,60,1,H,512,hil,NULL,NULL,0.870553053994706,NA 
rayol-farm2_2019-05-12_02-33-09.wav,44100,16,60,1,H,512,hil,NULL,NULL,0.869236706264524,NA 
rayol-farm2_2019-05-12_02-35-09.wav,44100,16,60,1,H,512,hil,NULL,NULL,0.840826710574185,NA 
rayol-farm2_2019-05-12_02-37-09.wav,44100,16,60,1,H,512,hil,NULL,NULL,0.871324662326341,NA 
rayol-farm2_2019-05-12_02-39-09.wav,44100,16,60,1,H,512,hil,NULL,NULL,0.858804965761482,NA 
rayol-farm2_2019-05-12_02-41-09.wav,44100,16,60,1,H,512,hil,NULL,NULL,0.865109575033511,NA 
rayol-farm2_2019-05-12_02-43-09.wav,44100,16,60,1,H,512,hil,NULL,NULL,0.863018148049696,NA 
rayol-farm2_2019-05-12_02-45-09.wav,44100,16,60,1,H,512,hil,NULL,NULL,0.869526229817972,NA 
rayol-farm2_2019-05-12_02-47-09.wav,44100,16,60,1,H,512,hil,NULL,NULL,0.866514248123491,NA 
rayol-farm2_2019-05-12_02-49-10.wav,44100,16,60,1,H,512,hil,NULL,NULL,0.857247973171523,NA 
rayol-farm2_2019-05-12_02-51-10.wav,44100,16,60,1,H,512,hil,NULL,NULL,0.864396655506082,NA 
rayol-farm2_2019-05-12_02-53-10.wav,44100,16,60,1,H,512,hil,NULL,NULL,0.853765005334233,NA 
rayol-farm2_2019-05-12_02-55-10.wav,44100,16,60,1,H,512,hil,NULL,NULL,0.867607915996736,NA 
rayol-farm2_2019-05-12_02-57-10.wav,44100,16,60,1,H,512,hil,NULL,NULL,0.853278726317328,NA 
rayol-farm2_2019-05-12_02-59-10.wav,44100,16,60,1,H,512,hil,NULL,NULL,0.851287495859092,NA 
rayol-farm2_2019-05-12_03-01-10.wav,44100,16,60,1,H,512,hil,NULL,NULL,0.863838539835943,NA 
rayol-farm2_2019-05-12_03-03-10.wav,44100,16,60,1,H,512,hil,NULL,NULL,0.859174050551545,NA 
rayol-farm2_2019-05-12_03-05-11.wav,44100,16,60,1,H,512,hil,NULL,NULL,0.867040693234542,NA 
rayol-farm2_2019-05-12_03-07-11.wav,44100,16,60,1,H,512,hil,NULL,NULL,0.859618461934074,NA 
rayol-farm2_2019-05-12_03-09-11.wav,44100,16,60,1,H,512,hil,NULL,NULL,0.88699710242775,NA 
rayol-farm2_2019-05-12_03-11-11.wav,44100,16,60,1,H,512,hil,NULL,NULL,0.847685542313033,NA 
rayol-farm2_2019-05-12_03-13-11.wav,44100,16,60,1,H,512,hil,NULL,NULL,0.856598167826627,NA 
rayol-farm2_2019-05-12_03-15-11.wav,44100,16,60,1,H,512,hil,NULL,NULL,0.871734297122005,NA 
rayol-farm2_2019-05-12_03-17-11.wav,44100,16,60,1,H,512,hil,NULL,NULL,0.864849593825699,NA 
rayol-farm2_2019-05-12_03-19-11.wav,44100,16,60,1,H,512,hil,NULL,NULL,0.831892545789131,NA 
rayol-farm2_2019-05-12_03-21-12.wav,44100,16,60,1,H,512,hil,NULL,NULL,0.817689469115224,NA 
rayol-farm2_2019-05-12_03-23-12.wav,44100,16,60,1,H,512,hil,NULL,NULL,0.866790690029553,NA 
rayol-farm2_2019-05-12_03-25-12.wav,44100,16,60,1,H,512,hil,NULL,NULL,0.850165563438691,NA 
rayol-farm2_2019-05-12_03-27-12.wav,44100,16,60,1,H,512,hil,NULL,NULL,0.857656887403324,NA 
rayol-farm2_2019-05-12_03-29-12.wav,44100,16,60,1,H,512,hil,NULL,NULL,0.863351705939156,NA 
rayol-farm2_2019-05-12_03-31-12.wav,44100,16,60,1,H,512,hil,NULL,NULL,0.866231834008183,NA 
rayol-farm2_2019-05-12_03-33-12.wav,44100,16,60,1,H,512,hil,NULL,NULL,0.863174752102881,NA 
rayol-farm2_2019-05-12_03-35-12.wav,44100,16,60,1,H,512,hil,NULL,NULL,0.815457449196003,NA 
rayol-farm2_2019-05-12_03-37-12.wav,44100,16,60,1,H,512,hil,NULL,NULL,0.844013667837881,NA 
rayol-farm2_2019-05-12_03-39-13.wav,44100,16,60,1,H,512,hil,NULL,NULL,0.866235889832872,NA 
rayol-farm2_2019-05-12_03-41-13.wav,44100,16,60,1,H,512,hil,NULL,NULL,0.867193088378009,NA 
rayol-farm2_2019-05-12_03-43-13.wav,44100,16,60,1,H,512,hil,NULL,NULL,0.845862984537139,NA 
rayol-farm2_2019-05-12_03-45-13.wav,44100,16,60,1,H,512,hil,NULL,NULL,0.867274622959616,NA 
rayol-farm2_2019-05-12_03-47-13.wav,44100,16,60,1,H,512,hil,NULL,NULL,0.864479885778697,NA 
rayol-farm2_2019-05-12_03-49-13.wav,44100,16,60,1,H,512,hil,NULL,NULL,0.857090889680402,NA 
rayol-farm2_2019-05-12_03-51-13.wav,44100,16,60,1,H,512,hil,NULL,NULL,0.859934548160293,NA 
rayol-farm2_2019-05-12_03-53-13.wav,44100,16,60,1,H,512,hil,NULL,NULL,0.866815499706823,NA 
rayol-farm2_2019-05-12_03-55-14.wav,44100,16,60,1,H,512,hil,NULL,NULL,0.861351009573409,NA 
rayol-farm2_2019-05-12_03-57-14.wav,44100,16,60,1,H,512,hil,NULL,NULL,0.867514622350232,NA 
rayol-farm2_2019-05-12_03-59-14.wav,44100,16,60,1,H,512,hil,NULL,NULL,0.861494421244775,NA 
rayol-farm2_2019-05-12_04-01-14.wav,44100,16,60,1,H,512,hil,NULL,NULL,0.86497530479356,NA 
rayol-farm2_2019-05-12_04-03-14.wav,44100,16,60,1,H,512,hil,NULL,NULL,0.846342587296889,NA 
rayol-farm2_2019-05-12_04-05-14.wav,44100,16,60,1,H,512,hil,NULL,NULL,0.86376814219129,NA 
rayol-farm2_2019-05-12_04-07-14.wav,44100,16,60,1,H,512,hil,NULL,NULL,0.861777667782936,NA 
rayol-farm2_2019-05-12_04-09-14.wav,44100,16,60,1,H,512,hil,NULL,NULL,0.855196338284269,NA 
rayol-farm2_2019-05-12_04-11-15.wav,44100,16,60,1,H,512,hil,NULL,NULL,0.862568567410689,NA 
rayol-farm2_2019-05-12_04-13-15.wav,44100,16,60,1,H,512,hil,NULL,NULL,0.850920749677091,NA 
rayol-farm2_2019-05-12_04-15-15.wav,44100,16,60,1,H,512,hil,NULL,NULL,0.841916502020991,NA 
rayol-farm2_2019-05-12_04-17-15.wav,44100,16,60,1,H,512,hil,NULL,NULL,0.86750674368099,NA 
rayol-farm2_2019-05-12_04-19-15.wav,44100,16,60,1,H,512,hil,NULL,NULL,0.862694912826667,NA 
rayol-farm2_2019-05-12_04-21-15.wav,44100,16,60,1,H,512,hil,NULL,NULL,0.8636608305738,NA 
rayol-farm2_2019-05-12_04-23-15.wav,44100,16,60,1,H,512,hil,NULL,NULL,0.852895492253418,NA 
rayol-farm2_2019-05-12_04-25-15.wav,44100,16,60,1,H,512,hil,NULL,NULL,0.865205451872123,NA 
rayol-farm2_2019-05-12_04-27-15.wav,44100,16,60,1,H,512,hil,NULL,NULL,0.860474893714695,NA 
rayol-farm2_2019-05-12_04-29-16.wav,44100,16,60,1,H,512,hil,NULL,NULL,0.866312217156553,NA 
rayol-farm2_2019-05-12_04-31-16.wav,44100,16,60,1,H,512,hil,NULL,NULL,0.866430023032262,NA 
rayol-farm2_2019-05-12_04-33-16.wav,44100,16,60,1,H,512,hil,NULL,NULL,0.865950703898875,NA 
rayol-farm2_2019-05-12_04-35-16.wav,44100,16,60,1,H,512,hil,NULL,NULL,0.867251237944547,NA 
rayol-farm2_2019-05-12_04-37-16.wav,44100,16,60,1,H,512,hil,NULL,NULL,0.859965390574293,NA 
rayol-farm2_2019-05-12_04-39-16.wav,44100,16,60,1,H,512,hil,NULL,NULL,0.852741328865446,NA 
rayol-farm2_2019-05-12_04-41-16.wav,44100,16,60,1,H,512,hil,NULL,NULL,0.845168050454351,NA 
rayol-farm2_2019-05-12_04-43-16.wav,44100,16,60,1,H,512,hil,NULL,NULL,0.866497506194395,NA 
rayol-farm2_2019-05-12_04-45-17.wav,44100,16,60,1,H,512,hil,NULL,NULL,0.860668609475713,NA 
rayol-farm2_2019-05-12_04-47-17.wav,44100,16,60,1,H,512,hil,NULL,NULL,0.864424014915315,NA 
rayol-farm2_2019-05-12_04-49-17.wav,44100,16,60,1,H,512,hil,NULL,NULL,0.840676091525278,NA 
rayol-farm2_2019-05-12_04-51-17.wav,44100,16,60,1,H,512,hil,NULL,NULL,0.853727144728211,NA 
rayol-farm2_2019-05-12_04-53-17.wav,44100,16,60,1,H,512,hil,NULL,NULL,0.864976893091975,NA 
rayol-farm2_2019-05-12_04-55-17.wav,44100,16,60,1,H,512,hil,NULL,NULL,0.866457511664116,NA 
rayol-farm2_2019-05-12_04-57-17.wav,44100,16,60,1,H,512,hil,NULL,NULL,0.811940324303503,NA 
rayol-farm2_2019-05-12_04-59-17.wav,44100,16,60,1,H,512,hil,NULL,NULL,0.858684896417648,NA 
rayol-farm2_2019-05-12_05-01-18.wav,44100,16,60,1,H,512,hil,NULL,NULL,0.862233303681198,NA 
rayol-farm2_2019-05-12_05-03-18.wav,44100,16,60,1,H,512,hil,NULL,NULL,0.863074608843062,NA 
rayol-farm2_2019-05-12_05-05-18.wav,44100,16,60,1,H,512,hil,NULL,NULL,0.859591946780304,NA 
rayol-farm2_2019-05-12_05-07-18.wav,44100,16,60,1,H,512,hil,NULL,NULL,0.86704992155923,NA 
rayol-farm2_2019-05-12_05-09-18.wav,44100,16,60,1,H,512,hil,NULL,NULL,0.864829994498615,NA 
rayol-farm2_2019-05-12_05-11-18.wav,44100,16,60,1,H,512,hil,NULL,NULL,0.867293896399335,NA 
rayol-farm2_2019-05-12_05-13-18.wav,44100,16,60,1,H,512,hil,NULL,NULL,0.817506218937452,NA 
rayol-farm2_2019-05-12_05-15-18.wav,44100,16,60,1,H,512,hil,NULL,NULL,0.856803691503875,NA 
rayol-farm2_2019-05-12_05-17-18.wav,44100,16,60,1,H,512,hil,NULL,NULL,0.865873175450096,NA 
rayol-farm2_2019-05-12_05-19-19.wav,44100,16,60,1,H,512,hil,NULL,NULL,0.86486114377138,NA 
rayol-farm2_2019-05-12_05-21-19.wav,44100,16,60,1,H,512,hil,NULL,NULL,0.857698875008413,NA 
rayol-farm2_2019-05-12_05-23-19.wav,44100,16,60,1,H,512,hil,NULL,NULL,0.865542431121941,NA 
rayol-farm2_2019-05-12_05-25-19.wav,44100,16,60,1,H,512,hil,NULL,NULL,0.870001389543369,NA 
rayol-farm2_2019-05-12_05-27-19.wav,44100,16,60,1,H,512,hil,NULL,NULL,0.853861703433252,NA 
rayol-farm2_2019-05-12_05-29-19.wav,44100,16,60,1,H,512,hil,NULL,NULL,0.870187765369236,NA 
rayol-farm2_2019-05-12_05-31-19.wav,44100,16,60,1,H,512,hil,NULL,NULL,0.866235342331509,NA 
rayol-farm2_2019-05-12_05-33-19.wav,44100,16,60,1,H,512,hil,NULL,NULL,0.871067362184952,NA 
rayol-farm2_2019-05-12_05-35-20.wav,44100,16,60,1,H,512,hil,NULL,NULL,0.871591623958154,NA 
rayol-farm2_2019-05-12_05-37-20.wav,44100,16,60,1,H,512,hil,NULL,NULL,0.870999248540457,NA 
rayol-farm2_2019-05-12_05-39-20.wav,44100,16,60,1,H,512,hil,NULL,NULL,0.87599652195986,NA 
rayol-farm2_2019-05-12_05-41-20.wav,44100,16,60,1,H,512,hil,NULL,NULL,0.868509091875149,NA 
rayol-farm2_2019-05-12_05-43-20.wav,44100,16,60,1,H,512,hil,NULL,NULL,0.874895211416145,NA 
rayol-farm2_2019-05-12_05-45-20.wav,44100,16,60,1,H,512,hil,NULL,NULL,0.880467699418345,NA 
rayol-farm2_2019-05-12_05-47-20.wav,44100,16,60,1,H,512,hil,NULL,NULL,0.840618433356151,NA 
rayol-farm2_2019-05-12_05-49-20.wav,44100,16,60,1,H,512,hil,NULL,NULL,0.867737444080597,NA 
rayol-farm2_2019-05-12_05-51-21.wav,44100,16,60,1,H,512,hil,NULL,NULL,0.875389665255933,NA 
rayol-farm2_2019-05-12_05-53-21.wav,44100,16,60,1,H,512,hil,NULL,NULL,0.876157129525024,NA 
rayol-farm2_2019-05-12_05-55-21.wav,44100,16,60,1,H,512,hil,NULL,NULL,0.869900619417996,NA 
rayol-farm2_2019-05-12_05-57-21.wav,44100,16,60,1,H,512,hil,NULL,NULL,0.861934887474217,NA 
rayol-farm2_2019-05-12_05-59-21.wav,44100,16,60,1,H,512,hil,NULL,NULL,0.872392031228342,NA 
rayol-farm2_2019-05-12_06-01-21.wav,44100,16,60,1,H,512,hil,NULL,NULL,0.865614156692502,NA 
rayol-farm2_2019-05-12_06-03-21.wav,44100,16,60,1,H,512,hil,NULL,NULL,0.872120624333366,NA 
rayol-farm2_2019-05-12_06-05-21.wav,44100,16,60,1,H,512,hil,NULL,NULL,0.86045743213241,NA 
rayol-farm2_2019-05-12_06-07-21.wav,44100,16,60,1,H,512,hil,NULL,NULL,0.871869367906568,NA 
rayol-farm2_2019-05-12_06-09-22.wav,44100,16,60,1,H,512,hil,NULL,NULL,0.857641138234048,NA 
rayol-farm2_2019-05-12_06-11-22.wav,44100,16,60,1,H,512,hil,NULL,NULL,0.863052815545927,NA 
rayol-farm2_2019-05-12_06-13-22.wav,44100,16,60,1,H,512,hil,NULL,NULL,0.855994299039163,NA 
rayol-farm2_2019-05-12_06-15-22.wav,44100,16,60,1,H,512,hil,NULL,NULL,0.870392231414702,NA 
rayol-farm2_2019-05-12_06-17-22.wav,44100,16,60,1,H,512,hil,NULL,NULL,0.869503956495101,NA 
rayol-farm2_2019-05-12_06-19-22.wav,44100,16,60,1,H,512,hil,NULL,NULL,0.870495520572891,NA 
rayol-farm2_2019-05-12_06-21-22.wav,44100,16,60,1,H,512,hil,NULL,NULL,0.866472390157014,NA 
rayol-farm2_2019-05-12_06-23-22.wav,44100,16,60,1,H,512,hil,NULL,NULL,0.870110897646934,NA 
rayol-farm2_2019-05-12_06-25-23.wav,44100,16,60,1,H,512,hil,NULL,NULL,0.869846910983814,NA 
rayol-farm2_2019-05-12_06-27-23.wav,44100,16,60,1,H,512,hil,NULL,NULL,0.866410724377988,NA 
rayol-farm2_2019-05-12_06-29-23.wav,44100,16,60,1,H,512,hil,NULL,NULL,0.866556590304986,NA 
rayol-farm2_2019-05-12_06-31-23.wav,44100,16,60,1,H,512,hil,NULL,NULL,0.869212491570307,NA 
rayol-farm2_2019-05-12_06-33-23.wav,44100,16,60,1,H,512,hil,NULL,NULL,0.865332688724786,NA 
rayol-farm2_2019-05-12_06-35-23.wav,44100,16,60,1,H,512,hil,NULL,NULL,0.85877860423406,NA 
rayol-farm2_2019-05-12_06-37-23.wav,44100,16,60,1,H,512,hil,NULL,NULL,0.868624136908464,NA 
rayol-farm2_2019-05-12_06-39-23.wav,44100,16,60,1,H,512,hil,NULL,NULL,0.865177784543996,NA 
rayol-farm2_2019-05-12_06-41-24.wav,44100,16,60,1,H,512,hil,NULL,NULL,0.856691853296329,NA 
rayol-farm2_2019-05-12_06-43-24.wav,44100,16,60,1,H,512,hil,NULL,NULL,0.864716173393851,NA 
rayol-farm2_2019-05-12_06-45-24.wav,44100,16,60,1,H,512,hil,NULL,NULL,0.846062473353638,NA 
rayol-farm2_2019-05-12_06-47-24.wav,44100,16,60,1,H,512,hil,NULL,NULL,0.849658460723493,NA 
rayol-farm2_2019-05-12_06-49-24.wav,44100,16,60,1,H,512,hil,NULL,NULL,0.85135680071366,NA 
rayol-farm2_2019-05-12_06-51-24.wav,44100,16,60,1,H,512,hil,NULL,NULL,0.870279077864546,NA 
rayol-farm2_2019-05-12_06-53-24.wav,44100,16,60,1,H,512,hil,NULL,NULL,0.868136487684459,NA 
rayol-farm2_2019-05-12_06-55-24.wav,44100,16,60,1,H,512,hil,NULL,NULL,0.827375244554315,NA 
rayol-farm2_2019-05-12_06-57-24.wav,44100,16,60,1,H,512,hil,NULL,NULL,0.867730277138834,NA 
rayol-farm2_2019-05-12_06-59-25.wav,44100,16,60,1,H,512,hil,NULL,NULL,0.869551303546554,NA 
rayol-farm2_2019-05-12_07-01-25.wav,44100,16,60,1,H,512,hil,NULL,NULL,0.866603671727913,NA 
rayol-farm2_2019-05-12_07-03-25.wav,44100,16,60,1,H,512,hil,NULL,NULL,0.855367768971865,NA 
rayol-farm2_2019-05-12_07-05-25.wav,44100,16,60,1,H,512,hil,NULL,NULL,0.868356737330873,NA 
rayol-farm2_2019-05-12_07-07-25.wav,44100,16,60,1,H,512,hil,NULL,NULL,0.864769347955284,NA 
rayol-farm2_2019-05-12_07-09-25.wav,44100,16,60,1,H,512,hil,NULL,NULL,0.867184763960485,NA 
rayol-farm2_2019-05-12_07-11-25.wav,44100,16,60,1,H,512,hil,NULL,NULL,0.866762573707126,NA 
rayol-farm2_2019-05-12_07-13-25.wav,44100,16,60,1,H,512,hil,NULL,NULL,0.869764015248873,NA 
rayol-farm2_2019-05-12_07-15-26.wav,44100,16,60,1,H,512,hil,NULL,NULL,0.867827886830116,NA 
rayol-farm2_2019-05-12_07-17-26.wav,44100,16,60,1,H,512,hil,NULL,NULL,0.829176690117838,NA 
rayol-farm2_2019-05-12_07-19-26.wav,44100,16,60,1,H,512,hil,NULL,NULL,0.856445161804239,NA 
rayol-farm2_2019-05-12_07-21-26.wav,44100,16,60,1,H,512,hil,NULL,NULL,0.867122481373967,NA 
rayol-farm2_2019-05-12_07-23-26.wav,44100,16,60,1,H,512,hil,NULL,NULL,0.831606763116344,NA 
rayol-farm2_2019-05-12_07-25-26.wav,44100,16,60,1,H,512,hil,NULL,NULL,0.868639264310797,NA 
rayol-farm2_2019-05-12_07-27-26.wav,44100,16,60,1,H,512,hil,NULL,NULL,0.864573800020709,NA 
rayol-farm2_2019-05-12_07-29-26.wav,44100,16,60,1,H,512,hil,NULL,NULL,0.867834598961141,NA 
rayol-farm2_2019-05-12_07-31-27.wav,44100,16,60,1,H,512,hil,NULL,NULL,0.870092540025764,NA 
rayol-farm2_2019-05-12_07-33-27.wav,44100,16,60,1,H,512,hil,NULL,NULL,0.863370615663,NA 
rayol-farm2_2019-05-12_07-35-27.wav,44100,16,60,1,H,512,hil,NULL,NULL,0.861973049404201,NA 
rayol-farm2_2019-05-12_07-37-27.wav,44100,16,60,1,H,512,hil,NULL,NULL,0.870418671029098,NA 
rayol-farm2_2019-05-12_07-39-27.wav,44100,16,60,1,H,512,hil,NULL,NULL,0.857040792170277,NA 
rayol-farm2_2019-05-12_07-41-27.wav,44100,16,60,1,H,512,hil,NULL,NULL,0.813074872694015,NA 
rayol-farm2_2019-05-12_07-43-27.wav,44100,16,60,1,H,512,hil,NULL,NULL,0.818718041677572,NA 
rayol-farm2_2019-05-12_07-45-27.wav,44100,16,60,1,H,512,hil,NULL,NULL,0.864811460946329,NA 
rayol-farm2_2019-05-12_07-47-28.wav,44100,16,60,1,H,512,hil,NULL,NULL,0.851582144900178,NA 
rayol-farm2_2019-05-12_07-49-28.wav,44100,16,60,1,H,512,hil,NULL,NULL,0.853973834001655,NA 
rayol-farm2_2019-05-12_07-51-28.wav,44100,16,60,1,H,512,hil,NULL,NULL,0.867501556960681,NA 
rayol-farm2_2019-05-12_07-53-28.wav,44100,16,60,1,H,512,hil,NULL,NULL,0.817720650104853,NA 
rayol-farm2_2019-05-12_07-55-28.wav,44100,16,60,1,H,512,hil,NULL,NULL,0.843941139808773,NA 
rayol-farm2_2019-05-12_07-57-28.wav,44100,16,60,1,H,512,hil,NULL,NULL,0.843652707204723,NA 
rayol-farm2_2019-05-12_07-59-28.wav,44100,16,60,1,H,512,hil,NULL,NULL,0.86826569594153,NA 
rayol-farm2_2019-05-12_08-01-28.wav,44100,16,60,1,H,512,hil,NULL,NULL,0.863796624665084,NA 
rayol-farm2_2019-05-12_08-03-29.wav,44100,16,60,1,H,512,hil,NULL,NULL,0.831947012837149,NA 
rayol-farm2_2019-05-12_08-05-29.wav,44100,16,60,1,H,512,hil,NULL,NULL,0.866318771878346,NA 
rayol-farm2_2019-05-12_08-07-29.wav,44100,16,60,1,H,512,hil,NULL,NULL,0.822625299399178,NA 
rayol-farm2_2019-05-12_08-09-29.wav,44100,16,60,1,H,512,hil,NULL,NULL,0.870739088955285,NA 
rayol-farm2_2019-05-12_08-11-29.wav,44100,16,60,1,H,512,hil,NULL,NULL,0.878979312309762,NA 
rayol-farm2_2019-05-12_08-13-29.wav,44100,16,60,1,H,512,hil,NULL,NULL,0.88538607308296,NA 
rayol-farm2_2019-05-12_08-15-29.wav,44100,16,60,1,H,512,hil,NULL,NULL,0.844141765426951,NA 
rayol-farm2_2019-05-12_08-17-29.wav,44100,16,60,1,H,512,hil,NULL,NULL,0.873828991990645,NA 
rayol-farm2_2019-05-12_08-19-29.wav,44100,16,60,1,H,512,hil,NULL,NULL,0.868874287474688,NA 
rayol-farm2_2019-05-12_08-21-30.wav,44100,16,60,1,H,512,hil,NULL,NULL,0.806974183271936,NA 
rayol-farm2_2019-05-12_08-23-30.wav,44100,16,60,1,H,512,hil,NULL,NULL,0.828086933936521,NA 
rayol-farm2_2019-05-12_08-25-30.wav,44100,16,60,1,H,512,hil,NULL,NULL,0.835865182986356,NA 
rayol-farm2_2019-05-12_08-27-30.wav,44100,16,60,1,H,512,hil,NULL,NULL,0.822643271371114,NA 
rayol-farm2_2019-05-12_08-29-30.wav,44100,16,60,1,H,512,hil,NULL,NULL,0.863214636416364,NA 
rayol-farm2_2019-05-12_08-31-30.wav,44100,16,60,1,H,512,hil,NULL,NULL,0.808786022028893,NA 
rayol-farm2_2019-05-12_08-33-30.wav,44100,16,60,1,H,512,hil,NULL,NULL,0.8548201764479,NA 
rayol-farm2_2019-05-12_08-35-30.wav,44100,16,60,1,H,512,hil,NULL,NULL,0.863601333209194,NA 
rayol-farm2_2019-05-12_08-37-31.wav,44100,16,60,1,H,512,hil,NULL,NULL,0.821117957367294,NA 
rayol-farm2_2019-05-12_08-39-31.wav,44100,16,60,1,H,512,hil,NULL,NULL,0.868837454759991,NA 
rayol-farm2_2019-05-12_08-41-31.wav,44100,16,60,1,H,512,hil,NULL,NULL,0.833654876188618,NA 
rayol-farm2_2019-05-12_08-43-31.wav,44100,16,60,1,H,512,hil,NULL,NULL,0.862912813328381,NA 
rayol-farm2_2019-05-12_08-45-31.wav,44100,16,60,1,H,512,hil,NULL,NULL,0.841452088903742,NA 
rayol-farm2_2019-05-12_08-47-31.wav,44100,16,60,1,H,512,hil,NULL,NULL,0.881046170879708,NA 
rayol-farm2_2019-05-12_08-49-31.wav,44100,16,60,1,H,512,hil,NULL,NULL,0.832958572609545,NA 
rayol-farm2_2019-05-12_08-51-31.wav,44100,16,60,1,H,512,hil,NULL,NULL,0.8731094754436,NA 
rayol-farm2_2019-05-12_08-53-32.wav,44100,16,60,1,H,512,hil,NULL,NULL,0.831009042935062,NA 
rayol-farm2_2019-05-12_08-55-32.wav,44100,16,60,1,H,512,hil,NULL,NULL,0.831780157792339,NA 
rayol-farm2_2019-05-12_08-57-32.wav,44100,16,60,1,H,512,hil,NULL,NULL,0.850605381398395,NA 
rayol-farm2_2019-05-12_08-59-32.wav,44100,16,60,1,H,512,hil,NULL,NULL,0.853229462692951,NA 
rayol-farm2_2019-05-12_09-01-32.wav,44100,16,60,1,H,512,hil,NULL,NULL,0.842477729882105,NA 
rayol-farm2_2019-05-12_09-03-32.wav,44100,16,60,1,H,512,hil,NULL,NULL,0.838782964119054,NA 
rayol-farm2_2019-05-12_09-05-32.wav,44100,16,60,1,H,512,hil,NULL,NULL,0.857665316274625,NA 
rayol-farm2_2019-05-12_09-07-32.wav,44100,16,60,1,H,512,hil,NULL,NULL,0.78776102047738,NA 
rayol-farm2_2019-05-12_09-09-33.wav,44100,16,60,1,H,512,hil,NULL,NULL,0.868638949176572,NA 
rayol-farm2_2019-05-12_09-11-33.wav,44100,16,60,1,H,512,hil,NULL,NULL,0.845351674428321,NA 
rayol-farm2_2019-05-12_09-13-33.wav,44100,16,60,1,H,512,hil,NULL,NULL,0.866668235044596,NA 
rayol-farm2_2019-05-12_09-15-33.wav,44100,16,60,1,H,512,hil,NULL,NULL,0.873827449466542,NA 
rayol-farm2_2019-05-12_09-17-33.wav,44100,16,60,1,H,512,hil,NULL,NULL,0.883003229496839,NA 
rayol-farm2_2019-05-12_09-19-33.wav,44100,16,60,1,H,512,hil,NULL,NULL,0.889962485470472,NA 
rayol-farm2_2019-05-12_09-21-33.wav,44100,16,60,1,H,512,hil,NULL,NULL,0.866008905749795,NA 
rayol-farm2_2019-05-12_09-23-33.wav,44100,16,60,1,H,512,hil,NULL,NULL,0.869588375427242,NA 
rayol-farm2_2019-05-12_09-25-33.wav,44100,16,60,1,H,512,hil,NULL,NULL,0.887076961457529,NA 
rayol-farm2_2019-05-12_09-27-34.wav,44100,16,60,1,H,512,hil,NULL,NULL,0.8739673371922,NA 
rayol-farm2_2019-05-12_09-29-34.wav,44100,16,60,1,H,512,hil,NULL,NULL,0.893890370813855,NA 
rayol-farm2_2019-05-12_09-31-34.wav,44100,16,60,1,H,512,hil,NULL,NULL,0.894693283729068,NA 
rayol-farm2_2019-05-12_09-33-34.wav,44100,16,60,1,H,512,hil,NULL,NULL,0.861355014983642,NA 
rayol-farm2_2019-05-12_09-35-34.wav,44100,16,60,1,H,512,hil,NULL,NULL,0.833357600866995,NA 
rayol-farm2_2019-05-12_09-37-34.wav,44100,16,60,1,H,512,hil,NULL,NULL,0.895427637463218,NA 
rayol-farm2_2019-05-12_09-39-34.wav,44100,16,60,1,H,512,hil,NULL,NULL,0.875969729078062,NA 
rayol-farm2_2019-05-12_09-41-34.wav,44100,16,60,1,H,512,hil,NULL,NULL,0.890852119848083,NA 
rayol-farm2_2019-05-12_09-43-35.wav,44100,16,60,1,H,512,hil,NULL,NULL,0.880245682992437,NA 
rayol-farm2_2019-05-12_09-45-35.wav,44100,16,60,1,H,512,hil,NULL,NULL,0.819520193014893,NA 
rayol-farm2_2019-05-12_09-47-35.wav,44100,16,60,1,H,512,hil,NULL,NULL,0.889815706609089,NA 
rayol-farm2_2019-05-12_09-49-35.wav,44100,16,60,1,H,512,hil,NULL,NULL,0.896000719519701,NA 
rayol-farm2_2019-05-12_09-51-35.wav,44100,16,60,1,H,512,hil,NULL,NULL,0.886166857332138,NA 
rayol-farm2_2019-05-12_09-53-35.wav,44100,16,60,1,H,512,hil,NULL,NULL,0.8528188767865,NA 
rayol-farm2_2019-05-12_09-55-35.wav,44100,16,60,1,H,512,hil,NULL,NULL,0.890611002003727,NA 
rayol-farm2_2019-05-12_09-57-35.wav,44100,16,60,1,H,512,hil,NULL,NULL,0.891508899583322,NA 
rayol-farm2_2019-05-12_09-59-36.wav,44100,16,60,1,H,512,hil,NULL,NULL,0.893299993616863,NA 
rayol-farm2_2019-05-12_10-01-36.wav,44100,16,60,1,H,512,hil,NULL,NULL,0.88999205619665,NA 
rayol-farm2_2019-05-12_10-03-36.wav,44100,16,60,1,H,512,hil,NULL,NULL,0.863242740284723,NA 
rayol-farm2_2019-05-12_10-05-36.wav,44100,16,60,1,H,512,hil,NULL,NULL,0.846326769986948,NA 
rayol-farm2_2019-05-12_10-07-36.wav,44100,16,60,1,H,512,hil,NULL,NULL,0.875197019053802,NA 
rayol-farm2_2019-05-12_10-09-36.wav,44100,16,60,1,H,512,hil,NULL,NULL,0.86336359080776,NA 
rayol-farm2_2019-05-12_10-11-36.wav,44100,16,60,1,H,512,hil,NULL,NULL,0.891386078466051,NA 
rayol-farm2_2019-05-12_10-13-36.wav,44100,16,60,1,H,512,hil,NULL,NULL,0.855955566880237,NA 
rayol-farm2_2019-05-12_10-15-37.wav,44100,16,60,1,H,512,hil,NULL,NULL,0.865986170016147,NA 
rayol-farm2_2019-05-12_10-17-37.wav,44100,16,60,1,H,512,hil,NULL,NULL,0.895036294707464,NA 
rayol-farm2_2019-05-12_10-19-37.wav,44100,16,60,1,H,512,hil,NULL,NULL,0.888935808320036,NA 
rayol-farm2_2019-05-12_10-21-37.wav,44100,16,60,1,H,512,hil,NULL,NULL,0.89208378565043,NA 
rayol-farm2_2019-05-12_10-23-37.wav,44100,16,60,1,H,512,hil,NULL,NULL,0.844757613991491,NA 
rayol-farm2_2019-05-12_10-25-37.wav,44100,16,60,1,H,512,hil,NULL,NULL,0.866197001962553,NA 
rayol-farm2_2019-05-12_10-27-37.wav,44100,16,60,1,H,512,hil,NULL,NULL,0.888077922883883,NA 
rayol-farm2_2019-05-12_10-29-37.wav,44100,16,60,1,H,512,hil,NULL,NULL,0.897287555208211,NA 
rayol-farm2_2019-05-12_10-31-37.wav,44100,16,60,1,H,512,hil,NULL,NULL,0.858249004276041,NA 
rayol-farm2_2019-05-12_10-33-38.wav,44100,16,60,1,H,512,hil,NULL,NULL,0.89226145748263,NA 
rayol-farm2_2019-05-12_10-35-38.wav,44100,16,60,1,H,512,hil,NULL,NULL,0.889671821225389,NA 
rayol-farm2_2019-05-12_10-37-38.wav,44100,16,60,1,H,512,hil,NULL,NULL,0.897067320345749,NA 
rayol-farm2_2019-05-12_10-39-38.wav,44100,16,60,1,H,512,hil,NULL,NULL,0.891395163542101,NA 
rayol-farm2_2019-05-12_10-41-38.wav,44100,16,60,1,H,512,hil,NULL,NULL,0.873821027456293,NA 
rayol-farm2_2019-05-12_10-43-38.wav,44100,16,60,1,H,512,hil,NULL,NULL,0.877184042060815,NA 
rayol-farm2_2019-05-12_10-45-38.wav,44100,16,60,1,H,512,hil,NULL,NULL,0.88158664487531,NA 
rayol-farm2_2019-05-12_10-47-38.wav,44100,16,60,1,H,512,hil,NULL,NULL,0.893319184942866,NA 
rayol-farm2_2019-05-12_10-49-39.wav,44100,16,60,1,H,512,hil,NULL,NULL,0.8335725286388,NA 
rayol-farm2_2019-05-12_10-51-39.wav,44100,16,60,1,H,512,hil,NULL,NULL,0.893246435472158,NA 
rayol-farm2_2019-05-12_10-53-39.wav,44100,16,60,1,H,512,hil,NULL,NULL,0.86136023185326,NA 
rayol-farm2_2019-05-12_10-55-39.wav,44100,16,60,1,H,512,hil,NULL,NULL,0.891104077848285,NA 
rayol-farm2_2019-05-12_10-57-39.wav,44100,16,60,1,H,512,hil,NULL,NULL,0.861878992279589,NA 
rayol-farm2_2019-05-12_10-59-39.wav,44100,16,60,1,H,512,hil,NULL,NULL,0.86799597513358,NA 
rayol-farm2_2019-05-12_11-01-39.wav,44100,16,60,1,H,512,hil,NULL,NULL,0.853072711477447,NA 
rayol-farm2_2019-05-12_11-03-39.wav,44100,16,60,1,H,512,hil,NULL,NULL,0.893547848920684,NA 
rayol-farm2_2019-05-12_11-05-40.wav,44100,16,60,1,H,512,hil,NULL,NULL,0.885790091963734,NA 
rayol-farm2_2019-05-12_11-07-40.wav,44100,16,60,1,H,512,hil,NULL,NULL,0.896175953703059,NA 
rayol-farm2_2019-05-12_11-09-40.wav,44100,16,60,1,H,512,hil,NULL,NULL,0.89887744920525,NA 
rayol-farm2_2019-05-12_11-11-40.wav,44100,16,60,1,H,512,hil,NULL,NULL,0.880536183603649,NA 
rayol-farm2_2019-05-12_11-13-40.wav,44100,16,60,1,H,512,hil,NULL,NULL,0.89587538369068,NA 
rayol-farm2_2019-05-12_11-15-40.wav,44100,16,60,1,H,512,hil,NULL,NULL,0.850209514230549,NA 
rayol-farm2_2019-05-12_11-17-40.wav,44100,16,60,1,H,512,hil,NULL,NULL,0.888109323781962,NA 
rayol-farm2_2019-05-12_11-19-40.wav,44100,16,60,1,H,512,hil,NULL,NULL,0.879967073020422,NA 
rayol-farm2_2019-05-12_11-21-40.wav,44100,16,60,1,H,512,hil,NULL,NULL,0.879662949271383,NA 
rayol-farm2_2019-05-12_11-23-41.wav,44100,16,60,1,H,512,hil,NULL,NULL,0.844304352544308,NA 
rayol-farm2_2019-05-12_11-25-41.wav,44100,16,60,1,H,512,hil,NULL,NULL,0.889292716213225,NA 
rayol-farm2_2019-05-12_11-27-41.wav,44100,16,60,1,H,512,hil,NULL,NULL,0.895061929571592,NA 
rayol-farm2_2019-05-12_11-29-41.wav,44100,16,60,1,H,512,hil,NULL,NULL,0.848177661136716,NA 
rayol-farm2_2019-05-12_11-31-41.wav,44100,16,60,1,H,512,hil,NULL,NULL,0.834576128971102,NA 
rayol-farm2_2019-05-12_11-33-41.wav,44100,16,60,1,H,512,hil,NULL,NULL,0.733171689812896,NA 
rayol-farm2_2019-05-12_11-35-41.wav,44100,16,60,1,H,512,hil,NULL,NULL,0.827317563756912,NA 
rayol-farm2_2019-05-12_11-37-41.wav,44100,16,60,1,H,512,hil,NULL,NULL,0.803782771238131,NA 
rayol-farm2_2019-05-12_11-39-42.wav,44100,16,60,1,H,512,hil,NULL,NULL,0.857240729337612,NA 
rayol-farm2_2019-05-12_11-41-42.wav,44100,16,60,1,H,512,hil,NULL,NULL,0.828827927277763,NA 
rayol-farm2_2019-05-12_11-43-42.wav,44100,16,60,1,H,512,hil,NULL,NULL,0.75511348120699,NA 
rayol-farm2_2019-05-12_11-45-42.wav,44100,16,60,1,H,512,hil,NULL,NULL,0.858851079810811,NA 
rayol-farm2_2019-05-12_11-47-42.wav,44100,16,60,1,H,512,hil,NULL,NULL,0.822081830795964,NA 
rayol-farm2_2019-05-12_11-49-42.wav,44100,16,60,1,H,512,hil,NULL,NULL,0.817994330369299,NA 
rayol-farm2_2019-05-12_11-51-42.wav,44100,16,60,1,H,512,hil,NULL,NULL,0.888996896764026,NA 
rayol-farm2_2019-05-12_11-53-42.wav,44100,16,60,1,H,512,hil,NULL,NULL,0.860717173717626,NA 
rayol-farm2_2019-05-12_11-55-43.wav,44100,16,60,1,H,512,hil,NULL,NULL,0.802589410648381,NA 
rayol-farm2_2019-05-12_11-57-43.wav,44100,16,60,1,H,512,hil,NULL,NULL,0.716755548572397,NA 
rayol-farm2_2019-05-12_11-59-43.wav,44100,16,60,1,H,512,hil,NULL,NULL,0.762167124810857,NA 
rayol-farm2_2019-05-12_12-01-43.wav,44100,16,60,1,H,512,hil,NULL,NULL,0.857283266782483,NA 
rayol-farm2_2019-05-12_12-03-43.wav,44100,16,60,1,H,512,hil,NULL,NULL,0.842956153297573,NA 
rayol-farm2_2019-05-12_12-05-43.wav,44100,16,60,1,H,512,hil,NULL,NULL,0.83992147695592,NA 
rayol-farm2_2019-05-12_12-07-43.wav,44100,16,60,1,H,512,hil,NULL,NULL,0.805120312595199,NA 
rayol-farm2_2019-05-12_12-09-43.wav,44100,16,60,1,H,512,hil,NULL,NULL,0.867689621758828,NA 
rayol-farm2_2019-05-12_12-11-44.wav,44100,16,60,1,H,512,hil,NULL,NULL,0.873282986085586,NA 
rayol-farm2_2019-05-12_12-13-44.wav,44100,16,60,1,H,512,hil,NULL,NULL,0.873636743746889,NA 
rayol-farm2_2019-05-12_12-15-44.wav,44100,16,60,1,H,512,hil,NULL,NULL,0.896094820747681,NA 
rayol-farm2_2019-05-12_12-17-44.wav,44100,16,60,1,H,512,hil,NULL,NULL,0.820873913655394,NA 
rayol-farm2_2019-05-12_12-19-44.wav,44100,16,60,1,H,512,hil,NULL,NULL,0.867623574872582,NA 
rayol-farm2_2019-05-12_12-21-44.wav,44100,16,60,1,H,512,hil,NULL,NULL,0.83704009390921,NA 
rayol-farm2_2019-05-12_12-23-44.wav,44100,16,60,1,H,512,hil,NULL,NULL,0.837744705868752,NA 
rayol-farm2_2019-05-12_12-25-44.wav,44100,16,60,1,H,512,hil,NULL,NULL,0.865302106565586,NA 
rayol-farm2_2019-05-12_12-27-45.wav,44100,16,60,1,H,512,hil,NULL,NULL,0.89710868797934,NA 
rayol-farm2_2019-05-12_12-29-45.wav,44100,16,60,1,H,512,hil,NULL,NULL,0.799162829466985,NA 
rayol-farm2_2019-05-12_12-31-45.wav,44100,16,60,1,H,512,hil,NULL,NULL,0.878795171524789,NA 
rayol-farm2_2019-05-12_12-33-45.wav,44100,16,60,1,H,512,hil,NULL,NULL,0.8596605549244,NA 
rayol-farm2_2019-05-12_12-35-45.wav,44100,16,60,1,H,512,hil,NULL,NULL,0.86482659691791,NA 
rayol-farm2_2019-05-12_12-37-45.wav,44100,16,60,1,H,512,hil,NULL,NULL,0.837846417741832,NA 
rayol-farm2_2019-05-12_12-39-45.wav,44100,16,60,1,H,512,hil,NULL,NULL,0.881687471833256,NA 
rayol-farm2_2019-05-12_12-41-45.wav,44100,16,60,1,H,512,hil,NULL,NULL,0.80999169745714,NA 
rayol-farm2_2019-05-12_12-43-45.wav,44100,16,60,1,H,512,hil,NULL,NULL,0.78456316966016,NA 
rayol-farm2_2019-05-12_12-45-46.wav,44100,16,60,1,H,512,hil,NULL,NULL,0.819250869265015,NA 
rayol-farm2_2019-05-12_12-47-46.wav,44100,16,60,1,H,512,hil,NULL,NULL,0.868481993720658,NA 
rayol-farm2_2019-05-12_12-49-46.wav,44100,16,60,1,H,512,hil,NULL,NULL,0.847946992706613,NA 
rayol-farm2_2019-05-12_12-51-46.wav,44100,16,60,1,H,512,hil,NULL,NULL,0.860327786880006,NA 
rayol-farm2_2019-05-12_12-53-46.wav,44100,16,60,1,H,512,hil,NULL,NULL,0.868815420968236,NA 
rayol-farm2_2019-05-12_12-55-46.wav,44100,16,60,1,H,512,hil,NULL,NULL,0.819686992196556,NA 
rayol-farm2_2019-05-12_12-57-46.wav,44100,16,60,1,H,512,hil,NULL,NULL,0.855639807353528,NA 
rayol-farm2_2019-05-12_12-59-46.wav,44100,16,60,1,H,512,hil,NULL,NULL,0.839839469358435,NA 
rayol-farm2_2019-05-12_13-01-47.wav,44100,16,60,1,H,512,hil,NULL,NULL,0.871872732884434,NA 
rayol-farm2_2019-05-12_13-03-47.wav,44100,16,60,1,H,512,hil,NULL,NULL,0.842218898286356,NA 
rayol-farm2_2019-05-12_13-05-47.wav,44100,16,60,1,H,512,hil,NULL,NULL,0.833260419810902,NA 
rayol-farm2_2019-05-12_13-07-47.wav,44100,16,60,1,H,512,hil,NULL,NULL,0.810856998661795,NA 
rayol-farm2_2019-05-12_13-09-47.wav,44100,16,60,1,H,512,hil,NULL,NULL,0.772357227866094,NA 
rayol-farm2_2019-05-12_13-11-47.wav,44100,16,60,1,H,512,hil,NULL,NULL,0.826585931558149,NA 
rayol-farm2_2019-05-12_13-13-47.wav,44100,16,60,1,H,512,hil,NULL,NULL,0.830177032218455,NA 
rayol-farm2_2019-05-12_13-15-47.wav,44100,16,60,1,H,512,hil,NULL,NULL,0.775902670309731,NA 
rayol-farm2_2019-05-12_13-17-48.wav,44100,16,60,1,H,512,hil,NULL,NULL,0.865533716850874,NA 
rayol-farm2_2019-05-12_13-19-48.wav,44100,16,60,1,H,512,hil,NULL,NULL,0.847970938629277,NA 
rayol-farm2_2019-05-12_13-21-48.wav,44100,16,60,1,H,512,hil,NULL,NULL,0.849294484418636,NA 
rayol-farm2_2019-05-12_13-23-48.wav,44100,16,60,1,H,512,hil,NULL,NULL,0.845329117940468,NA 
rayol-farm2_2019-05-12_13-25-48.wav,44100,16,60,1,H,512,hil,NULL,NULL,0.890128906936746,NA 
rayol-farm2_2019-05-12_13-27-48.wav,44100,16,60,1,H,512,hil,NULL,NULL,0.872406817605004,NA 
rayol-farm2_2019-05-12_13-29-48.wav,44100,16,60,1,H,512,hil,NULL,NULL,0.865015924721092,NA 
rayol-farm2_2019-05-12_13-31-48.wav,44100,16,60,1,H,512,hil,NULL,NULL,0.847849988197001,NA 
rayol-farm2_2019-05-12_13-33-48.wav,44100,16,60,1,H,512,hil,NULL,NULL,0.812183848963758,NA 
rayol-farm2_2019-05-12_13-35-49.wav,44100,16,60,1,H,512,hil,NULL,NULL,0.833145061981776,NA 
rayol-farm2_2019-05-12_13-37-49.wav,44100,16,60,1,H,512,hil,NULL,NULL,0.812691231945893,NA 
rayol-farm2_2019-05-12_13-39-49.wav,44100,16,60,1,H,512,hil,NULL,NULL,0.806795653329291,NA 
rayol-farm2_2019-05-12_13-41-49.wav,44100,16,60,1,H,512,hil,NULL,NULL,0.842285078496031,NA 
rayol-farm2_2019-05-12_13-43-49.wav,44100,16,60,1,H,512,hil,NULL,NULL,0.787339427060457,NA 
rayol-farm2_2019-05-12_13-45-49.wav,44100,16,60,1,H,512,hil,NULL,NULL,0.807082168134921,NA 
rayol-farm2_2019-05-12_13-47-49.wav,44100,16,60,1,H,512,hil,NULL,NULL,0.779006077627364,NA 
rayol-farm2_2019-05-12_13-49-49.wav,44100,16,60,1,H,512,hil,NULL,NULL,0.826706402232232,NA 
rayol-farm2_2019-05-12_13-51-50.wav,44100,16,60,1,H,512,hil,NULL,NULL,0.871025979708591,NA 
rayol-farm2_2019-05-12_13-53-50.wav,44100,16,60,1,H,512,hil,NULL,NULL,0.873689391265487,NA 
rayol-farm2_2019-05-12_13-55-50.wav,44100,16,60,1,H,512,hil,NULL,NULL,0.875629575780473,NA 
rayol-farm2_2019-05-12_13-57-50.wav,44100,16,60,1,H,512,hil,NULL,NULL,0.845975115332916,NA 
rayol-farm2_2019-05-12_13-59-50.wav,44100,16,60,1,H,512,hil,NULL,NULL,0.877799208985815,NA 
rayol-farm2_2019-05-12_14-01-50.wav,44100,16,60,1,H,512,hil,NULL,NULL,0.871454486116017,NA 
rayol-farm2_2019-05-12_14-03-50.wav,44100,16,60,1,H,512,hil,NULL,NULL,0.891769646174392,NA 
rayol-farm2_2019-05-12_14-05-50.wav,44100,16,60,1,H,512,hil,NULL,NULL,0.887433513881639,NA 
rayol-farm2_2019-05-12_14-07-51.wav,44100,16,60,1,H,512,hil,NULL,NULL,0.855759582427632,NA 
rayol-farm2_2019-05-12_14-09-51.wav,44100,16,60,1,H,512,hil,NULL,NULL,0.884314703708513,NA 
rayol-farm2_2019-05-12_14-11-51.wav,44100,16,60,1,H,512,hil,NULL,NULL,0.884390122350745,NA 
rayol-farm2_2019-05-12_14-13-51.wav,44100,16,60,1,H,512,hil,NULL,NULL,0.891158786885827,NA 
rayol-farm2_2019-05-12_14-15-51.wav,44100,16,60,1,H,512,hil,NULL,NULL,0.896939332766895,NA 
rayol-farm2_2019-05-12_14-17-51.wav,44100,16,60,1,H,512,hil,NULL,NULL,0.884172195097544,NA 
rayol-farm2_2019-05-12_14-19-51.wav,44100,16,60,1,H,512,hil,NULL,NULL,0.896276056454443,NA 
rayol-farm2_2019-05-12_14-21-51.wav,44100,16,60,1,H,512,hil,NULL,NULL,0.883506306890093,NA 
rayol-farm2_2019-05-12_14-23-52.wav,44100,16,60,1,H,512,hil,NULL,NULL,0.896688846922941,NA 
rayol-farm2_2019-05-12_14-25-52.wav,44100,16,60,1,H,512,hil,NULL,NULL,0.876341455038679,NA 
rayol-farm2_2019-05-12_14-27-52.wav,44100,16,60,1,H,512,hil,NULL,NULL,0.885343563020662,NA 
rayol-farm2_2019-05-12_14-29-52.wav,44100,16,60,1,H,512,hil,NULL,NULL,0.88550804206858,NA 
rayol-farm2_2019-05-12_14-31-52.wav,44100,16,60,1,H,512,hil,NULL,NULL,0.893211604603928,NA 
rayol-farm2_2019-05-12_14-33-52.wav,44100,16,60,1,H,512,hil,NULL,NULL,0.890092402956742,NA 
rayol-farm2_2019-05-12_14-35-52.wav,44100,16,60,1,H,512,hil,NULL,NULL,0.897688656515149,NA 
rayol-farm2_2019-05-12_14-37-52.wav,44100,16,60,1,H,512,hil,NULL,NULL,0.894927803404695,NA 
rayol-farm2_2019-05-12_14-39-53.wav,44100,16,60,1,H,512,hil,NULL,NULL,0.891571951027904,NA 
rayol-farm2_2019-05-12_14-41-53.wav,44100,16,60,1,H,512,hil,NULL,NULL,0.891524453425298,NA 
rayol-farm2_2019-05-12_14-43-53.wav,44100,16,60,1,H,512,hil,NULL,NULL,0.892363685362683,NA 
rayol-farm2_2019-05-12_14-45-53.wav,44100,16,60,1,H,512,hil,NULL,NULL,0.888031086378225,NA 
rayol-farm2_2019-05-12_14-47-53.wav,44100,16,60,1,H,512,hil,NULL,NULL,0.87735222085872,NA 
rayol-farm2_2019-05-12_14-49-53.wav,44100,16,60,1,H,512,hil,NULL,NULL,0.867442606006022,NA 
rayol-farm2_2019-05-12_14-51-53.wav,44100,16,60,1,H,512,hil,NULL,NULL,0.864303169552309,NA 
rayol-farm2_2019-05-12_14-53-53.wav,44100,16,60,1,H,512,hil,NULL,NULL,0.86904407679388,NA 
rayol-farm2_2019-05-12_14-55-53.wav,44100,16,60,1,H,512,hil,NULL,NULL,0.868049902989089,NA 
rayol-farm2_2019-05-12_14-57-54.wav,44100,16,60,1,H,512,hil,NULL,NULL,0.870507523121192,NA 
rayol-farm2_2019-05-12_14-59-54.wav,44100,16,60,1,H,512,hil,NULL,NULL,0.86528229969268,NA 
rayol-farm2_2019-05-12_15-01-54.wav,44100,16,60,1,H,512,hil,NULL,NULL,0.872594082551859,NA 
rayol-farm2_2019-05-12_15-03-54.wav,44100,16,60,1,H,512,hil,NULL,NULL,0.898132330728505,NA 
rayol-farm2_2019-05-12_15-05-54.wav,44100,16,60,1,H,512,hil,NULL,NULL,0.872173690978891,NA 
rayol-farm2_2019-05-12_15-07-54.wav,44100,16,60,1,H,512,hil,NULL,NULL,0.895258619787351,NA 
rayol-farm2_2019-05-12_15-09-54.wav,44100,16,60,1,H,512,hil,NULL,NULL,0.896459179752065,NA 
rayol-farm2_2019-05-12_15-11-54.wav,44100,16,60,1,H,512,hil,NULL,NULL,0.880813875163516,NA 
rayol-farm2_2019-05-12_15-13-55.wav,44100,16,60,1,H,512,hil,NULL,NULL,0.865500700555792,NA 
rayol-farm2_2019-05-12_15-15-55.wav,44100,16,60,1,H,512,hil,NULL,NULL,0.879003992025349,NA 
rayol-farm2_2019-05-12_15-17-55.wav,44100,16,60,1,H,512,hil,NULL,NULL,0.875788553146972,NA 
rayol-farm2_2019-05-12_15-19-55.wav,44100,16,60,1,H,512,hil,NULL,NULL,0.866279714030988,NA 
rayol-farm2_2019-05-12_15-21-55.wav,44100,16,60,1,H,512,hil,NULL,NULL,0.872039217763599,NA 
rayol-farm2_2019-05-12_15-23-55.wav,44100,16,60,1,H,512,hil,NULL,NULL,0.870646681541016,NA 
rayol-farm2_2019-05-12_15-25-55.wav,44100,16,60,1,H,512,hil,NULL,NULL,0.86808058827276,NA 
rayol-farm2_2019-05-12_15-27-55.wav,44100,16,60,1,H,512,hil,NULL,NULL,0.870810059116116,NA 
rayol-farm2_2019-05-12_15-29-56.wav,44100,16,60,1,H,512,hil,NULL,NULL,0.870057725542598,NA 
rayol-farm2_2019-05-12_15-31-56.wav,44100,16,60,1,H,512,hil,NULL,NULL,0.877544416250709,NA 
rayol-farm2_2019-05-12_15-33-56.wav,44100,16,60,1,H,512,hil,NULL,NULL,0.870032460845023,NA 
rayol-farm2_2019-05-12_15-35-56.wav,44100,16,60,1,H,512,hil,NULL,NULL,0.871477165043581,NA 
rayol-farm2_2019-05-12_15-37-56.wav,44100,16,60,1,H,512,hil,NULL,NULL,0.876177265195447,NA 
rayol-farm2_2019-05-12_15-39-56.wav,44100,16,60,1,H,512,hil,NULL,NULL,0.869750524962036,NA 
rayol-farm2_2019-05-12_15-41-56.wav,44100,16,60,1,H,512,hil,NULL,NULL,0.866332337736595,NA 
rayol-farm2_2019-05-12_15-43-56.wav,44100,16,60,1,H,512,hil,NULL,NULL,0.869367726062098,NA 
rayol-farm2_2019-05-12_15-45-57.wav,44100,16,60,1,H,512,hil,NULL,NULL,0.862830951518117,NA 
rayol-farm2_2019-05-12_15-47-57.wav,44100,16,60,1,H,512,hil,NULL,NULL,0.873111323088928,NA 
rayol-farm2_2019-05-12_15-49-57.wav,44100,16,60,1,H,512,hil,NULL,NULL,0.872444776922085,NA 
rayol-farm2_2019-05-12_15-51-57.wav,44100,16,60,1,H,512,hil,NULL,NULL,0.870070825094095,NA 
rayol-farm2_2019-05-12_15-53-57.wav,44100,16,60,1,H,512,hil,NULL,NULL,0.859555154806874,NA 
rayol-farm2_2019-05-12_15-55-57.wav,44100,16,60,1,H,512,hil,NULL,NULL,0.870901878188056,NA 
rayol-farm2_2019-05-12_15-57-57.wav,44100,16,60,1,H,512,hil,NULL,NULL,0.869388754225554,NA 
rayol-farm2_2019-05-12_15-59-57.wav,44100,16,60,1,H,512,hil,NULL,NULL,0.85163920854994,NA 
rayol-farm2_2019-05-12_16-01-58.wav,44100,16,60,1,H,512,hil,NULL,NULL,0.867676140710167,NA 
rayol-farm2_2019-05-12_16-03-58.wav,44100,16,60,1,H,512,hil,NULL,NULL,0.865790705399142,NA 
rayol-farm2_2019-05-12_16-05-58.wav,44100,16,60,1,H,512,hil,NULL,NULL,0.867128550607151,NA 
rayol-farm2_2019-05-12_16-07-58.wav,44100,16,60,1,H,512,hil,NULL,NULL,0.868686259669321,NA 
rayol-farm2_2019-05-12_16-09-58.wav,44100,16,60,1,H,512,hil,NULL,NULL,0.862791140781328,NA 
rayol-farm2_2019-05-12_16-11-58.wav,44100,16,60,1,H,512,hil,NULL,NULL,0.867685059483557,NA 
rayol-farm2_2019-05-12_16-13-58.wav,44100,16,60,1,H,512,hil,NULL,NULL,0.871196945602604,NA 
rayol-farm2_2019-05-12_16-15-58.wav,44100,16,60,1,H,512,hil,NULL,NULL,0.866203225355004,NA 
rayol-farm2_2019-05-12_16-17-58.wav,44100,16,60,1,H,512,hil,NULL,NULL,0.871638935540033,NA 
rayol-farm2_2019-05-12_16-19-59.wav,44100,16,60,1,H,512,hil,NULL,NULL,0.872663534858394,NA 
rayol-farm2_2019-05-12_16-21-59.wav,44100,16,60,1,H,512,hil,NULL,NULL,0.873100163522157,NA 
rayol-farm2_2019-05-12_16-23-59.wav,44100,16,60,1,H,512,hil,NULL,NULL,0.867377139699535,NA 
rayol-farm2_2019-05-12_16-25-59.wav,44100,16,60,1,H,512,hil,NULL,NULL,0.866988566287856,NA 
rayol-farm2_2019-05-12_16-27-59.wav,44100,16,60,1,H,512,hil,NULL,NULL,0.873213304266963,NA 
rayol-farm2_2019-05-12_16-29-59.wav,44100,16,60,1,H,512,hil,NULL,NULL,0.872527721276573,NA 
rayol-farm2_2019-05-12_16-31-59.wav,44100,16,60,1,H,512,hil,NULL,NULL,0.872362883808603,NA 
rayol-farm2_2019-05-12_16-33-59.wav,44100,16,60,1,H,512,hil,NULL,NULL,0.871033599614427,NA 
rayol-farm2_2019-05-12_16-36-00.wav,44100,16,60,1,H,512,hil,NULL,NULL,0.871530837616299,NA 
rayol-farm2_2019-05-12_16-38-00.wav,44100,16,60,1,H,512,hil,NULL,NULL,0.864196776083704,NA 
rayol-farm2_2019-05-12_16-40-00.wav,44100,16,60,1,H,512,hil,NULL,NULL,0.868127966210022,NA 
rayol-farm2_2019-05-12_16-42-00.wav,44100,16,60,1,H,512,hil,NULL,NULL,0.871604949347715,NA 
rayol-farm2_2019-05-12_16-44-00.wav,44100,16,60,1,H,512,hil,NULL,NULL,0.869209178299426,NA 
rayol-farm2_2019-05-12_16-46-00.wav,44100,16,60,1,H,512,hil,NULL,NULL,0.871187045450125,NA 
rayol-farm2_2019-05-12_16-48-00.wav,44100,16,60,1,H,512,hil,NULL,NULL,0.868495450574832,NA 
rayol-farm2_2019-05-12_16-50-00.wav,44100,16,60,1,H,512,hil,NULL,NULL,0.864696840871686,NA 
rayol-farm2_2019-05-12_16-52-01.wav,44100,16,60,1,H,512,hil,NULL,NULL,0.865984810154856,NA 
rayol-farm2_2019-05-12_16-54-01.wav,44100,16,60,1,H,512,hil,NULL,NULL,0.866387253162549,NA 
rayol-farm2_2019-05-12_16-56-01.wav,44100,16,60,1,H,512,hil,NULL,NULL,0.870332034534052,NA 
rayol-farm2_2019-05-12_16-58-01.wav,44100,16,60,1,H,512,hil,NULL,NULL,0.875573613335044,NA 
rayol-farm2_2019-05-12_17-00-01.wav,44100,16,60,1,H,512,hil,NULL,NULL,0.898562508280163,NA 
rayol-farm2_2019-05-12_17-02-01.wav,44100,16,60,1,H,512,hil,NULL,NULL,0.898162640072582,NA 
rayol-farm2_2019-05-12_17-04-01.wav,44100,16,60,1,H,512,hil,NULL,NULL,0.896535077698698,NA 
rayol-farm2_2019-05-12_17-06-01.wav,44100,16,60,1,H,512,hil,NULL,NULL,0.897691024522478,NA 
rayol-farm2_2019-05-12_17-08-02.wav,44100,16,60,1,H,512,hil,NULL,NULL,0.876203905090286,NA 
rayol-farm2_2019-05-12_17-10-02.wav,44100,16,60,1,H,512,hil,NULL,NULL,0.894874345581803,NA 
rayol-farm2_2019-05-12_17-12-02.wav,44100,16,60,1,H,512,hil,NULL,NULL,0.883395212828027,NA 
rayol-farm2_2019-05-12_17-14-02.wav,44100,16,60,1,H,512,hil,NULL,NULL,0.872281682266495,NA 
rayol-farm2_2019-05-12_17-16-02.wav,44100,16,60,1,H,512,hil,NULL,NULL,0.871964158380838,NA 
rayol-farm2_2019-05-12_17-18-02.wav,44100,16,60,1,H,512,hil,NULL,NULL,0.872584410608802,NA 
rayol-farm2_2019-05-12_17-20-02.wav,44100,16,60,1,H,512,hil,NULL,NULL,0.868103064617629,NA 
rayol-farm2_2019-05-12_17-22-02.wav,44100,16,60,1,H,512,hil,NULL,NULL,0.869976179844827,NA 
rayol-farm2_2019-05-12_17-24-02.wav,44100,16,60,1,H,512,hil,NULL,NULL,0.869284961678267,NA 
rayol-farm2_2019-05-12_17-26-03.wav,44100,16,60,1,H,512,hil,NULL,NULL,0.867412214557654,NA 
rayol-farm2_2019-05-12_17-28-03.wav,44100,16,60,1,H,512,hil,NULL,NULL,0.865229357262382,NA 
rayol-farm2_2019-05-12_17-30-03.wav,44100,16,60,1,H,512,hil,NULL,NULL,0.868773108070318,NA 
rayol-farm2_2019-05-12_17-32-03.wav,44100,16,60,1,H,512,hil,NULL,NULL,0.870168770587422,NA 
rayol-farm2_2019-05-12_17-34-03.wav,44100,16,60,1,H,512,hil,NULL,NULL,0.868669946714743,NA 
rayol-farm2_2019-05-12_17-36-03.wav,44100,16,60,1,H,512,hil,NULL,NULL,0.868661308759637,NA 
rayol-farm2_2019-05-12_17-38-03.wav,44100,16,60,1,H,512,hil,NULL,NULL,0.864129863736094,NA 
rayol-farm2_2019-05-12_17-40-03.wav,44100,16,60,1,H,512,hil,NULL,NULL,0.865694681635875,NA 
rayol-farm2_2019-05-12_17-42-04.wav,44100,16,60,1,H,512,hil,NULL,NULL,0.870120987121565,NA 
rayol-farm2_2019-05-12_17-44-04.wav,44100,16,60,1,H,512,hil,NULL,NULL,0.868168468659664,NA 
rayol-farm2_2019-05-12_17-46-04.wav,44100,16,60,1,H,512,hil,NULL,NULL,0.865178291356524,NA 
rayol-farm2_2019-05-12_17-48-04.wav,44100,16,60,1,H,512,hil,NULL,NULL,0.869361489724539,NA 
rayol-farm2_2019-05-12_17-50-04.wav,44100,16,60,1,H,512,hil,NULL,NULL,0.868833468626547,NA 
rayol-farm2_2019-05-12_17-52-04.wav,44100,16,60,1,H,512,hil,NULL,NULL,0.868169523507945,NA 
rayol-farm2_2019-05-12_17-54-04.wav,44100,16,60,1,H,512,hil,NULL,NULL,0.866722110423475,NA 
rayol-farm2_2019-05-12_17-56-04.wav,44100,16,60,1,H,512,hil,NULL,NULL,0.870593865284318,NA 
rayol-farm2_2019-05-12_17-58-05.wav,44100,16,60,1,H,512,hil,NULL,NULL,0.865371741730721,NA 
rayol-farm2_2019-05-12_18-00-05.wav,44100,16,60,1,H,512,hil,NULL,NULL,0.862702906490819,NA 
rayol-farm2_2019-05-12_18-02-05.wav,44100,16,60,1,H,512,hil,NULL,NULL,0.86892917206125,NA 
rayol-farm2_2019-05-12_18-04-05.wav,44100,16,60,1,H,512,hil,NULL,NULL,0.866637245316597,NA 
rayol-farm2_2019-05-12_18-06-05.wav,44100,16,60,1,H,512,hil,NULL,NULL,0.869039927102653,NA 
rayol-farm2_2019-05-12_18-08-05.wav,44100,16,60,1,H,512,hil,NULL,NULL,0.868609169091918,NA 
rayol-farm2_2019-05-12_18-10-05.wav,44100,16,60,1,H,512,hil,NULL,NULL,0.870055549750188,NA 
rayol-farm2_2019-05-12_18-12-05.wav,44100,16,60,1,H,512,hil,NULL,NULL,0.866507453103187,NA 
rayol-farm2_2019-05-12_18-14-06.wav,44100,16,60,1,H,512,hil,NULL,NULL,0.868451759845908,NA 
rayol-farm2_2019-05-12_18-16-06.wav,44100,16,60,1,H,512,hil,NULL,NULL,0.867086323573428,NA 
rayol-farm2_2019-05-12_18-18-06.wav,44100,16,60,1,H,512,hil,NULL,NULL,0.870861266896759,NA 
rayol-farm2_2019-05-12_18-20-06.wav,44100,16,60,1,H,512,hil,NULL,NULL,0.869924976818885,NA 
rayol-farm2_2019-05-12_18-22-06.wav,44100,16,60,1,H,512,hil,NULL,NULL,0.866642548225763,NA 
rayol-farm2_2019-05-12_18-24-06.wav,44100,16,60,1,H,512,hil,NULL,NULL,0.898392264369595,NA 
rayol-farm2_2019-05-12_18-26-06.wav,44100,16,60,1,H,512,hil,NULL,NULL,0.895307263259544,NA 
rayol-farm2_2019-05-12_18-28-06.wav,44100,16,60,1,H,512,hil,NULL,NULL,0.892151809060618,NA 
rayol-farm2_2019-05-12_18-30-06.wav,44100,16,60,1,H,512,hil,NULL,NULL,0.887989800331933,NA 
rayol-farm2_2019-05-12_18-32-07.wav,44100,16,60,1,H,512,hil,NULL,NULL,0.899680591062218,NA 
rayol-farm2_2019-05-12_18-34-07.wav,44100,16,60,1,H,512,hil,NULL,NULL,0.895823216650108,NA 
rayol-farm2_2019-05-12_18-36-07.wav,44100,16,60,1,H,512,hil,NULL,NULL,0.892265113442934,NA 
rayol-farm2_2019-05-12_18-38-07.wav,44100,16,60,1,H,512,hil,NULL,NULL,0.887483247473285,NA 
rayol-farm2_2019-05-12_18-40-07.wav,44100,16,60,1,H,512,hil,NULL,NULL,0.870330925644132,NA 
rayol-farm2_2019-05-12_18-42-07.wav,44100,16,60,1,H,512,hil,NULL,NULL,0.869467132145942,NA 
rayol-farm2_2019-05-12_18-44-07.wav,44100,16,60,1,H,512,hil,NULL,NULL,0.869885485788363,NA 
rayol-farm2_2019-05-12_18-46-07.wav,44100,16,60,1,H,512,hil,NULL,NULL,0.873949942367277,NA 
rayol-farm2_2019-05-12_18-48-08.wav,44100,16,60,1,H,512,hil,NULL,NULL,0.868661011934727,NA 
rayol-farm2_2019-05-12_18-50-08.wav,44100,16,60,1,H,512,hil,NULL,NULL,0.871432380890825,NA 
rayol-farm2_2019-05-12_18-52-08.wav,44100,16,60,1,H,512,hil,NULL,NULL,0.871087036930188,NA 
rayol-farm2_2019-05-12_18-54-08.wav,44100,16,60,1,H,512,hil,NULL,NULL,0.870114661949974,NA 
rayol-farm2_2019-05-12_18-56-08.wav,44100,16,60,1,H,512,hil,NULL,NULL,0.867525577593251,NA 
rayol-farm2_2019-05-12_18-58-08.wav,44100,16,60,1,H,512,hil,NULL,NULL,0.867322846332542,NA 
rayol-farm2_2019-05-12_19-00-08.wav,44100,16,60,1,H,512,hil,NULL,NULL,0.876026906599218,NA 
rayol-farm2_2019-05-12_19-02-08.wav,44100,16,60,1,H,512,hil,NULL,NULL,0.877835554907493,NA 
rayol-farm2_2019-05-12_19-04-09.wav,44100,16,60,1,H,512,hil,NULL,NULL,0.871519643427482,NA 
rayol-farm2_2019-05-12_19-06-09.wav,44100,16,60,1,H,512,hil,NULL,NULL,0.871012036083115,NA 
rayol-farm2_2019-05-12_19-08-09.wav,44100,16,60,1,H,512,hil,NULL,NULL,0.869153176774529,NA 
rayol-farm2_2019-05-12_19-10-09.wav,44100,16,60,1,H,512,hil,NULL,NULL,0.878174961832859,NA 
rayol-farm2_2019-05-12_19-12-09.wav,44100,16,60,1,H,512,hil,NULL,NULL,0.878216639193528,NA 
rayol-farm2_2019-05-12_19-14-09.wav,44100,16,60,1,H,512,hil,NULL,NULL,0.873137995254016,NA 
rayol-farm2_2019-05-12_19-16-09.wav,44100,16,60,1,H,512,hil,NULL,NULL,0.896606767251567,NA 
rayol-farm2_2019-05-12_19-18-09.wav,44100,16,60,1,H,512,hil,NULL,NULL,0.895273523383536,NA 
rayol-farm2_2019-05-12_19-20-09.wav,44100,16,60,1,H,512,hil,NULL,NULL,0.875043793229292,NA 
rayol-farm2_2019-05-12_19-22-10.wav,44100,16,60,1,H,512,hil,NULL,NULL,0.875423390200631,NA 
rayol-farm2_2019-05-12_19-24-10.wav,44100,16,60,1,H,512,hil,NULL,NULL,0.873925458699969,NA 
rayol-farm2_2019-05-12_19-26-10.wav,44100,16,60,1,H,512,hil,NULL,NULL,0.871900627931291,NA 
rayol-farm2_2019-05-12_19-28-10.wav,44100,16,60,1,H,512,hil,NULL,NULL,0.875568228956886,NA 
rayol-farm2_2019-05-12_19-30-10.wav,44100,16,60,1,H,512,hil,NULL,NULL,0.89793070970472,NA 
rayol-farm2_2019-05-12_19-32-10.wav,44100,16,60,1,H,512,hil,NULL,NULL,0.899593647031346,NA 
rayol-farm2_2019-05-12_19-34-10.wav,44100,16,60,1,H,512,hil,NULL,NULL,0.901092576314559,NA 
rayol-farm2_2019-05-12_19-36-10.wav,44100,16,60,1,H,512,hil,NULL,NULL,0.896152467430531,NA 
rayol-farm2_2019-05-12_19-38-11.wav,44100,16,60,1,H,512,hil,NULL,NULL,0.900313229638504,NA 
rayol-farm2_2019-05-12_19-40-11.wav,44100,16,60,1,H,512,hil,NULL,NULL,0.902443795089067,NA 
rayol-farm2_2019-05-12_19-42-11.wav,44100,16,60,1,H,512,hil,NULL,NULL,0.903485718887722,NA 
rayol-farm2_2019-05-12_19-44-11.wav,44100,16,60,1,H,512,hil,NULL,NULL,0.900711735196602,NA 
rayol-farm2_2019-05-12_19-46-11.wav,44100,16,60,1,H,512,hil,NULL,NULL,0.901813718705165,NA 
rayol-farm2_2019-05-12_19-48-11.wav,44100,16,60,1,H,512,hil,NULL,NULL,0.892531023717816,NA 
rayol-farm2_2019-05-12_19-50-11.wav,44100,16,60,1,H,512,hil,NULL,NULL,0.885128606511292,NA 
rayol-farm2_2019-05-12_19-52-11.wav,44100,16,60,1,H,512,hil,NULL,NULL,0.896849824009147,NA 
rayol-farm2_2019-05-12_19-54-12.wav,44100,16,60,1,H,512,hil,NULL,NULL,0.903224709293678,NA 
rayol-farm2_2019-05-12_19-56-12.wav,44100,16,60,1,H,512,hil,NULL,NULL,0.898461456100564,NA 
rayol-farm2_2019-05-12_19-58-12.wav,44100,16,60,1,H,512,hil,NULL,NULL,0.89077048987831,NA 
rayol-farm2_2019-05-12_20-00-12.wav,44100,16,60,1,H,512,hil,NULL,NULL,0.901324564895821,NA 
rayol-farm2_2019-05-12_20-02-12.wav,44100,16,60,1,H,512,hil,NULL,NULL,0.897609069997295,NA 
rayol-farm2_2019-05-12_20-04-12.wav,44100,16,60,1,H,512,hil,NULL,NULL,0.890172129127949,NA 
rayol-farm2_2019-05-12_20-06-12.wav,44100,16,60,1,H,512,hil,NULL,NULL,0.894525345263762,NA 
rayol-farm2_2019-05-12_20-08-12.wav,44100,16,60,1,H,512,hil,NULL,NULL,0.901630496398759,NA 
rayol-farm2_2019-05-12_20-10-13.wav,44100,16,60,1,H,512,hil,NULL,NULL,0.89667749922188,NA 
rayol-farm2_2019-05-12_20-12-13.wav,44100,16,60,1,H,512,hil,NULL,NULL,0.898666624862793,NA 
rayol-farm2_2019-05-12_20-14-13.wav,44100,16,60,1,H,512,hil,NULL,NULL,0.900998911470644,NA 
rayol-farm2_2019-05-12_20-16-13.wav,44100,16,60,1,H,512,hil,NULL,NULL,0.901151242393259,NA 
rayol-farm2_2019-05-12_20-18-13.wav,44100,16,60,1,H,512,hil,NULL,NULL,0.902602433189072,NA 
rayol-farm2_2019-05-12_20-20-13.wav,44100,16,60,1,H,512,hil,NULL,NULL,0.892047133069135,NA 
rayol-farm2_2019-05-12_20-22-13.wav,44100,16,60,1,H,512,hil,NULL,NULL,0.901935779056091,NA 
rayol-farm2_2019-05-12_20-24-13.wav,44100,16,60,1,H,512,hil,NULL,NULL,0.902662000749001,NA 
rayol-farm2_2019-05-12_20-26-13.wav,44100,16,60,1,H,512,hil,NULL,NULL,0.899467635350473,NA 
rayol-farm2_2019-05-12_20-28-14.wav,44100,16,60,1,H,512,hil,NULL,NULL,0.899811176075492,NA 
rayol-farm2_2019-05-12_20-30-14.wav,44100,16,60,1,H,512,hil,NULL,NULL,0.904241571333196,NA 
rayol-farm2_2019-05-12_20-32-14.wav,44100,16,60,1,H,512,hil,NULL,NULL,0.905290572444518,NA 
rayol-farm2_2019-05-12_20-34-14.wav,44100,16,60,1,H,512,hil,NULL,NULL,0.893273426994969,NA 
rayol-farm2_2019-05-12_20-36-14.wav,44100,16,60,1,H,512,hil,NULL,NULL,0.903671599730148,NA 
rayol-farm2_2019-05-12_20-38-14.wav,44100,16,60,1,H,512,hil,NULL,NULL,0.904553044191918,NA 
rayol-farm2_2019-05-12_20-40-14.wav,44100,16,60,1,H,512,hil,NULL,NULL,0.89804729193522,NA 
rayol-farm2_2019-05-12_20-42-14.wav,44100,16,60,1,H,512,hil,NULL,NULL,0.897327033530139,NA 
rayol-farm2_2019-05-12_20-44-15.wav,44100,16,60,1,H,512,hil,NULL,NULL,0.903644457658051,NA 
rayol-farm2_2019-05-12_20-46-15.wav,44100,16,60,1,H,512,hil,NULL,NULL,0.901965317178835,NA 
rayol-farm2_2019-05-12_20-48-15.wav,44100,16,60,1,H,512,hil,NULL,NULL,0.900543158522516,NA 
rayol-farm2_2019-05-12_20-50-15.wav,44100,16,60,1,H,512,hil,NULL,NULL,0.901453731285539,NA 
rayol-farm2_2019-05-12_20-52-15.wav,44100,16,60,1,H,512,hil,NULL,NULL,0.902196171076519,NA 
rayol-farm2_2019-05-12_20-54-15.wav,44100,16,60,1,H,512,hil,NULL,NULL,0.900568267048942,NA 
rayol-farm2_2019-05-12_20-56-15.wav,44100,16,60,1,H,512,hil,NULL,NULL,0.900196189680861,NA 
rayol-farm2_2019-05-12_20-58-15.wav,44100,16,60,1,H,512,hil,NULL,NULL,0.902266649269365,NA 
rayol-farm2_2019-05-12_21-00-16.wav,44100,16,60,1,H,512,hil,NULL,NULL,0.900853768521942,NA 
rayol-farm2_2019-05-12_21-02-16.wav,44100,16,60,1,H,512,hil,NULL,NULL,0.900753098904275,NA 
rayol-farm2_2019-05-12_21-04-16.wav,44100,16,60,1,H,512,hil,NULL,NULL,0.870481203510555,NA 
rayol-farm2_2019-05-12_21-06-16.wav,44100,16,60,1,H,512,hil,NULL,NULL,0.871081895504882,NA 
rayol-farm2_2019-05-12_21-08-16.wav,44100,16,60,1,H,512,hil,NULL,NULL,0.875900317660501,NA 
rayol-farm2_2019-05-12_21-10-16.wav,44100,16,60,1,H,512,hil,NULL,NULL,0.8667635411516,NA 
rayol-farm2_2019-05-12_21-12-16.wav,44100,16,60,1,H,512,hil,NULL,NULL,0.869197472435996,NA 
rayol-farm2_2019-05-12_21-14-16.wav,44100,16,60,1,H,512,hil,NULL,NULL,0.866551124679608,NA 
rayol-farm2_2019-05-12_21-16-17.wav,44100,16,60,1,H,512,hil,NULL,NULL,0.866017327198288,NA 
rayol-farm2_2019-05-12_21-18-17.wav,44100,16,60,1,H,512,hil,NULL,NULL,0.868654934270963,NA 
rayol-farm2_2019-05-12_21-20-17.wav,44100,16,60,1,H,512,hil,NULL,NULL,0.868823517140771,NA 
rayol-farm2_2019-05-12_21-22-17.wav,44100,16,60,1,H,512,hil,NULL,NULL,0.862043272007426,NA 
rayol-farm2_2019-05-12_21-24-17.wav,44100,16,60,1,H,512,hil,NULL,NULL,0.862266136588516,NA 
rayol-farm2_2019-05-12_21-26-17.wav,44100,16,60,1,H,512,hil,NULL,NULL,0.861850296546263,NA 
rayol-farm2_2019-05-12_21-28-17.wav,44100,16,60,1,H,512,hil,NULL,NULL,0.864488341651534,NA 
rayol-farm2_2019-05-12_21-30-17.wav,44100,16,60,1,H,512,hil,NULL,NULL,0.830830288484387,NA 
rayol-farm2_2019-05-12_21-32-18.wav,44100,16,60,1,H,512,hil,NULL,NULL,0.864162990313019,NA 
rayol-farm2_2019-05-12_21-34-18.wav,44100,16,60,1,H,512,hil,NULL,NULL,0.863019000080021,NA 
rayol-farm2_2019-05-12_21-36-18.wav,44100,16,60,1,H,512,hil,NULL,NULL,0.865393294882001,NA 
rayol-farm2_2019-05-12_21-38-18.wav,44100,16,60,1,H,512,hil,NULL,NULL,0.864802596801106,NA 
rayol-farm2_2019-05-12_21-40-18.wav,44100,16,60,1,H,512,hil,NULL,NULL,0.86397180409264,NA 
rayol-farm2_2019-05-12_21-42-18.wav,44100,16,60,1,H,512,hil,NULL,NULL,0.865042778505415,NA 
rayol-farm2_2019-05-12_21-44-18.wav,44100,16,60,1,H,512,hil,NULL,NULL,0.864265174868545,NA 
rayol-farm2_2019-05-12_21-46-18.wav,44100,16,60,1,H,512,hil,NULL,NULL,0.865356441021534,NA 
rayol-farm2_2019-05-12_21-48-19.wav,44100,16,60,1,H,512,hil,NULL,NULL,0.86503643269024,NA 
rayol-farm2_2019-05-12_21-50-19.wav,44100,16,60,1,H,512,hil,NULL,NULL,0.865002792753229,NA 
rayol-farm2_2019-05-12_21-52-19.wav,44100,16,60,1,H,512,hil,NULL,NULL,0.865055866777434,NA 
rayol-farm2_2019-05-12_21-54-19.wav,44100,16,60,1,H,512,hil,NULL,NULL,0.864695360695481,NA 
rayol-farm2_2019-05-12_21-56-19.wav,44100,16,60,1,H,512,hil,NULL,NULL,0.863827236158673,NA 
rayol-farm2_2019-05-12_21-58-19.wav,44100,16,60,1,H,512,hil,NULL,NULL,0.86247159593133,NA 
rayol-farm2_2019-05-12_22-00-19.wav,44100,16,60,1,H,512,hil,NULL,NULL,0.859498114066702,NA 
rayol-farm2_2019-05-12_22-02-19.wav,44100,16,60,1,H,512,hil,NULL,NULL,0.867377683016635,NA 
rayol-farm2_2019-05-12_22-04-19.wav,44100,16,60,1,H,512,hil,NULL,NULL,0.861432243317233,NA 
rayol-farm2_2019-05-12_22-06-20.wav,44100,16,60,1,H,512,hil,NULL,NULL,0.885054656144354,NA 
rayol-farm2_2019-05-12_22-08-20.wav,44100,16,60,1,H,512,hil,NULL,NULL,0.897512881149944,NA 
rayol-farm2_2019-05-12_22-10-20.wav,44100,16,60,1,H,512,hil,NULL,NULL,0.897843053400872,NA 
rayol-farm2_2019-05-12_22-12-20.wav,44100,16,60,1,H,512,hil,NULL,NULL,0.898152588814596,NA 
rayol-farm2_2019-05-12_22-14-20.wav,44100,16,60,1,H,512,hil,NULL,NULL,0.898115096001373,NA 
rayol-farm2_2019-05-12_22-16-20.wav,44100,16,60,1,H,512,hil,NULL,NULL,0.891563962340828,NA 
rayol-farm2_2019-05-12_22-18-20.wav,44100,16,60,1,H,512,hil,NULL,NULL,0.890286322067665,NA 
rayol-farm2_2019-05-12_22-20-20.wav,44100,16,60,1,H,512,hil,NULL,NULL,0.879899539386459,NA 
rayol-farm2_2019-05-12_22-22-21.wav,44100,16,60,1,H,512,hil,NULL,NULL,0.89788977079194,NA 
rayol-farm2_2019-05-12_22-24-21.wav,44100,16,60,1,H,512,hil,NULL,NULL,0.896544193518738,NA 
rayol-farm2_2019-05-12_22-26-21.wav,44100,16,60,1,H,512,hil,NULL,NULL,0.898059964876577,NA 
rayol-farm2_2019-05-12_22-28-21.wav,44100,16,60,1,H,512,hil,NULL,NULL,0.896657165811977,NA 
rayol-farm2_2019-05-12_22-30-21.wav,44100,16,60,1,H,512,hil,NULL,NULL,0.899003035812633,NA 
rayol-farm2_2019-05-12_22-32-21.wav,44100,16,60,1,H,512,hil,NULL,NULL,0.896715736955834,NA 
rayol-farm2_2019-05-12_22-34-21.wav,44100,16,60,1,H,512,hil,NULL,NULL,0.899428962820502,NA 
rayol-farm2_2019-05-12_22-36-21.wav,44100,16,60,1,H,512,hil,NULL,NULL,0.896049966003982,NA 
rayol-farm2_2019-05-12_22-38-22.wav,44100,16,60,1,H,512,hil,NULL,NULL,0.896121532011647,NA 
rayol-farm2_2019-05-12_22-40-22.wav,44100,16,60,1,H,512,hil,NULL,NULL,0.89396175183587,NA 
rayol-farm2_2019-05-12_22-42-22.wav,44100,16,60,1,H,512,hil,NULL,NULL,0.898126468961015,NA 
rayol-farm2_2019-05-12_22-44-22.wav,44100,16,60,1,H,512,hil,NULL,NULL,0.89914945470372,NA 
rayol-farm2_2019-05-12_22-46-22.wav,44100,16,60,1,H,512,hil,NULL,NULL,0.8989700090782,NA 
rayol-farm2_2019-05-12_22-48-22.wav,44100,16,60,1,H,512,hil,NULL,NULL,0.894551795316429,NA 
rayol-farm2_2019-05-12_22-50-22.wav,44100,16,60,1,H,512,hil,NULL,NULL,0.891285339786597,NA 
rayol-farm2_2019-05-12_22-52-22.wav,44100,16,60,1,H,512,hil,NULL,NULL,0.896942576702922,NA 
rayol-farm2_2019-05-12_22-54-23.wav,44100,16,60,1,H,512,hil,NULL,NULL,0.898724126870739,NA 
rayol-farm2_2019-05-12_22-56-23.wav,44100,16,60,1,H,512,hil,NULL,NULL,0.899327639357311,NA 
rayol-farm2_2019-05-12_22-58-23.wav,44100,16,60,1,H,512,hil,NULL,NULL,0.899658062008439,NA 
rayol-farm2_2019-05-12_23-00-23.wav,44100,16,60,1,H,512,hil,NULL,NULL,0.898679245555186,NA 
rayol-farm2_2019-05-12_23-02-23.wav,44100,16,60,1,H,512,hil,NULL,NULL,0.898273664469348,NA 
rayol-farm2_2019-05-12_23-04-23.wav,44100,16,60,1,H,512,hil,NULL,NULL,0.89906969563302,NA 
rayol-farm2_2019-05-12_23-06-23.wav,44100,16,60,1,H,512,hil,NULL,NULL,0.898194440907101,NA 
rayol-farm2_2019-05-12_23-08-23.wav,44100,16,60,1,H,512,hil,NULL,NULL,0.898054008867175,NA 
rayol-farm2_2019-05-12_23-10-23.wav,44100,16,60,1,H,512,hil,NULL,NULL,0.898315584635034,NA 
rayol-farm2_2019-05-12_23-12-24.wav,44100,16,60,1,H,512,hil,NULL,NULL,0.89790151954487,NA 
rayol-farm2_2019-05-12_23-14-24.wav,44100,16,60,1,H,512,hil,NULL,NULL,0.897986319088441,NA 
rayol-farm2_2019-05-12_23-16-24.wav,44100,16,60,1,H,512,hil,NULL,NULL,0.894293853255146,NA 
rayol-farm2_2019-05-12_23-18-24.wav,44100,16,60,1,H,512,hil,NULL,NULL,0.896455180503461,NA 
rayol-farm2_2019-05-12_23-20-24.wav,44100,16,60,1,H,512,hil,NULL,NULL,0.838446090333641,NA 
rayol-farm2_2019-05-12_23-22-24.wav,44100,16,60,1,H,512,hil,NULL,NULL,0.892953173716381,NA 
rayol-farm2_2019-05-12_23-24-24.wav,44100,16,60,1,H,512,hil,NULL,NULL,0.899135819357647,NA 
rayol-farm2_2019-05-12_23-26-24.wav,44100,16,60,1,H,512,hil,NULL,NULL,0.899690251078839,NA 
rayol-farm2_2019-05-12_23-28-25.wav,44100,16,60,1,H,512,hil,NULL,NULL,0.899580784885233,NA 
rayol-farm2_2019-05-12_23-30-25.wav,44100,16,60,1,H,512,hil,NULL,NULL,0.899108302830502,NA 
rayol-farm2_2019-05-12_23-32-25.wav,44100,16,60,1,H,512,hil,NULL,NULL,0.89914842432374,NA 
rayol-farm2_2019-05-12_23-34-25.wav,44100,16,60,1,H,512,hil,NULL,NULL,0.897821583538822,NA 
rayol-farm2_2019-05-12_23-36-25.wav,44100,16,60,1,H,512,hil,NULL,NULL,0.898896298880678,NA 
rayol-farm2_2019-05-12_23-38-25.wav,44100,16,60,1,H,512,hil,NULL,NULL,0.899007096537527,NA 
rayol-farm2_2019-05-12_23-40-25.wav,44100,16,60,1,H,512,hil,NULL,NULL,0.89816918394271,NA 
rayol-farm2_2019-05-12_23-42-25.wav,44100,16,60,1,H,512,hil,NULL,NULL,0.897895497227414,NA 
rayol-farm2_2019-05-12_23-44-26.wav,44100,16,60,1,H,512,hil,NULL,NULL,0.89835130742392,NA 
rayol-farm2_2019-05-12_23-46-26.wav,44100,16,60,1,H,512,hil,NULL,NULL,0.897708520104346,NA 
rayol-farm2_2019-05-12_23-48-26.wav,44100,16,60,1,H,512,hil,NULL,NULL,0.898503971787428,NA 
rayol-farm2_2019-05-12_23-50-26.wav,44100,16,60,1,H,512,hil,NULL,NULL,0.89841541758481,NA 
rayol-farm2_2019-05-12_23-52-26.wav,44100,16,60,1,H,512,hil,NULL,NULL,0.891048912348827,NA 
rayol-farm2_2019-05-12_23-54-26.wav,44100,16,60,1,H,512,hil,NULL,NULL,0.894730637997212,NA 
rayol-farm2_2019-05-12_23-56-26.wav,44100,16,60,1,H,512,hil,NULL,NULL,0.893071561963555,NA 
rayol-farm2_2019-05-12_23-58-26.wav,44100,16,60,1,H,512,hil,NULL,NULL,0.891660409272724,NA
