DATE,MOON_VIS,ENTREES,J_i_MEAN,J_i_STD,J_i_VAR,J_m_TEMP_MEAN,J_m_TEMP_VAR,J_m_RAY_MEAN,J_m_RAY_VAR,J_m_UV_MEAN,J_m_UV_VAR,J_m_HUMID_MEAN,J_m_HUMID_VAR,J_m_HUMIDEX_MEAN,J_m_HUMIDEX_VAR,J_m_WNDSP_MEAN,J_m_WNDSP_VAR,J_m_PRESSION_MEAN,J_m_PRESSION_VAR,J_m_PRECIP_MEAN,J_m_PRECIP_VAR,N_i_MEAN,N_i_STD,N_i_VAR,N_m_TEMP_MEAN,N_m_TEMP_VAR,N_m_RAY_MEAN,N_m_RAY_VAR,N_m_UV_MEAN,N_m_UV_VAR,N_m_HUMID_MEAN,N_m_HUMID_VAR,N_m_HUMIDEX_MEAN,N_m_HUMIDEX_VAR,N_m_WNDSP_MEAN,N_m_WNDSP_VAR,N_m_PRESSION_MEAN,N_m_PRESSION_VAR,N_m_PRECIP_MEAN,N_m_PRECIP_VAR
2019-03-22 00:00:00,99.0,117,1.6395360778689965,0.9034007525975859,0.8161329197938846,19.759999999999998,1.3303999999999998,283.4,57986.77333333334,1.0933333333333333,1.1472888888888888,45.733333333333334,48.062222222222225,20.086666666666662,0.8584888888888889,11.666666666666666,1.6888888888888884,1003.2066666666666,2.0686222222222286,0.0,0.0,1.003307837889417,0.08493313107580469,0.0072136367543398205,16.277777777777775,1.4039506172839518,0.0,0.0,0.0,0.0,67.44444444444444,40.46913580246913,17.54444444444444,1.2424691358024686,7.555555555555555,2.2469135802469133,1000.9000000000001,0.8377777777777773,0.06666666666666668,0.01777777777777778
2019-03-23 00:00:00,95.0,162,1.6031400375092995,0.9181668905598133,0.8430304389202761,14.726666666666665,0.19928888888888888,61.666666666666664,2403.0222222222224,0.43333333333333335,0.18622222222222223,86.26666666666667,51.528888888888886,17.139999999999997,0.14906666666666654,6.0,2.0,999.5733333333333,1.2246222222222027,0.3733333333333333,0.20728888888888888,1.0125705596116423,0.11673349566553934,0.01362670901029649,14.300000000000002,0.10666666666666666,2.111111111111111,35.654320987654344,0.0,0.0,93.88888888888889,3.654320987654321,17.200000000000003,0.3933333333333333,1.0,2.2222222222222223,1005.5333333333333,3.020000000000009,0.044444444444444446,0.006913580246913581
2019-03-24 00:00:00,88.0,402,2.030652331474533,0.8608417492635606,0.741048517275147,14.933333333333334,0.37688888888888894,71.2,5179.226666666667,0.7266666666666667,1.0606222222222224,93.46666666666667,4.115555555555556,18.133333333333333,0.6568888888888887,7.666666666666667,6.355555555555556,1011.5,4.394666666666675,0.9199999999999999,1.4762666666666666,0.9886468112536768,0.10166707151477807,0.010336193430390998,14.444444444444445,0.015802469135802452,2.111111111111111,35.654320987654344,0.0,0.0,95.0,2.888888888888889,17.51111111111111,0.04987654320987654,1.6666666666666667,3.777777777777777,1016.0222222222224,0.9017283950617296,0.0,0.0
2019-03-25 00:00:00,81.0,79,1.8272944029388285,0.8910144063072712,0.7939066722470991,15.280000000000001,1.2015999999999998,164.26666666666668,15380.062222222226,1.1066666666666665,1.2579555555555553,88.73333333333333,11.662222222222223,18.220000000000002,1.9455999999999998,4.933333333333334,3.128888888888889,1016.7666666666665,0.3995555555555604,0.0,0.0,1.0879063276593064,0.4003749937138194,0.16030013559134093,14.944444444444445,0.046913580246913625,2.111111111111111,35.654320987654344,0.0,0.0,93.55555555555556,1.5802469135802473,18.144444444444446,0.04691358024691375,3.2222222222222223,4.617283950617284,1014.8333333333334,0.528888888888865,0.1111111111111111,0.036543209876543206
2019-03-26 00:00:00,71.0,143,1.9051644163655939,0.8485103290593602,0.7199697785204238,18.126666666666665,6.63528888888889,411.1333333333333,119249.71555555555,1.9466666666666665,2.546488888888889,66.26666666666667,534.5955555555555,19.980000000000004,3.3122666666666674,6.466666666666667,10.115555555555556,1014.7866666666667,0.9131555555555553,0.0,0.0,0.9408017523817626,0.2609669959333522,0.06810377296647827,15.844444444444443,0.400246913580247,2.3333333333333335,43.55555555555557,0.0,0.0,52.0,4.222222222222222,15.844444444444443,0.400246913580247,11.0,35.55555555555556,1017.8222222222222,0.5128395061728204,0.0,0.0
2019-03-27 00:00:00,62.0,130,1.726308835241777,0.7160163728084986,0.5126794461298388,18.526666666666664,9.88862222222222,456.2,115022.82666666668,2.246666666666667,3.546488888888889,49.13333333333333,61.8488888888889,18.813333333333333,11.258488888888886,16.6,15.706666666666665,1017.6,0.20933333333334367,0.0,0.0,0.9134175941850758,0.03198083787965912,0.0010227739914850397,16.211111111111112,1.020987654320987,2.3333333333333335,43.55555555555557,0.0,0.0,56.22222222222222,76.83950617283952,16.8,2.477777777777776,10.333333333333334,17.333333333333332,1017.3666666666666,0.7999999999999823,0.0,0.0
2019-03-28 00:00:00,52.0,210,1.6972348806021553,0.852960753168701,0.7275420464461178,16.900000000000002,6.149333333333333,329.1333333333333,54415.58222222223,1.8733333333333333,2.421955555555555,37.733333333333334,40.595555555555556,16.900000000000002,6.149333333333333,15.8,5.893333333333333,1014.8133333333333,3.459822222222191,0.0,0.0,1.0610403797055785,0.32055663563433956,0.10275655664920674,14.600000000000001,1.4088888888888895,2.7777777777777777,61.72839506172839,0.0,0.0,37.44444444444444,6.691358024691358,14.600000000000001,1.4088888888888895,21.444444444444443,24.91358024691358,1012.8888888888889,0.32765432098765507,0.0,0.0
2019-03-29 00:00:00,42.0,127,1.9667068871809301,0.8769518743465746,0.7690445899199705,16.92,7.665600000000001,477.26666666666665,113567.79555555554,2.1133333333333337,2.9824888888888887,37.53333333333333,23.182222222222215,16.92,7.665600000000001,9.066666666666666,30.195555555555554,1013.8733333333333,0.5966222222222061,0.0,0.0,1.0367003952256393,0.17468108671125157,0.030513482054623793,11.444444444444443,4.335802469135802,2.0,32.0,0.0,0.0,73.88888888888889,124.32098765432099,11.511111111111111,4.438765432098766,0.4444444444444444,0.9135802469135802,1014.7555555555557,0.31580246913581156,0.0,0.0
2019-03-30 00:00:00,33.0,166,1.7811570951660176,0.8494172050019744,0.7215095881533662,15.326666666666663,7.61928888888889,473.6666666666667,109796.35555555554,2.2199999999999998,3.3136,72.73333333333333,54.46222222222221,16.713333333333335,10.814488888888889,4.866666666666666,8.915555555555557,1013.9733333333334,0.21928888888888745,0.0,0.0,1.0476077232432828,0.17820226671924091,0.03175604786387548,11.349999999999998,2.1625000000000005,1.9,32.490000000000016,0.0,0.0,88.5,26.25,12.3,3.036,0.6,2.2399999999999998,1013.4,0.2759999999999959,0.0,0.0
2019-03-31 00:00:00,24.0,285,1.781276500954449,0.9410035222647135,0.8854876289145971,15.953333333333335,4.151822222222223,429.3333333333333,106120.6222222222,2.1199999999999997,3.122933333333333,79.8,65.09333333333333,18.34,5.394399999999998,5.533333333333333,8.515555555555554,1014.3,0.5453333333333418,0.0,0.0,1.0421260358041944,0.18189579271497486,0.033086079407409104,11.477777777777778,2.786172839506173,0.0,0.0,0.0,0.0,91.44444444444444,3.3580246913580254,12.744444444444447,5.586913580246913,0.1111111111111111,0.09876543209876548,1013.6555555555557,0.6402469135802189,0.0,0.0
2019-04-01 00:00:00,17.0,95,1.9691030270677432,0.9481144767034054,0.8989210609345722,15.953333333333335,4.151822222222223,429.3333333333333,106120.6222222222,2.1199999999999997,3.122933333333333,79.8,65.09333333333333,18.34,5.394399999999998,5.533333333333333,8.515555555555554,1014.3,0.5453333333333418,0.0,0.0,1.080733122830255,0.3364262141899623,0.11318259759419041,12.166666666666666,1.5666666666666669,0.0,0.0,0.0,0.0,93.11111111111111,6.543209876543211,13.88888888888889,2.763209876543209,0.1111111111111111,0.09876543209876548,1014.5,0.16888888888887982,0.0,0.0
2019-04-02 00:00:00,10.0,145,1.8032205964280337,0.8825678861676828,0.778926073694492,16.293333333333333,6.097955555555555,343.0,60450.933333333334,2.0666666666666664,2.906222222222222,81.66666666666667,49.68888888888889,19.066666666666666,9.60888888888889,7.0,15.6,1013.4533333333334,1.8011555555555567,0.0,0.0,1.136688660181873,0.45214280828353004,0.20443311908251702,15.700000000000001,0.404444444444444,0.0,0.0,0.0,0.0,64.77777777777777,66.39506172839505,16.53333333333333,0.7644444444444447,5.888888888888889,4.320987654320987,1009.9333333333333,0.8511111111111216,0.0,0.0
2019-04-03 00:00:00,5.0,28,2.2218620586519253,0.9250061547735874,0.8556363863690178,18.246666666666666,5.89448888888889,334.06666666666666,76965.1288888889,2.0533333333333332,3.463822222222222,55.733333333333334,71.26222222222222,19.24,9.18106666666667,7.733333333333333,8.462222222222222,1007.3266666666665,0.652622222222235,0.0,0.0,1.921575320900758,0.6494753069175093,0.421818174295593,13.8,0.35111111111111115,0.0,0.0,0.0,0.0,82.11111111111111,53.4320987654321,15.344444444444447,0.3224691358024691,0.4444444444444444,0.46913580246913583,1006.9777777777776,0.7039506172839387,0.0,0.0
2019-04-04 00:00:00,2.0,139,1.9235728076041045,0.6709673011607251,0.45019711922690714,17.65333333333333,6.7211555555555575,438.2,101048.42666666668,2.26,3.4143999999999997,64.86666666666666,263.44888888888886,19.24666666666667,5.831822222222223,5.6,12.373333333333333,1003.98,2.9202666666666532,0.0,0.0,1.2665221685862844,0.21470848235917545,0.046099732396980356,13.966666666666669,11.857777777777773,0.0,0.0,0.0,0.0,43.666666666666664,45.77777777777778,13.966666666666669,11.857777777777773,12.88888888888889,31.876543209876544,1000.3555555555556,4.751358024691371,0.0,0.0
2019-04-05 00:00:00,0.0,170,1.945033849696643,0.8838264443933946,0.7811491838090703,15.653333333333336,11.507822222222218,457.1333333333333,136077.58222222223,1.9800000000000002,2.6109333333333327,33.06666666666667,68.19555555555556,15.653333333333336,11.507822222222218,13.533333333333333,31.982222222222227,1000.5066666666668,7.976622222222205,0.013333333333333334,0.002488888888888888,1.3105079051525235,0.13586109326728107,0.018458236663780846,12.222222222222221,0.9417283950617291,0.0,0.0,0.0,0.0,39.44444444444444,63.80246913580246,12.222222222222221,0.9417283950617291,12.11111111111111,10.098765432098766,1007.811111111111,1.5920987654321344,0.0,0.0
2019-04-09 00:00:00,13.0,199,1.7139977719147597,0.8208911748400954,0.6738623209303521,19.88,11.029600000000006,487.53333333333336,113358.78222222225,2.493333333333333,4.069955555555556,51.46666666666667,266.64888888888885,20.62,7.849600000000001,10.6,15.173333333333336,1007.0866666666666,0.15982222222222783,0.013333333333333334,0.0024888888888888886,0.9481682755350788,0.24988568781256537,0.062442856973558884,16.255555555555556,0.15580246913580253,0.0,0.0,0.0,0.0,64.66666666666667,18.44444444444445,17.255555555555556,0.4158024691358031,7.333333333333333,3.1111111111111107,1009.9777777777776,0.5595061728395357,0.0,0.0
2019-04-10 00:00:00,21.0,124,2.2983137414738772,1.1796957301206432,1.3916820156648775,19.726666666666667,3.504622222222222,473.3333333333333,99266.22222222222,2.6666666666666665,4.666222222222221,58.46666666666667,30.648888888888884,21.586666666666662,6.622488888888889,8.2,10.293333333333331,1011.0266666666668,0.16328888888888435,0.0,0.0,0.9086236664311096,0.03673629666718932,0.0013495554928197452,14.677777777777777,0.9750617283950613,0.0,0.0,0.0,0.0,86.33333333333333,15.33333333333334,17.07777777777778,1.31283950617284,0.1111111111111111,0.09876543209876548,1014.1777777777778,0.32839506172841015,0.0,0.0
2019-04-11 00:00:00,31.0,181,2.031056224337933,0.9439891617997307,0.8911155375953582,20.7,11.635999999999997,308.73333333333335,64003.52888888889,2.1600000000000006,3.319733333333333,58.6,516.1066666666666,22.686666666666667,7.141155555555555,5.733333333333333,15.262222222222222,1013.4799999999999,1.0789333333333646,0.02666666666666667,0.00462222222222222,0.9334797375568561,0.24097235524237817,0.05806767599105891,17.25555555555556,1.0513580246913583,0.0,0.0,0.0,0.0,40.0,2.888888888888889,17.25555555555556,1.0513580246913583,16.666666666666668,26.888888888888886,1011.9333333333333,0.0977777777777793,0.0,0.0
2019-04-12 00:00:00,41.5,161,2.05933576314455,1.1152148497374266,1.243704161074871,19.393333333333334,5.468622222222224,487.6666666666667,119486.0888888889,2.1799999999999997,3.1002666666666667,42.8,48.16,19.706666666666667,6.424622222222223,12.666666666666666,57.955555555555556,1012.7800000000001,1.045600000000015,0.0,0.0,0.9376955375401638,0.24805972521621514,0.061533627274344166,14.455555555555556,0.789135802469136,0.0,0.0,0.0,0.0,59.44444444444444,12.469135802469138,14.455555555555556,0.789135802469136,0.3333333333333333,0.22222222222222227,1015.188888888889,0.11209876543210316,0.0,0.0
2019-04-13 00:00:00,52.0,295,2.021133946264118,0.856191391301886,0.7330636985394593,19.779999999999998,7.732266666666669,482.6,108171.30666666667,2.313333333333333,3.4571555555555564,43.06666666666667,87.66222222222223,19.959999999999997,8.022400000000001,4.6,7.706666666666667,1016.5266666666668,1.0126222222222097,0.0,0.0,0.9195988355308506,0.05896873330287843,0.0034773115073460036,15.366666666666665,0.84,0.0,0.0,0.0,0.0,63.22222222222222,35.50617283950618,15.88888888888889,0.7854320987654321,0.8888888888888888,0.3209876543209877,1018.4111111111112,0.20320987654321077,0.0,0.0
2019-04-14 00:00:00,64.0,504,1.7062607713302633,0.6567608329255706,0.4313347916650893,19.39333333333333,8.573955555555557,479.53333333333336,113603.0488888889,2.586666666666667,4.434488888888889,52.53333333333333,146.5155555555556,20.18,8.429600000000002,6.2,15.093333333333334,1014.8599999999999,2.5104000000000144,0.0,0.0,0.9230545663910035,0.25975805984984174,0.06747424965695396,15.622222222222225,0.34172839506172825,0.0,0.0,0.0,0.0,72.44444444444444,8.91358024691358,17.133333333333336,0.9266666666666659,2.2222222222222223,5.061728395061729,1013.1777777777778,0.74839506172838,0.0,0.0
2019-04-15 00:00:00,74.0,569,2.1676546341199634,0.8720485998546177,0.7604687605083991,14.42666666666667,4.6099555555555565,409.46666666666664,132708.91555555555,1.8866666666666665,3.1344888888888884,64.6,163.30666666666664,14.693333333333333,3.728622222222222,6.8,4.426666666666667,1013.1133333333333,0.2984888888889007,0.05333333333333334,0.023822222222222206,0.9773310789616027,0.2828341350650266,0.07999514795798171,11.222222222222223,2.1439506172839504,0.0,0.0,0.0,0.0,77.0,56.888888888888886,11.322222222222223,2.3328395061728404,1.0,1.3333333333333333,1013.3111111111112,0.4609876543209786,0.0,0.0
2019-04-16 00:00:00,84.0,190,2.0440542334109653,1.0182322715180319,1.036796958760771,16.013333333333335,8.982488888888888,458.06666666666666,87789.79555555555,2.4733333333333336,3.9112888888888886,67.06666666666666,90.19555555555553,17.126666666666665,12.053955555555559,6.666666666666667,16.62222222222222,1011.2066666666665,1.085955555555589,0.0,0.0,0.9504346664825174,0.3405492120283089,0.11597376581310208,13.177777777777779,2.588395061728395,0.0,0.0,0.0,0.0,78.66666666666667,26.000000000000007,14.18888888888889,4.500987654320986,1.2222222222222223,3.2839506172839497,1009.4333333333333,0.5555555555555488,0.0,0.0
2019-04-17 00:00:00,92.0,552,2.2259985247041105,1.0310432719797784,1.0630502286947672,15.02,2.4229333333333334,112.66666666666667,7909.555555555557,1.2266666666666666,2.1499555555555556,81.46666666666667,33.582222222222214,17.126666666666665,3.3579555555555562,5.266666666666667,13.92888888888889,1006.3133333333334,1.0304888888888715,0.24000000000000005,0.3317333333333334,0.9403813021984634,0.1390657988343516,0.01933929640543635,14.311111111111112,1.6187654320987654,0.0,0.0,0.0,0.0,82.33333333333333,59.77777777777778,16.1,1.6800000000000002,3.7777777777777777,1.5061728395061729,1004.2888888888888,0.0609876543209935,1.0222222222222221,3.559506172839506
2019-04-18 00:00:00,97.0,707,2.6347920934357822,0.9726204488290342,0.945990537480392,16.179999999999996,4.425599999999999,187.4,26067.30666666666,1.34,2.2784,75.0,114.8,18.126666666666665,4.48728888888889,3.466666666666667,4.648888888888889,1004.7266666666666,0.39262222222220383,0.02666666666666667,0.00462222222222222,1.6161935247007395,0.6033390061715982,0.36401795636813183,13.811111111111112,0.647654320987654,0.0,0.0,0.0,0.0,88.88888888888889,12.543209876543209,15.97777777777778,0.9328395061728396,0.0,0.0,1005.7999999999998,0.6577777777777838,0.022222222222222223,0.003950617283950618
2019-04-19 00:00:00,100.0,565,2.8285279197211266,1.1046320907004377,1.22021205580522,15.573333333333332,3.3126222222222212,214.66666666666666,44840.88888888889,1.5333333333333337,2.7662222222222215,85.0,78.8,18.27333333333333,4.057955555555554,2.2666666666666666,6.195555555555553,1004.34,0.05973333333333291,0.64,4.5664,1.237116538175905,0.42715906018619276,0.18246486269915144,13.177777777777777,1.661728395061728,0.0,0.0,0.0,0.0,92.11111111111111,5.876543209876543,15.333333333333334,3.1000000000000005,0.2222222222222222,0.1728395061728395,1005.2888888888889,0.15876543209875565,0.0,0.0
2019-04-20 00:00:00,99.0,405,2.789724544333016,1.037743868046711,1.0769123356685497,16.55333333333333,4.423822222222223,199.33333333333334,20633.422222222216,1.86,3.0344,81.86666666666666,41.84888888888889,19.486666666666668,7.189155555555555,2.8666666666666667,2.248888888888888,1006.1333333333333,0.475555555555551,0.013333333333333334,0.002488888888888889,1.8163829900401458,0.8034301187014871,0.6454999556366856,12.911111111111111,2.414320987654321,0.0,0.0,0.0,0.0,93.88888888888889,5.2098765432098775,15.06666666666667,4.777777777777775,0.0,0.0,1008.4777777777779,0.1306172839506009,0.0,0.0
2019-04-21 00:00:00,97.0,456,2.7658928752108904,0.8498045076857333,0.7221677012829916,18.033333333333335,8.336888888888886,518.4666666666667,104105.44888888887,2.646666666666667,4.494488888888889,76.13333333333334,84.24888888888887,21.15333333333334,13.555822222222218,4.133333333333334,6.782222222222223,1010.2600000000001,0.6250666666666854,0.0,0.0,2.999877410190731,0.8904775640185011,0.7929502920203237,15.366666666666665,0.4555555555555552,0.0,0.0,0.0,0.0,87.33333333333333,7.333333333333333,18.233333333333334,0.6955555555555564,0.8888888888888888,0.9876543209876544,1013.1333333333332,0.13777777777776634,0.0,0.0
2019-04-22 00:00:00,92.0,512,3.8049948036433854,0.7087291099867872,0.5022969513426635,19.013333333333335,2.6291555555555566,357.2,52049.76000000001,2.2800000000000002,3.7575999999999996,76.2,37.760000000000005,22.68,3.652266666666669,4.866666666666666,4.515555555555555,1014.9733333333332,0.31262222222222036,0.0,0.0,2.5002421922048144,0.9302630612562048,0.8653893631377655,14.944444444444445,1.3113580246913579,1.0,8.0,0.0,0.0,88.55555555555556,30.913580246913583,17.677777777777777,2.2217283950617297,0.8888888888888888,0.7654320987654322,1015.9777777777779,0.09283950617284242,0.0,0.0
2019-04-23 00:00:00,85.0,119,2.3367717420775174,0.8004504721035337,0.6407209582907699,18.97333333333334,2.789955555555556,480.4,119429.04000000001,2.6066666666666674,4.336622222222222,79.93333333333334,51.2622222222222,23.099999999999998,3.7119999999999984,4.6,6.106666666666667,1016.3533333333336,0.5091555555555473,0.0,0.0,0.9520364979811236,0.32916412228356173,0.10834901939870759,14.711111111111112,1.5054320987654315,0.0,0.0,0.0,0.0,90.88888888888889,6.765432098765434,17.555555555555557,2.8446913580246918,0.4444444444444444,0.46913580246913583,1015.0555555555555,0.1802469135802559,0.0,0.0
2019-04-24 00:00:00,77.0,231,2.3676187526879997,0.9428050862466703,0.8888814306525913,18.546666666666667,3.0318222222222206,462.8,106843.89333333333,2.5200000000000005,4.485600000000001,82.66666666666667,36.62222222222222,22.753333333333334,4.642488888888885,5.6,10.639999999999997,1014.2933333333332,0.2686222222222297,0.0,0.0,0.9731515512594089,0.15960745581960875,0.025474539953208364,16.166666666666668,0.4822222222222222,0.0,0.0,0.0,0.0,91.55555555555556,1.8024691358024691,19.944444444444443,1.0802469135802466,0.1111111111111111,0.09876543209876548,1013.4444444444445,0.10913580246913013,0.0,0.0
2019-04-25 00:00:00,66.0,669,2.005245030994333,0.7277640093265403,0.5296404532710406,18.699999999999996,1.7599999999999996,274.6,72736.64,1.6533333333333333,2.798488888888889,82.53333333333333,27.315555555555548,23.013333333333335,2.5758222222222225,3.8666666666666667,11.048888888888888,1013.9733333333334,0.24728888888889342,0.0,0.0,1.1311363801144856,0.3691349886490876,0.13626063984496206,15.455555555555557,0.6335802469135803,0.0,0.0,0.0,0.0,92.33333333333333,3.5555555555555554,18.855555555555554,1.4202469135802482,0.2222222222222222,0.1728395061728395,1013.2444444444445,0.5491358024691526,0.0,0.0
2019-04-26 00:00:00,59.0,418,2.0951030366495784,0.7792438735281418,0.6072210144311427,20.206666666666667,5.173955555555555,303.06666666666666,71164.99555555555,1.9533333333333334,3.655822222222222,69.93333333333334,71.39555555555556,23.72666666666667,6.835288888888887,3.2666666666666666,5.262222222222221,1012.0000000000001,0.5906666666666472,0.013333333333333334,0.002488888888888889,1.7226217848702443,0.9691367041176504,0.9392259512680223,17.98888888888889,1.2676543209876536,0.7777777777777778,4.839506172839505,0.0,0.0,78.11111111111111,28.98765432098766,21.299999999999997,1.4222222222222212,0.5555555555555556,0.9135802469135805,1008.9222222222223,1.8617283950617205,0.0,0.0
2019-04-27 00:00:00,49.5,400,2.7965670887936094,0.728415643960749,0.5305893503667527,19.119999999999997,3.2949333333333333,236.06666666666666,42083.9288888889,1.646666666666667,2.7438222222222226,79.86666666666666,100.24888888888889,23.273333333333333,3.325955555555556,3.7333333333333334,5.9288888888888875,1007.6666666666666,0.11822222222221941,0.2,0.14933333333333335,1.3621392098016016,0.5693960382459461,0.32421184837017886,15.58888888888889,0.5098765432098767,0.0,0.0,0.0,0.0,94.88888888888889,2.3209876543209873,19.333333333333332,1.1911111111111126,0.2222222222222222,0.39506172839506193,1006.6777777777778,1.0372839506172966,0.35555555555555557,0.23802469135802465
2019-04-28 00:00:00,40.0,483,2.2048768620676946,0.7610311375794266,0.5791683923654363,21.066666666666663,10.135555555555555,335.53333333333336,67047.71555555557,2.2466666666666666,4.266488888888889,56.06666666666667,411.5288888888889,22.913333333333334,7.1318222222222225,10.0,17.733333333333334,1005.0266666666666,0.06328888888888777,0.0,0.0,2.1499676032332338,1.0022743525016065,1.0045538776825147,17.84444444444444,1.7935802469135815,0.5555555555555556,2.4691358024691366,0.0,0.0,42.22222222222222,17.50617283950617,17.84444444444444,1.7935802469135815,15.555555555555555,11.802469135802468,1007.2000000000002,1.3577777777777738,0.0,0.0
2019-04-29 00:00:00,31.0,448,2.1957477257348774,0.9260892434874776,0.8576412869032085,20.633333333333333,5.622222222222222,510.2,109387.49333333333,2.606666666666667,4.096622222222222,52.0,72.13333333333334,22.186666666666664,10.322488888888888,6.666666666666667,10.222222222222223,1011.1066666666666,2.561955555555531,0.0,0.0,1.3810832220584408,0.6730032234071692,0.4529333387164401,15.066666666666666,3.7466666666666666,0.7777777777777778,4.839506172839505,0.0,0.0,70.0,20.22222222222222,16.07777777777778,5.550617283950618,1.0,1.3333333333333333,1017.0777777777779,0.895061728395049,0.0,0.0
2019-04-30 00:00:00,23.0,502,2.373412043503144,0.9763064283443595,0.95317424202652,20.86,13.33173333333333,523.0,105206.26666666666,2.7933333333333334,4.244622222222222,50.733333333333334,152.32888888888888,21.980000000000004,14.746933333333335,5.2,12.026666666666667,1020.6266666666667,0.8912888888889036,0.0,0.0,1.748790093837018,1.0878575204981809,1.1834339849044497,15.844444444444443,4.298024691358025,0.7777777777777778,4.839506172839505,0.0,0.0,69.33333333333333,122.66666666666667,17.08888888888889,3.7543209876543204,0.4444444444444444,0.2469135802469136,1022.0999999999999,0.16888888888890255,0.0,0.0
2019-05-01 00:00:00,15.0,669,2.3630556502147946,0.8960975273711473,0.8029907785606842,21.086666666666666,11.342488888888887,516.0,101750.13333333333,3.0133333333333336,5.019822222222221,63.86666666666667,90.91555555555557,24.28666666666667,17.21982222222222,5.4,10.24,1021.6266666666668,1.8606222222222082,0.0,0.0,2.1821118857904174,0.9492644788788271,0.9011030508610913,17.1,4.273333333333335,0.7777777777777778,4.839506172839505,0.0,0.0,74.88888888888889,52.09876543209877,19.566666666666666,5.422222222222221,2.0,10.0,1019.1111111111111,0.1898765432098854,0.0,0.0
2019-05-02 00:00:00,9.0,433,2.4004355407912343,0.8193669745195677,0.67136223893335,22.90666666666667,12.716622222222218,516.3333333333334,101223.68888888886,2.913333333333333,4.643822222222222,57.266666666666666,149.39555555555555,25.980000000000004,15.061600000000004,6.4,18.506666666666668,1018.1933333333333,1.0606222222222261,0.0,0.0,2.02848262217192,0.6368010066109293,0.4055155220206928,18.01111111111111,7.016543209876542,0.7777777777777778,4.839506172839505,0.0,0.0,64.44444444444444,68.69135802469135,19.700000000000003,8.646666666666665,2.111111111111111,5.876543209876544,1017.2333333333333,0.1555555555555682,0.0,0.0
2019-05-03 00:00:00,4.0,491,2.3388946205928622,0.722300564618763,0.5217181056485838,21.94,12.034400000000002,520.6,104520.90666666668,3.0133333333333336,5.199822222222222,62.13333333333333,38.11555555555556,25.5,24.301333333333336,6.466666666666667,15.848888888888894,1016.8199999999999,1.0656000000000085,0.0,0.0,2.098021309307866,0.6247221993478906,0.39027782635806557,19.144444444444442,4.522469135802471,1.2222222222222223,11.950617283950614,0.0,0.0,60.22222222222222,64.39506172839506,20.866666666666667,5.608888888888886,4.222222222222222,9.061728395061728,1015.0333333333334,0.11999999999999561,0.0,0.0
2019-05-04 00:00:00,1.0,443,2.1878716416285666,0.6790150516456853,0.46106144036139274,22.06,10.363733333333332,501.3333333333333,99806.62222222221,2.8533333333333326,4.467822222222223,59.4,127.03999999999999,25.080000000000002,13.834933333333328,4.666666666666667,9.288888888888888,1014.2866666666666,0.7358222222222276,0.0,0.0,2.0254179240074976,0.7519008615975051,0.5653549056710705,16.822222222222223,2.706172839506175,2.0,32.0,0.0,0.0,64.44444444444444,51.135802469135804,18.12222222222222,7.148395061728392,0.4444444444444444,0.2469135802469136,1012.1999999999999,0.24444444444446464,0.0,0.0
2019-05-05 00:00:00,0.0,297,2.165404188459756,0.7758331671874437,0.6019171033080999,22.22666666666667,7.724622222222225,517.0666666666667,97888.86222222223,2.8933333333333326,4.633955555555556,69.8,82.02666666666669,26.980000000000004,13.616266666666665,4.6,7.040000000000002,1010.0400000000001,1.0597333333333212,0.0,0.0,1.5008394230936788,0.3966138597833935,0.15730255377228128,19.27777777777778,0.1706172839506175,0.7777777777777778,4.839506172839505,0.0,0.0,88.77777777777777,5.283950617283952,24.67777777777778,0.29061728395061714,0.8888888888888888,0.3209876543209877,1008.9888888888888,0.06543209876543182,0.0,0.0
2019-05-06 00:00:00,1.0,320,1.9687105286009332,0.5516194846026455,0.3042840557932883,21.546666666666667,3.6584888888888885,515.1333333333333,99253.04888888888,2.8266666666666667,4.469955555555555,64.86666666666666,188.51555555555555,25.05333333333333,4.0678222222222225,7.933333333333334,18.06222222222222,1011.9933333333333,1.1366222222221978,0.0,0.0,1.521937332381746,0.6596834074090621,0.4351821980108305,15.88888888888889,3.5943209876543225,1.0,8.0,0.0,0.0,71.55555555555556,122.24691358024691,17.35555555555555,3.7402469135802474,2.5555555555555554,10.246913580246913,1014.5999999999999,0.20888888888889295,0.0,0.0
2019-05-07 00:00:00,5.0,304,2.0497012207667376,0.6795575606165921,0.4617984781911732,21.173333333333336,5.256622222222221,456.3333333333333,76281.55555555553,2.8466666666666662,4.546488888888889,76.53333333333333,32.24888888888888,26.253333333333334,10.207822222222223,4.733333333333333,3.1288888888888886,1015.4066666666665,0.2499555555555492,0.0,0.0,1.5427862972088007,0.58419672520847,0.34128581374430056,18.15555555555555,1.3291358024691347,1.0,8.0,0.0,0.0,85.44444444444444,40.02469135802468,22.46666666666666,2.615555555555557,0.7777777777777778,1.0617283950617287,1018.2222222222222,0.4083950617284017,0.0,0.0
2019-05-08 00:00:00,10.0,196,2.0113293312347365,0.5997381707324614,0.359685873433519,24.753333333333334,13.138488888888892,462.2,70041.62666666666,2.953333333333334,4.650488888888888,48.06666666666667,319.79555555555555,27.026666666666667,8.827288888888893,5.0,4.4,1019.6866666666667,0.08648888888888498,0.0,0.0,1.5226087147066056,0.3718347489968162,0.1382610805615253,19.5,0.0955555555555559,1.2222222222222223,11.950617283950614,0.0,0.0,80.55555555555556,26.246913580246915,24.066666666666666,0.5400000000000007,1.6666666666666667,0.6666666666666666,1020.2000000000002,0.38666666666665556,0.0,0.0
2019-05-09 00:00:00,18.0,293,2.045248463631243,0.5555984862772912,0.30868967795361735,24.100000000000005,3.9760000000000018,336.8666666666667,61749.84888888889,2.4933333333333336,4.099288888888888,58.6,85.17333333333332,28.166666666666668,4.455555555555557,6.066666666666666,6.062222222222222,1016.1133333333332,2.229155555555583,0.0,0.0,1.5213618864010705,0.4349480476364203,0.18917980414273375,23.355555555555554,0.12913580246913592,0.7777777777777778,4.839506172839505,0.0,0.0,66.33333333333333,5.777777777777778,28.32222222222222,0.1995061728395059,3.3333333333333335,0.2222222222222222,1012.4666666666666,1.075555555555552,0.0,0.0
2019-05-10 00:00:00,28.0,397,2.0933734006813096,0.666873533643857,0.4447203098746445,24.506666666666668,2.3406222222222235,361.2,102554.69333333333,2.3533333333333335,3.5731555555555556,64.86666666666666,95.18222222222222,29.886666666666667,2.069155555555556,4.533333333333333,0.9155555555555558,1008.24,1.326399999999989,0.04,0.02239999999999999,1.5272441269412076,0.5303255286014624,0.2812451662864205,19.07777777777778,2.0861728395061743,0.5555555555555556,2.4691358024691366,0.0,0.0,91.66666666666667,5.333333333333332,24.766666666666666,5.133333333333334,1.0,0.8888888888888888,1008.3888888888889,0.28543209876543085,0.0,0.0
2019-05-11 00:00:00,36.0,275,2.2508391281296403,0.5693502015541816,0.3241596520097872,21.42,3.0016000000000003,348.26666666666665,73628.86222222222,2.1933333333333334,3.8206222222222217,73.66666666666667,78.88888888888889,26.193333333333335,3.749955555555555,3.1333333333333333,6.515555555555555,1008.9599999999999,0.1757333333333429,0.0,0.0,2.0459613977516233,0.6131200562254684,0.3759162033459216,18.333333333333336,1.8266666666666669,0.0,0.0,0.0,0.0,68.55555555555556,14.469135802469133,20.733333333333334,2.7000000000000006,1.1111111111111112,1.2098765432098761,1009.5888888888888,0.10765432098765695,0.0,0.0
