FILENAME,SAMPLINGRATE,BIT,DURATION,CHANNELS,INDEX,FFT_W,MIN_FREQ,MAX_FREQ,J,LEFT_CHANNEL,RIGHT_CHANNEL
rayol-farm2_2019-03-28_19-25-04.wav,44100,16,60,1,acoustic_complexity,512,1,NA,5,1812.46629444961,NA 
rayol-farm2_2019-03-28_19-27-04.wav,44100,16,60,1,acoustic_complexity,512,1,NA,5,1811.51466752322,NA 
rayol-farm2_2019-03-28_19-29-04.wav,44100,16,60,1,acoustic_complexity,512,1,NA,5,1801.7623503561,NA 
rayol-farm2_2019-03-28_19-31-04.wav,44100,16,60,1,acoustic_complexity,512,1,NA,5,1801.93122908944,NA 
rayol-farm2_2019-03-28_19-33-05.wav,44100,16,60,1,acoustic_complexity,512,1,NA,5,1809.18139175255,NA 
rayol-farm2_2019-03-28_19-35-05.wav,44100,16,60,1,acoustic_complexity,512,1,NA,5,1811.64469016165,NA 
rayol-farm2_2019-03-28_19-37-05.wav,44100,16,60,1,acoustic_complexity,512,1,NA,5,1801.40338928211,NA 
rayol-farm2_2019-03-28_19-39-05.wav,44100,16,60,1,acoustic_complexity,512,1,NA,5,1806.92446337721,NA 
rayol-farm2_2019-03-28_19-41-05.wav,44100,16,60,1,acoustic_complexity,512,1,NA,5,1810.55261001225,NA 
rayol-farm2_2019-03-28_19-43-05.wav,44100,16,60,1,acoustic_complexity,512,1,NA,5,1813.23384217819,NA 
rayol-farm2_2019-03-28_19-45-05.wav,44100,16,60,1,acoustic_complexity,512,1,NA,5,1816.95485997536,NA 
rayol-farm2_2019-03-28_19-47-05.wav,44100,16,60,1,acoustic_complexity,512,1,NA,5,1799.73700283486,NA 
rayol-farm2_2019-03-28_19-49-06.wav,44100,16,60,1,acoustic_complexity,512,1,NA,5,1819.60904616999,NA 
rayol-farm2_2019-03-28_19-51-06.wav,44100,16,60,1,acoustic_complexity,512,1,NA,5,1807.55296424593,NA 
rayol-farm2_2019-03-28_19-53-06.wav,44100,16,60,1,acoustic_complexity,512,1,NA,5,1806.10042378695,NA 
rayol-farm2_2019-03-28_19-55-06.wav,44100,16,60,1,acoustic_complexity,512,1,NA,5,1821.51240949859,NA 
rayol-farm2_2019-03-28_19-57-06.wav,44100,16,60,1,acoustic_complexity,512,1,NA,5,1791.32947389081,NA 
rayol-farm2_2019-03-28_19-59-06.wav,44100,16,60,1,acoustic_complexity,512,1,NA,5,1820.0145583807,NA 
rayol-farm2_2019-03-28_20-01-06.wav,44100,16,60,1,acoustic_complexity,512,1,NA,5,1808.48653771539,NA 
rayol-farm2_2019-03-28_20-03-06.wav,44100,16,60,1,acoustic_complexity,512,1,NA,5,1818.48035126588,NA 
rayol-farm2_2019-03-28_20-05-07.wav,44100,16,60,1,acoustic_complexity,512,1,NA,5,1808.9008399884,NA 
rayol-farm2_2019-03-28_20-07-07.wav,44100,16,60,1,acoustic_complexity,512,1,NA,5,1813.23243837499,NA 
rayol-farm2_2019-03-28_20-09-07.wav,44100,16,60,1,acoustic_complexity,512,1,NA,5,1804.79703686935,NA 
rayol-farm2_2019-03-28_20-11-07.wav,44100,16,60,1,acoustic_complexity,512,1,NA,5,1804.86432131097,NA 
rayol-farm2_2019-03-28_20-13-07.wav,44100,16,60,1,acoustic_complexity,512,1,NA,5,1810.93500792099,NA 
rayol-farm2_2019-03-28_20-15-07.wav,44100,16,60,1,acoustic_complexity,512,1,NA,5,1801.36017820275,NA 
rayol-farm2_2019-03-28_20-17-07.wav,44100,16,60,1,acoustic_complexity,512,1,NA,5,1821.43795350461,NA 
rayol-farm2_2019-03-28_20-19-07.wav,44100,16,60,1,acoustic_complexity,512,1,NA,5,1809.12085425669,NA 
rayol-farm2_2019-03-28_20-21-07.wav,44100,16,60,1,acoustic_complexity,512,1,NA,5,1802.73859241638,NA 
rayol-farm2_2019-03-28_20-23-08.wav,44100,16,60,1,acoustic_complexity,512,1,NA,5,1801.55304914741,NA 
rayol-farm2_2019-03-28_20-25-08.wav,44100,16,60,1,acoustic_complexity,512,1,NA,5,1802.62971918454,NA 
rayol-farm2_2019-03-28_20-27-08.wav,44100,16,60,1,acoustic_complexity,512,1,NA,5,1798.11205657016,NA 
rayol-farm2_2019-03-28_20-29-08.wav,44100,16,60,1,acoustic_complexity,512,1,NA,5,1806.11824845008,NA 
rayol-farm2_2019-03-28_20-31-08.wav,44100,16,60,1,acoustic_complexity,512,1,NA,5,1810.59419736343,NA 
rayol-farm2_2019-03-28_20-33-08.wav,44100,16,60,1,acoustic_complexity,512,1,NA,5,1820.94236287857,NA 
rayol-farm2_2019-03-28_20-35-08.wav,44100,16,60,1,acoustic_complexity,512,1,NA,5,1808.02446217028,NA 
rayol-farm2_2019-03-28_20-37-08.wav,44100,16,60,1,acoustic_complexity,512,1,NA,5,1819.14004462018,NA 
rayol-farm2_2019-03-28_20-39-09.wav,44100,16,60,1,acoustic_complexity,512,1,NA,5,1796.46207366083,NA 
rayol-farm2_2019-03-28_20-41-09.wav,44100,16,60,1,acoustic_complexity,512,1,NA,5,1795.29062342211,NA 
rayol-farm2_2019-03-28_20-43-09.wav,44100,16,60,1,acoustic_complexity,512,1,NA,5,1806.3533127216,NA 
rayol-farm2_2019-03-28_20-45-09.wav,44100,16,60,1,acoustic_complexity,512,1,NA,5,1801.14086538458,NA 
rayol-farm2_2019-03-28_20-47-09.wav,44100,16,60,1,acoustic_complexity,512,1,NA,5,1809.69667742957,NA 
rayol-farm2_2019-03-28_20-49-09.wav,44100,16,60,1,acoustic_complexity,512,1,NA,5,1801.34395043475,NA 
rayol-farm2_2019-03-28_20-51-09.wav,44100,16,60,1,acoustic_complexity,512,1,NA,5,1833.06164860885,NA 
rayol-farm2_2019-03-28_20-53-09.wav,44100,16,60,1,acoustic_complexity,512,1,NA,5,1805.87372582752,NA 
rayol-farm2_2019-03-28_20-55-10.wav,44100,16,60,1,acoustic_complexity,512,1,NA,5,1862.31132582397,NA 
rayol-farm2_2019-03-28_20-57-10.wav,44100,16,60,1,acoustic_complexity,512,1,NA,5,1793.92074674223,NA 
rayol-farm2_2019-03-28_20-59-10.wav,44100,16,60,1,acoustic_complexity,512,1,NA,5,1796.97885483406,NA 
rayol-farm2_2019-03-28_21-01-10.wav,44100,16,60,1,acoustic_complexity,512,1,NA,5,1803.98491433685,NA 
rayol-farm2_2019-03-28_21-03-10.wav,44100,16,60,1,acoustic_complexity,512,1,NA,5,1823.38739903836,NA 
rayol-farm2_2019-03-28_21-05-10.wav,44100,16,60,1,acoustic_complexity,512,1,NA,5,1800.27502722254,NA 
rayol-farm2_2019-03-28_21-07-10.wav,44100,16,60,1,acoustic_complexity,512,1,NA,5,1803.38342083934,NA 
rayol-farm2_2019-03-28_21-09-10.wav,44100,16,60,1,acoustic_complexity,512,1,NA,5,1806.33218561815,NA 
rayol-farm2_2019-03-28_21-11-11.wav,44100,16,60,1,acoustic_complexity,512,1,NA,5,1811.45495887532,NA 
rayol-farm2_2019-03-28_21-13-11.wav,44100,16,60,1,acoustic_complexity,512,1,NA,5,1802.72020448499,NA 
rayol-farm2_2019-03-28_21-15-11.wav,44100,16,60,1,acoustic_complexity,512,1,NA,5,1798.58904473567,NA 
rayol-farm2_2019-03-28_21-17-11.wav,44100,16,60,1,acoustic_complexity,512,1,NA,5,1805.81382650802,NA 
rayol-farm2_2019-03-28_21-19-11.wav,44100,16,60,1,acoustic_complexity,512,1,NA,5,1814.12566937116,NA 
rayol-farm2_2019-03-28_21-21-11.wav,44100,16,60,1,acoustic_complexity,512,1,NA,5,1795.52103503338,NA 
rayol-farm2_2019-03-28_21-23-11.wav,44100,16,60,1,acoustic_complexity,512,1,NA,5,1794.13530643,NA 
rayol-farm2_2019-03-28_21-25-11.wav,44100,16,60,1,acoustic_complexity,512,1,NA,5,1806.55261533813,NA 
rayol-farm2_2019-03-28_21-27-12.wav,44100,16,60,1,acoustic_complexity,512,1,NA,5,1801.42907861124,NA 
rayol-farm2_2019-03-28_21-29-12.wav,44100,16,60,1,acoustic_complexity,512,1,NA,5,1809.08597641745,NA 
rayol-farm2_2019-03-28_21-31-12.wav,44100,16,60,1,acoustic_complexity,512,1,NA,5,1809.59455018068,NA 
rayol-farm2_2019-03-28_21-33-12.wav,44100,16,60,1,acoustic_complexity,512,1,NA,5,1813.93377564346,NA 
rayol-farm2_2019-03-28_21-35-12.wav,44100,16,60,1,acoustic_complexity,512,1,NA,5,1800.0080511656,NA 
rayol-farm2_2019-03-28_21-37-12.wav,44100,16,60,1,acoustic_complexity,512,1,NA,5,1799.36890615164,NA 
rayol-farm2_2019-03-28_21-39-12.wav,44100,16,60,1,acoustic_complexity,512,1,NA,5,1811.36097139047,NA 
rayol-farm2_2019-03-28_21-41-12.wav,44100,16,60,1,acoustic_complexity,512,1,NA,5,1809.30863203979,NA 
rayol-farm2_2019-03-28_21-43-12.wav,44100,16,60,1,acoustic_complexity,512,1,NA,5,1804.30196802847,NA 
rayol-farm2_2019-03-28_21-45-13.wav,44100,16,60,1,acoustic_complexity,512,1,NA,5,1798.85305488144,NA 
rayol-farm2_2019-03-28_21-47-13.wav,44100,16,60,1,acoustic_complexity,512,1,NA,5,1800.61689294771,NA 
rayol-farm2_2019-03-28_21-49-13.wav,44100,16,60,1,acoustic_complexity,512,1,NA,5,1788.90126722152,NA 
rayol-farm2_2019-03-28_21-51-13.wav,44100,16,60,1,acoustic_complexity,512,1,NA,5,1796.56408403671,NA 
rayol-farm2_2019-03-28_21-53-13.wav,44100,16,60,1,acoustic_complexity,512,1,NA,5,1795.03350125077,NA 
rayol-farm2_2019-03-28_21-55-13.wav,44100,16,60,1,acoustic_complexity,512,1,NA,5,1807.28823896047,NA 
rayol-farm2_2019-03-28_21-57-13.wav,44100,16,60,1,acoustic_complexity,512,1,NA,5,1813.39812937865,NA 
rayol-farm2_2019-03-28_21-59-13.wav,44100,16,60,1,acoustic_complexity,512,1,NA,5,1800.80198464812,NA 
rayol-farm2_2019-03-28_22-01-14.wav,44100,16,60,1,acoustic_complexity,512,1,NA,5,1806.96558310002,NA 
rayol-farm2_2019-03-28_22-03-14.wav,44100,16,60,1,acoustic_complexity,512,1,NA,5,1800.22697956174,NA 
rayol-farm2_2019-03-28_22-05-14.wav,44100,16,60,1,acoustic_complexity,512,1,NA,5,1807.31307546241,NA 
rayol-farm2_2019-03-28_22-07-14.wav,44100,16,60,1,acoustic_complexity,512,1,NA,5,1803.52327620836,NA 
rayol-farm2_2019-03-28_22-09-14.wav,44100,16,60,1,acoustic_complexity,512,1,NA,5,1795.84366435788,NA 
rayol-farm2_2019-03-28_22-11-14.wav,44100,16,60,1,acoustic_complexity,512,1,NA,5,1814.75433108992,NA 
rayol-farm2_2019-03-28_22-13-14.wav,44100,16,60,1,acoustic_complexity,512,1,NA,5,1801.590328786,NA 
rayol-farm2_2019-03-28_22-15-14.wav,44100,16,60,1,acoustic_complexity,512,1,NA,5,1803.77416059924,NA 
rayol-farm2_2019-03-28_22-17-15.wav,44100,16,60,1,acoustic_complexity,512,1,NA,5,1806.75198898807,NA 
rayol-farm2_2019-03-28_22-19-15.wav,44100,16,60,1,acoustic_complexity,512,1,NA,5,1784.0661628845,NA 
rayol-farm2_2019-03-28_22-21-15.wav,44100,16,60,1,acoustic_complexity,512,1,NA,5,1806.95867948376,NA 
rayol-farm2_2019-03-28_22-23-15.wav,44100,16,60,1,acoustic_complexity,512,1,NA,5,1811.39938964225,NA 
rayol-farm2_2019-03-28_22-25-15.wav,44100,16,60,1,acoustic_complexity,512,1,NA,5,1797.19603251526,NA 
rayol-farm2_2019-03-28_22-27-15.wav,44100,16,60,1,acoustic_complexity,512,1,NA,5,1816.56223274736,NA 
rayol-farm2_2019-03-28_22-29-15.wav,44100,16,60,1,acoustic_complexity,512,1,NA,5,1806.54303128989,NA 
rayol-farm2_2019-03-28_22-31-15.wav,44100,16,60,1,acoustic_complexity,512,1,NA,5,1817.48898724211,NA 
rayol-farm2_2019-03-28_22-33-16.wav,44100,16,60,1,acoustic_complexity,512,1,NA,5,1801.26155621818,NA 
rayol-farm2_2019-03-28_22-35-16.wav,44100,16,60,1,acoustic_complexity,512,1,NA,5,1810.18203054533,NA 
rayol-farm2_2019-03-28_22-37-16.wav,44100,16,60,1,acoustic_complexity,512,1,NA,5,1796.29894761698,NA 
rayol-farm2_2019-03-28_22-39-16.wav,44100,16,60,1,acoustic_complexity,512,1,NA,5,1802.44674131304,NA 
rayol-farm2_2019-03-28_22-41-16.wav,44100,16,60,1,acoustic_complexity,512,1,NA,5,1806.97288801283,NA 
rayol-farm2_2019-03-28_22-43-16.wav,44100,16,60,1,acoustic_complexity,512,1,NA,5,1810.28102366142,NA 
rayol-farm2_2019-03-28_22-45-16.wav,44100,16,60,1,acoustic_complexity,512,1,NA,5,1793.94599426483,NA 
rayol-farm2_2019-03-28_22-47-16.wav,44100,16,60,1,acoustic_complexity,512,1,NA,5,1805.09099813869,NA 
rayol-farm2_2019-03-28_22-49-16.wav,44100,16,60,1,acoustic_complexity,512,1,NA,5,1800.59357098091,NA 
rayol-farm2_2019-03-28_22-51-17.wav,44100,16,60,1,acoustic_complexity,512,1,NA,5,1800.74437108725,NA 
rayol-farm2_2019-03-28_22-53-17.wav,44100,16,60,1,acoustic_complexity,512,1,NA,5,1808.39035326414,NA 
rayol-farm2_2019-03-28_22-55-17.wav,44100,16,60,1,acoustic_complexity,512,1,NA,5,1806.62404373943,NA 
rayol-farm2_2019-03-28_22-57-17.wav,44100,16,60,1,acoustic_complexity,512,1,NA,5,1799.63053316621,NA 
rayol-farm2_2019-03-28_22-59-17.wav,44100,16,60,1,acoustic_complexity,512,1,NA,5,1807.27592432304,NA 
rayol-farm2_2019-03-28_23-01-17.wav,44100,16,60,1,acoustic_complexity,512,1,NA,5,1808.86057275551,NA 
rayol-farm2_2019-03-28_23-03-17.wav,44100,16,60,1,acoustic_complexity,512,1,NA,5,1807.59403388728,NA 
rayol-farm2_2019-03-28_23-05-17.wav,44100,16,60,1,acoustic_complexity,512,1,NA,5,1829.42159626433,NA 
rayol-farm2_2019-03-28_23-07-18.wav,44100,16,60,1,acoustic_complexity,512,1,NA,5,1805.36993025194,NA 
rayol-farm2_2019-03-28_23-09-18.wav,44100,16,60,1,acoustic_complexity,512,1,NA,5,1814.2447943485,NA 
rayol-farm2_2019-03-28_23-11-18.wav,44100,16,60,1,acoustic_complexity,512,1,NA,5,1836.59364183054,NA 
rayol-farm2_2019-03-28_23-13-18.wav,44100,16,60,1,acoustic_complexity,512,1,NA,5,1816.05911162465,NA 
rayol-farm2_2019-03-28_23-15-18.wav,44100,16,60,1,acoustic_complexity,512,1,NA,5,1804.29542271656,NA 
rayol-farm2_2019-03-28_23-17-18.wav,44100,16,60,1,acoustic_complexity,512,1,NA,5,1799.47025805645,NA 
rayol-farm2_2019-03-28_23-19-18.wav,44100,16,60,1,acoustic_complexity,512,1,NA,5,1814.22193337712,NA 
rayol-farm2_2019-03-28_23-21-18.wav,44100,16,60,1,acoustic_complexity,512,1,NA,5,1810.40972394644,NA 
rayol-farm2_2019-03-28_23-23-19.wav,44100,16,60,1,acoustic_complexity,512,1,NA,5,1800.8500922355,NA 
rayol-farm2_2019-03-28_23-25-19.wav,44100,16,60,1,acoustic_complexity,512,1,NA,5,1809.98510004465,NA 
rayol-farm2_2019-03-28_23-27-19.wav,44100,16,60,1,acoustic_complexity,512,1,NA,5,1800.07543743838,NA 
rayol-farm2_2019-03-28_23-29-19.wav,44100,16,60,1,acoustic_complexity,512,1,NA,5,1804.01924732701,NA 
rayol-farm2_2019-03-28_23-31-19.wav,44100,16,60,1,acoustic_complexity,512,1,NA,5,1810.40855985936,NA 
rayol-farm2_2019-03-28_23-33-19.wav,44100,16,60,1,acoustic_complexity,512,1,NA,5,1808.92993652433,NA 
rayol-farm2_2019-03-28_23-35-19.wav,44100,16,60,1,acoustic_complexity,512,1,NA,5,1799.48394085318,NA 
rayol-farm2_2019-03-28_23-37-19.wav,44100,16,60,1,acoustic_complexity,512,1,NA,5,1798.90741265083,NA 
rayol-farm2_2019-03-28_23-39-20.wav,44100,16,60,1,acoustic_complexity,512,1,NA,5,1811.99354431501,NA 
rayol-farm2_2019-03-28_23-41-20.wav,44100,16,60,1,acoustic_complexity,512,1,NA,5,1799.16309427756,NA 
rayol-farm2_2019-03-28_23-43-20.wav,44100,16,60,1,acoustic_complexity,512,1,NA,5,1801.53526292961,NA 
rayol-farm2_2019-03-28_23-45-20.wav,44100,16,60,1,acoustic_complexity,512,1,NA,5,1812.01345701816,NA 
rayol-farm2_2019-03-28_23-47-20.wav,44100,16,60,1,acoustic_complexity,512,1,NA,5,1809.0885733555,NA 
rayol-farm2_2019-03-28_23-49-20.wav,44100,16,60,1,acoustic_complexity,512,1,NA,5,1821.38188571635,NA 
rayol-farm2_2019-03-28_23-51-20.wav,44100,16,60,1,acoustic_complexity,512,1,NA,5,1801.70156077073,NA 
rayol-farm2_2019-03-28_23-53-20.wav,44100,16,60,1,acoustic_complexity,512,1,NA,5,1803.6119737222,NA 
rayol-farm2_2019-03-28_23-55-20.wav,44100,16,60,1,acoustic_complexity,512,1,NA,5,1803.25676911014,NA 
rayol-farm2_2019-03-28_23-57-21.wav,44100,16,60,1,acoustic_complexity,512,1,NA,5,1804.02909645455,NA 
rayol-farm2_2019-03-28_23-59-21.wav,44100,16,60,1,acoustic_complexity,512,1,NA,5,1809.5276282087,NA
