FILENAME,SAMPLINGRATE,BIT,DURATION,CHANNELS,INDEX,WL,ENVT,MSMOOTH,KSMOOTH,LEFT_CHANNEL,RIGHT_CHANNEL
rayol-farm2_2019-03-30_00-00-48.wav,44100,16,60,1,H,512,hil,NULL,NULL,0.896271453499747,NA 
rayol-farm2_2019-03-30_00-02-48.wav,44100,16,60,1,H,512,hil,NULL,NULL,0.89549002316923,NA 
rayol-farm2_2019-03-30_00-04-48.wav,44100,16,60,1,H,512,hil,NULL,NULL,0.897257445051627,NA 
rayol-farm2_2019-03-30_00-06-48.wav,44100,16,60,1,H,512,hil,NULL,NULL,0.896668757772901,NA 
rayol-farm2_2019-03-30_00-08-48.wav,44100,16,60,1,H,512,hil,NULL,NULL,0.895006558300488,NA 
rayol-farm2_2019-03-30_00-10-48.wav,44100,16,60,1,H,512,hil,NULL,NULL,0.894409305430627,NA 
rayol-farm2_2019-03-30_00-12-49.wav,44100,16,60,1,H,512,hil,NULL,NULL,0.893965675255757,NA 
rayol-farm2_2019-03-30_00-14-49.wav,44100,16,60,1,H,512,hil,NULL,NULL,0.895799788895997,NA 
rayol-farm2_2019-03-30_00-16-49.wav,44100,16,60,1,H,512,hil,NULL,NULL,0.898324825436696,NA 
rayol-farm2_2019-03-30_00-18-49.wav,44100,16,60,1,H,512,hil,NULL,NULL,0.898136911127419,NA 
rayol-farm2_2019-03-30_00-20-49.wav,44100,16,60,1,H,512,hil,NULL,NULL,0.896270438663649,NA 
rayol-farm2_2019-03-30_00-22-49.wav,44100,16,60,1,H,512,hil,NULL,NULL,0.897765386754743,NA 
rayol-farm2_2019-03-30_00-24-49.wav,44100,16,60,1,H,512,hil,NULL,NULL,0.896996588336615,NA 
rayol-farm2_2019-03-30_00-26-49.wav,44100,16,60,1,H,512,hil,NULL,NULL,0.896735534436166,NA 
rayol-farm2_2019-03-30_00-28-50.wav,44100,16,60,1,H,512,hil,NULL,NULL,0.896683324428378,NA 
rayol-farm2_2019-03-30_00-30-50.wav,44100,16,60,1,H,512,hil,NULL,NULL,0.897179334458807,NA 
rayol-farm2_2019-03-30_00-32-50.wav,44100,16,60,1,H,512,hil,NULL,NULL,0.897836535276125,NA 
rayol-farm2_2019-03-30_00-34-50.wav,44100,16,60,1,H,512,hil,NULL,NULL,0.894568846222806,NA 
rayol-farm2_2019-03-30_00-36-50.wav,44100,16,60,1,H,512,hil,NULL,NULL,0.893714556354417,NA 
rayol-farm2_2019-03-30_00-38-50.wav,44100,16,60,1,H,512,hil,NULL,NULL,0.892243374400965,NA 
rayol-farm2_2019-03-30_00-40-50.wav,44100,16,60,1,H,512,hil,NULL,NULL,0.895879073570811,NA 
rayol-farm2_2019-03-30_00-42-50.wav,44100,16,60,1,H,512,hil,NULL,NULL,0.897952117913543,NA 
rayol-farm2_2019-03-30_00-44-51.wav,44100,16,60,1,H,512,hil,NULL,NULL,0.897188069798051,NA 
rayol-farm2_2019-03-30_00-46-51.wav,44100,16,60,1,H,512,hil,NULL,NULL,0.897343576125246,NA 
rayol-farm2_2019-03-30_00-48-51.wav,44100,16,60,1,H,512,hil,NULL,NULL,0.896895596867776,NA 
rayol-farm2_2019-03-30_00-50-51.wav,44100,16,60,1,H,512,hil,NULL,NULL,0.897218532673209,NA 
rayol-farm2_2019-03-30_00-52-51.wav,44100,16,60,1,H,512,hil,NULL,NULL,0.895293090732531,NA 
rayol-farm2_2019-03-30_00-54-51.wav,44100,16,60,1,H,512,hil,NULL,NULL,0.896469908615173,NA 
rayol-farm2_2019-03-30_00-56-51.wav,44100,16,60,1,H,512,hil,NULL,NULL,0.896400919353729,NA 
rayol-farm2_2019-03-30_00-58-51.wav,44100,16,60,1,H,512,hil,NULL,NULL,0.89699465588181,NA 
rayol-farm2_2019-03-30_01-00-51.wav,44100,16,60,1,H,512,hil,NULL,NULL,0.895922205217943,NA 
rayol-farm2_2019-03-30_01-02-52.wav,44100,16,60,1,H,512,hil,NULL,NULL,0.893197121357149,NA 
rayol-farm2_2019-03-30_01-04-52.wav,44100,16,60,1,H,512,hil,NULL,NULL,0.893205946037255,NA 
rayol-farm2_2019-03-30_01-06-52.wav,44100,16,60,1,H,512,hil,NULL,NULL,0.895733718545119,NA 
rayol-farm2_2019-03-30_01-08-52.wav,44100,16,60,1,H,512,hil,NULL,NULL,0.897215667584371,NA 
rayol-farm2_2019-03-30_01-10-52.wav,44100,16,60,1,H,512,hil,NULL,NULL,0.898242479969733,NA 
rayol-farm2_2019-03-30_01-12-52.wav,44100,16,60,1,H,512,hil,NULL,NULL,0.89467206393008,NA 
rayol-farm2_2019-03-30_01-14-52.wav,44100,16,60,1,H,512,hil,NULL,NULL,0.897183858788917,NA 
rayol-farm2_2019-03-30_01-16-52.wav,44100,16,60,1,H,512,hil,NULL,NULL,0.89729754233472,NA 
rayol-farm2_2019-03-30_01-18-53.wav,44100,16,60,1,H,512,hil,NULL,NULL,0.89667063749944,NA 
rayol-farm2_2019-03-30_01-20-53.wav,44100,16,60,1,H,512,hil,NULL,NULL,0.896780729379282,NA 
rayol-farm2_2019-03-30_01-22-53.wav,44100,16,60,1,H,512,hil,NULL,NULL,0.895495125696061,NA 
rayol-farm2_2019-03-30_01-24-53.wav,44100,16,60,1,H,512,hil,NULL,NULL,0.896264330518866,NA 
rayol-farm2_2019-03-30_01-26-53.wav,44100,16,60,1,H,512,hil,NULL,NULL,0.892102724618994,NA 
rayol-farm2_2019-03-30_01-28-53.wav,44100,16,60,1,H,512,hil,NULL,NULL,0.892363770348461,NA 
rayol-farm2_2019-03-30_01-30-53.wav,44100,16,60,1,H,512,hil,NULL,NULL,0.892902132080547,NA 
rayol-farm2_2019-03-30_01-32-53.wav,44100,16,60,1,H,512,hil,NULL,NULL,0.895165919791621,NA 
rayol-farm2_2019-03-30_01-34-54.wav,44100,16,60,1,H,512,hil,NULL,NULL,0.897944763151609,NA 
rayol-farm2_2019-03-30_01-36-54.wav,44100,16,60,1,H,512,hil,NULL,NULL,0.896355806012157,NA 
rayol-farm2_2019-03-30_01-38-54.wav,44100,16,60,1,H,512,hil,NULL,NULL,0.896867816441394,NA 
rayol-farm2_2019-03-30_01-40-54.wav,44100,16,60,1,H,512,hil,NULL,NULL,0.896746673876341,NA 
rayol-farm2_2019-03-30_01-42-54.wav,44100,16,60,1,H,512,hil,NULL,NULL,0.896816132662747,NA 
rayol-farm2_2019-03-30_01-44-54.wav,44100,16,60,1,H,512,hil,NULL,NULL,0.896819475025822,NA 
rayol-farm2_2019-03-30_01-46-54.wav,44100,16,60,1,H,512,hil,NULL,NULL,0.896338807972909,NA 
rayol-farm2_2019-03-30_01-48-54.wav,44100,16,60,1,H,512,hil,NULL,NULL,0.897225188804295,NA 
rayol-farm2_2019-03-30_01-50-54.wav,44100,16,60,1,H,512,hil,NULL,NULL,0.895535033159319,NA 
rayol-farm2_2019-03-30_01-52-55.wav,44100,16,60,1,H,512,hil,NULL,NULL,0.892380609529693,NA 
rayol-farm2_2019-03-30_01-54-55.wav,44100,16,60,1,H,512,hil,NULL,NULL,0.891066555796212,NA 
rayol-farm2_2019-03-30_01-56-55.wav,44100,16,60,1,H,512,hil,NULL,NULL,0.889970874553169,NA 
rayol-farm2_2019-03-30_01-58-55.wav,44100,16,60,1,H,512,hil,NULL,NULL,0.895412415425744,NA 
rayol-farm2_2019-03-30_02-00-55.wav,44100,16,60,1,H,512,hil,NULL,NULL,0.892925742525368,NA 
rayol-farm2_2019-03-30_02-02-55.wav,44100,16,60,1,H,512,hil,NULL,NULL,0.896249154908699,NA 
rayol-farm2_2019-03-30_02-04-55.wav,44100,16,60,1,H,512,hil,NULL,NULL,0.895095627964783,NA 
rayol-farm2_2019-03-30_02-06-55.wav,44100,16,60,1,H,512,hil,NULL,NULL,0.89669079283336,NA 
rayol-farm2_2019-03-30_02-08-56.wav,44100,16,60,1,H,512,hil,NULL,NULL,0.896409687968251,NA 
rayol-farm2_2019-03-30_02-10-56.wav,44100,16,60,1,H,512,hil,NULL,NULL,0.896670266743155,NA 
rayol-farm2_2019-03-30_02-12-56.wav,44100,16,60,1,H,512,hil,NULL,NULL,0.896708627980203,NA 
rayol-farm2_2019-03-30_02-14-56.wav,44100,16,60,1,H,512,hil,NULL,NULL,0.896361628341376,NA 
rayol-farm2_2019-03-30_02-16-56.wav,44100,16,60,1,H,512,hil,NULL,NULL,0.896837171893266,NA 
rayol-farm2_2019-03-30_02-18-56.wav,44100,16,60,1,H,512,hil,NULL,NULL,0.893571831844673,NA 
rayol-farm2_2019-03-30_02-20-56.wav,44100,16,60,1,H,512,hil,NULL,NULL,0.890572701294938,NA 
rayol-farm2_2019-03-30_02-22-56.wav,44100,16,60,1,H,512,hil,NULL,NULL,0.889526403900703,NA 
rayol-farm2_2019-03-30_02-24-57.wav,44100,16,60,1,H,512,hil,NULL,NULL,0.887348195515474,NA 
rayol-farm2_2019-03-30_02-26-57.wav,44100,16,60,1,H,512,hil,NULL,NULL,0.893315155358297,NA 
rayol-farm2_2019-03-30_02-28-57.wav,44100,16,60,1,H,512,hil,NULL,NULL,0.895184376377356,NA 
rayol-farm2_2019-03-30_02-30-57.wav,44100,16,60,1,H,512,hil,NULL,NULL,0.895764883632842,NA 
rayol-farm2_2019-03-30_02-32-57.wav,44100,16,60,1,H,512,hil,NULL,NULL,0.895105381130344,NA 
rayol-farm2_2019-03-30_02-34-57.wav,44100,16,60,1,H,512,hil,NULL,NULL,0.895958130368429,NA 
rayol-farm2_2019-03-30_02-36-57.wav,44100,16,60,1,H,512,hil,NULL,NULL,0.896147519278515,NA 
rayol-farm2_2019-03-30_02-38-57.wav,44100,16,60,1,H,512,hil,NULL,NULL,0.896206912723979,NA 
rayol-farm2_2019-03-30_02-40-57.wav,44100,16,60,1,H,512,hil,NULL,NULL,0.896034298435866,NA 
rayol-farm2_2019-03-30_02-42-58.wav,44100,16,60,1,H,512,hil,NULL,NULL,0.895561533952217,NA 
rayol-farm2_2019-03-30_02-44-58.wav,44100,16,60,1,H,512,hil,NULL,NULL,0.892909943350445,NA 
rayol-farm2_2019-03-30_02-46-58.wav,44100,16,60,1,H,512,hil,NULL,NULL,0.891245723734891,NA 
rayol-farm2_2019-03-30_02-48-58.wav,44100,16,60,1,H,512,hil,NULL,NULL,0.891803080763004,NA 
rayol-farm2_2019-03-30_02-50-58.wav,44100,16,60,1,H,512,hil,NULL,NULL,0.891200622435397,NA 
rayol-farm2_2019-03-30_02-52-58.wav,44100,16,60,1,H,512,hil,NULL,NULL,0.895673720433147,NA 
rayol-farm2_2019-03-30_02-54-58.wav,44100,16,60,1,H,512,hil,NULL,NULL,0.895648421708445,NA 
rayol-farm2_2019-03-30_02-56-58.wav,44100,16,60,1,H,512,hil,NULL,NULL,0.896989647818187,NA 
rayol-farm2_2019-03-30_02-58-59.wav,44100,16,60,1,H,512,hil,NULL,NULL,0.897641334094351,NA 
rayol-farm2_2019-03-30_03-00-59.wav,44100,16,60,1,H,512,hil,NULL,NULL,0.896167402689335,NA 
rayol-farm2_2019-03-30_03-02-59.wav,44100,16,60,1,H,512,hil,NULL,NULL,0.896204647973933,NA 
rayol-farm2_2019-03-30_03-04-59.wav,44100,16,60,1,H,512,hil,NULL,NULL,0.896163337855633,NA 
rayol-farm2_2019-03-30_03-06-59.wav,44100,16,60,1,H,512,hil,NULL,NULL,0.8958938209079,NA 
rayol-farm2_2019-03-30_03-08-59.wav,44100,16,60,1,H,512,hil,NULL,NULL,0.89714670639204,NA 
rayol-farm2_2019-03-30_03-10-59.wav,44100,16,60,1,H,512,hil,NULL,NULL,0.896951233235822,NA 
rayol-farm2_2019-03-30_03-12-59.wav,44100,16,60,1,H,512,hil,NULL,NULL,0.893427748029858,NA 
rayol-farm2_2019-03-30_03-15-00.wav,44100,16,60,1,H,512,hil,NULL,NULL,0.891426117087536,NA 
rayol-farm2_2019-03-30_03-17-00.wav,44100,16,60,1,H,512,hil,NULL,NULL,0.892178939140659,NA 
rayol-farm2_2019-03-30_03-19-00.wav,44100,16,60,1,H,512,hil,NULL,NULL,0.896654130379902,NA 
rayol-farm2_2019-03-30_03-21-00.wav,44100,16,60,1,H,512,hil,NULL,NULL,0.895022488544834,NA 
rayol-farm2_2019-03-30_03-23-00.wav,44100,16,60,1,H,512,hil,NULL,NULL,0.896206917617198,NA 
rayol-farm2_2019-03-30_03-25-00.wav,44100,16,60,1,H,512,hil,NULL,NULL,0.893252885548537,NA 
rayol-farm2_2019-03-30_03-27-00.wav,44100,16,60,1,H,512,hil,NULL,NULL,0.896715481809895,NA 
rayol-farm2_2019-03-30_03-29-00.wav,44100,16,60,1,H,512,hil,NULL,NULL,0.896103220500175,NA 
rayol-farm2_2019-03-30_03-31-00.wav,44100,16,60,1,H,512,hil,NULL,NULL,0.896758425961771,NA 
rayol-farm2_2019-03-30_03-33-01.wav,44100,16,60,1,H,512,hil,NULL,NULL,0.895257496620759,NA 
rayol-farm2_2019-03-30_03-35-01.wav,44100,16,60,1,H,512,hil,NULL,NULL,0.896468273143871,NA 
rayol-farm2_2019-03-30_03-37-01.wav,44100,16,60,1,H,512,hil,NULL,NULL,0.894765471467148,NA 
rayol-farm2_2019-03-30_03-39-01.wav,44100,16,60,1,H,512,hil,NULL,NULL,0.892414864199929,NA 
rayol-farm2_2019-03-30_03-41-01.wav,44100,16,60,1,H,512,hil,NULL,NULL,0.888063003858604,NA 
rayol-farm2_2019-03-30_03-43-01.wav,44100,16,60,1,H,512,hil,NULL,NULL,0.87709318436523,NA 
rayol-farm2_2019-03-30_03-45-01.wav,44100,16,60,1,H,512,hil,NULL,NULL,0.889369114976514,NA 
rayol-farm2_2019-03-30_03-47-01.wav,44100,16,60,1,H,512,hil,NULL,NULL,0.89309583073145,NA 
rayol-farm2_2019-03-30_03-49-02.wav,44100,16,60,1,H,512,hil,NULL,NULL,0.881699335359375,NA 
rayol-farm2_2019-03-30_03-51-02.wav,44100,16,60,1,H,512,hil,NULL,NULL,0.889585899616184,NA 
rayol-farm2_2019-03-30_03-53-02.wav,44100,16,60,1,H,512,hil,NULL,NULL,0.891157287434054,NA 
rayol-farm2_2019-03-30_03-55-02.wav,44100,16,60,1,H,512,hil,NULL,NULL,0.892096875232352,NA 
rayol-farm2_2019-03-30_03-57-02.wav,44100,16,60,1,H,512,hil,NULL,NULL,0.892758531465265,NA 
rayol-farm2_2019-03-30_03-59-02.wav,44100,16,60,1,H,512,hil,NULL,NULL,0.895056968675951,NA 
rayol-farm2_2019-03-30_04-01-02.wav,44100,16,60,1,H,512,hil,NULL,NULL,0.895134186220051,NA 
rayol-farm2_2019-03-30_04-03-02.wav,44100,16,60,1,H,512,hil,NULL,NULL,0.89346740556758,NA 
rayol-farm2_2019-03-30_04-05-03.wav,44100,16,60,1,H,512,hil,NULL,NULL,0.891478226464499,NA 
rayol-farm2_2019-03-30_04-07-03.wav,44100,16,60,1,H,512,hil,NULL,NULL,0.88527883272435,NA 
rayol-farm2_2019-03-30_04-09-03.wav,44100,16,60,1,H,512,hil,NULL,NULL,0.884250742587848,NA 
rayol-farm2_2019-03-30_04-11-03.wav,44100,16,60,1,H,512,hil,NULL,NULL,0.888416466321981,NA 
rayol-farm2_2019-03-30_04-13-03.wav,44100,16,60,1,H,512,hil,NULL,NULL,0.888371429902832,NA 
rayol-farm2_2019-03-30_04-15-03.wav,44100,16,60,1,H,512,hil,NULL,NULL,0.894072928372391,NA 
rayol-farm2_2019-03-30_04-17-03.wav,44100,16,60,1,H,512,hil,NULL,NULL,0.894390177731854,NA 
rayol-farm2_2019-03-30_04-19-03.wav,44100,16,60,1,H,512,hil,NULL,NULL,0.894788742098293,NA 
rayol-farm2_2019-03-30_04-21-03.wav,44100,16,60,1,H,512,hil,NULL,NULL,0.88991084770316,NA 
rayol-farm2_2019-03-30_04-23-04.wav,44100,16,60,1,H,512,hil,NULL,NULL,0.891617513934912,NA 
rayol-farm2_2019-03-30_04-25-04.wav,44100,16,60,1,H,512,hil,NULL,NULL,0.889607325141318,NA 
rayol-farm2_2019-03-30_04-27-04.wav,44100,16,60,1,H,512,hil,NULL,NULL,0.893220100591165,NA 
rayol-farm2_2019-03-30_04-29-04.wav,44100,16,60,1,H,512,hil,NULL,NULL,0.894270113318727,NA 
rayol-farm2_2019-03-30_04-31-04.wav,44100,16,60,1,H,512,hil,NULL,NULL,0.895629391183187,NA 
rayol-farm2_2019-03-30_04-33-04.wav,44100,16,60,1,H,512,hil,NULL,NULL,0.894636074845955,NA 
rayol-farm2_2019-03-30_04-35-04.wav,44100,16,60,1,H,512,hil,NULL,NULL,0.895662921082129,NA 
rayol-farm2_2019-03-30_04-37-04.wav,44100,16,60,1,H,512,hil,NULL,NULL,0.892560402791408,NA 
rayol-farm2_2019-03-30_04-39-05.wav,44100,16,60,1,H,512,hil,NULL,NULL,0.890804802076883,NA 
rayol-farm2_2019-03-30_04-41-05.wav,44100,16,60,1,H,512,hil,NULL,NULL,0.891412921505106,NA 
rayol-farm2_2019-03-30_04-43-05.wav,44100,16,60,1,H,512,hil,NULL,NULL,0.894897769788296,NA 
rayol-farm2_2019-03-30_04-45-05.wav,44100,16,60,1,H,512,hil,NULL,NULL,0.896276267663502,NA 
rayol-farm2_2019-03-30_04-47-05.wav,44100,16,60,1,H,512,hil,NULL,NULL,0.897071755191116,NA 
rayol-farm2_2019-03-30_04-49-05.wav,44100,16,60,1,H,512,hil,NULL,NULL,0.897120172989566,NA 
rayol-farm2_2019-03-30_04-51-05.wav,44100,16,60,1,H,512,hil,NULL,NULL,0.896517434373069,NA 
rayol-farm2_2019-03-30_04-53-05.wav,44100,16,60,1,H,512,hil,NULL,NULL,0.895057838294351,NA 
rayol-farm2_2019-03-30_04-55-06.wav,44100,16,60,1,H,512,hil,NULL,NULL,0.894836172967518,NA 
rayol-farm2_2019-03-30_04-57-06.wav,44100,16,60,1,H,512,hil,NULL,NULL,0.892523474932263,NA 
rayol-farm2_2019-03-30_04-59-06.wav,44100,16,60,1,H,512,hil,NULL,NULL,0.894643034774336,NA 
rayol-farm2_2019-03-30_05-01-06.wav,44100,16,60,1,H,512,hil,NULL,NULL,0.896041596778438,NA 
rayol-farm2_2019-03-30_05-03-06.wav,44100,16,60,1,H,512,hil,NULL,NULL,0.895644146887157,NA 
rayol-farm2_2019-03-30_05-05-06.wav,44100,16,60,1,H,512,hil,NULL,NULL,0.892807926724122,NA 
rayol-farm2_2019-03-30_05-07-06.wav,44100,16,60,1,H,512,hil,NULL,NULL,0.893491073598681,NA 
rayol-farm2_2019-03-30_05-09-06.wav,44100,16,60,1,H,512,hil,NULL,NULL,0.892292592384142,NA 
rayol-farm2_2019-03-30_05-11-07.wav,44100,16,60,1,H,512,hil,NULL,NULL,0.895625711939546,NA 
rayol-farm2_2019-03-30_05-13-07.wav,44100,16,60,1,H,512,hil,NULL,NULL,0.896581110208089,NA 
rayol-farm2_2019-03-30_05-15-07.wav,44100,16,60,1,H,512,hil,NULL,NULL,0.896209720709984,NA 
rayol-farm2_2019-03-30_05-17-07.wav,44100,16,60,1,H,512,hil,NULL,NULL,0.897034823573775,NA 
rayol-farm2_2019-03-30_05-19-07.wav,44100,16,60,1,H,512,hil,NULL,NULL,0.894984598149121,NA 
rayol-farm2_2019-03-30_05-21-07.wav,44100,16,60,1,H,512,hil,NULL,NULL,0.895396774686088,NA 
rayol-farm2_2019-03-30_05-23-07.wav,44100,16,60,1,H,512,hil,NULL,NULL,0.89464497720463,NA 
rayol-farm2_2019-03-30_05-25-07.wav,44100,16,60,1,H,512,hil,NULL,NULL,0.814758705650721,NA 
rayol-farm2_2019-03-30_05-27-08.wav,44100,16,60,1,H,512,hil,NULL,NULL,0.89345543529905,NA 
rayol-farm2_2019-03-30_05-29-08.wav,44100,16,60,1,H,512,hil,NULL,NULL,0.89042488697141,NA 
rayol-farm2_2019-03-30_05-31-08.wav,44100,16,60,1,H,512,hil,NULL,NULL,0.895062346881412,NA 
rayol-farm2_2019-03-30_05-33-08.wav,44100,16,60,1,H,512,hil,NULL,NULL,0.892270599082316,NA 
rayol-farm2_2019-03-30_05-35-08.wav,44100,16,60,1,H,512,hil,NULL,NULL,0.88795129529382,NA 
rayol-farm2_2019-03-30_05-37-08.wav,44100,16,60,1,H,512,hil,NULL,NULL,0.883396974944024,NA 
rayol-farm2_2019-03-30_05-39-08.wav,44100,16,60,1,H,512,hil,NULL,NULL,0.886995851770737,NA 
rayol-farm2_2019-03-30_05-41-08.wav,44100,16,60,1,H,512,hil,NULL,NULL,0.886502750155247,NA 
rayol-farm2_2019-03-30_05-43-08.wav,44100,16,60,1,H,512,hil,NULL,NULL,0.892073082638067,NA 
rayol-farm2_2019-03-30_05-45-09.wav,44100,16,60,1,H,512,hil,NULL,NULL,0.896960800837083,NA 
rayol-farm2_2019-03-30_05-47-09.wav,44100,16,60,1,H,512,hil,NULL,NULL,0.892808645766236,NA 
rayol-farm2_2019-03-30_05-49-09.wav,44100,16,60,1,H,512,hil,NULL,NULL,0.898409958394866,NA 
rayol-farm2_2019-03-30_05-51-09.wav,44100,16,60,1,H,512,hil,NULL,NULL,0.887380568307693,NA 
rayol-farm2_2019-03-30_05-53-09.wav,44100,16,60,1,H,512,hil,NULL,NULL,0.87240679962221,NA 
rayol-farm2_2019-03-30_05-55-09.wav,44100,16,60,1,H,512,hil,NULL,NULL,0.893093295638224,NA 
rayol-farm2_2019-03-30_05-57-09.wav,44100,16,60,1,H,512,hil,NULL,NULL,0.896280341093032,NA 
rayol-farm2_2019-03-30_05-59-09.wav,44100,16,60,1,H,512,hil,NULL,NULL,0.894553139487938,NA 
rayol-farm2_2019-03-30_06-01-10.wav,44100,16,60,1,H,512,hil,NULL,NULL,0.88973597575301,NA 
rayol-farm2_2019-03-30_06-03-10.wav,44100,16,60,1,H,512,hil,NULL,NULL,0.877029936640117,NA 
rayol-farm2_2019-03-30_06-05-10.wav,44100,16,60,1,H,512,hil,NULL,NULL,0.887646315172345,NA 
rayol-farm2_2019-03-30_06-07-10.wav,44100,16,60,1,H,512,hil,NULL,NULL,0.890068176414294,NA 
rayol-farm2_2019-03-30_06-09-10.wav,44100,16,60,1,H,512,hil,NULL,NULL,0.893515561748251,NA 
rayol-farm2_2019-03-30_06-11-10.wav,44100,16,60,1,H,512,hil,NULL,NULL,0.892416967678189,NA 
rayol-farm2_2019-03-30_06-13-10.wav,44100,16,60,1,H,512,hil,NULL,NULL,0.893933468077347,NA 
rayol-farm2_2019-03-30_06-15-10.wav,44100,16,60,1,H,512,hil,NULL,NULL,0.896328794903395,NA 
rayol-farm2_2019-03-30_06-17-10.wav,44100,16,60,1,H,512,hil,NULL,NULL,0.893947919927935,NA 
rayol-farm2_2019-03-30_06-19-11.wav,44100,16,60,1,H,512,hil,NULL,NULL,0.892677408449749,NA 
rayol-farm2_2019-03-30_06-21-11.wav,44100,16,60,1,H,512,hil,NULL,NULL,0.890327937063787,NA 
rayol-farm2_2019-03-30_06-23-11.wav,44100,16,60,1,H,512,hil,NULL,NULL,0.895573820451987,NA 
rayol-farm2_2019-03-30_06-25-11.wav,44100,16,60,1,H,512,hil,NULL,NULL,0.893445411371479,NA 
rayol-farm2_2019-03-30_06-27-11.wav,44100,16,60,1,H,512,hil,NULL,NULL,0.893187417451722,NA 
rayol-farm2_2019-03-30_06-29-11.wav,44100,16,60,1,H,512,hil,NULL,NULL,0.892946206010929,NA 
rayol-farm2_2019-03-30_06-31-11.wav,44100,16,60,1,H,512,hil,NULL,NULL,0.892907785890289,NA 
rayol-farm2_2019-03-30_06-33-11.wav,44100,16,60,1,H,512,hil,NULL,NULL,0.89377729554548,NA 
rayol-farm2_2019-03-30_06-35-12.wav,44100,16,60,1,H,512,hil,NULL,NULL,0.89466692800034,NA 
rayol-farm2_2019-03-30_06-37-12.wav,44100,16,60,1,H,512,hil,NULL,NULL,0.898454262893712,NA 
rayol-farm2_2019-03-30_06-39-12.wav,44100,16,60,1,H,512,hil,NULL,NULL,0.897935779967125,NA 
rayol-farm2_2019-03-30_06-41-12.wav,44100,16,60,1,H,512,hil,NULL,NULL,0.897553927272809,NA 
rayol-farm2_2019-03-30_06-43-12.wav,44100,16,60,1,H,512,hil,NULL,NULL,0.896396039209802,NA 
rayol-farm2_2019-03-30_06-45-12.wav,44100,16,60,1,H,512,hil,NULL,NULL,0.898865568382883,NA 
rayol-farm2_2019-03-30_06-47-12.wav,44100,16,60,1,H,512,hil,NULL,NULL,0.898909274499954,NA 
rayol-farm2_2019-03-30_06-49-12.wav,44100,16,60,1,H,512,hil,NULL,NULL,0.899606462590964,NA 
rayol-farm2_2019-03-30_06-51-13.wav,44100,16,60,1,H,512,hil,NULL,NULL,0.897382724754983,NA 
rayol-farm2_2019-03-30_06-53-13.wav,44100,16,60,1,H,512,hil,NULL,NULL,0.901183114112244,NA 
rayol-farm2_2019-03-30_06-55-13.wav,44100,16,60,1,H,512,hil,NULL,NULL,0.896743781027688,NA 
rayol-farm2_2019-03-30_06-57-13.wav,44100,16,60,1,H,512,hil,NULL,NULL,0.897921207662287,NA 
rayol-farm2_2019-03-30_06-59-13.wav,44100,16,60,1,H,512,hil,NULL,NULL,0.893906651549919,NA 
rayol-farm2_2019-03-30_07-01-13.wav,44100,16,60,1,H,512,hil,NULL,NULL,0.890940527158942,NA 
rayol-farm2_2019-03-30_07-03-13.wav,44100,16,60,1,H,512,hil,NULL,NULL,0.894004416261174,NA 
rayol-farm2_2019-03-30_07-05-13.wav,44100,16,60,1,H,512,hil,NULL,NULL,0.893412123441586,NA 
rayol-farm2_2019-03-30_07-07-14.wav,44100,16,60,1,H,512,hil,NULL,NULL,0.895835809334014,NA 
rayol-farm2_2019-03-30_07-09-14.wav,44100,16,60,1,H,512,hil,NULL,NULL,0.899742444449967,NA 
rayol-farm2_2019-03-30_07-11-14.wav,44100,16,60,1,H,512,hil,NULL,NULL,0.898060875217076,NA 
rayol-farm2_2019-03-30_07-13-14.wav,44100,16,60,1,H,512,hil,NULL,NULL,0.897930082448039,NA 
rayol-farm2_2019-03-30_07-15-14.wav,44100,16,60,1,H,512,hil,NULL,NULL,0.898220995323805,NA 
rayol-farm2_2019-03-30_07-17-14.wav,44100,16,60,1,H,512,hil,NULL,NULL,0.899200004008409,NA 
rayol-farm2_2019-03-30_07-19-14.wav,44100,16,60,1,H,512,hil,NULL,NULL,0.899447544749603,NA 
rayol-farm2_2019-03-30_07-21-14.wav,44100,16,60,1,H,512,hil,NULL,NULL,0.899727233534985,NA 
rayol-farm2_2019-03-30_07-23-15.wav,44100,16,60,1,H,512,hil,NULL,NULL,0.899087629618298,NA 
rayol-farm2_2019-03-30_07-25-15.wav,44100,16,60,1,H,512,hil,NULL,NULL,0.899062691265192,NA 
rayol-farm2_2019-03-30_07-27-15.wav,44100,16,60,1,H,512,hil,NULL,NULL,0.898319897950799,NA 
rayol-farm2_2019-03-30_07-29-15.wav,44100,16,60,1,H,512,hil,NULL,NULL,0.822913819859816,NA 
rayol-farm2_2019-03-30_07-31-15.wav,44100,16,60,1,H,512,hil,NULL,NULL,0.892296056743725,NA 
rayol-farm2_2019-03-30_07-33-15.wav,44100,16,60,1,H,512,hil,NULL,NULL,0.891713261136503,NA 
rayol-farm2_2019-03-30_07-35-15.wav,44100,16,60,1,H,512,hil,NULL,NULL,0.893722357571216,NA 
rayol-farm2_2019-03-30_07-37-15.wav,44100,16,60,1,H,512,hil,NULL,NULL,0.898991388250021,NA 
rayol-farm2_2019-03-30_07-39-15.wav,44100,16,60,1,H,512,hil,NULL,NULL,0.897998550861392,NA 
rayol-farm2_2019-03-30_07-41-16.wav,44100,16,60,1,H,512,hil,NULL,NULL,0.898455610213526,NA 
rayol-farm2_2019-03-30_07-43-16.wav,44100,16,60,1,H,512,hil,NULL,NULL,0.896347961450396,NA 
rayol-farm2_2019-03-30_07-45-16.wav,44100,16,60,1,H,512,hil,NULL,NULL,0.895254000761469,NA 
rayol-farm2_2019-03-30_07-47-16.wav,44100,16,60,1,H,512,hil,NULL,NULL,0.897392664970415,NA 
rayol-farm2_2019-03-30_07-49-16.wav,44100,16,60,1,H,512,hil,NULL,NULL,0.897209157500393,NA 
rayol-farm2_2019-03-30_07-51-16.wav,44100,16,60,1,H,512,hil,NULL,NULL,0.893668300771875,NA 
rayol-farm2_2019-03-30_07-53-16.wav,44100,16,60,1,H,512,hil,NULL,NULL,0.891527208689756,NA 
rayol-farm2_2019-03-30_07-55-16.wav,44100,16,60,1,H,512,hil,NULL,NULL,0.897261677781534,NA 
rayol-farm2_2019-03-30_07-57-17.wav,44100,16,60,1,H,512,hil,NULL,NULL,0.890068444620942,NA 
rayol-farm2_2019-03-30_07-59-17.wav,44100,16,60,1,H,512,hil,NULL,NULL,0.891560679861939,NA 
rayol-farm2_2019-03-30_08-01-17.wav,44100,16,60,1,H,512,hil,NULL,NULL,0.889335867406495,NA 
rayol-farm2_2019-03-30_08-03-17.wav,44100,16,60,1,H,512,hil,NULL,NULL,0.891456076669096,NA 
rayol-farm2_2019-03-30_08-05-17.wav,44100,16,60,1,H,512,hil,NULL,NULL,0.891224103360044,NA 
rayol-farm2_2019-03-30_08-07-17.wav,44100,16,60,1,H,512,hil,NULL,NULL,0.897944841436369,NA 
rayol-farm2_2019-03-30_08-09-17.wav,44100,16,60,1,H,512,hil,NULL,NULL,0.897615523681097,NA 
rayol-farm2_2019-03-30_08-11-17.wav,44100,16,60,1,H,512,hil,NULL,NULL,0.89797706193116,NA 
rayol-farm2_2019-03-30_08-13-18.wav,44100,16,60,1,H,512,hil,NULL,NULL,0.897235378215859,NA 
rayol-farm2_2019-03-30_08-15-18.wav,44100,16,60,1,H,512,hil,NULL,NULL,0.897920577270763,NA 
rayol-farm2_2019-03-30_08-17-18.wav,44100,16,60,1,H,512,hil,NULL,NULL,0.897688933043124,NA 
rayol-farm2_2019-03-30_08-19-18.wav,44100,16,60,1,H,512,hil,NULL,NULL,0.895836961398891,NA 
rayol-farm2_2019-03-30_08-21-18.wav,44100,16,60,1,H,512,hil,NULL,NULL,0.895006154049879,NA 
rayol-farm2_2019-03-30_08-23-18.wav,44100,16,60,1,H,512,hil,NULL,NULL,0.897055952615828,NA 
rayol-farm2_2019-03-30_08-25-18.wav,44100,16,60,1,H,512,hil,NULL,NULL,0.897820637614304,NA 
rayol-farm2_2019-03-30_08-27-18.wav,44100,16,60,1,H,512,hil,NULL,NULL,0.899031854194033,NA 
rayol-farm2_2019-03-30_08-29-19.wav,44100,16,60,1,H,512,hil,NULL,NULL,0.891429164258343,NA 
rayol-farm2_2019-03-30_08-31-19.wav,44100,16,60,1,H,512,hil,NULL,NULL,0.892258810385153,NA 
rayol-farm2_2019-03-30_08-33-19.wav,44100,16,60,1,H,512,hil,NULL,NULL,0.88871403307138,NA 
rayol-farm2_2019-03-30_08-35-19.wav,44100,16,60,1,H,512,hil,NULL,NULL,0.888619721467944,NA 
rayol-farm2_2019-03-30_08-37-19.wav,44100,16,60,1,H,512,hil,NULL,NULL,0.899456355719237,NA 
rayol-farm2_2019-03-30_08-39-19.wav,44100,16,60,1,H,512,hil,NULL,NULL,0.898279224000802,NA 
rayol-farm2_2019-03-30_08-41-19.wav,44100,16,60,1,H,512,hil,NULL,NULL,0.896679651284072,NA 
rayol-farm2_2019-03-30_08-43-19.wav,44100,16,60,1,H,512,hil,NULL,NULL,0.899460463097895,NA 
rayol-farm2_2019-03-30_08-45-19.wav,44100,16,60,1,H,512,hil,NULL,NULL,0.898473774021806,NA 
rayol-farm2_2019-03-30_08-47-20.wav,44100,16,60,1,H,512,hil,NULL,NULL,0.898965756550928,NA 
rayol-farm2_2019-03-30_08-49-20.wav,44100,16,60,1,H,512,hil,NULL,NULL,0.894743446818781,NA 
rayol-farm2_2019-03-30_08-51-20.wav,44100,16,60,1,H,512,hil,NULL,NULL,0.889652828687697,NA 
rayol-farm2_2019-03-30_08-53-20.wav,44100,16,60,1,H,512,hil,NULL,NULL,0.890825557862879,NA 
rayol-farm2_2019-03-30_08-55-20.wav,44100,16,60,1,H,512,hil,NULL,NULL,0.884573389779314,NA 
rayol-farm2_2019-03-30_08-57-20.wav,44100,16,60,1,H,512,hil,NULL,NULL,0.889061924511048,NA 
rayol-farm2_2019-03-30_08-59-20.wav,44100,16,60,1,H,512,hil,NULL,NULL,0.89102174934837,NA 
rayol-farm2_2019-03-30_09-01-20.wav,44100,16,60,1,H,512,hil,NULL,NULL,0.893733723353014,NA 
rayol-farm2_2019-03-30_09-03-21.wav,44100,16,60,1,H,512,hil,NULL,NULL,0.89494652585062,NA 
rayol-farm2_2019-03-30_09-05-21.wav,44100,16,60,1,H,512,hil,NULL,NULL,0.894360383050557,NA 
rayol-farm2_2019-03-30_09-07-21.wav,44100,16,60,1,H,512,hil,NULL,NULL,0.891948779004771,NA 
rayol-farm2_2019-03-30_09-09-21.wav,44100,16,60,1,H,512,hil,NULL,NULL,0.894058591336201,NA 
rayol-farm2_2019-03-30_09-11-21.wav,44100,16,60,1,H,512,hil,NULL,NULL,0.899395309693118,NA 
rayol-farm2_2019-03-30_09-13-21.wav,44100,16,60,1,H,512,hil,NULL,NULL,0.8925606513514,NA 
rayol-farm2_2019-03-30_09-15-21.wav,44100,16,60,1,H,512,hil,NULL,NULL,0.894716494387727,NA 
rayol-farm2_2019-03-30_09-17-21.wav,44100,16,60,1,H,512,hil,NULL,NULL,0.893178464017824,NA 
rayol-farm2_2019-03-30_09-19-22.wav,44100,16,60,1,H,512,hil,NULL,NULL,0.892541276132201,NA 
rayol-farm2_2019-03-30_09-21-22.wav,44100,16,60,1,H,512,hil,NULL,NULL,0.893187131346745,NA 
rayol-farm2_2019-03-30_09-23-22.wav,44100,16,60,1,H,512,hil,NULL,NULL,0.895597525232625,NA 
rayol-farm2_2019-03-30_09-25-22.wav,44100,16,60,1,H,512,hil,NULL,NULL,0.894533072312495,NA 
rayol-farm2_2019-03-30_09-27-22.wav,44100,16,60,1,H,512,hil,NULL,NULL,0.894749936609886,NA 
rayol-farm2_2019-03-30_09-29-22.wav,44100,16,60,1,H,512,hil,NULL,NULL,0.892561408893519,NA 
rayol-farm2_2019-03-30_09-31-22.wav,44100,16,60,1,H,512,hil,NULL,NULL,0.887181796534829,NA 
rayol-farm2_2019-03-30_09-33-22.wav,44100,16,60,1,H,512,hil,NULL,NULL,0.895619824930382,NA 
rayol-farm2_2019-03-30_09-35-22.wav,44100,16,60,1,H,512,hil,NULL,NULL,0.889953354569228,NA 
rayol-farm2_2019-03-30_09-37-23.wav,44100,16,60,1,H,512,hil,NULL,NULL,0.892338244314274,NA 
rayol-farm2_2019-03-30_09-39-23.wav,44100,16,60,1,H,512,hil,NULL,NULL,0.889288765527243,NA 
rayol-farm2_2019-03-30_09-41-23.wav,44100,16,60,1,H,512,hil,NULL,NULL,0.895003278007549,NA 
rayol-farm2_2019-03-30_09-43-23.wav,44100,16,60,1,H,512,hil,NULL,NULL,0.893300234327034,NA 
rayol-farm2_2019-03-30_09-45-23.wav,44100,16,60,1,H,512,hil,NULL,NULL,0.881417050908504,NA 
rayol-farm2_2019-03-30_09-47-23.wav,44100,16,60,1,H,512,hil,NULL,NULL,0.883191050105049,NA 
rayol-farm2_2019-03-30_09-49-23.wav,44100,16,60,1,H,512,hil,NULL,NULL,0.876596438819094,NA 
rayol-farm2_2019-03-30_09-51-23.wav,44100,16,60,1,H,512,hil,NULL,NULL,0.849915336855164,NA 
rayol-farm2_2019-03-30_09-53-24.wav,44100,16,60,1,H,512,hil,NULL,NULL,0.88727274939524,NA 
rayol-farm2_2019-03-30_09-55-24.wav,44100,16,60,1,H,512,hil,NULL,NULL,0.884317550173051,NA 
rayol-farm2_2019-03-30_09-57-24.wav,44100,16,60,1,H,512,hil,NULL,NULL,0.850441140440522,NA 
rayol-farm2_2019-03-30_09-59-24.wav,44100,16,60,1,H,512,hil,NULL,NULL,0.890663130048716,NA 
rayol-farm2_2019-03-30_10-01-24.wav,44100,16,60,1,H,512,hil,NULL,NULL,0.889263688661443,NA 
rayol-farm2_2019-03-30_10-03-24.wav,44100,16,60,1,H,512,hil,NULL,NULL,0.886090558126341,NA 
rayol-farm2_2019-03-30_10-05-24.wav,44100,16,60,1,H,512,hil,NULL,NULL,0.889687950504597,NA 
rayol-farm2_2019-03-30_10-07-24.wav,44100,16,60,1,H,512,hil,NULL,NULL,0.873122486464669,NA 
rayol-farm2_2019-03-30_10-09-25.wav,44100,16,60,1,H,512,hil,NULL,NULL,0.887149266787117,NA 
rayol-farm2_2019-03-30_10-11-25.wav,44100,16,60,1,H,512,hil,NULL,NULL,0.886897342962892,NA 
rayol-farm2_2019-03-30_10-13-25.wav,44100,16,60,1,H,512,hil,NULL,NULL,0.888467766862494,NA 
rayol-farm2_2019-03-30_10-15-25.wav,44100,16,60,1,H,512,hil,NULL,NULL,0.891495510305845,NA 
rayol-farm2_2019-03-30_10-17-25.wav,44100,16,60,1,H,512,hil,NULL,NULL,0.894410699070457,NA 
rayol-farm2_2019-03-30_10-19-25.wav,44100,16,60,1,H,512,hil,NULL,NULL,0.896813857848728,NA 
rayol-farm2_2019-03-30_10-21-25.wav,44100,16,60,1,H,512,hil,NULL,NULL,0.893410573343315,NA 
rayol-farm2_2019-03-30_10-23-25.wav,44100,16,60,1,H,512,hil,NULL,NULL,0.858637535777856,NA 
rayol-farm2_2019-03-30_10-25-26.wav,44100,16,60,1,H,512,hil,NULL,NULL,0.889770153941172,NA 
rayol-farm2_2019-03-30_10-27-26.wav,44100,16,60,1,H,512,hil,NULL,NULL,0.885455507799739,NA 
rayol-farm2_2019-03-30_10-29-26.wav,44100,16,60,1,H,512,hil,NULL,NULL,0.883531539160437,NA 
rayol-farm2_2019-03-30_10-31-26.wav,44100,16,60,1,H,512,hil,NULL,NULL,0.889344562220874,NA 
rayol-farm2_2019-03-30_10-33-26.wav,44100,16,60,1,H,512,hil,NULL,NULL,0.887689710649094,NA 
rayol-farm2_2019-03-30_10-35-26.wav,44100,16,60,1,H,512,hil,NULL,NULL,0.860861618093452,NA 
rayol-farm2_2019-03-30_10-37-26.wav,44100,16,60,1,H,512,hil,NULL,NULL,0.890829469947065,NA 
rayol-farm2_2019-03-30_10-39-26.wav,44100,16,60,1,H,512,hil,NULL,NULL,0.896129984403996,NA 
rayol-farm2_2019-03-30_10-41-26.wav,44100,16,60,1,H,512,hil,NULL,NULL,0.865286480815663,NA 
rayol-farm2_2019-03-30_10-43-27.wav,44100,16,60,1,H,512,hil,NULL,NULL,0.877406460980599,NA 
rayol-farm2_2019-03-30_10-45-27.wav,44100,16,60,1,H,512,hil,NULL,NULL,0.890887814717314,NA 
rayol-farm2_2019-03-30_10-47-27.wav,44100,16,60,1,H,512,hil,NULL,NULL,0.875074955458373,NA 
rayol-farm2_2019-03-30_10-49-27.wav,44100,16,60,1,H,512,hil,NULL,NULL,0.884359375982937,NA 
rayol-farm2_2019-03-30_10-51-27.wav,44100,16,60,1,H,512,hil,NULL,NULL,0.874802634014741,NA 
rayol-farm2_2019-03-30_10-53-27.wav,44100,16,60,1,H,512,hil,NULL,NULL,0.885259064021761,NA 
rayol-farm2_2019-03-30_10-55-27.wav,44100,16,60,1,H,512,hil,NULL,NULL,0.882730150638434,NA 
rayol-farm2_2019-03-30_10-57-27.wav,44100,16,60,1,H,512,hil,NULL,NULL,0.863277735231079,NA 
rayol-farm2_2019-03-30_10-59-28.wav,44100,16,60,1,H,512,hil,NULL,NULL,0.889904767153796,NA 
rayol-farm2_2019-03-30_11-01-28.wav,44100,16,60,1,H,512,hil,NULL,NULL,0.886247669789851,NA 
rayol-farm2_2019-03-30_11-03-28.wav,44100,16,60,1,H,512,hil,NULL,NULL,0.892047908156566,NA 
rayol-farm2_2019-03-30_11-05-28.wav,44100,16,60,1,H,512,hil,NULL,NULL,0.892796794038607,NA 
rayol-farm2_2019-03-30_11-07-28.wav,44100,16,60,1,H,512,hil,NULL,NULL,0.889847814196715,NA 
rayol-farm2_2019-03-30_11-09-28.wav,44100,16,60,1,H,512,hil,NULL,NULL,0.887362728488228,NA 
rayol-farm2_2019-03-30_11-11-28.wav,44100,16,60,1,H,512,hil,NULL,NULL,0.89007010956019,NA 
rayol-farm2_2019-03-30_11-13-28.wav,44100,16,60,1,H,512,hil,NULL,NULL,0.888817073767075,NA 
rayol-farm2_2019-03-30_11-15-29.wav,44100,16,60,1,H,512,hil,NULL,NULL,0.852225993459904,NA 
rayol-farm2_2019-03-30_11-17-29.wav,44100,16,60,1,H,512,hil,NULL,NULL,0.883271218934508,NA 
rayol-farm2_2019-03-30_11-19-29.wav,44100,16,60,1,H,512,hil,NULL,NULL,0.877044919635217,NA 
rayol-farm2_2019-03-30_11-21-29.wav,44100,16,60,1,H,512,hil,NULL,NULL,0.89235723468252,NA 
rayol-farm2_2019-03-30_11-23-29.wav,44100,16,60,1,H,512,hil,NULL,NULL,0.888980597628582,NA 
rayol-farm2_2019-03-30_11-25-29.wav,44100,16,60,1,H,512,hil,NULL,NULL,0.889103883252694,NA 
rayol-farm2_2019-03-30_11-27-29.wav,44100,16,60,1,H,512,hil,NULL,NULL,0.865148142121167,NA 
rayol-farm2_2019-03-30_11-29-29.wav,44100,16,60,1,H,512,hil,NULL,NULL,0.879492316688935,NA 
rayol-farm2_2019-03-30_11-31-29.wav,44100,16,60,1,H,512,hil,NULL,NULL,0.873877347777845,NA 
rayol-farm2_2019-03-30_11-33-30.wav,44100,16,60,1,H,512,hil,NULL,NULL,0.887550873243784,NA 
rayol-farm2_2019-03-30_11-35-30.wav,44100,16,60,1,H,512,hil,NULL,NULL,0.878620378700148,NA 
rayol-farm2_2019-03-30_11-37-30.wav,44100,16,60,1,H,512,hil,NULL,NULL,0.882923576724751,NA 
rayol-farm2_2019-03-30_11-39-30.wav,44100,16,60,1,H,512,hil,NULL,NULL,0.887083020530041,NA 
rayol-farm2_2019-03-30_11-41-30.wav,44100,16,60,1,H,512,hil,NULL,NULL,0.892674054682852,NA 
rayol-farm2_2019-03-30_11-43-30.wav,44100,16,60,1,H,512,hil,NULL,NULL,0.892011549580427,NA 
rayol-farm2_2019-03-30_11-45-30.wav,44100,16,60,1,H,512,hil,NULL,NULL,0.868254328117527,NA 
rayol-farm2_2019-03-30_11-47-30.wav,44100,16,60,1,H,512,hil,NULL,NULL,0.887710903044785,NA 
rayol-farm2_2019-03-30_11-49-31.wav,44100,16,60,1,H,512,hil,NULL,NULL,0.894043476077488,NA 
rayol-farm2_2019-03-30_11-51-31.wav,44100,16,60,1,H,512,hil,NULL,NULL,0.892525142274973,NA 
rayol-farm2_2019-03-30_11-53-31.wav,44100,16,60,1,H,512,hil,NULL,NULL,0.890251986177176,NA 
rayol-farm2_2019-03-30_11-55-31.wav,44100,16,60,1,H,512,hil,NULL,NULL,0.777799560040944,NA 
rayol-farm2_2019-03-30_11-57-31.wav,44100,16,60,1,H,512,hil,NULL,NULL,0.884709642209973,NA 
rayol-farm2_2019-03-30_11-59-31.wav,44100,16,60,1,H,512,hil,NULL,NULL,0.88426887745918,NA 
rayol-farm2_2019-03-30_12-01-31.wav,44100,16,60,1,H,512,hil,NULL,NULL,0.851582453933832,NA 
rayol-farm2_2019-03-30_12-03-31.wav,44100,16,60,1,H,512,hil,NULL,NULL,0.885048753807857,NA 
rayol-farm2_2019-03-30_12-05-32.wav,44100,16,60,1,H,512,hil,NULL,NULL,0.8938266922836,NA 
rayol-farm2_2019-03-30_12-07-32.wav,44100,16,60,1,H,512,hil,NULL,NULL,0.890725608836238,NA 
rayol-farm2_2019-03-30_12-09-32.wav,44100,16,60,1,H,512,hil,NULL,NULL,0.880603894432041,NA 
rayol-farm2_2019-03-30_12-11-32.wav,44100,16,60,1,H,512,hil,NULL,NULL,0.885246087226,NA 
rayol-farm2_2019-03-30_12-13-32.wav,44100,16,60,1,H,512,hil,NULL,NULL,0.884814451680545,NA 
rayol-farm2_2019-03-30_12-15-32.wav,44100,16,60,1,H,512,hil,NULL,NULL,0.876706602539161,NA 
rayol-farm2_2019-03-30_12-17-32.wav,44100,16,60,1,H,512,hil,NULL,NULL,0.881779102692464,NA 
rayol-farm2_2019-03-30_12-19-32.wav,44100,16,60,1,H,512,hil,NULL,NULL,0.879185147151741,NA 
rayol-farm2_2019-03-30_12-21-33.wav,44100,16,60,1,H,512,hil,NULL,NULL,0.874883173520492,NA 
rayol-farm2_2019-03-30_12-23-33.wav,44100,16,60,1,H,512,hil,NULL,NULL,0.886081825165393,NA 
rayol-farm2_2019-03-30_12-25-33.wav,44100,16,60,1,H,512,hil,NULL,NULL,0.891109153688616,NA 
rayol-farm2_2019-03-30_12-27-33.wav,44100,16,60,1,H,512,hil,NULL,NULL,0.890188169373446,NA 
rayol-farm2_2019-03-30_12-29-33.wav,44100,16,60,1,H,512,hil,NULL,NULL,0.891730011684788,NA 
rayol-farm2_2019-03-30_12-31-33.wav,44100,16,60,1,H,512,hil,NULL,NULL,0.890485515840828,NA 
rayol-farm2_2019-03-30_12-33-33.wav,44100,16,60,1,H,512,hil,NULL,NULL,0.888694036803238,NA 
rayol-farm2_2019-03-30_12-35-33.wav,44100,16,60,1,H,512,hil,NULL,NULL,0.883142617915367,NA 
rayol-farm2_2019-03-30_12-37-33.wav,44100,16,60,1,H,512,hil,NULL,NULL,0.885146320583504,NA 
rayol-farm2_2019-03-30_12-39-34.wav,44100,16,60,1,H,512,hil,NULL,NULL,0.884419604422119,NA 
rayol-farm2_2019-03-30_12-41-34.wav,44100,16,60,1,H,512,hil,NULL,NULL,0.884154426216165,NA 
rayol-farm2_2019-03-30_12-43-34.wav,44100,16,60,1,H,512,hil,NULL,NULL,0.883003951201346,NA 
rayol-farm2_2019-03-30_12-45-34.wav,44100,16,60,1,H,512,hil,NULL,NULL,0.883261625764049,NA 
rayol-farm2_2019-03-30_12-47-34.wav,44100,16,60,1,H,512,hil,NULL,NULL,0.883359528354281,NA 
rayol-farm2_2019-03-30_12-49-34.wav,44100,16,60,1,H,512,hil,NULL,NULL,0.880969444626186,NA 
rayol-farm2_2019-03-30_12-51-34.wav,44100,16,60,1,H,512,hil,NULL,NULL,0.889701881555966,NA 
rayol-farm2_2019-03-30_12-53-34.wav,44100,16,60,1,H,512,hil,NULL,NULL,0.886839018866669,NA 
rayol-farm2_2019-03-30_12-55-35.wav,44100,16,60,1,H,512,hil,NULL,NULL,0.887420394013795,NA 
rayol-farm2_2019-03-30_12-57-35.wav,44100,16,60,1,H,512,hil,NULL,NULL,0.883063118269154,NA 
rayol-farm2_2019-03-30_12-59-35.wav,44100,16,60,1,H,512,hil,NULL,NULL,0.888989681499659,NA 
rayol-farm2_2019-03-30_13-01-35.wav,44100,16,60,1,H,512,hil,NULL,NULL,0.886659031093188,NA 
rayol-farm2_2019-03-30_13-03-35.wav,44100,16,60,1,H,512,hil,NULL,NULL,0.881611670859177,NA 
rayol-farm2_2019-03-30_13-05-35.wav,44100,16,60,1,H,512,hil,NULL,NULL,0.886631312826709,NA 
rayol-farm2_2019-03-30_13-07-35.wav,44100,16,60,1,H,512,hil,NULL,NULL,0.888026492992132,NA 
rayol-farm2_2019-03-30_13-09-35.wav,44100,16,60,1,H,512,hil,NULL,NULL,0.891469947664746,NA 
rayol-farm2_2019-03-30_13-11-36.wav,44100,16,60,1,H,512,hil,NULL,NULL,0.880478361799682,NA 
rayol-farm2_2019-03-30_13-13-36.wav,44100,16,60,1,H,512,hil,NULL,NULL,0.893338054455074,NA 
rayol-farm2_2019-03-30_13-15-36.wav,44100,16,60,1,H,512,hil,NULL,NULL,0.888727511919725,NA 
rayol-farm2_2019-03-30_13-17-36.wav,44100,16,60,1,H,512,hil,NULL,NULL,0.886640308752694,NA 
rayol-farm2_2019-03-30_13-19-36.wav,44100,16,60,1,H,512,hil,NULL,NULL,0.891552084531986,NA 
rayol-farm2_2019-03-30_13-21-36.wav,44100,16,60,1,H,512,hil,NULL,NULL,0.890584283901893,NA 
rayol-farm2_2019-03-30_13-23-36.wav,44100,16,60,1,H,512,hil,NULL,NULL,0.892139876246306,NA 
rayol-farm2_2019-03-30_13-25-36.wav,44100,16,60,1,H,512,hil,NULL,NULL,0.894033950974324,NA 
rayol-farm2_2019-03-30_13-27-36.wav,44100,16,60,1,H,512,hil,NULL,NULL,0.890649728395961,NA 
rayol-farm2_2019-03-30_13-29-37.wav,44100,16,60,1,H,512,hil,NULL,NULL,0.889456848178741,NA 
rayol-farm2_2019-03-30_13-31-37.wav,44100,16,60,1,H,512,hil,NULL,NULL,0.888682545380417,NA 
rayol-farm2_2019-03-30_13-33-37.wav,44100,16,60,1,H,512,hil,NULL,NULL,0.892396857908822,NA 
rayol-farm2_2019-03-30_13-35-37.wav,44100,16,60,1,H,512,hil,NULL,NULL,0.89150860096508,NA 
rayol-farm2_2019-03-30_13-37-37.wav,44100,16,60,1,H,512,hil,NULL,NULL,0.894277340732724,NA 
rayol-farm2_2019-03-30_13-39-37.wav,44100,16,60,1,H,512,hil,NULL,NULL,0.888393113355713,NA 
rayol-farm2_2019-03-30_13-41-37.wav,44100,16,60,1,H,512,hil,NULL,NULL,0.884375473061329,NA 
rayol-farm2_2019-03-30_13-43-37.wav,44100,16,60,1,H,512,hil,NULL,NULL,0.878496811494347,NA 
rayol-farm2_2019-03-30_13-45-38.wav,44100,16,60,1,H,512,hil,NULL,NULL,0.891929440534314,NA 
rayol-farm2_2019-03-30_13-47-38.wav,44100,16,60,1,H,512,hil,NULL,NULL,0.882983811068828,NA 
rayol-farm2_2019-03-30_13-49-38.wav,44100,16,60,1,H,512,hil,NULL,NULL,0.887245250481959,NA 
rayol-farm2_2019-03-30_13-51-38.wav,44100,16,60,1,H,512,hil,NULL,NULL,0.882181195703506,NA 
rayol-farm2_2019-03-30_13-53-38.wav,44100,16,60,1,H,512,hil,NULL,NULL,0.88544588745874,NA 
rayol-farm2_2019-03-30_13-55-38.wav,44100,16,60,1,H,512,hil,NULL,NULL,0.872071678809168,NA 
rayol-farm2_2019-03-30_13-57-38.wav,44100,16,60,1,H,512,hil,NULL,NULL,0.885443426931925,NA 
rayol-farm2_2019-03-30_13-59-38.wav,44100,16,60,1,H,512,hil,NULL,NULL,0.890697980009612,NA 
rayol-farm2_2019-03-30_14-01-39.wav,44100,16,60,1,H,512,hil,NULL,NULL,0.88879425902344,NA 
rayol-farm2_2019-03-30_14-03-39.wav,44100,16,60,1,H,512,hil,NULL,NULL,0.88672457886529,NA 
rayol-farm2_2019-03-30_14-05-39.wav,44100,16,60,1,H,512,hil,NULL,NULL,0.881876651297539,NA 
rayol-farm2_2019-03-30_14-07-39.wav,44100,16,60,1,H,512,hil,NULL,NULL,0.882675272945061,NA 
rayol-farm2_2019-03-30_14-09-39.wav,44100,16,60,1,H,512,hil,NULL,NULL,0.881282192450407,NA 
rayol-farm2_2019-03-30_14-11-39.wav,44100,16,60,1,H,512,hil,NULL,NULL,0.88463628290501,NA 
rayol-farm2_2019-03-30_14-13-39.wav,44100,16,60,1,H,512,hil,NULL,NULL,0.891297930230584,NA 
rayol-farm2_2019-03-30_14-15-39.wav,44100,16,60,1,H,512,hil,NULL,NULL,0.8880559022157,NA 
rayol-farm2_2019-03-30_14-17-40.wav,44100,16,60,1,H,512,hil,NULL,NULL,0.88942556024306,NA 
rayol-farm2_2019-03-30_14-19-40.wav,44100,16,60,1,H,512,hil,NULL,NULL,0.8897157154539,NA 
rayol-farm2_2019-03-30_14-21-40.wav,44100,16,60,1,H,512,hil,NULL,NULL,0.892554582648169,NA 
rayol-farm2_2019-03-30_14-23-40.wav,44100,16,60,1,H,512,hil,NULL,NULL,0.887798972417244,NA 
rayol-farm2_2019-03-30_14-25-40.wav,44100,16,60,1,H,512,hil,NULL,NULL,0.891012839554923,NA 
rayol-farm2_2019-03-30_14-27-40.wav,44100,16,60,1,H,512,hil,NULL,NULL,0.891667449875591,NA 
rayol-farm2_2019-03-30_14-29-40.wav,44100,16,60,1,H,512,hil,NULL,NULL,0.867757115846088,NA 
rayol-farm2_2019-03-30_14-31-40.wav,44100,16,60,1,H,512,hil,NULL,NULL,0.889124898957822,NA 
rayol-farm2_2019-03-30_14-33-40.wav,44100,16,60,1,H,512,hil,NULL,NULL,0.893581603382656,NA 
rayol-farm2_2019-03-30_14-35-41.wav,44100,16,60,1,H,512,hil,NULL,NULL,0.891719847046421,NA 
rayol-farm2_2019-03-30_14-37-41.wav,44100,16,60,1,H,512,hil,NULL,NULL,0.873630835088858,NA 
rayol-farm2_2019-03-30_14-39-41.wav,44100,16,60,1,H,512,hil,NULL,NULL,0.890803328237804,NA 
rayol-farm2_2019-03-30_14-41-41.wav,44100,16,60,1,H,512,hil,NULL,NULL,0.890778268516001,NA 
rayol-farm2_2019-03-30_14-43-41.wav,44100,16,60,1,H,512,hil,NULL,NULL,0.891876673195638,NA 
rayol-farm2_2019-03-30_14-45-41.wav,44100,16,60,1,H,512,hil,NULL,NULL,0.890838538993556,NA 
rayol-farm2_2019-03-30_14-47-41.wav,44100,16,60,1,H,512,hil,NULL,NULL,0.888881393188498,NA 
rayol-farm2_2019-03-30_14-49-41.wav,44100,16,60,1,H,512,hil,NULL,NULL,0.887244349108758,NA 
rayol-farm2_2019-03-30_14-51-42.wav,44100,16,60,1,H,512,hil,NULL,NULL,0.893179014802577,NA 
rayol-farm2_2019-03-30_14-53-42.wav,44100,16,60,1,H,512,hil,NULL,NULL,0.885287508173313,NA 
rayol-farm2_2019-03-30_14-55-42.wav,44100,16,60,1,H,512,hil,NULL,NULL,0.895695073246269,NA 
rayol-farm2_2019-03-30_14-57-42.wav,44100,16,60,1,H,512,hil,NULL,NULL,0.891160817975267,NA 
rayol-farm2_2019-03-30_14-59-42.wav,44100,16,60,1,H,512,hil,NULL,NULL,0.896283095088007,NA 
rayol-farm2_2019-03-30_15-01-42.wav,44100,16,60,1,H,512,hil,NULL,NULL,0.896551362761669,NA 
rayol-farm2_2019-03-30_15-03-42.wav,44100,16,60,1,H,512,hil,NULL,NULL,0.893258187447084,NA 
rayol-farm2_2019-03-30_15-05-42.wav,44100,16,60,1,H,512,hil,NULL,NULL,0.884256625021281,NA 
rayol-farm2_2019-03-30_15-07-43.wav,44100,16,60,1,H,512,hil,NULL,NULL,0.885319762370265,NA 
rayol-farm2_2019-03-30_15-09-43.wav,44100,16,60,1,H,512,hil,NULL,NULL,0.893973020137762,NA 
rayol-farm2_2019-03-30_15-11-43.wav,44100,16,60,1,H,512,hil,NULL,NULL,0.890203177484936,NA 
rayol-farm2_2019-03-30_15-13-43.wav,44100,16,60,1,H,512,hil,NULL,NULL,0.889743203103454,NA 
rayol-farm2_2019-03-30_15-15-43.wav,44100,16,60,1,H,512,hil,NULL,NULL,0.896840529026538,NA 
rayol-farm2_2019-03-30_15-17-43.wav,44100,16,60,1,H,512,hil,NULL,NULL,0.896547798905778,NA 
rayol-farm2_2019-03-30_15-19-43.wav,44100,16,60,1,H,512,hil,NULL,NULL,0.895041066076679,NA 
rayol-farm2_2019-03-30_15-21-43.wav,44100,16,60,1,H,512,hil,NULL,NULL,0.895438602154337,NA 
rayol-farm2_2019-03-30_15-23-44.wav,44100,16,60,1,H,512,hil,NULL,NULL,0.88757946082296,NA 
rayol-farm2_2019-03-30_15-25-44.wav,44100,16,60,1,H,512,hil,NULL,NULL,0.893179550808714,NA 
rayol-farm2_2019-03-30_15-27-44.wav,44100,16,60,1,H,512,hil,NULL,NULL,0.894440988515909,NA 
rayol-farm2_2019-03-30_15-29-44.wav,44100,16,60,1,H,512,hil,NULL,NULL,0.887882293498269,NA 
rayol-farm2_2019-03-30_15-31-44.wav,44100,16,60,1,H,512,hil,NULL,NULL,0.887311070588586,NA 
rayol-farm2_2019-03-30_15-33-44.wav,44100,16,60,1,H,512,hil,NULL,NULL,0.891213088927293,NA 
rayol-farm2_2019-03-30_15-35-44.wav,44100,16,60,1,H,512,hil,NULL,NULL,0.895337620938706,NA 
rayol-farm2_2019-03-30_15-37-44.wav,44100,16,60,1,H,512,hil,NULL,NULL,0.896830942341414,NA 
rayol-farm2_2019-03-30_15-39-44.wav,44100,16,60,1,H,512,hil,NULL,NULL,0.895397048091429,NA 
rayol-farm2_2019-03-30_15-41-45.wav,44100,16,60,1,H,512,hil,NULL,NULL,0.893611882217697,NA 
rayol-farm2_2019-03-30_15-43-45.wav,44100,16,60,1,H,512,hil,NULL,NULL,0.895729752276301,NA 
rayol-farm2_2019-03-30_15-45-45.wav,44100,16,60,1,H,512,hil,NULL,NULL,0.896237606795766,NA 
rayol-farm2_2019-03-30_15-47-45.wav,44100,16,60,1,H,512,hil,NULL,NULL,0.891538045266731,NA 
rayol-farm2_2019-03-30_15-49-45.wav,44100,16,60,1,H,512,hil,NULL,NULL,0.893184310565257,NA 
rayol-farm2_2019-03-30_15-51-45.wav,44100,16,60,1,H,512,hil,NULL,NULL,0.891495626645191,NA 
rayol-farm2_2019-03-30_15-53-45.wav,44100,16,60,1,H,512,hil,NULL,NULL,0.889688628047786,NA 
rayol-farm2_2019-03-30_15-55-45.wav,44100,16,60,1,H,512,hil,NULL,NULL,0.894409330985554,NA 
rayol-farm2_2019-03-30_15-57-46.wav,44100,16,60,1,H,512,hil,NULL,NULL,0.897055069753072,NA 
rayol-farm2_2019-03-30_15-59-46.wav,44100,16,60,1,H,512,hil,NULL,NULL,0.894231221510431,NA 
rayol-farm2_2019-03-30_16-01-46.wav,44100,16,60,1,H,512,hil,NULL,NULL,0.888880658938457,NA 
rayol-farm2_2019-03-30_16-03-46.wav,44100,16,60,1,H,512,hil,NULL,NULL,0.896097447477423,NA 
rayol-farm2_2019-03-30_16-05-46.wav,44100,16,60,1,H,512,hil,NULL,NULL,0.882315510830204,NA 
rayol-farm2_2019-03-30_16-07-46.wav,44100,16,60,1,H,512,hil,NULL,NULL,0.885622943464628,NA 
rayol-farm2_2019-03-30_16-09-46.wav,44100,16,60,1,H,512,hil,NULL,NULL,0.897288798551016,NA 
rayol-farm2_2019-03-30_16-11-46.wav,44100,16,60,1,H,512,hil,NULL,NULL,0.892616049186834,NA 
rayol-farm2_2019-03-30_16-13-47.wav,44100,16,60,1,H,512,hil,NULL,NULL,0.886642157109498,NA 
rayol-farm2_2019-03-30_16-15-47.wav,44100,16,60,1,H,512,hil,NULL,NULL,0.886262962456966,NA 
rayol-farm2_2019-03-30_16-17-47.wav,44100,16,60,1,H,512,hil,NULL,NULL,0.88686985967522,NA 
rayol-farm2_2019-03-30_16-19-47.wav,44100,16,60,1,H,512,hil,NULL,NULL,0.874532813028163,NA 
rayol-farm2_2019-03-30_16-21-47.wav,44100,16,60,1,H,512,hil,NULL,NULL,0.891189198499966,NA 
rayol-farm2_2019-03-30_16-23-47.wav,44100,16,60,1,H,512,hil,NULL,NULL,0.887851007619586,NA 
rayol-farm2_2019-03-30_16-25-47.wav,44100,16,60,1,H,512,hil,NULL,NULL,0.899561531028848,NA 
rayol-farm2_2019-03-30_16-27-47.wav,44100,16,60,1,H,512,hil,NULL,NULL,0.900062731200458,NA 
rayol-farm2_2019-03-30_16-29-48.wav,44100,16,60,1,H,512,hil,NULL,NULL,0.899818841634017,NA 
rayol-farm2_2019-03-30_16-31-48.wav,44100,16,60,1,H,512,hil,NULL,NULL,0.899174206409512,NA 
rayol-farm2_2019-03-30_16-33-48.wav,44100,16,60,1,H,512,hil,NULL,NULL,0.900638084026737,NA 
rayol-farm2_2019-03-30_16-35-48.wav,44100,16,60,1,H,512,hil,NULL,NULL,0.893450586972055,NA 
rayol-farm2_2019-03-30_16-37-48.wav,44100,16,60,1,H,512,hil,NULL,NULL,0.898003233818459,NA 
rayol-farm2_2019-03-30_16-39-48.wav,44100,16,60,1,H,512,hil,NULL,NULL,0.889870840039581,NA 
rayol-farm2_2019-03-30_16-41-48.wav,44100,16,60,1,H,512,hil,NULL,NULL,0.895690979296884,NA 
rayol-farm2_2019-03-30_16-43-48.wav,44100,16,60,1,H,512,hil,NULL,NULL,0.891596525292761,NA 
rayol-farm2_2019-03-30_16-45-48.wav,44100,16,60,1,H,512,hil,NULL,NULL,0.894929799508042,NA 
rayol-farm2_2019-03-30_16-47-49.wav,44100,16,60,1,H,512,hil,NULL,NULL,0.893809731760706,NA 
rayol-farm2_2019-03-30_16-49-49.wav,44100,16,60,1,H,512,hil,NULL,NULL,0.865578789552484,NA 
rayol-farm2_2019-03-30_16-51-49.wav,44100,16,60,1,H,512,hil,NULL,NULL,0.897336722896422,NA 
rayol-farm2_2019-03-30_16-53-49.wav,44100,16,60,1,H,512,hil,NULL,NULL,0.895128431148631,NA 
rayol-farm2_2019-03-30_16-55-49.wav,44100,16,60,1,H,512,hil,NULL,NULL,0.898884479152291,NA 
rayol-farm2_2019-03-30_16-57-49.wav,44100,16,60,1,H,512,hil,NULL,NULL,0.897640546439053,NA 
rayol-farm2_2019-03-30_16-59-49.wav,44100,16,60,1,H,512,hil,NULL,NULL,0.840312111872015,NA 
rayol-farm2_2019-03-30_17-01-49.wav,44100,16,60,1,H,512,hil,NULL,NULL,0.893289318801794,NA 
rayol-farm2_2019-03-30_17-03-50.wav,44100,16,60,1,H,512,hil,NULL,NULL,0.893896763326675,NA 
rayol-farm2_2019-03-30_17-05-50.wav,44100,16,60,1,H,512,hil,NULL,NULL,0.889032368229601,NA 
rayol-farm2_2019-03-30_17-07-50.wav,44100,16,60,1,H,512,hil,NULL,NULL,0.892451256572652,NA 
rayol-farm2_2019-03-30_17-09-50.wav,44100,16,60,1,H,512,hil,NULL,NULL,0.896053098911469,NA 
rayol-farm2_2019-03-30_17-11-50.wav,44100,16,60,1,H,512,hil,NULL,NULL,0.891038519857017,NA 
rayol-farm2_2019-03-30_17-13-50.wav,44100,16,60,1,H,512,hil,NULL,NULL,0.890770609728037,NA 
rayol-farm2_2019-03-30_17-15-50.wav,44100,16,60,1,H,512,hil,NULL,NULL,0.896873035765995,NA 
rayol-farm2_2019-03-30_17-17-50.wav,44100,16,60,1,H,512,hil,NULL,NULL,0.89561231993534,NA 
rayol-farm2_2019-03-30_17-19-51.wav,44100,16,60,1,H,512,hil,NULL,NULL,0.895363969140153,NA 
rayol-farm2_2019-03-30_17-21-51.wav,44100,16,60,1,H,512,hil,NULL,NULL,0.890707684497801,NA 
rayol-farm2_2019-03-30_17-23-51.wav,44100,16,60,1,H,512,hil,NULL,NULL,0.890443162960502,NA 
rayol-farm2_2019-03-30_17-25-51.wav,44100,16,60,1,H,512,hil,NULL,NULL,0.892024672360447,NA 
rayol-farm2_2019-03-30_17-27-51.wav,44100,16,60,1,H,512,hil,NULL,NULL,0.891935724663914,NA 
rayol-farm2_2019-03-30_17-29-51.wav,44100,16,60,1,H,512,hil,NULL,NULL,0.898956001131425,NA 
rayol-farm2_2019-03-30_17-31-51.wav,44100,16,60,1,H,512,hil,NULL,NULL,0.902659084131767,NA 
rayol-farm2_2019-03-30_17-33-51.wav,44100,16,60,1,H,512,hil,NULL,NULL,0.897874259830101,NA 
rayol-farm2_2019-03-30_17-35-51.wav,44100,16,60,1,H,512,hil,NULL,NULL,0.901221302576584,NA 
rayol-farm2_2019-03-30_17-37-52.wav,44100,16,60,1,H,512,hil,NULL,NULL,0.894324750965292,NA 
rayol-farm2_2019-03-30_17-39-52.wav,44100,16,60,1,H,512,hil,NULL,NULL,0.898646960982262,NA 
rayol-farm2_2019-03-30_17-41-52.wav,44100,16,60,1,H,512,hil,NULL,NULL,0.895785498254154,NA 
rayol-farm2_2019-03-30_17-43-52.wav,44100,16,60,1,H,512,hil,NULL,NULL,0.892125559192677,NA 
rayol-farm2_2019-03-30_17-45-52.wav,44100,16,60,1,H,512,hil,NULL,NULL,0.892036814165293,NA 
rayol-farm2_2019-03-30_17-47-52.wav,44100,16,60,1,H,512,hil,NULL,NULL,0.891425221777474,NA 
rayol-farm2_2019-03-30_17-49-52.wav,44100,16,60,1,H,512,hil,NULL,NULL,0.893421820858569,NA 
rayol-farm2_2019-03-30_17-51-52.wav,44100,16,60,1,H,512,hil,NULL,NULL,0.894574542505255,NA 
rayol-farm2_2019-03-30_17-53-53.wav,44100,16,60,1,H,512,hil,NULL,NULL,0.89568688015581,NA 
rayol-farm2_2019-03-30_17-55-53.wav,44100,16,60,1,H,512,hil,NULL,NULL,0.899014788621224,NA 
rayol-farm2_2019-03-30_17-57-53.wav,44100,16,60,1,H,512,hil,NULL,NULL,0.89676070910025,NA 
rayol-farm2_2019-03-30_17-59-53.wav,44100,16,60,1,H,512,hil,NULL,NULL,0.896367325696991,NA 
rayol-farm2_2019-03-30_18-01-53.wav,44100,16,60,1,H,512,hil,NULL,NULL,0.895270811678467,NA 
rayol-farm2_2019-03-30_18-03-53.wav,44100,16,60,1,H,512,hil,NULL,NULL,0.896515940465454,NA 
rayol-farm2_2019-03-30_18-05-53.wav,44100,16,60,1,H,512,hil,NULL,NULL,0.896258253832223,NA 
rayol-farm2_2019-03-30_18-07-53.wav,44100,16,60,1,H,512,hil,NULL,NULL,0.89203169302355,NA 
rayol-farm2_2019-03-30_18-09-54.wav,44100,16,60,1,H,512,hil,NULL,NULL,0.887497282110581,NA 
rayol-farm2_2019-03-30_18-11-54.wav,44100,16,60,1,H,512,hil,NULL,NULL,0.88981592375835,NA 
rayol-farm2_2019-03-30_18-13-54.wav,44100,16,60,1,H,512,hil,NULL,NULL,0.893262096655649,NA 
rayol-farm2_2019-03-30_18-15-54.wav,44100,16,60,1,H,512,hil,NULL,NULL,0.894896253723665,NA 
rayol-farm2_2019-03-30_18-17-54.wav,44100,16,60,1,H,512,hil,NULL,NULL,0.898786283259261,NA 
rayol-farm2_2019-03-30_18-19-54.wav,44100,16,60,1,H,512,hil,NULL,NULL,0.899920212236197,NA 
rayol-farm2_2019-03-30_18-21-54.wav,44100,16,60,1,H,512,hil,NULL,NULL,0.899029923111915,NA 
rayol-farm2_2019-03-30_18-23-54.wav,44100,16,60,1,H,512,hil,NULL,NULL,0.897906058891719,NA 
rayol-farm2_2019-03-30_18-25-55.wav,44100,16,60,1,H,512,hil,NULL,NULL,0.897622638277921,NA 
rayol-farm2_2019-03-30_18-27-55.wav,44100,16,60,1,H,512,hil,NULL,NULL,0.891702479451354,NA 
rayol-farm2_2019-03-30_18-29-55.wav,44100,16,60,1,H,512,hil,NULL,NULL,0.897554926181872,NA 
rayol-farm2_2019-03-30_18-31-55.wav,44100,16,60,1,H,512,hil,NULL,NULL,0.892534560723258,NA 
rayol-farm2_2019-03-30_18-33-55.wav,44100,16,60,1,H,512,hil,NULL,NULL,0.894681745002933,NA 
rayol-farm2_2019-03-30_18-35-55.wav,44100,16,60,1,H,512,hil,NULL,NULL,0.888882363379336,NA 
rayol-farm2_2019-03-30_18-37-55.wav,44100,16,60,1,H,512,hil,NULL,NULL,0.894488942533593,NA 
rayol-farm2_2019-03-30_18-39-55.wav,44100,16,60,1,H,512,hil,NULL,NULL,0.892508692207442,NA 
rayol-farm2_2019-03-30_18-41-55.wav,44100,16,60,1,H,512,hil,NULL,NULL,0.894172738192319,NA 
rayol-farm2_2019-03-30_18-43-56.wav,44100,16,60,1,H,512,hil,NULL,NULL,0.895810692544216,NA 
rayol-farm2_2019-03-30_18-45-56.wav,44100,16,60,1,H,512,hil,NULL,NULL,0.89872893217837,NA 
rayol-farm2_2019-03-30_18-47-56.wav,44100,16,60,1,H,512,hil,NULL,NULL,0.894109146307134,NA 
rayol-farm2_2019-03-30_18-49-56.wav,44100,16,60,1,H,512,hil,NULL,NULL,0.893481249746264,NA 
rayol-farm2_2019-03-30_18-51-56.wav,44100,16,60,1,H,512,hil,NULL,NULL,0.89882435140806,NA 
rayol-farm2_2019-03-30_18-53-56.wav,44100,16,60,1,H,512,hil,NULL,NULL,0.777823376552009,NA 
rayol-farm2_2019-03-30_18-55-56.wav,44100,16,60,1,H,512,hil,NULL,NULL,0.77940977630497,NA 
rayol-farm2_2019-03-30_18-57-56.wav,44100,16,60,1,H,512,hil,NULL,NULL,0.897011866318082,NA 
rayol-farm2_2019-03-30_18-59-57.wav,44100,16,60,1,H,512,hil,NULL,NULL,0.898917071608372,NA 
rayol-farm2_2019-03-30_19-01-57.wav,44100,16,60,1,H,512,hil,NULL,NULL,0.899375140878123,NA 
rayol-farm2_2019-03-30_19-03-57.wav,44100,16,60,1,H,512,hil,NULL,NULL,0.897371145111481,NA 
rayol-farm2_2019-03-30_19-05-57.wav,44100,16,60,1,H,512,hil,NULL,NULL,0.900133871558546,NA 
rayol-farm2_2019-03-30_19-07-57.wav,44100,16,60,1,H,512,hil,NULL,NULL,0.900225595226013,NA 
rayol-farm2_2019-03-30_19-09-57.wav,44100,16,60,1,H,512,hil,NULL,NULL,0.893292549492529,NA 
rayol-farm2_2019-03-30_19-11-57.wav,44100,16,60,1,H,512,hil,NULL,NULL,0.90158860618504,NA 
rayol-farm2_2019-03-30_19-13-57.wav,44100,16,60,1,H,512,hil,NULL,NULL,0.895752188560346,NA 
rayol-farm2_2019-03-30_19-15-58.wav,44100,16,60,1,H,512,hil,NULL,NULL,0.8958541689335,NA 
rayol-farm2_2019-03-30_19-17-58.wav,44100,16,60,1,H,512,hil,NULL,NULL,0.89021707007392,NA 
rayol-farm2_2019-03-30_19-19-58.wav,44100,16,60,1,H,512,hil,NULL,NULL,0.897921826676942,NA 
rayol-farm2_2019-03-30_19-21-58.wav,44100,16,60,1,H,512,hil,NULL,NULL,0.894346373489398,NA 
rayol-farm2_2019-03-30_19-23-58.wav,44100,16,60,1,H,512,hil,NULL,NULL,0.894109667487132,NA 
rayol-farm2_2019-03-30_19-25-58.wav,44100,16,60,1,H,512,hil,NULL,NULL,0.899427732242917,NA 
rayol-farm2_2019-03-30_19-27-58.wav,44100,16,60,1,H,512,hil,NULL,NULL,0.898691249596124,NA 
rayol-farm2_2019-03-30_19-29-58.wav,44100,16,60,1,H,512,hil,NULL,NULL,0.899163300339014,NA 
rayol-farm2_2019-03-30_19-31-58.wav,44100,16,60,1,H,512,hil,NULL,NULL,0.89968392423319,NA 
rayol-farm2_2019-03-30_19-33-59.wav,44100,16,60,1,H,512,hil,NULL,NULL,0.896732169863454,NA 
rayol-farm2_2019-03-30_19-35-59.wav,44100,16,60,1,H,512,hil,NULL,NULL,0.896939160427298,NA 
rayol-farm2_2019-03-30_19-37-59.wav,44100,16,60,1,H,512,hil,NULL,NULL,0.896986422983931,NA 
rayol-farm2_2019-03-30_19-39-59.wav,44100,16,60,1,H,512,hil,NULL,NULL,0.893192942298712,NA 
rayol-farm2_2019-03-30_19-41-59.wav,44100,16,60,1,H,512,hil,NULL,NULL,0.89404725029563,NA 
rayol-farm2_2019-03-30_19-43-59.wav,44100,16,60,1,H,512,hil,NULL,NULL,0.891842956308092,NA 
rayol-farm2_2019-03-30_19-45-59.wav,44100,16,60,1,H,512,hil,NULL,NULL,0.895005278554123,NA 
rayol-farm2_2019-03-30_19-47-59.wav,44100,16,60,1,H,512,hil,NULL,NULL,0.895947221104668,NA 
rayol-farm2_2019-03-30_19-50-00.wav,44100,16,60,1,H,512,hil,NULL,NULL,0.896611673901268,NA 
rayol-farm2_2019-03-30_19-52-00.wav,44100,16,60,1,H,512,hil,NULL,NULL,0.891084809351146,NA 
rayol-farm2_2019-03-30_19-54-00.wav,44100,16,60,1,H,512,hil,NULL,NULL,0.890382887506019,NA 
rayol-farm2_2019-03-30_19-56-00.wav,44100,16,60,1,H,512,hil,NULL,NULL,0.884020141448615,NA 
rayol-farm2_2019-03-30_19-58-00.wav,44100,16,60,1,H,512,hil,NULL,NULL,0.894991922937437,NA 
rayol-farm2_2019-03-30_20-00-00.wav,44100,16,60,1,H,512,hil,NULL,NULL,0.895382812732021,NA 
rayol-farm2_2019-03-30_20-02-00.wav,44100,16,60,1,H,512,hil,NULL,NULL,0.891484530087723,NA 
rayol-farm2_2019-03-30_20-04-00.wav,44100,16,60,1,H,512,hil,NULL,NULL,0.894547431510702,NA 
rayol-farm2_2019-03-30_20-06-01.wav,44100,16,60,1,H,512,hil,NULL,NULL,0.892870521147296,NA 
rayol-farm2_2019-03-30_20-08-01.wav,44100,16,60,1,H,512,hil,NULL,NULL,0.893390051949011,NA 
rayol-farm2_2019-03-30_20-10-01.wav,44100,16,60,1,H,512,hil,NULL,NULL,0.892824316404355,NA 
rayol-farm2_2019-03-30_20-12-01.wav,44100,16,60,1,H,512,hil,NULL,NULL,0.898190139868264,NA 
rayol-farm2_2019-03-30_20-14-01.wav,44100,16,60,1,H,512,hil,NULL,NULL,0.891173816849123,NA 
rayol-farm2_2019-03-30_20-16-01.wav,44100,16,60,1,H,512,hil,NULL,NULL,0.896846866254731,NA 
rayol-farm2_2019-03-30_20-18-01.wav,44100,16,60,1,H,512,hil,NULL,NULL,0.895948747584543,NA 
rayol-farm2_2019-03-30_20-20-01.wav,44100,16,60,1,H,512,hil,NULL,NULL,0.89549365439627,NA 
rayol-farm2_2019-03-30_20-22-01.wav,44100,16,60,1,H,512,hil,NULL,NULL,0.896534022207583,NA 
rayol-farm2_2019-03-30_20-24-02.wav,44100,16,60,1,H,512,hil,NULL,NULL,0.894902658185509,NA 
rayol-farm2_2019-03-30_20-26-02.wav,44100,16,60,1,H,512,hil,NULL,NULL,0.896324348481254,NA 
rayol-farm2_2019-03-30_20-28-02.wav,44100,16,60,1,H,512,hil,NULL,NULL,0.892722952383956,NA 
rayol-farm2_2019-03-30_20-30-02.wav,44100,16,60,1,H,512,hil,NULL,NULL,0.893226714337564,NA 
rayol-farm2_2019-03-30_20-32-02.wav,44100,16,60,1,H,512,hil,NULL,NULL,0.894042184617863,NA 
rayol-farm2_2019-03-30_20-34-02.wav,44100,16,60,1,H,512,hil,NULL,NULL,0.897125614148949,NA 
rayol-farm2_2019-03-30_20-36-02.wav,44100,16,60,1,H,512,hil,NULL,NULL,0.89114911851102,NA 
rayol-farm2_2019-03-30_20-38-02.wav,44100,16,60,1,H,512,hil,NULL,NULL,0.897313449260295,NA 
rayol-farm2_2019-03-30_20-40-03.wav,44100,16,60,1,H,512,hil,NULL,NULL,0.899216371074287,NA 
rayol-farm2_2019-03-30_20-42-03.wav,44100,16,60,1,H,512,hil,NULL,NULL,0.896439447260989,NA 
rayol-farm2_2019-03-30_20-44-03.wav,44100,16,60,1,H,512,hil,NULL,NULL,0.897866801208868,NA 
rayol-farm2_2019-03-30_20-46-03.wav,44100,16,60,1,H,512,hil,NULL,NULL,0.896977307810466,NA 
rayol-farm2_2019-03-30_20-48-03.wav,44100,16,60,1,H,512,hil,NULL,NULL,0.896714539201307,NA 
rayol-farm2_2019-03-30_20-50-03.wav,44100,16,60,1,H,512,hil,NULL,NULL,0.890898947701813,NA 
rayol-farm2_2019-03-30_20-52-03.wav,44100,16,60,1,H,512,hil,NULL,NULL,0.890579886172818,NA 
rayol-farm2_2019-03-30_20-54-03.wav,44100,16,60,1,H,512,hil,NULL,NULL,0.893449612272679,NA 
rayol-farm2_2019-03-30_20-56-04.wav,44100,16,60,1,H,512,hil,NULL,NULL,0.893876366559945,NA 
rayol-farm2_2019-03-30_20-58-04.wav,44100,16,60,1,H,512,hil,NULL,NULL,0.896193247990029,NA 
rayol-farm2_2019-03-30_21-00-04.wav,44100,16,60,1,H,512,hil,NULL,NULL,0.888281678334359,NA 
rayol-farm2_2019-03-30_21-02-04.wav,44100,16,60,1,H,512,hil,NULL,NULL,0.891899193613107,NA 
rayol-farm2_2019-03-30_21-04-04.wav,44100,16,60,1,H,512,hil,NULL,NULL,0.89511251689161,NA 
rayol-farm2_2019-03-30_21-06-04.wav,44100,16,60,1,H,512,hil,NULL,NULL,0.895453285185508,NA 
rayol-farm2_2019-03-30_21-08-04.wav,44100,16,60,1,H,512,hil,NULL,NULL,0.894748746487935,NA 
rayol-farm2_2019-03-30_21-10-04.wav,44100,16,60,1,H,512,hil,NULL,NULL,0.892922277517593,NA 
rayol-farm2_2019-03-30_21-12-04.wav,44100,16,60,1,H,512,hil,NULL,NULL,0.892348731451636,NA 
rayol-farm2_2019-03-30_21-14-05.wav,44100,16,60,1,H,512,hil,NULL,NULL,0.889219329537085,NA 
rayol-farm2_2019-03-30_21-16-05.wav,44100,16,60,1,H,512,hil,NULL,NULL,0.885900258163362,NA 
rayol-farm2_2019-03-30_21-18-05.wav,44100,16,60,1,H,512,hil,NULL,NULL,0.891303793571414,NA 
rayol-farm2_2019-03-30_21-20-05.wav,44100,16,60,1,H,512,hil,NULL,NULL,0.894625745572287,NA 
rayol-farm2_2019-03-30_21-22-05.wav,44100,16,60,1,H,512,hil,NULL,NULL,0.896410246160458,NA 
rayol-farm2_2019-03-30_21-24-05.wav,44100,16,60,1,H,512,hil,NULL,NULL,0.896812625738899,NA 
rayol-farm2_2019-03-30_21-26-05.wav,44100,16,60,1,H,512,hil,NULL,NULL,0.895612576527105,NA 
rayol-farm2_2019-03-30_21-28-05.wav,44100,16,60,1,H,512,hil,NULL,NULL,0.892952049850007,NA 
rayol-farm2_2019-03-30_21-30-06.wav,44100,16,60,1,H,512,hil,NULL,NULL,0.894274040256009,NA 
rayol-farm2_2019-03-30_21-32-06.wav,44100,16,60,1,H,512,hil,NULL,NULL,0.894496369400207,NA 
rayol-farm2_2019-03-30_21-34-06.wav,44100,16,60,1,H,512,hil,NULL,NULL,0.892997471351071,NA 
rayol-farm2_2019-03-30_21-36-06.wav,44100,16,60,1,H,512,hil,NULL,NULL,0.896307864954187,NA 
rayol-farm2_2019-03-30_21-38-06.wav,44100,16,60,1,H,512,hil,NULL,NULL,0.894770911920225,NA 
rayol-farm2_2019-03-30_21-40-06.wav,44100,16,60,1,H,512,hil,NULL,NULL,0.89132024664784,NA 
rayol-farm2_2019-03-30_21-42-06.wav,44100,16,60,1,H,512,hil,NULL,NULL,0.893253897123768,NA 
rayol-farm2_2019-03-30_21-44-06.wav,44100,16,60,1,H,512,hil,NULL,NULL,0.895561800662687,NA 
rayol-farm2_2019-03-30_21-46-07.wav,44100,16,60,1,H,512,hil,NULL,NULL,0.896998229683956,NA 
rayol-farm2_2019-03-30_21-48-07.wav,44100,16,60,1,H,512,hil,NULL,NULL,0.898383459436762,NA 
rayol-farm2_2019-03-30_21-50-07.wav,44100,16,60,1,H,512,hil,NULL,NULL,0.891448772068583,NA 
rayol-farm2_2019-03-30_21-52-07.wav,44100,16,60,1,H,512,hil,NULL,NULL,0.892472874885121,NA 
rayol-farm2_2019-03-30_21-54-07.wav,44100,16,60,1,H,512,hil,NULL,NULL,0.896385546433397,NA 
rayol-farm2_2019-03-30_21-56-07.wav,44100,16,60,1,H,512,hil,NULL,NULL,0.897014342078568,NA 
rayol-farm2_2019-03-30_21-58-07.wav,44100,16,60,1,H,512,hil,NULL,NULL,0.895166673311288,NA 
rayol-farm2_2019-03-30_22-00-07.wav,44100,16,60,1,H,512,hil,NULL,NULL,0.883225685154843,NA 
rayol-farm2_2019-03-30_22-02-08.wav,44100,16,60,1,H,512,hil,NULL,NULL,0.893297058226766,NA 
rayol-farm2_2019-03-30_22-04-08.wav,44100,16,60,1,H,512,hil,NULL,NULL,0.890836984623473,NA 
rayol-farm2_2019-03-30_22-06-08.wav,44100,16,60,1,H,512,hil,NULL,NULL,0.892873504400429,NA 
rayol-farm2_2019-03-30_22-08-08.wav,44100,16,60,1,H,512,hil,NULL,NULL,0.893600569257082,NA 
rayol-farm2_2019-03-30_22-10-08.wav,44100,16,60,1,H,512,hil,NULL,NULL,0.897046875544001,NA 
rayol-farm2_2019-03-30_22-12-08.wav,44100,16,60,1,H,512,hil,NULL,NULL,0.896235959444518,NA 
rayol-farm2_2019-03-30_22-14-08.wav,44100,16,60,1,H,512,hil,NULL,NULL,0.895804125406876,NA 
rayol-farm2_2019-03-30_22-16-08.wav,44100,16,60,1,H,512,hil,NULL,NULL,0.894098684126365,NA 
rayol-farm2_2019-03-30_22-18-08.wav,44100,16,60,1,H,512,hil,NULL,NULL,0.895034827430884,NA 
rayol-farm2_2019-03-30_22-20-09.wav,44100,16,60,1,H,512,hil,NULL,NULL,0.896606658676549,NA 
rayol-farm2_2019-03-30_22-22-09.wav,44100,16,60,1,H,512,hil,NULL,NULL,0.898286154219454,NA 
rayol-farm2_2019-03-30_22-24-09.wav,44100,16,60,1,H,512,hil,NULL,NULL,0.897072250734882,NA 
rayol-farm2_2019-03-30_22-26-09.wav,44100,16,60,1,H,512,hil,NULL,NULL,0.892955341410333,NA 
rayol-farm2_2019-03-30_22-28-09.wav,44100,16,60,1,H,512,hil,NULL,NULL,0.894526636026175,NA 
rayol-farm2_2019-03-30_22-30-09.wav,44100,16,60,1,H,512,hil,NULL,NULL,0.893216840420631,NA 
rayol-farm2_2019-03-30_22-32-09.wav,44100,16,60,1,H,512,hil,NULL,NULL,0.893750306532646,NA 
rayol-farm2_2019-03-30_22-34-09.wav,44100,16,60,1,H,512,hil,NULL,NULL,0.893339267713616,NA 
rayol-farm2_2019-03-30_22-36-10.wav,44100,16,60,1,H,512,hil,NULL,NULL,0.896140762193895,NA 
rayol-farm2_2019-03-30_22-38-10.wav,44100,16,60,1,H,512,hil,NULL,NULL,0.888453767970527,NA 
rayol-farm2_2019-03-30_22-40-10.wav,44100,16,60,1,H,512,hil,NULL,NULL,0.896363058119534,NA 
rayol-farm2_2019-03-30_22-42-10.wav,44100,16,60,1,H,512,hil,NULL,NULL,0.896478852657229,NA 
rayol-farm2_2019-03-30_22-44-10.wav,44100,16,60,1,H,512,hil,NULL,NULL,0.894845074605775,NA 
rayol-farm2_2019-03-30_22-46-10.wav,44100,16,60,1,H,512,hil,NULL,NULL,0.896185989721304,NA 
rayol-farm2_2019-03-30_22-48-10.wav,44100,16,60,1,H,512,hil,NULL,NULL,0.894955374269388,NA 
rayol-farm2_2019-03-30_22-50-10.wav,44100,16,60,1,H,512,hil,NULL,NULL,0.888544138206391,NA 
rayol-farm2_2019-03-30_22-52-11.wav,44100,16,60,1,H,512,hil,NULL,NULL,0.886178519930043,NA 
rayol-farm2_2019-03-30_22-54-11.wav,44100,16,60,1,H,512,hil,NULL,NULL,0.892295826992335,NA 
rayol-farm2_2019-03-30_22-56-11.wav,44100,16,60,1,H,512,hil,NULL,NULL,0.889600486504993,NA 
rayol-farm2_2019-03-30_22-58-11.wav,44100,16,60,1,H,512,hil,NULL,NULL,0.888380886878976,NA 
rayol-farm2_2019-03-30_23-00-11.wav,44100,16,60,1,H,512,hil,NULL,NULL,0.893671208580883,NA 
rayol-farm2_2019-03-30_23-02-11.wav,44100,16,60,1,H,512,hil,NULL,NULL,0.893846799466312,NA 
rayol-farm2_2019-03-30_23-04-11.wav,44100,16,60,1,H,512,hil,NULL,NULL,0.896849633839636,NA 
rayol-farm2_2019-03-30_23-06-11.wav,44100,16,60,1,H,512,hil,NULL,NULL,0.897646209356757,NA 
rayol-farm2_2019-03-30_23-08-12.wav,44100,16,60,1,H,512,hil,NULL,NULL,0.897226819671337,NA 
rayol-farm2_2019-03-30_23-10-12.wav,44100,16,60,1,H,512,hil,NULL,NULL,0.899041785009717,NA 
rayol-farm2_2019-03-30_23-12-12.wav,44100,16,60,1,H,512,hil,NULL,NULL,0.890836002054464,NA 
rayol-farm2_2019-03-30_23-14-12.wav,44100,16,60,1,H,512,hil,NULL,NULL,0.894129708683327,NA 
rayol-farm2_2019-03-30_23-16-12.wav,44100,16,60,1,H,512,hil,NULL,NULL,0.895720183975707,NA 
rayol-farm2_2019-03-30_23-18-12.wav,44100,16,60,1,H,512,hil,NULL,NULL,0.894896796341088,NA 
rayol-farm2_2019-03-30_23-20-12.wav,44100,16,60,1,H,512,hil,NULL,NULL,0.89477556393893,NA 
rayol-farm2_2019-03-30_23-22-12.wav,44100,16,60,1,H,512,hil,NULL,NULL,0.897731030055413,NA 
rayol-farm2_2019-03-30_23-24-12.wav,44100,16,60,1,H,512,hil,NULL,NULL,0.896435619591708,NA 
rayol-farm2_2019-03-30_23-26-13.wav,44100,16,60,1,H,512,hil,NULL,NULL,0.897050749469642,NA 
rayol-farm2_2019-03-30_23-28-13.wav,44100,16,60,1,H,512,hil,NULL,NULL,0.898317407483597,NA 
rayol-farm2_2019-03-30_23-30-13.wav,44100,16,60,1,H,512,hil,NULL,NULL,0.897645293269561,NA 
rayol-farm2_2019-03-30_23-32-13.wav,44100,16,60,1,H,512,hil,NULL,NULL,0.898787347386468,NA 
rayol-farm2_2019-03-30_23-34-13.wav,44100,16,60,1,H,512,hil,NULL,NULL,0.898784816855626,NA 
rayol-farm2_2019-03-30_23-36-13.wav,44100,16,60,1,H,512,hil,NULL,NULL,0.897833936075043,NA 
rayol-farm2_2019-03-30_23-38-13.wav,44100,16,60,1,H,512,hil,NULL,NULL,0.899330075111696,NA 
rayol-farm2_2019-03-30_23-40-13.wav,44100,16,60,1,H,512,hil,NULL,NULL,0.892442834600832,NA 
rayol-farm2_2019-03-30_23-42-14.wav,44100,16,60,1,H,512,hil,NULL,NULL,0.895017439629912,NA 
rayol-farm2_2019-03-30_23-44-14.wav,44100,16,60,1,H,512,hil,NULL,NULL,0.890714891389934,NA 
rayol-farm2_2019-03-30_23-46-14.wav,44100,16,60,1,H,512,hil,NULL,NULL,0.897309768801577,NA 
rayol-farm2_2019-03-30_23-48-14.wav,44100,16,60,1,H,512,hil,NULL,NULL,0.898720952757886,NA 
rayol-farm2_2019-03-30_23-50-14.wav,44100,16,60,1,H,512,hil,NULL,NULL,0.898647167335368,NA 
rayol-farm2_2019-03-30_23-52-14.wav,44100,16,60,1,H,512,hil,NULL,NULL,0.898008842735402,NA 
rayol-farm2_2019-03-30_23-54-14.wav,44100,16,60,1,H,512,hil,NULL,NULL,0.896677347907658,NA 
rayol-farm2_2019-03-30_23-56-14.wav,44100,16,60,1,H,512,hil,NULL,NULL,0.898639122532574,NA 
rayol-farm2_2019-03-30_23-58-15.wav,44100,16,60,1,H,512,hil,NULL,NULL,0.89766031622062,NA
