FILENAME,SAMPLINGRATE,BIT,DURATION,CHANNELS,INDEX,FFT_W,MIN_FREQ,MAX_FREQ,LEFT_CHANNEL,RIGHT_CHANNEL
rayol-farm2_2019-05-10_00-00-02.wav,44100,16,60,1,bioacoustic_index,512,2000,8000,1.32716133222513,NA 
rayol-farm2_2019-05-10_00-02-02.wav,44100,16,60,1,bioacoustic_index,512,2000,8000,1.26504106702145,NA 
rayol-farm2_2019-05-10_00-04-02.wav,44100,16,60,1,bioacoustic_index,512,2000,8000,1.24473949122793,NA 
rayol-farm2_2019-05-10_00-06-02.wav,44100,16,60,1,bioacoustic_index,512,2000,8000,1.27069434539014,NA 
rayol-farm2_2019-05-10_00-08-02.wav,44100,16,60,1,bioacoustic_index,512,2000,8000,1.29315270265063,NA 
rayol-farm2_2019-05-10_00-10-02.wav,44100,16,60,1,bioacoustic_index,512,2000,8000,1.24257417491403,NA 
rayol-farm2_2019-05-10_00-12-03.wav,44100,16,60,1,bioacoustic_index,512,2000,8000,1.33298293724614,NA 
rayol-farm2_2019-05-10_00-14-03.wav,44100,16,60,1,bioacoustic_index,512,2000,8000,1.3744080999984,NA 
rayol-farm2_2019-05-10_00-16-03.wav,44100,16,60,1,bioacoustic_index,512,2000,8000,1.30137749095299,NA 
rayol-farm2_2019-05-10_00-18-03.wav,44100,16,60,1,bioacoustic_index,512,2000,8000,1.24966921790873,NA 
rayol-farm2_2019-05-10_00-20-03.wav,44100,16,60,1,bioacoustic_index,512,2000,8000,1.25106000951103,NA 
rayol-farm2_2019-05-10_00-22-03.wav,44100,16,60,1,bioacoustic_index,512,2000,8000,1.29950861210101,NA 
rayol-farm2_2019-05-10_00-24-03.wav,44100,16,60,1,bioacoustic_index,512,2000,8000,1.28953176694684,NA 
rayol-farm2_2019-05-10_00-26-03.wav,44100,16,60,1,bioacoustic_index,512,2000,8000,1.25675930163163,NA 
rayol-farm2_2019-05-10_00-28-04.wav,44100,16,60,1,bioacoustic_index,512,2000,8000,1.30080689168658,NA 
rayol-farm2_2019-05-10_00-30-04.wav,44100,16,60,1,bioacoustic_index,512,2000,8000,1.36623039585529,NA 
rayol-farm2_2019-05-10_00-32-04.wav,44100,16,60,1,bioacoustic_index,512,2000,8000,1.31539443028227,NA 
rayol-farm2_2019-05-10_00-34-04.wav,44100,16,60,1,bioacoustic_index,512,2000,8000,1.34279158954059,NA 
rayol-farm2_2019-05-10_00-36-04.wav,44100,16,60,1,bioacoustic_index,512,2000,8000,1.31221709202674,NA 
rayol-farm2_2019-05-10_00-38-04.wav,44100,16,60,1,bioacoustic_index,512,2000,8000,1.32072842740764,NA 
rayol-farm2_2019-05-10_00-40-04.wav,44100,16,60,1,bioacoustic_index,512,2000,8000,1.28011404322119,NA 
rayol-farm2_2019-05-10_00-42-04.wav,44100,16,60,1,bioacoustic_index,512,2000,8000,1.35140476012015,NA 
rayol-farm2_2019-05-10_00-44-05.wav,44100,16,60,1,bioacoustic_index,512,2000,8000,1.32836808311518,NA 
rayol-farm2_2019-05-10_00-46-05.wav,44100,16,60,1,bioacoustic_index,512,2000,8000,1.30335560957273,NA 
rayol-farm2_2019-05-10_00-48-05.wav,44100,16,60,1,bioacoustic_index,512,2000,8000,1.3067280057253,NA 
rayol-farm2_2019-05-10_00-50-05.wav,44100,16,60,1,bioacoustic_index,512,2000,8000,1.28352718176425,NA 
rayol-farm2_2019-05-10_00-52-05.wav,44100,16,60,1,bioacoustic_index,512,2000,8000,1.98778745941253,NA 
rayol-farm2_2019-05-10_00-54-05.wav,44100,16,60,1,bioacoustic_index,512,2000,8000,1.27042418610392,NA 
rayol-farm2_2019-05-10_00-56-05.wav,44100,16,60,1,bioacoustic_index,512,2000,8000,1.2363950279494,NA 
rayol-farm2_2019-05-10_00-58-05.wav,44100,16,60,1,bioacoustic_index,512,2000,8000,1.27615805020649,NA 
rayol-farm2_2019-05-10_01-00-06.wav,44100,16,60,1,bioacoustic_index,512,2000,8000,1.22395325139126,NA 
rayol-farm2_2019-05-10_01-02-06.wav,44100,16,60,1,bioacoustic_index,512,2000,8000,1.30697725553878,NA 
rayol-farm2_2019-05-10_01-04-06.wav,44100,16,60,1,bioacoustic_index,512,2000,8000,1.2550482013314,NA 
rayol-farm2_2019-05-10_01-06-06.wav,44100,16,60,1,bioacoustic_index,512,2000,8000,1.27138061628523,NA 
rayol-farm2_2019-05-10_01-08-06.wav,44100,16,60,1,bioacoustic_index,512,2000,8000,1.33238418458646,NA 
rayol-farm2_2019-05-10_01-10-06.wav,44100,16,60,1,bioacoustic_index,512,2000,8000,1.26780124027365,NA 
rayol-farm2_2019-05-10_01-12-06.wav,44100,16,60,1,bioacoustic_index,512,2000,8000,1.29804756912153,NA 
rayol-farm2_2019-05-10_01-14-06.wav,44100,16,60,1,bioacoustic_index,512,2000,8000,1.36833535605689,NA 
rayol-farm2_2019-05-10_01-16-07.wav,44100,16,60,1,bioacoustic_index,512,2000,8000,1.61714256784292,NA 
rayol-farm2_2019-05-10_01-18-07.wav,44100,16,60,1,bioacoustic_index,512,2000,8000,1.25297217668563,NA 
rayol-farm2_2019-05-10_01-20-07.wav,44100,16,60,1,bioacoustic_index,512,2000,8000,1.26060250015486,NA 
rayol-farm2_2019-05-10_01-22-07.wav,44100,16,60,1,bioacoustic_index,512,2000,8000,1.31101559441431,NA 
rayol-farm2_2019-05-10_01-24-07.wav,44100,16,60,1,bioacoustic_index,512,2000,8000,1.27326231624618,NA 
rayol-farm2_2019-05-10_01-26-07.wav,44100,16,60,1,bioacoustic_index,512,2000,8000,1.21527211490884,NA 
rayol-farm2_2019-05-10_01-28-07.wav,44100,16,60,1,bioacoustic_index,512,2000,8000,1.31783686718728,NA 
rayol-farm2_2019-05-10_01-30-07.wav,44100,16,60,1,bioacoustic_index,512,2000,8000,1.27546560479177,NA 
rayol-farm2_2019-05-10_01-32-08.wav,44100,16,60,1,bioacoustic_index,512,2000,8000,1.27614629777388,NA 
rayol-farm2_2019-05-10_01-34-08.wav,44100,16,60,1,bioacoustic_index,512,2000,8000,1.28210498549273,NA 
rayol-farm2_2019-05-10_01-36-08.wav,44100,16,60,1,bioacoustic_index,512,2000,8000,1.31275588871454,NA 
rayol-farm2_2019-05-10_01-38-08.wav,44100,16,60,1,bioacoustic_index,512,2000,8000,1.24261702835477,NA 
rayol-farm2_2019-05-10_01-40-08.wav,44100,16,60,1,bioacoustic_index,512,2000,8000,1.24883188335962,NA 
rayol-farm2_2019-05-10_01-42-08.wav,44100,16,60,1,bioacoustic_index,512,2000,8000,1.27566911677908,NA 
rayol-farm2_2019-05-10_01-44-08.wav,44100,16,60,1,bioacoustic_index,512,2000,8000,1.30780976504373,NA 
rayol-farm2_2019-05-10_01-46-08.wav,44100,16,60,1,bioacoustic_index,512,2000,8000,1.32695450191083,NA 
rayol-farm2_2019-05-10_01-48-09.wav,44100,16,60,1,bioacoustic_index,512,2000,8000,1.27268914028489,NA 
rayol-farm2_2019-05-10_01-50-09.wav,44100,16,60,1,bioacoustic_index,512,2000,8000,1.3120336544605,NA 
rayol-farm2_2019-05-10_01-52-09.wav,44100,16,60,1,bioacoustic_index,512,2000,8000,1.22629722171082,NA 
rayol-farm2_2019-05-10_01-54-09.wav,44100,16,60,1,bioacoustic_index,512,2000,8000,1.30785289558353,NA 
rayol-farm2_2019-05-10_01-56-09.wav,44100,16,60,1,bioacoustic_index,512,2000,8000,1.39436969092793,NA 
rayol-farm2_2019-05-10_01-58-09.wav,44100,16,60,1,bioacoustic_index,512,2000,8000,1.87116695906047,NA 
rayol-farm2_2019-05-10_02-00-09.wav,44100,16,60,1,bioacoustic_index,512,2000,8000,1.31811691688211,NA 
rayol-farm2_2019-05-10_02-02-09.wav,44100,16,60,1,bioacoustic_index,512,2000,8000,1.26055247640602,NA 
rayol-farm2_2019-05-10_02-04-10.wav,44100,16,60,1,bioacoustic_index,512,2000,8000,1.29961940545375,NA 
rayol-farm2_2019-05-10_02-06-10.wav,44100,16,60,1,bioacoustic_index,512,2000,8000,1.29703718109124,NA 
rayol-farm2_2019-05-10_02-08-10.wav,44100,16,60,1,bioacoustic_index,512,2000,8000,1.33350587918353,NA 
rayol-farm2_2019-05-10_02-10-10.wav,44100,16,60,1,bioacoustic_index,512,2000,8000,1.25406436181052,NA 
rayol-farm2_2019-05-10_02-12-10.wav,44100,16,60,1,bioacoustic_index,512,2000,8000,1.28834842612205,NA 
rayol-farm2_2019-05-10_02-14-10.wav,44100,16,60,1,bioacoustic_index,512,2000,8000,1.23026788185876,NA 
rayol-farm2_2019-05-10_02-16-10.wav,44100,16,60,1,bioacoustic_index,512,2000,8000,1.23449643799568,NA 
rayol-farm2_2019-05-10_02-18-10.wav,44100,16,60,1,bioacoustic_index,512,2000,8000,1.6956178687396,NA 
rayol-farm2_2019-05-10_02-20-11.wav,44100,16,60,1,bioacoustic_index,512,2000,8000,1.32224815307563,NA 
rayol-farm2_2019-05-10_02-22-11.wav,44100,16,60,1,bioacoustic_index,512,2000,8000,1.36981883398531,NA 
rayol-farm2_2019-05-10_02-24-11.wav,44100,16,60,1,bioacoustic_index,512,2000,8000,1.24544021725482,NA 
rayol-farm2_2019-05-10_02-26-11.wav,44100,16,60,1,bioacoustic_index,512,2000,8000,1.33800401656617,NA 
rayol-farm2_2019-05-10_02-28-11.wav,44100,16,60,1,bioacoustic_index,512,2000,8000,1.34936248035089,NA 
rayol-farm2_2019-05-10_02-30-11.wav,44100,16,60,1,bioacoustic_index,512,2000,8000,1.33647821240823,NA 
rayol-farm2_2019-05-10_02-32-11.wav,44100,16,60,1,bioacoustic_index,512,2000,8000,1.54235935300936,NA 
rayol-farm2_2019-05-10_02-34-11.wav,44100,16,60,1,bioacoustic_index,512,2000,8000,1.81555778546623,NA 
rayol-farm2_2019-05-10_02-36-12.wav,44100,16,60,1,bioacoustic_index,512,2000,8000,1.28864516960694,NA 
rayol-farm2_2019-05-10_02-38-12.wav,44100,16,60,1,bioacoustic_index,512,2000,8000,1.2936020842287,NA 
rayol-farm2_2019-05-10_02-40-12.wav,44100,16,60,1,bioacoustic_index,512,2000,8000,1.2386274651687,NA 
rayol-farm2_2019-05-10_02-42-12.wav,44100,16,60,1,bioacoustic_index,512,2000,8000,1.25541603705789,NA 
rayol-farm2_2019-05-10_02-44-12.wav,44100,16,60,1,bioacoustic_index,512,2000,8000,1.22974343069142,NA 
rayol-farm2_2019-05-10_02-46-12.wav,44100,16,60,1,bioacoustic_index,512,2000,8000,1.32834391073794,NA 
rayol-farm2_2019-05-10_02-48-12.wav,44100,16,60,1,bioacoustic_index,512,2000,8000,1.34831856430641,NA 
rayol-farm2_2019-05-10_02-50-12.wav,44100,16,60,1,bioacoustic_index,512,2000,8000,1.41750255835844,NA 
rayol-farm2_2019-05-10_02-52-12.wav,44100,16,60,1,bioacoustic_index,512,2000,8000,1.44912674326544,NA 
rayol-farm2_2019-05-10_02-54-13.wav,44100,16,60,1,bioacoustic_index,512,2000,8000,1.37777934186499,NA 
rayol-farm2_2019-05-10_02-56-13.wav,44100,16,60,1,bioacoustic_index,512,2000,8000,1.32172232083399,NA 
rayol-farm2_2019-05-10_02-58-13.wav,44100,16,60,1,bioacoustic_index,512,2000,8000,1.32992346020313,NA 
rayol-farm2_2019-05-10_03-00-13.wav,44100,16,60,1,bioacoustic_index,512,2000,8000,1.38469975339361,NA 
rayol-farm2_2019-05-10_03-02-13.wav,44100,16,60,1,bioacoustic_index,512,2000,8000,1.42102949329332,NA 
rayol-farm2_2019-05-10_03-04-13.wav,44100,16,60,1,bioacoustic_index,512,2000,8000,1.31854551156003,NA 
rayol-farm2_2019-05-10_03-06-13.wav,44100,16,60,1,bioacoustic_index,512,2000,8000,1.33061281407021,NA 
rayol-farm2_2019-05-10_03-08-13.wav,44100,16,60,1,bioacoustic_index,512,2000,8000,1.35984597656434,NA 
rayol-farm2_2019-05-10_03-10-14.wav,44100,16,60,1,bioacoustic_index,512,2000,8000,1.26663418982805,NA 
rayol-farm2_2019-05-10_03-12-14.wav,44100,16,60,1,bioacoustic_index,512,2000,8000,1.26040123128353,NA 
rayol-farm2_2019-05-10_03-14-14.wav,44100,16,60,1,bioacoustic_index,512,2000,8000,1.28730619299088,NA 
rayol-farm2_2019-05-10_03-16-14.wav,44100,16,60,1,bioacoustic_index,512,2000,8000,1.30528671460461,NA 
rayol-farm2_2019-05-10_03-18-14.wav,44100,16,60,1,bioacoustic_index,512,2000,8000,1.20620609701901,NA 
rayol-farm2_2019-05-10_03-20-14.wav,44100,16,60,1,bioacoustic_index,512,2000,8000,1.3407987205799,NA 
rayol-farm2_2019-05-10_03-22-14.wav,44100,16,60,1,bioacoustic_index,512,2000,8000,1.38469250293556,NA 
rayol-farm2_2019-05-10_03-24-14.wav,44100,16,60,1,bioacoustic_index,512,2000,8000,1.33619848068131,NA 
rayol-farm2_2019-05-10_03-26-15.wav,44100,16,60,1,bioacoustic_index,512,2000,8000,1.39813080206985,NA 
rayol-farm2_2019-05-10_03-28-15.wav,44100,16,60,1,bioacoustic_index,512,2000,8000,1.35108198625448,NA 
rayol-farm2_2019-05-10_03-30-15.wav,44100,16,60,1,bioacoustic_index,512,2000,8000,1.32587107831379,NA 
rayol-farm2_2019-05-10_03-32-15.wav,44100,16,60,1,bioacoustic_index,512,2000,8000,1.33286872013704,NA 
rayol-farm2_2019-05-10_03-34-17.wav,44100,16,60,1,bioacoustic_index,512,2000,8000,1.38635172599277,NA 
rayol-farm2_2019-05-10_03-36-17.wav,44100,16,60,1,bioacoustic_index,512,2000,8000,1.69083566500129,NA 
rayol-farm2_2019-05-10_03-38-17.wav,44100,16,60,1,bioacoustic_index,512,2000,8000,1.39149427327273,NA 
rayol-farm2_2019-05-10_03-40-17.wav,44100,16,60,1,bioacoustic_index,512,2000,8000,1.40119915845699,NA 
rayol-farm2_2019-05-10_03-42-17.wav,44100,16,60,1,bioacoustic_index,512,2000,8000,1.38083101456752,NA 
rayol-farm2_2019-05-10_03-44-17.wav,44100,16,60,1,bioacoustic_index,512,2000,8000,1.32442548598328,NA 
rayol-farm2_2019-05-10_03-46-17.wav,44100,16,60,1,bioacoustic_index,512,2000,8000,1.4088335853806,NA 
rayol-farm2_2019-05-10_03-48-17.wav,44100,16,60,1,bioacoustic_index,512,2000,8000,1.41157754486919,NA 
rayol-farm2_2019-05-10_03-50-18.wav,44100,16,60,1,bioacoustic_index,512,2000,8000,1.32621272549825,NA 
rayol-farm2_2019-05-10_03-52-18.wav,44100,16,60,1,bioacoustic_index,512,2000,8000,1.29352605407889,NA 
rayol-farm2_2019-05-10_03-54-18.wav,44100,16,60,1,bioacoustic_index,512,2000,8000,1.3753466065676,NA 
rayol-farm2_2019-05-10_03-56-18.wav,44100,16,60,1,bioacoustic_index,512,2000,8000,1.34756230089875,NA 
rayol-farm2_2019-05-10_03-58-18.wav,44100,16,60,1,bioacoustic_index,512,2000,8000,1.4140183528823,NA 
rayol-farm2_2019-05-10_04-00-18.wav,44100,16,60,1,bioacoustic_index,512,2000,8000,1.33219307228872,NA 
rayol-farm2_2019-05-10_04-02-18.wav,44100,16,60,1,bioacoustic_index,512,2000,8000,1.35818634496775,NA 
rayol-farm2_2019-05-10_04-04-18.wav,44100,16,60,1,bioacoustic_index,512,2000,8000,1.38999851818646,NA 
rayol-farm2_2019-05-10_04-06-19.wav,44100,16,60,1,bioacoustic_index,512,2000,8000,1.41042221000697,NA 
rayol-farm2_2019-05-10_04-08-19.wav,44100,16,60,1,bioacoustic_index,512,2000,8000,1.41432663765465,NA 
rayol-farm2_2019-05-10_04-10-19.wav,44100,16,60,1,bioacoustic_index,512,2000,8000,1.45210891174856,NA 
rayol-farm2_2019-05-10_04-12-19.wav,44100,16,60,1,bioacoustic_index,512,2000,8000,1.30235017492454,NA 
rayol-farm2_2019-05-10_04-14-19.wav,44100,16,60,1,bioacoustic_index,512,2000,8000,1.32271557279823,NA 
rayol-farm2_2019-05-10_04-16-19.wav,44100,16,60,1,bioacoustic_index,512,2000,8000,1.44707107986702,NA 
rayol-farm2_2019-05-10_04-18-19.wav,44100,16,60,1,bioacoustic_index,512,2000,8000,1.61611810260478,NA 
rayol-farm2_2019-05-10_04-20-19.wav,44100,16,60,1,bioacoustic_index,512,2000,8000,1.3454852310605,NA 
rayol-farm2_2019-05-10_04-22-20.wav,44100,16,60,1,bioacoustic_index,512,2000,8000,1.36439525215849,NA 
rayol-farm2_2019-05-10_04-24-20.wav,44100,16,60,1,bioacoustic_index,512,2000,8000,1.3796460453456,NA 
rayol-farm2_2019-05-10_04-26-20.wav,44100,16,60,1,bioacoustic_index,512,2000,8000,1.36567797582368,NA 
rayol-farm2_2019-05-10_04-28-20.wav,44100,16,60,1,bioacoustic_index,512,2000,8000,1.42863565776177,NA 
rayol-farm2_2019-05-10_04-30-20.wav,44100,16,60,1,bioacoustic_index,512,2000,8000,1.31211867620071,NA 
rayol-farm2_2019-05-10_04-32-20.wav,44100,16,60,1,bioacoustic_index,512,2000,8000,1.33673147730542,NA 
rayol-farm2_2019-05-10_04-34-20.wav,44100,16,60,1,bioacoustic_index,512,2000,8000,1.30169920543731,NA 
rayol-farm2_2019-05-10_04-36-20.wav,44100,16,60,1,bioacoustic_index,512,2000,8000,1.21632546041144,NA 
rayol-farm2_2019-05-10_04-38-21.wav,44100,16,60,1,bioacoustic_index,512,2000,8000,1.36699543177218,NA 
rayol-farm2_2019-05-10_04-40-21.wav,44100,16,60,1,bioacoustic_index,512,2000,8000,1.32584389654211,NA 
rayol-farm2_2019-05-10_04-42-21.wav,44100,16,60,1,bioacoustic_index,512,2000,8000,1.23424055938638,NA 
rayol-farm2_2019-05-10_04-44-21.wav,44100,16,60,1,bioacoustic_index,512,2000,8000,1.22018108709572,NA 
rayol-farm2_2019-05-10_04-46-21.wav,44100,16,60,1,bioacoustic_index,512,2000,8000,1.22897935092008,NA 
rayol-farm2_2019-05-10_04-48-21.wav,44100,16,60,1,bioacoustic_index,512,2000,8000,1.30557000163055,NA 
rayol-farm2_2019-05-10_04-50-21.wav,44100,16,60,1,bioacoustic_index,512,2000,8000,1.22665486372177,NA 
rayol-farm2_2019-05-10_04-52-21.wav,44100,16,60,1,bioacoustic_index,512,2000,8000,1.28530519006105,NA 
rayol-farm2_2019-05-10_04-54-22.wav,44100,16,60,1,bioacoustic_index,512,2000,8000,1.3216990292653,NA 
rayol-farm2_2019-05-10_04-56-22.wav,44100,16,60,1,bioacoustic_index,512,2000,8000,1.31971259232652,NA 
rayol-farm2_2019-05-10_04-58-22.wav,44100,16,60,1,bioacoustic_index,512,2000,8000,1.31995248697789,NA 
rayol-farm2_2019-05-10_05-00-22.wav,44100,16,60,1,bioacoustic_index,512,2000,8000,1.3114011563297,NA 
rayol-farm2_2019-05-10_05-02-22.wav,44100,16,60,1,bioacoustic_index,512,2000,8000,1.24972828898042,NA 
rayol-farm2_2019-05-10_05-04-22.wav,44100,16,60,1,bioacoustic_index,512,2000,8000,1.66292641291533,NA 
rayol-farm2_2019-05-10_05-06-22.wav,44100,16,60,1,bioacoustic_index,512,2000,8000,2.0626054569417,NA 
rayol-farm2_2019-05-10_05-08-22.wav,44100,16,60,1,bioacoustic_index,512,2000,8000,3.47209775530553,NA 
rayol-farm2_2019-05-10_05-10-23.wav,44100,16,60,1,bioacoustic_index,512,2000,8000,2.08365507569991,NA 
rayol-farm2_2019-05-10_05-12-23.wav,44100,16,60,1,bioacoustic_index,512,2000,8000,2.33321516138783,NA 
rayol-farm2_2019-05-10_05-14-23.wav,44100,16,60,1,bioacoustic_index,512,2000,8000,2.29334448294769,NA 
rayol-farm2_2019-05-10_05-16-23.wav,44100,16,60,1,bioacoustic_index,512,2000,8000,2.42180398143251,NA 
rayol-farm2_2019-05-10_05-18-23.wav,44100,16,60,1,bioacoustic_index,512,2000,8000,2.66981093173342,NA 
rayol-farm2_2019-05-10_05-20-23.wav,44100,16,60,1,bioacoustic_index,512,2000,8000,2.38989422142223,NA 
rayol-farm2_2019-05-10_05-22-23.wav,44100,16,60,1,bioacoustic_index,512,2000,8000,2.09016939554002,NA 
rayol-farm2_2019-05-10_05-24-23.wav,44100,16,60,1,bioacoustic_index,512,2000,8000,2.26642877467072,NA 
rayol-farm2_2019-05-10_05-26-24.wav,44100,16,60,1,bioacoustic_index,512,2000,8000,2.24417328661216,NA 
rayol-farm2_2019-05-10_05-28-24.wav,44100,16,60,1,bioacoustic_index,512,2000,8000,2.45709448686227,NA 
rayol-farm2_2019-05-10_05-30-24.wav,44100,16,60,1,bioacoustic_index,512,2000,8000,2.97533745750312,NA 
rayol-farm2_2019-05-10_05-32-24.wav,44100,16,60,1,bioacoustic_index,512,2000,8000,2.99010225780372,NA 
rayol-farm2_2019-05-10_05-34-24.wav,44100,16,60,1,bioacoustic_index,512,2000,8000,3.18678316615147,NA 
rayol-farm2_2019-05-10_05-36-24.wav,44100,16,60,1,bioacoustic_index,512,2000,8000,2.65652151350285,NA 
rayol-farm2_2019-05-10_05-38-24.wav,44100,16,60,1,bioacoustic_index,512,2000,8000,3.10017266301442,NA 
rayol-farm2_2019-05-10_05-40-24.wav,44100,16,60,1,bioacoustic_index,512,2000,8000,2.88416023078925,NA 
rayol-farm2_2019-05-10_05-42-25.wav,44100,16,60,1,bioacoustic_index,512,2000,8000,2.98130731423466,NA 
rayol-farm2_2019-05-10_05-44-25.wav,44100,16,60,1,bioacoustic_index,512,2000,8000,2.72644478034367,NA 
rayol-farm2_2019-05-10_05-46-25.wav,44100,16,60,1,bioacoustic_index,512,2000,8000,2.65198189887832,NA 
rayol-farm2_2019-05-10_05-48-25.wav,44100,16,60,1,bioacoustic_index,512,2000,8000,2.85051885872994,NA 
rayol-farm2_2019-05-10_05-50-25.wav,44100,16,59.87,1,bioacoustic_index,512,2000,8000,2.59720820154354,NA 
rayol-farm2_2019-05-10_05-52-25.wav,44100,16,60,1,bioacoustic_index,512,2000,8000,2.64739237042138,NA 
rayol-farm2_2019-05-10_05-54-25.wav,44100,16,60,1,bioacoustic_index,512,2000,8000,3.71184615448187,NA 
rayol-farm2_2019-05-10_05-56-25.wav,44100,16,60,1,bioacoustic_index,512,2000,8000,2.46251213240119,NA 
rayol-farm2_2019-05-10_05-58-26.wav,44100,16,60,1,bioacoustic_index,512,2000,8000,2.83779532401808,NA 
rayol-farm2_2019-05-10_06-00-26.wav,44100,16,60,1,bioacoustic_index,512,2000,8000,2.24176862378884,NA 
rayol-farm2_2019-05-10_06-02-26.wav,44100,16,60,1,bioacoustic_index,512,2000,8000,2.47466183021033,NA 
rayol-farm2_2019-05-10_06-04-26.wav,44100,16,60,1,bioacoustic_index,512,2000,8000,2.18196787440655,NA 
rayol-farm2_2019-05-10_06-06-26.wav,44100,16,60,1,bioacoustic_index,512,2000,8000,2.81718466267954,NA 
rayol-farm2_2019-05-10_06-08-26.wav,44100,16,60,1,bioacoustic_index,512,2000,8000,2.1708177193819,NA 
rayol-farm2_2019-05-10_06-10-26.wav,44100,16,60,1,bioacoustic_index,512,2000,8000,2.02820218492871,NA 
rayol-farm2_2019-05-10_06-12-26.wav,44100,16,60,1,bioacoustic_index,512,2000,8000,2.45246432449983,NA 
rayol-farm2_2019-05-10_06-14-27.wav,44100,16,60,1,bioacoustic_index,512,2000,8000,4.03555985761393,NA 
rayol-farm2_2019-05-10_06-16-27.wav,44100,16,60,1,bioacoustic_index,512,2000,8000,1.75428011474209,NA 
rayol-farm2_2019-05-10_06-18-27.wav,44100,16,60,1,bioacoustic_index,512,2000,8000,2.0668490106861,NA 
rayol-farm2_2019-05-10_06-20-27.wav,44100,16,60,1,bioacoustic_index,512,2000,8000,2.36039245411436,NA 
rayol-farm2_2019-05-10_06-22-27.wav,44100,16,60,1,bioacoustic_index,512,2000,8000,2.21879250107417,NA 
rayol-farm2_2019-05-10_06-24-27.wav,44100,16,60,1,bioacoustic_index,512,2000,8000,3.14418439772386,NA 
rayol-farm2_2019-05-10_06-26-29.wav,44100,16,60,1,bioacoustic_index,512,2000,8000,1.43276763517444,NA 
rayol-farm2_2019-05-10_06-28-29.wav,44100,16,60,1,bioacoustic_index,512,2000,8000,1.6223365458142,NA 
rayol-farm2_2019-05-10_06-30-29.wav,44100,16,60,1,bioacoustic_index,512,2000,8000,1.38385473663399,NA 
rayol-farm2_2019-05-10_06-32-29.wav,44100,16,60,1,bioacoustic_index,512,2000,8000,1.96431337217655,NA 
rayol-farm2_2019-05-10_06-34-29.wav,44100,16,60,1,bioacoustic_index,512,2000,8000,1.88412307551576,NA 
rayol-farm2_2019-05-10_06-36-29.wav,44100,16,60,1,bioacoustic_index,512,2000,8000,1.92162138221997,NA 
rayol-farm2_2019-05-10_06-38-29.wav,44100,16,60,1,bioacoustic_index,512,2000,8000,2.14417039204153,NA 
rayol-farm2_2019-05-10_06-40-29.wav,44100,16,60,1,bioacoustic_index,512,2000,8000,1.83180456598798,NA 
rayol-farm2_2019-05-10_06-42-30.wav,44100,16,60,1,bioacoustic_index,512,2000,8000,1.72943237961982,NA 
rayol-farm2_2019-05-10_06-44-30.wav,44100,16,60,1,bioacoustic_index,512,2000,8000,3.42184073980089,NA 
rayol-farm2_2019-05-10_06-46-30.wav,44100,16,60,1,bioacoustic_index,512,2000,8000,1.63853123331288,NA 
rayol-farm2_2019-05-10_06-48-30.wav,44100,16,60,1,bioacoustic_index,512,2000,8000,5.00263440430601,NA 
rayol-farm2_2019-05-10_06-50-30.wav,44100,16,60,1,bioacoustic_index,512,2000,8000,2.41666085084146,NA 
rayol-farm2_2019-05-10_06-52-30.wav,44100,16,60,1,bioacoustic_index,512,2000,8000,1.68138436072592,NA 
rayol-farm2_2019-05-10_06-54-30.wav,44100,16,60,1,bioacoustic_index,512,2000,8000,1.61745349511176,NA 
rayol-farm2_2019-05-10_06-56-30.wav,44100,16,60,1,bioacoustic_index,512,2000,8000,1.46509955962519,NA 
rayol-farm2_2019-05-10_06-58-31.wav,44100,16,60,1,bioacoustic_index,512,2000,8000,1.90909591697771,NA 
rayol-farm2_2019-05-10_07-00-31.wav,44100,16,60,1,bioacoustic_index,512,2000,8000,1.60780979052494,NA 
rayol-farm2_2019-05-10_07-02-31.wav,44100,16,60,1,bioacoustic_index,512,2000,8000,1.70522996331847,NA 
rayol-farm2_2019-05-10_07-04-31.wav,44100,16,60,1,bioacoustic_index,512,2000,8000,2.08071248351574,NA 
rayol-farm2_2019-05-10_07-06-31.wav,44100,16,60,1,bioacoustic_index,512,2000,8000,2.48547023654131,NA 
rayol-farm2_2019-05-10_07-08-31.wav,44100,16,60,1,bioacoustic_index,512,2000,8000,2.34623849438687,NA 
rayol-farm2_2019-05-10_07-10-31.wav,44100,16,60,1,bioacoustic_index,512,2000,8000,2.86380037655682,NA 
rayol-farm2_2019-05-10_07-12-31.wav,44100,16,60,1,bioacoustic_index,512,2000,8000,1.65252892244224,NA 
rayol-farm2_2019-05-10_07-14-31.wav,44100,16,60,1,bioacoustic_index,512,2000,8000,2.51102491570192,NA 
rayol-farm2_2019-05-10_07-16-32.wav,44100,16,60,1,bioacoustic_index,512,2000,8000,2.46489020550804,NA 
rayol-farm2_2019-05-10_07-18-32.wav,44100,16,60,1,bioacoustic_index,512,2000,8000,2.16926079075681,NA 
rayol-farm2_2019-05-10_07-20-32.wav,44100,16,60,1,bioacoustic_index,512,2000,8000,2.04490763580227,NA 
rayol-farm2_2019-05-10_07-22-32.wav,44100,16,60,1,bioacoustic_index,512,2000,8000,2.2976378402758,NA 
rayol-farm2_2019-05-10_07-24-32.wav,44100,16,60,1,bioacoustic_index,512,2000,8000,1.75936105718273,NA 
rayol-farm2_2019-05-10_07-26-32.wav,44100,16,60,1,bioacoustic_index,512,2000,8000,2.06458760631891,NA 
rayol-farm2_2019-05-10_07-28-32.wav,44100,16,60,1,bioacoustic_index,512,2000,8000,1.95485612030303,NA 
rayol-farm2_2019-05-10_07-30-32.wav,44100,16,60,1,bioacoustic_index,512,2000,8000,1.22587145633771,NA 
rayol-farm2_2019-05-10_07-32-33.wav,44100,16,60,1,bioacoustic_index,512,2000,8000,1.4414327812975,NA 
rayol-farm2_2019-05-10_07-34-33.wav,44100,16,60,1,bioacoustic_index,512,2000,8000,1.58615992390711,NA 
rayol-farm2_2019-05-10_07-36-33.wav,44100,16,60,1,bioacoustic_index,512,2000,8000,1.56797525408164,NA 
rayol-farm2_2019-05-10_07-38-33.wav,44100,16,60,1,bioacoustic_index,512,2000,8000,1.81462902316165,NA 
rayol-farm2_2019-05-10_07-40-33.wav,44100,16,60,1,bioacoustic_index,512,2000,8000,1.43714714164362,NA 
rayol-farm2_2019-05-10_07-44-33.wav,44100,16,60,1,bioacoustic_index,512,2000,8000,1.8763706587551,NA 
rayol-farm2_2019-05-10_07-46-33.wav,44100,16,60,1,bioacoustic_index,512,2000,8000,1.82124339039357,NA 
rayol-farm2_2019-05-10_07-48-34.wav,44100,16,60,1,bioacoustic_index,512,2000,8000,1.55297566488029,NA 
rayol-farm2_2019-05-10_07-50-34.wav,44100,16,60,1,bioacoustic_index,512,2000,8000,1.86981663720276,NA 
rayol-farm2_2019-05-10_07-54-34.wav,44100,16,60,1,bioacoustic_index,512,2000,8000,1.6574071505238,NA 
rayol-farm2_2019-05-10_07-56-34.wav,44100,16,60,1,bioacoustic_index,512,2000,8000,2.05387815263402,NA 
rayol-farm2_2019-05-10_07-58-34.wav,44100,16,60,1,bioacoustic_index,512,2000,8000,2.00293412569131,NA 
rayol-farm2_2019-05-10_08-00-34.wav,44100,16,60,1,bioacoustic_index,512,2000,8000,1.76240919320871,NA 
rayol-farm2_2019-05-10_08-02-34.wav,44100,16,60,1,bioacoustic_index,512,2000,8000,2.41018936355717,NA 
rayol-farm2_2019-05-10_08-04-35.wav,44100,16,60,1,bioacoustic_index,512,2000,8000,2.18085047766608,NA 
rayol-farm2_2019-05-10_08-06-35.wav,44100,16,60,1,bioacoustic_index,512,2000,8000,2.55727265618348,NA 
rayol-farm2_2019-05-10_08-08-35.wav,44100,16,60,1,bioacoustic_index,512,2000,8000,1.79569721803957,NA 
rayol-farm2_2019-05-10_08-10-35.wav,44100,16,60,1,bioacoustic_index,512,2000,8000,1.96767273553368,NA 
rayol-farm2_2019-05-10_08-12-35.wav,44100,16,60,1,bioacoustic_index,512,2000,8000,2.37228779853383,NA 
rayol-farm2_2019-05-10_08-14-35.wav,44100,16,60,1,bioacoustic_index,512,2000,8000,2.08884002543739,NA 
rayol-farm2_2019-05-10_08-16-35.wav,44100,16,60,1,bioacoustic_index,512,2000,8000,1.88667527456418,NA 
rayol-farm2_2019-05-10_08-18-35.wav,44100,16,60,1,bioacoustic_index,512,2000,8000,2.10879891978969,NA 
rayol-farm2_2019-05-10_08-20-36.wav,44100,16,60,1,bioacoustic_index,512,2000,8000,2.25569860681797,NA 
rayol-farm2_2019-05-10_08-22-36.wav,44100,16,60,1,bioacoustic_index,512,2000,8000,3.98591867010945,NA 
rayol-farm2_2019-05-10_08-24-36.wav,44100,16,60,1,bioacoustic_index,512,2000,8000,1.67901585089846,NA 
rayol-farm2_2019-05-10_08-26-36.wav,44100,16,60,1,bioacoustic_index,512,2000,8000,4.5390307531728,NA 
rayol-farm2_2019-05-10_08-28-36.wav,44100,16,60,1,bioacoustic_index,512,2000,8000,3.27191254102955,NA 
rayol-farm2_2019-05-10_08-30-36.wav,44100,16,60,1,bioacoustic_index,512,2000,8000,2.07733148866699,NA 
rayol-farm2_2019-05-10_08-32-36.wav,44100,16,60,1,bioacoustic_index,512,2000,8000,1.83373038743766,NA 
rayol-farm2_2019-05-10_08-34-36.wav,44100,16,60,1,bioacoustic_index,512,2000,8000,1.88548768437525,NA 
rayol-farm2_2019-05-10_08-36-37.wav,44100,16,60,1,bioacoustic_index,512,2000,8000,2.44553212553188,NA 
rayol-farm2_2019-05-10_08-38-37.wav,44100,16,60,1,bioacoustic_index,512,2000,8000,2.24435202289328,NA 
rayol-farm2_2019-05-10_08-40-37.wav,44100,16,60,1,bioacoustic_index,512,2000,8000,1.67930660732611,NA 
rayol-farm2_2019-05-10_08-42-37.wav,44100,16,60,1,bioacoustic_index,512,2000,8000,1.85516971320876,NA 
rayol-farm2_2019-05-10_08-44-37.wav,44100,16,60,1,bioacoustic_index,512,2000,8000,1.97242823453743,NA 
rayol-farm2_2019-05-10_08-46-37.wav,44100,16,60,1,bioacoustic_index,512,2000,8000,1.75981048394804,NA 
rayol-farm2_2019-05-10_08-48-37.wav,44100,16,60,1,bioacoustic_index,512,2000,8000,2.65843353060826,NA 
rayol-farm2_2019-05-10_08-50-37.wav,44100,16,60,1,bioacoustic_index,512,2000,8000,1.7438356134154,NA 
rayol-farm2_2019-05-10_08-52-38.wav,44100,16,60,1,bioacoustic_index,512,2000,8000,2.54060358652539,NA 
rayol-farm2_2019-05-10_08-54-38.wav,44100,16,60,1,bioacoustic_index,512,2000,8000,1.75369936533275,NA 
rayol-farm2_2019-05-10_08-56-38.wav,44100,16,60,1,bioacoustic_index,512,2000,8000,1.52283440466188,NA 
rayol-farm2_2019-05-10_08-58-38.wav,44100,16,60,1,bioacoustic_index,512,2000,8000,1.71437118283582,NA 
rayol-farm2_2019-05-10_09-00-38.wav,44100,16,60,1,bioacoustic_index,512,2000,8000,1.57944673873771,NA 
rayol-farm2_2019-05-10_09-02-38.wav,44100,16,60,1,bioacoustic_index,512,2000,8000,1.63221625203024,NA 
rayol-farm2_2019-05-10_09-04-38.wav,44100,16,60,1,bioacoustic_index,512,2000,8000,1.97335097927807,NA 
rayol-farm2_2019-05-10_09-06-38.wav,44100,16,60,1,bioacoustic_index,512,2000,8000,5.75511718321584,NA 
rayol-farm2_2019-05-10_09-08-39.wav,44100,16,60,1,bioacoustic_index,512,2000,8000,4.26244152543911,NA 
rayol-farm2_2019-05-10_09-10-39.wav,44100,16,60,1,bioacoustic_index,512,2000,8000,3.25431036257875,NA 
rayol-farm2_2019-05-10_09-12-39.wav,44100,16,60,1,bioacoustic_index,512,2000,8000,1.84286366246523,NA 
rayol-farm2_2019-05-10_09-14-39.wav,44100,16,60,1,bioacoustic_index,512,2000,8000,4.21938566802831,NA 
rayol-farm2_2019-05-10_09-16-39.wav,44100,16,60,1,bioacoustic_index,512,2000,8000,3.93542357759708,NA 
rayol-farm2_2019-05-10_09-18-39.wav,44100,16,60,1,bioacoustic_index,512,2000,8000,1.93289846684529,NA 
rayol-farm2_2019-05-10_09-20-39.wav,44100,16,60,1,bioacoustic_index,512,2000,8000,5.49353535877871,NA 
rayol-farm2_2019-05-10_09-22-39.wav,44100,16,60,1,bioacoustic_index,512,2000,8000,2.62301989290071,NA 
rayol-farm2_2019-05-10_09-24-40.wav,44100,16,60,1,bioacoustic_index,512,2000,8000,3.72901601295635,NA 
rayol-farm2_2019-05-10_09-26-40.wav,44100,16,60,1,bioacoustic_index,512,2000,8000,2.07407924185655,NA 
rayol-farm2_2019-05-10_09-28-40.wav,44100,16,60,1,bioacoustic_index,512,2000,8000,2.61359450199672,NA 
rayol-farm2_2019-05-10_09-30-40.wav,44100,16,60,1,bioacoustic_index,512,2000,8000,2.1217157237832,NA 
rayol-farm2_2019-05-10_09-32-40.wav,44100,16,60,1,bioacoustic_index,512,2000,8000,1.6767507167905,NA 
rayol-farm2_2019-05-10_09-34-40.wav,44100,16,60,1,bioacoustic_index,512,2000,8000,1.85877589299981,NA 
rayol-farm2_2019-05-10_09-36-40.wav,44100,16,60,1,bioacoustic_index,512,2000,8000,1.74121099215038,NA 
rayol-farm2_2019-05-10_09-38-40.wav,44100,16,60,1,bioacoustic_index,512,2000,8000,1.6665955146563,NA 
rayol-farm2_2019-05-10_09-40-41.wav,44100,16,60,1,bioacoustic_index,512,2000,8000,2.68717893751134,NA 
rayol-farm2_2019-05-10_09-42-41.wav,44100,16,60,1,bioacoustic_index,512,2000,8000,2.48359668390562,NA 
rayol-farm2_2019-05-10_09-44-41.wav,44100,16,60,1,bioacoustic_index,512,2000,8000,2.96239098858569,NA 
rayol-farm2_2019-05-10_09-46-41.wav,44100,16,60,1,bioacoustic_index,512,2000,8000,2.45183888614278,NA 
rayol-farm2_2019-05-10_09-48-41.wav,44100,16,60,1,bioacoustic_index,512,2000,8000,3.14568775619202,NA 
rayol-farm2_2019-05-10_09-50-41.wav,44100,16,60,1,bioacoustic_index,512,2000,8000,2.02339723905681,NA 
rayol-farm2_2019-05-10_09-52-41.wav,44100,16,60,1,bioacoustic_index,512,2000,8000,2.13823001898979,NA 
rayol-farm2_2019-05-10_09-54-41.wav,44100,16,60,1,bioacoustic_index,512,2000,8000,1.99579754558876,NA 
rayol-farm2_2019-05-10_09-56-41.wav,44100,16,60,1,bioacoustic_index,512,2000,8000,1.81602326755392,NA 
rayol-farm2_2019-05-10_09-58-42.wav,44100,16,60,1,bioacoustic_index,512,2000,8000,3.23189369056673,NA 
rayol-farm2_2019-05-10_10-00-42.wav,44100,16,60,1,bioacoustic_index,512,2000,8000,2.17076167997193,NA 
rayol-farm2_2019-05-10_10-02-42.wav,44100,16,60,1,bioacoustic_index,512,2000,8000,2.07249171409668,NA 
rayol-farm2_2019-05-10_10-04-42.wav,44100,16,60,1,bioacoustic_index,512,2000,8000,2.66641864603911,NA 
rayol-farm2_2019-05-10_10-06-42.wav,44100,16,60,1,bioacoustic_index,512,2000,8000,2.10298630448568,NA 
rayol-farm2_2019-05-10_10-08-42.wav,44100,16,60,1,bioacoustic_index,512,2000,8000,3.8352528449086,NA 
rayol-farm2_2019-05-10_10-10-42.wav,44100,16,60,1,bioacoustic_index,512,2000,8000,3.52919754101902,NA 
rayol-farm2_2019-05-10_10-12-42.wav,44100,16,60,1,bioacoustic_index,512,2000,8000,3.56041462994243,NA 
rayol-farm2_2019-05-10_10-14-43.wav,44100,16,60,1,bioacoustic_index,512,2000,8000,2.6721911267384,NA 
rayol-farm2_2019-05-10_10-16-43.wav,44100,16,60,1,bioacoustic_index,512,2000,8000,2.14841201012828,NA 
rayol-farm2_2019-05-10_10-18-43.wav,44100,16,60,1,bioacoustic_index,512,2000,8000,1.76244269806511,NA 
rayol-farm2_2019-05-10_10-20-43.wav,44100,16,60,1,bioacoustic_index,512,2000,8000,2.91628926037947,NA 
rayol-farm2_2019-05-10_10-22-43.wav,44100,16,60,1,bioacoustic_index,512,2000,8000,1.52522348762385,NA 
rayol-farm2_2019-05-10_10-24-43.wav,44100,16,60,1,bioacoustic_index,512,2000,8000,3.04210256752226,NA 
rayol-farm2_2019-05-10_10-26-43.wav,44100,16,60,1,bioacoustic_index,512,2000,8000,3.04506636207694,NA 
rayol-farm2_2019-05-10_10-28-43.wav,44100,16,60,1,bioacoustic_index,512,2000,8000,1.94169881881308,NA 
rayol-farm2_2019-05-10_10-30-44.wav,44100,16,60,1,bioacoustic_index,512,2000,8000,2.34681173119183,NA 
rayol-farm2_2019-05-10_10-32-44.wav,44100,16,60,1,bioacoustic_index,512,2000,8000,1.76090712854515,NA 
rayol-farm2_2019-05-10_10-34-44.wav,44100,16,60,1,bioacoustic_index,512,2000,8000,2.55525100732438,NA 
rayol-farm2_2019-05-10_10-36-44.wav,44100,16,60,1,bioacoustic_index,512,2000,8000,2.56785539206376,NA 
rayol-farm2_2019-05-10_10-38-44.wav,44100,16,60,1,bioacoustic_index,512,2000,8000,2.87783061032457,NA 
rayol-farm2_2019-05-10_10-40-44.wav,44100,16,60,1,bioacoustic_index,512,2000,8000,1.85149894740171,NA 
rayol-farm2_2019-05-10_10-42-44.wav,44100,16,60,1,bioacoustic_index,512,2000,8000,1.83706696367441,NA 
rayol-farm2_2019-05-10_10-44-44.wav,44100,16,60,1,bioacoustic_index,512,2000,8000,1.6994568384635,NA 
rayol-farm2_2019-05-10_10-46-44.wav,44100,16,60,1,bioacoustic_index,512,2000,8000,1.5374643807793,NA 
rayol-farm2_2019-05-10_10-48-45.wav,44100,16,60,1,bioacoustic_index,512,2000,8000,1.50108286873431,NA 
rayol-farm2_2019-05-10_10-50-45.wav,44100,16,60,1,bioacoustic_index,512,2000,8000,1.91081758426508,NA 
rayol-farm2_2019-05-10_10-52-45.wav,44100,16,60,1,bioacoustic_index,512,2000,8000,3.46882482778371,NA 
rayol-farm2_2019-05-10_10-54-45.wav,44100,16,60,1,bioacoustic_index,512,2000,8000,3.13175815408537,NA 
rayol-farm2_2019-05-10_10-56-45.wav,44100,16,60,1,bioacoustic_index,512,2000,8000,4.58859253484726,NA 
rayol-farm2_2019-05-10_10-58-45.wav,44100,16,60,1,bioacoustic_index,512,2000,8000,3.20521394217699,NA 
rayol-farm2_2019-05-10_11-00-45.wav,44100,16,60,1,bioacoustic_index,512,2000,8000,4.18709417806364,NA 
rayol-farm2_2019-05-10_11-02-45.wav,44100,16,60,1,bioacoustic_index,512,2000,8000,3.20722802605162,NA 
rayol-farm2_2019-05-10_11-04-46.wav,44100,16,60,1,bioacoustic_index,512,2000,8000,1.86030139937134,NA 
rayol-farm2_2019-05-10_11-06-46.wav,44100,16,60,1,bioacoustic_index,512,2000,8000,2.16468892781656,NA 
rayol-farm2_2019-05-10_11-08-46.wav,44100,16,60,1,bioacoustic_index,512,2000,8000,2.6544400565942,NA 
rayol-farm2_2019-05-10_11-10-46.wav,44100,16,60,1,bioacoustic_index,512,2000,8000,2.02736805397549,NA 
rayol-farm2_2019-05-10_11-12-46.wav,44100,16,60,1,bioacoustic_index,512,2000,8000,3.42608432081957,NA 
rayol-farm2_2019-05-10_11-14-46.wav,44100,16,60,1,bioacoustic_index,512,2000,8000,3.01698063386751,NA 
rayol-farm2_2019-05-10_11-16-46.wav,44100,16,60,1,bioacoustic_index,512,2000,8000,2.43527197850662,NA 
rayol-farm2_2019-05-10_11-18-46.wav,44100,16,60,1,bioacoustic_index,512,2000,8000,2.51425214759901,NA 
rayol-farm2_2019-05-10_11-20-47.wav,44100,16,60,1,bioacoustic_index,512,2000,8000,2.5127714661986,NA 
rayol-farm2_2019-05-10_11-22-47.wav,44100,16,60,1,bioacoustic_index,512,2000,8000,1.66369263426772,NA 
rayol-farm2_2019-05-10_11-24-47.wav,44100,16,60,1,bioacoustic_index,512,2000,8000,1.60834685372215,NA 
rayol-farm2_2019-05-10_11-26-47.wav,44100,16,60,1,bioacoustic_index,512,2000,8000,1.85454241131148,NA 
rayol-farm2_2019-05-10_11-28-47.wav,44100,16,60,1,bioacoustic_index,512,2000,8000,2.21163634161894,NA 
rayol-farm2_2019-05-10_11-30-47.wav,44100,16,60,1,bioacoustic_index,512,2000,8000,2.64502289131828,NA 
rayol-farm2_2019-05-10_11-32-47.wav,44100,16,60,1,bioacoustic_index,512,2000,8000,1.8490996174764,NA 
rayol-farm2_2019-05-10_11-34-47.wav,44100,16,60,1,bioacoustic_index,512,2000,8000,2.06830938863049,NA 
rayol-farm2_2019-05-10_11-36-47.wav,44100,16,60,1,bioacoustic_index,512,2000,8000,3.02434104092353,NA 
rayol-farm2_2019-05-10_11-38-48.wav,44100,16,60,1,bioacoustic_index,512,2000,8000,2.7208861433384,NA 
rayol-farm2_2019-05-10_11-40-48.wav,44100,16,60,1,bioacoustic_index,512,2000,8000,1.68883804190193,NA 
rayol-farm2_2019-05-10_11-42-48.wav,44100,16,60,1,bioacoustic_index,512,2000,8000,1.8991540391211,NA 
rayol-farm2_2019-05-10_11-44-48.wav,44100,16,60,1,bioacoustic_index,512,2000,8000,2.02166156471508,NA 
rayol-farm2_2019-05-10_11-46-48.wav,44100,16,60,1,bioacoustic_index,512,2000,8000,2.04255964899515,NA 
rayol-farm2_2019-05-10_11-48-48.wav,44100,16,60,1,bioacoustic_index,512,2000,8000,2.1864374018814,NA 
rayol-farm2_2019-05-10_11-50-48.wav,44100,16,60,1,bioacoustic_index,512,2000,8000,2.02925264540178,NA 
rayol-farm2_2019-05-10_11-52-48.wav,44100,16,60,1,bioacoustic_index,512,2000,8000,2.75733303473884,NA 
rayol-farm2_2019-05-10_11-54-49.wav,44100,16,60,1,bioacoustic_index,512,2000,8000,1.85581214712904,NA 
rayol-farm2_2019-05-10_11-56-49.wav,44100,16,60,1,bioacoustic_index,512,2000,8000,1.73243064058433,NA 
rayol-farm2_2019-05-10_11-58-49.wav,44100,16,60,1,bioacoustic_index,512,2000,8000,2.23654111547481,NA 
rayol-farm2_2019-05-10_12-00-49.wav,44100,16,60,1,bioacoustic_index,512,2000,8000,1.71251486472041,NA 
rayol-farm2_2019-05-10_12-02-49.wav,44100,16,60,1,bioacoustic_index,512,2000,8000,2.81629359247311,NA 
rayol-farm2_2019-05-10_12-04-49.wav,44100,16,60,1,bioacoustic_index,512,2000,8000,2.10739002524292,NA 
rayol-farm2_2019-05-10_12-06-49.wav,44100,16,60,1,bioacoustic_index,512,2000,8000,1.68085561841391,NA 
rayol-farm2_2019-05-10_12-08-49.wav,44100,16,60,1,bioacoustic_index,512,2000,8000,2.05351238108723,NA 
rayol-farm2_2019-05-10_12-10-50.wav,44100,16,60,1,bioacoustic_index,512,2000,8000,1.93742746863203,NA 
rayol-farm2_2019-05-10_12-12-50.wav,44100,16,60,1,bioacoustic_index,512,2000,8000,2.60438798817188,NA 
rayol-farm2_2019-05-10_12-14-50.wav,44100,16,60,1,bioacoustic_index,512,2000,8000,1.90928146202645,NA 
rayol-farm2_2019-05-10_12-16-50.wav,44100,16,60,1,bioacoustic_index,512,2000,8000,1.80681379959256,NA 
rayol-farm2_2019-05-10_12-18-50.wav,44100,16,60,1,bioacoustic_index,512,2000,8000,1.96971806020033,NA 
rayol-farm2_2019-05-10_12-20-50.wav,44100,16,60,1,bioacoustic_index,512,2000,8000,1.92182691446693,NA 
rayol-farm2_2019-05-10_12-22-50.wav,44100,16,60,1,bioacoustic_index,512,2000,8000,1.84541753230223,NA 
rayol-farm2_2019-05-10_12-24-50.wav,44100,16,60,1,bioacoustic_index,512,2000,8000,1.88358172831001,NA 
rayol-farm2_2019-05-10_12-26-50.wav,44100,16,60,1,bioacoustic_index,512,2000,8000,2.11967764630827,NA 
rayol-farm2_2019-05-10_12-28-51.wav,44100,16,60,1,bioacoustic_index,512,2000,8000,1.9611900799243,NA 
rayol-farm2_2019-05-10_12-30-51.wav,44100,16,60,1,bioacoustic_index,512,2000,8000,2.35017585272733,NA 
rayol-farm2_2019-05-10_12-32-51.wav,44100,16,60,1,bioacoustic_index,512,2000,8000,2.35326623273818,NA 
rayol-farm2_2019-05-10_12-34-51.wav,44100,16,60,1,bioacoustic_index,512,2000,8000,2.17688667050887,NA 
rayol-farm2_2019-05-10_12-36-51.wav,44100,16,60,1,bioacoustic_index,512,2000,8000,2.10001844786479,NA 
rayol-farm2_2019-05-10_12-38-51.wav,44100,16,60,1,bioacoustic_index,512,2000,8000,2.63799122573009,NA 
rayol-farm2_2019-05-10_12-40-51.wav,44100,16,60,1,bioacoustic_index,512,2000,8000,1.83357974708527,NA 
rayol-farm2_2019-05-10_12-42-51.wav,44100,16,60,1,bioacoustic_index,512,2000,8000,1.5635672278949,NA 
rayol-farm2_2019-05-10_12-44-52.wav,44100,16,60,1,bioacoustic_index,512,2000,8000,2.40611833928301,NA 
rayol-farm2_2019-05-10_12-46-52.wav,44100,16,60,1,bioacoustic_index,512,2000,8000,3.01432192110467,NA 
rayol-farm2_2019-05-10_12-48-52.wav,44100,16,60,1,bioacoustic_index,512,2000,8000,2.22599201774781,NA 
rayol-farm2_2019-05-10_12-50-52.wav,44100,16,60,1,bioacoustic_index,512,2000,8000,2.09833354458773,NA 
rayol-farm2_2019-05-10_12-52-52.wav,44100,16,60,1,bioacoustic_index,512,2000,8000,2.98089351225356,NA 
rayol-farm2_2019-05-10_12-54-52.wav,44100,16,60,1,bioacoustic_index,512,2000,8000,1.92433134815643,NA 
rayol-farm2_2019-05-10_12-56-52.wav,44100,16,60,1,bioacoustic_index,512,2000,8000,2.07685129488134,NA 
rayol-farm2_2019-05-10_12-58-52.wav,44100,16,60,1,bioacoustic_index,512,2000,8000,2.3167134344699,NA 
rayol-farm2_2019-05-10_13-00-53.wav,44100,16,60,1,bioacoustic_index,512,2000,8000,2.64651438764229,NA 
rayol-farm2_2019-05-10_13-02-53.wav,44100,16,60,1,bioacoustic_index,512,2000,8000,2.06804201936369,NA 
rayol-farm2_2019-05-10_13-04-53.wav,44100,16,60,1,bioacoustic_index,512,2000,8000,2.52311546894304,NA 
rayol-farm2_2019-05-10_13-06-53.wav,44100,16,60,1,bioacoustic_index,512,2000,8000,2.13265879066499,NA 
rayol-farm2_2019-05-10_13-08-53.wav,44100,16,60,1,bioacoustic_index,512,2000,8000,1.96560229863381,NA 
rayol-farm2_2019-05-10_13-10-53.wav,44100,16,60,1,bioacoustic_index,512,2000,8000,1.42063118036885,NA 
rayol-farm2_2019-05-10_13-12-53.wav,44100,16,60,1,bioacoustic_index,512,2000,8000,1.89510807053607,NA 
rayol-farm2_2019-05-10_13-14-53.wav,44100,16,60,1,bioacoustic_index,512,2000,8000,1.66931163895808,NA 
rayol-farm2_2019-05-10_13-16-54.wav,44100,16,60,1,bioacoustic_index,512,2000,8000,2.27356353792491,NA 
rayol-farm2_2019-05-10_13-18-54.wav,44100,16,60,1,bioacoustic_index,512,2000,8000,2.03315351746732,NA 
rayol-farm2_2019-05-10_13-20-54.wav,44100,16,60,1,bioacoustic_index,512,2000,8000,1.76097710508644,NA 
rayol-farm2_2019-05-10_13-22-54.wav,44100,16,60,1,bioacoustic_index,512,2000,8000,1.69850434786957,NA 
rayol-farm2_2019-05-10_13-24-54.wav,44100,16,60,1,bioacoustic_index,512,2000,8000,1.7979941300695,NA 
rayol-farm2_2019-05-10_13-26-54.wav,44100,16,60,1,bioacoustic_index,512,2000,8000,1.55757194582863,NA 
rayol-farm2_2019-05-10_13-28-54.wav,44100,16,60,1,bioacoustic_index,512,2000,8000,1.86039496441771,NA 
rayol-farm2_2019-05-10_13-30-54.wav,44100,16,60,1,bioacoustic_index,512,2000,8000,2.35167562978745,NA 
rayol-farm2_2019-05-10_13-32-54.wav,44100,16,60,1,bioacoustic_index,512,2000,8000,1.65848888635529,NA 
rayol-farm2_2019-05-10_13-34-55.wav,44100,16,60,1,bioacoustic_index,512,2000,8000,2.53699356912719,NA 
rayol-farm2_2019-05-10_13-36-55.wav,44100,16,60,1,bioacoustic_index,512,2000,8000,2.25196612465913,NA 
rayol-farm2_2019-05-10_13-38-55.wav,44100,16,60,1,bioacoustic_index,512,2000,8000,2.13512641014647,NA 
rayol-farm2_2019-05-10_13-40-55.wav,44100,16,60,1,bioacoustic_index,512,2000,8000,2.94901779873457,NA 
rayol-farm2_2019-05-10_13-42-55.wav,44100,16,60,1,bioacoustic_index,512,2000,8000,2.24370466240791,NA 
rayol-farm2_2019-05-10_13-44-55.wav,44100,16,60,1,bioacoustic_index,512,2000,8000,1.64577984377812,NA 
rayol-farm2_2019-05-10_13-46-55.wav,44100,16,60,1,bioacoustic_index,512,2000,8000,2.30431683019988,NA 
rayol-farm2_2019-05-10_13-48-55.wav,44100,16,60,1,bioacoustic_index,512,2000,8000,1.89367148830197,NA 
rayol-farm2_2019-05-10_13-50-56.wav,44100,16,60,1,bioacoustic_index,512,2000,8000,2.96503258242015,NA 
rayol-farm2_2019-05-10_13-52-56.wav,44100,16,60,1,bioacoustic_index,512,2000,8000,2.3514985394953,NA 
rayol-farm2_2019-05-10_13-54-56.wav,44100,16,60,1,bioacoustic_index,512,2000,8000,2.02969482801256,NA 
rayol-farm2_2019-05-10_13-56-56.wav,44100,16,60,1,bioacoustic_index,512,2000,8000,1.61094191926888,NA 
rayol-farm2_2019-05-10_13-58-56.wav,44100,16,60,1,bioacoustic_index,512,2000,8000,1.52385712478211,NA 
rayol-farm2_2019-05-10_14-00-56.wav,44100,16,60,1,bioacoustic_index,512,2000,8000,1.78484703708224,NA 
rayol-farm2_2019-05-10_14-02-56.wav,44100,16,60,1,bioacoustic_index,512,2000,8000,1.79178118193161,NA 
rayol-farm2_2019-05-10_14-04-56.wav,44100,16,60,1,bioacoustic_index,512,2000,8000,1.69564858320732,NA 
rayol-farm2_2019-05-10_14-06-57.wav,44100,16,60,1,bioacoustic_index,512,2000,8000,1.38686778510275,NA 
rayol-farm2_2019-05-10_14-08-57.wav,44100,16,60,1,bioacoustic_index,512,2000,8000,1.4223290821034,NA 
rayol-farm2_2019-05-10_14-10-57.wav,44100,16,60,1,bioacoustic_index,512,2000,8000,1.78872885261567,NA 
rayol-farm2_2019-05-10_14-12-57.wav,44100,16,60,1,bioacoustic_index,512,2000,8000,1.95876429045255,NA 
rayol-farm2_2019-05-10_14-14-57.wav,44100,16,60,1,bioacoustic_index,512,2000,8000,1.91369024018829,NA 
rayol-farm2_2019-05-10_14-16-57.wav,44100,16,60,1,bioacoustic_index,512,2000,8000,1.55144454562304,NA 
rayol-farm2_2019-05-10_14-18-57.wav,44100,16,60,1,bioacoustic_index,512,2000,8000,1.81063538570631,NA 
rayol-farm2_2019-05-10_14-20-57.wav,44100,16,60,1,bioacoustic_index,512,2000,8000,3.51912871927456,NA 
rayol-farm2_2019-05-10_14-22-57.wav,44100,16,60,1,bioacoustic_index,512,2000,8000,2.11296882491109,NA 
rayol-farm2_2019-05-10_14-24-58.wav,44100,16,60,1,bioacoustic_index,512,2000,8000,2.99621690966695,NA 
rayol-farm2_2019-05-10_14-26-58.wav,44100,16,60,1,bioacoustic_index,512,2000,8000,2.27236763559377,NA 
rayol-farm2_2019-05-10_14-28-58.wav,44100,16,60,1,bioacoustic_index,512,2000,8000,2.46404998907837,NA 
rayol-farm2_2019-05-10_14-30-58.wav,44100,16,60,1,bioacoustic_index,512,2000,8000,1.65035632058307,NA 
rayol-farm2_2019-05-10_14-32-58.wav,44100,16,60,1,bioacoustic_index,512,2000,8000,1.64741923112108,NA 
rayol-farm2_2019-05-10_14-34-58.wav,44100,16,60,1,bioacoustic_index,512,2000,8000,2.78967918146767,NA 
rayol-farm2_2019-05-10_14-36-58.wav,44100,16,60,1,bioacoustic_index,512,2000,8000,1.78753897509468,NA 
rayol-farm2_2019-05-10_14-38-58.wav,44100,16,60,1,bioacoustic_index,512,2000,8000,2.30788248909002,NA 
rayol-farm2_2019-05-10_14-40-59.wav,44100,16,60,1,bioacoustic_index,512,2000,8000,2.00099089239571,NA 
rayol-farm2_2019-05-10_14-42-59.wav,44100,16,60,1,bioacoustic_index,512,2000,8000,1.98292518781202,NA 
rayol-farm2_2019-05-10_14-44-59.wav,44100,16,60,1,bioacoustic_index,512,2000,8000,2.2102795993584,NA 
rayol-farm2_2019-05-10_14-46-59.wav,44100,16,60,1,bioacoustic_index,512,2000,8000,2.26105454262693,NA 
rayol-farm2_2019-05-10_14-48-59.wav,44100,16,60,1,bioacoustic_index,512,2000,8000,1.82768097009323,NA 
rayol-farm2_2019-05-10_14-50-59.wav,44100,16,60,1,bioacoustic_index,512,2000,8000,1.83850992802393,NA 
rayol-farm2_2019-05-10_14-52-59.wav,44100,16,60,1,bioacoustic_index,512,2000,8000,1.82040773550036,NA 
rayol-farm2_2019-05-10_14-54-59.wav,44100,16,60,1,bioacoustic_index,512,2000,8000,3.33589930773375,NA 
rayol-farm2_2019-05-10_14-57-00.wav,44100,16,60,1,bioacoustic_index,512,2000,8000,2.03636524514428,NA 
rayol-farm2_2019-05-10_14-59-00.wav,44100,16,60,1,bioacoustic_index,512,2000,8000,2.12831237467301,NA 
rayol-farm2_2019-05-10_15-01-00.wav,44100,16,60,1,bioacoustic_index,512,2000,8000,1.87897707239768,NA 
rayol-farm2_2019-05-10_15-03-00.wav,44100,16,60,1,bioacoustic_index,512,2000,8000,1.63986196582596,NA 
rayol-farm2_2019-05-10_15-05-00.wav,44100,16,60,1,bioacoustic_index,512,2000,8000,1.55582452318761,NA 
rayol-farm2_2019-05-10_15-07-00.wav,44100,16,60,1,bioacoustic_index,512,2000,8000,1.64923758802662,NA 
rayol-farm2_2019-05-10_15-09-00.wav,44100,16,60,1,bioacoustic_index,512,2000,8000,1.83594891992039,NA 
rayol-farm2_2019-05-10_15-11-00.wav,44100,16,60,1,bioacoustic_index,512,2000,8000,4.5484732453168,NA 
rayol-farm2_2019-05-10_15-13-01.wav,44100,16,60,1,bioacoustic_index,512,2000,8000,3.3173538969236,NA 
rayol-farm2_2019-05-10_15-15-01.wav,44100,16,60,1,bioacoustic_index,512,2000,8000,2.1750392510542,NA 
rayol-farm2_2019-05-10_15-17-01.wav,44100,16,60,1,bioacoustic_index,512,2000,8000,2.18064963754073,NA 
rayol-farm2_2019-05-10_15-19-01.wav,44100,16,60,1,bioacoustic_index,512,2000,8000,2.05281043076186,NA 
rayol-farm2_2019-05-10_15-21-01.wav,44100,16,60,1,bioacoustic_index,512,2000,8000,2.00773349309165,NA 
rayol-farm2_2019-05-10_15-23-01.wav,44100,16,60,1,bioacoustic_index,512,2000,8000,1.89579669515543,NA 
rayol-farm2_2019-05-10_15-25-01.wav,44100,16,60,1,bioacoustic_index,512,2000,8000,1.88131157945447,NA 
rayol-farm2_2019-05-10_15-27-01.wav,44100,16,60,1,bioacoustic_index,512,2000,8000,2.10377660811456,NA 
rayol-farm2_2019-05-10_15-29-01.wav,44100,16,60,1,bioacoustic_index,512,2000,8000,1.80644361488982,NA 
rayol-farm2_2019-05-10_15-31-02.wav,44100,16,60,1,bioacoustic_index,512,2000,8000,1.96639518884079,NA 
rayol-farm2_2019-05-10_15-33-02.wav,44100,16,60,1,bioacoustic_index,512,2000,8000,3.01868782126239,NA 
rayol-farm2_2019-05-10_15-35-02.wav,44100,16,60,1,bioacoustic_index,512,2000,8000,2.23754843524052,NA 
rayol-farm2_2019-05-10_15-37-02.wav,44100,16,60,1,bioacoustic_index,512,2000,8000,1.83836903542934,NA 
rayol-farm2_2019-05-10_15-39-02.wav,44100,16,60,1,bioacoustic_index,512,2000,8000,2.43074308828914,NA 
rayol-farm2_2019-05-10_15-41-02.wav,44100,16,60,1,bioacoustic_index,512,2000,8000,2.64028264625675,NA 
rayol-farm2_2019-05-10_15-43-02.wav,44100,16,60,1,bioacoustic_index,512,2000,8000,2.22514636065785,NA 
rayol-farm2_2019-05-10_15-45-02.wav,44100,16,60,1,bioacoustic_index,512,2000,8000,2.01339736944499,NA 
rayol-farm2_2019-05-10_15-47-03.wav,44100,16,60,1,bioacoustic_index,512,2000,8000,1.94784413603308,NA 
rayol-farm2_2019-05-10_15-49-03.wav,44100,16,60,1,bioacoustic_index,512,2000,8000,1.86305320239265,NA 
rayol-farm2_2019-05-10_15-51-03.wav,44100,16,60,1,bioacoustic_index,512,2000,8000,1.86956147206923,NA 
rayol-farm2_2019-05-10_15-53-03.wav,44100,16,60,1,bioacoustic_index,512,2000,8000,2.08111745919799,NA 
rayol-farm2_2019-05-10_15-55-03.wav,44100,16,60,1,bioacoustic_index,512,2000,8000,1.87666803523527,NA 
rayol-farm2_2019-05-10_15-57-03.wav,44100,16,60,1,bioacoustic_index,512,2000,8000,2.10303151826801,NA 
rayol-farm2_2019-05-10_15-59-03.wav,44100,16,60,1,bioacoustic_index,512,2000,8000,1.85231313048472,NA 
rayol-farm2_2019-05-10_16-01-03.wav,44100,16,60,1,bioacoustic_index,512,2000,8000,1.56389278359322,NA 
rayol-farm2_2019-05-10_16-03-04.wav,44100,16,60,1,bioacoustic_index,512,2000,8000,1.53686876142104,NA 
rayol-farm2_2019-05-10_16-05-04.wav,44100,16,60,1,bioacoustic_index,512,2000,8000,1.47500837204268,NA 
rayol-farm2_2019-05-10_16-07-04.wav,44100,16,60,1,bioacoustic_index,512,2000,8000,1.48961172896907,NA 
rayol-farm2_2019-05-10_16-09-04.wav,44100,16,60,1,bioacoustic_index,512,2000,8000,1.3770937430594,NA 
rayol-farm2_2019-05-10_16-11-04.wav,44100,16,60,1,bioacoustic_index,512,2000,8000,1.46353723169347,NA 
rayol-farm2_2019-05-10_16-13-04.wav,44100,16,60,1,bioacoustic_index,512,2000,8000,1.73525588727737,NA 
rayol-farm2_2019-05-10_16-15-04.wav,44100,16,60,1,bioacoustic_index,512,2000,8000,1.46679508190015,NA 
rayol-farm2_2019-05-10_16-17-04.wav,44100,16,60,1,bioacoustic_index,512,2000,8000,1.83604773134172,NA 
rayol-farm2_2019-05-10_16-19-05.wav,44100,16,60,1,bioacoustic_index,512,2000,8000,1.79970131880669,NA 
rayol-farm2_2019-05-10_16-21-05.wav,44100,16,60,1,bioacoustic_index,512,2000,8000,1.49904245447142,NA 
rayol-farm2_2019-05-10_16-23-05.wav,44100,16,60,1,bioacoustic_index,512,2000,8000,1.52460017112285,NA 
rayol-farm2_2019-05-10_16-25-05.wav,44100,16,60,1,bioacoustic_index,512,2000,8000,1.92212057996152,NA 
rayol-farm2_2019-05-10_16-27-05.wav,44100,16,60,1,bioacoustic_index,512,2000,8000,2.23752752660598,NA 
rayol-farm2_2019-05-10_16-29-05.wav,44100,16,60,1,bioacoustic_index,512,2000,8000,1.96466003480051,NA 
rayol-farm2_2019-05-10_16-31-05.wav,44100,16,60,1,bioacoustic_index,512,2000,8000,1.83058832742593,NA 
rayol-farm2_2019-05-10_16-33-05.wav,44100,16,60,1,bioacoustic_index,512,2000,8000,1.75944131601212,NA 
rayol-farm2_2019-05-10_16-35-05.wav,44100,16,60,1,bioacoustic_index,512,2000,8000,1.90817145358329,NA 
rayol-farm2_2019-05-10_16-37-06.wav,44100,16,60,1,bioacoustic_index,512,2000,8000,2.18118091158162,NA 
rayol-farm2_2019-05-10_16-39-06.wav,44100,16,60,1,bioacoustic_index,512,2000,8000,3.74397758186186,NA 
rayol-farm2_2019-05-10_16-41-06.wav,44100,16,60,1,bioacoustic_index,512,2000,8000,2.10486245686629,NA 
rayol-farm2_2019-05-10_16-43-06.wav,44100,16,60,1,bioacoustic_index,512,2000,8000,1.7417783092327,NA 
rayol-farm2_2019-05-10_16-45-06.wav,44100,16,60,1,bioacoustic_index,512,2000,8000,1.36329134095661,NA 
rayol-farm2_2019-05-10_16-47-06.wav,44100,16,60,1,bioacoustic_index,512,2000,8000,2.97177119182424,NA 
rayol-farm2_2019-05-10_16-49-06.wav,44100,16,60,1,bioacoustic_index,512,2000,8000,1.67990063265255,NA 
rayol-farm2_2019-05-10_16-51-06.wav,44100,16,60,1,bioacoustic_index,512,2000,8000,1.75107109451152,NA 
rayol-farm2_2019-05-10_16-53-07.wav,44100,16,60,1,bioacoustic_index,512,2000,8000,1.83799804259221,NA 
rayol-farm2_2019-05-10_16-55-07.wav,44100,16,60,1,bioacoustic_index,512,2000,8000,1.7910372997926,NA 
rayol-farm2_2019-05-10_16-57-07.wav,44100,16,60,1,bioacoustic_index,512,2000,8000,2.37851832763794,NA 
rayol-farm2_2019-05-10_16-59-07.wav,44100,16,60,1,bioacoustic_index,512,2000,8000,2.05361804171609,NA 
rayol-farm2_2019-05-10_17-01-07.wav,44100,16,60,1,bioacoustic_index,512,2000,8000,1.60647821426925,NA 
rayol-farm2_2019-05-10_17-03-07.wav,44100,16,60,1,bioacoustic_index,512,2000,8000,2.6233448757524,NA 
rayol-farm2_2019-05-10_17-05-07.wav,44100,16,60,1,bioacoustic_index,512,2000,8000,2.17012941523561,NA 
rayol-farm2_2019-05-10_17-07-07.wav,44100,16,60,1,bioacoustic_index,512,2000,8000,2.06743407736986,NA 
rayol-farm2_2019-05-10_17-09-08.wav,44100,16,60,1,bioacoustic_index,512,2000,8000,2.00271903134951,NA 
rayol-farm2_2019-05-10_17-11-08.wav,44100,16,60,1,bioacoustic_index,512,2000,8000,1.97468312580785,NA 
rayol-farm2_2019-05-10_17-13-08.wav,44100,16,60,1,bioacoustic_index,512,2000,8000,2.35070831730432,NA 
rayol-farm2_2019-05-10_17-15-08.wav,44100,16,60,1,bioacoustic_index,512,2000,8000,1.66861081693204,NA 
rayol-farm2_2019-05-10_17-17-08.wav,44100,16,60,1,bioacoustic_index,512,2000,8000,1.71067401393982,NA 
rayol-farm2_2019-05-10_17-19-08.wav,44100,16,60,1,bioacoustic_index,512,2000,8000,1.6539913081926,NA 
rayol-farm2_2019-05-10_17-21-08.wav,44100,16,60,1,bioacoustic_index,512,2000,8000,1.70108279349482,NA 
rayol-farm2_2019-05-10_17-23-08.wav,44100,16,60,1,bioacoustic_index,512,2000,8000,1.42981238095969,NA 
rayol-farm2_2019-05-10_17-25-09.wav,44100,16,60,1,bioacoustic_index,512,2000,8000,1.40622004113843,NA 
rayol-farm2_2019-05-10_17-27-09.wav,44100,16,60,1,bioacoustic_index,512,2000,8000,1.47061536381366,NA 
rayol-farm2_2019-05-10_17-29-09.wav,44100,16,60,1,bioacoustic_index,512,2000,8000,1.36900836233094,NA 
rayol-farm2_2019-05-10_17-31-09.wav,44100,16,60,1,bioacoustic_index,512,2000,8000,1.45251256086683,NA 
rayol-farm2_2019-05-10_17-33-09.wav,44100,16,60,1,bioacoustic_index,512,2000,8000,1.59407739577164,NA 
rayol-farm2_2019-05-10_17-35-09.wav,44100,16,60,1,bioacoustic_index,512,2000,8000,1.46271555254541,NA 
rayol-farm2_2019-05-10_17-37-09.wav,44100,16,60,1,bioacoustic_index,512,2000,8000,1.86701484620895,NA 
rayol-farm2_2019-05-10_17-39-09.wav,44100,16,60,1,bioacoustic_index,512,2000,8000,1.58833767985266,NA 
rayol-farm2_2019-05-10_17-41-09.wav,44100,16,60,1,bioacoustic_index,512,2000,8000,1.63608932246395,NA 
rayol-farm2_2019-05-10_17-43-10.wav,44100,16,60,1,bioacoustic_index,512,2000,8000,1.84129600250167,NA 
rayol-farm2_2019-05-10_17-45-10.wav,44100,16,60,1,bioacoustic_index,512,2000,8000,1.73892310549639,NA 
rayol-farm2_2019-05-10_17-47-10.wav,44100,16,60,1,bioacoustic_index,512,2000,8000,1.41582939181551,NA 
rayol-farm2_2019-05-10_17-49-10.wav,44100,16,60,1,bioacoustic_index,512,2000,8000,1.41424053091232,NA 
rayol-farm2_2019-05-10_17-51-10.wav,44100,16,60,1,bioacoustic_index,512,2000,8000,1.49155280130539,NA 
rayol-farm2_2019-05-10_17-53-10.wav,44100,16,60,1,bioacoustic_index,512,2000,8000,1.37302546855567,NA 
rayol-farm2_2019-05-10_17-55-10.wav,44100,16,60,1,bioacoustic_index,512,2000,8000,2.03706542402122,NA 
rayol-farm2_2019-05-10_17-57-10.wav,44100,16,60,1,bioacoustic_index,512,2000,8000,1.72774699014261,NA 
rayol-farm2_2019-05-10_17-59-11.wav,44100,16,60,1,bioacoustic_index,512,2000,8000,1.91844836097018,NA 
rayol-farm2_2019-05-10_18-01-11.wav,44100,16,60,1,bioacoustic_index,512,2000,8000,1.9547581274204,NA 
rayol-farm2_2019-05-10_18-03-11.wav,44100,16,60,1,bioacoustic_index,512,2000,8000,6.35872130710718,NA 
rayol-farm2_2019-05-10_18-05-11.wav,44100,16,60,1,bioacoustic_index,512,2000,8000,1.69232006032851,NA 
rayol-farm2_2019-05-10_18-07-11.wav,44100,16,60,1,bioacoustic_index,512,2000,8000,1.83236379589952,NA 
rayol-farm2_2019-05-10_18-09-11.wav,44100,16,60,1,bioacoustic_index,512,2000,8000,1.78978578692944,NA 
rayol-farm2_2019-05-10_18-11-11.wav,44100,16,60,1,bioacoustic_index,512,2000,8000,1.90597259261787,NA 
rayol-farm2_2019-05-10_18-13-11.wav,44100,16,60,1,bioacoustic_index,512,2000,8000,2.40154182473146,NA 
rayol-farm2_2019-05-10_18-15-12.wav,44100,16,60,1,bioacoustic_index,512,2000,8000,1.53270077852616,NA 
rayol-farm2_2019-05-10_18-17-12.wav,44100,16,60,1,bioacoustic_index,512,2000,8000,1.56860031395044,NA 
rayol-farm2_2019-05-10_18-19-12.wav,44100,16,60,1,bioacoustic_index,512,2000,8000,1.66385483826534,NA 
rayol-farm2_2019-05-10_18-21-12.wav,44100,16,60,1,bioacoustic_index,512,2000,8000,1.5141141276518,NA 
rayol-farm2_2019-05-10_18-23-12.wav,44100,16,60,1,bioacoustic_index,512,2000,8000,1.56369477909876,NA 
rayol-farm2_2019-05-10_18-25-12.wav,44100,16,60,1,bioacoustic_index,512,2000,8000,1.58141132577668,NA 
rayol-farm2_2019-05-10_18-27-12.wav,44100,16,60,1,bioacoustic_index,512,2000,8000,1.59094312955046,NA 
rayol-farm2_2019-05-10_18-29-12.wav,44100,16,60,1,bioacoustic_index,512,2000,8000,1.44681745572356,NA 
rayol-farm2_2019-05-10_18-31-12.wav,44100,16,60,1,bioacoustic_index,512,2000,8000,1.40859134988818,NA 
rayol-farm2_2019-05-10_18-33-13.wav,44100,16,60,1,bioacoustic_index,512,2000,8000,1.60759655758775,NA 
rayol-farm2_2019-05-10_18-35-13.wav,44100,16,60,1,bioacoustic_index,512,2000,8000,1.63405479284246,NA 
rayol-farm2_2019-05-10_18-37-13.wav,44100,16,60,1,bioacoustic_index,512,2000,8000,1.61845160322424,NA 
rayol-farm2_2019-05-10_18-39-13.wav,44100,16,60,1,bioacoustic_index,512,2000,8000,1.45790823152899,NA 
rayol-farm2_2019-05-10_18-41-13.wav,44100,16,60,1,bioacoustic_index,512,2000,8000,1.30388551751581,NA 
rayol-farm2_2019-05-10_18-43-13.wav,44100,16,60,1,bioacoustic_index,512,2000,8000,1.49393456551948,NA 
rayol-farm2_2019-05-10_18-45-13.wav,44100,16,60,1,bioacoustic_index,512,2000,8000,1.49231551211547,NA 
rayol-farm2_2019-05-10_18-47-13.wav,44100,16,60,1,bioacoustic_index,512,2000,8000,1.57116686682264,NA 
rayol-farm2_2019-05-10_18-49-14.wav,44100,16,60,1,bioacoustic_index,512,2000,8000,1.56814766254226,NA 
rayol-farm2_2019-05-10_18-51-14.wav,44100,16,60,1,bioacoustic_index,512,2000,8000,1.62294321855224,NA 
rayol-farm2_2019-05-10_18-53-14.wav,44100,16,60,1,bioacoustic_index,512,2000,8000,1.48101995529701,NA 
rayol-farm2_2019-05-10_18-55-14.wav,44100,16,60,1,bioacoustic_index,512,2000,8000,1.46513400304247,NA 
rayol-farm2_2019-05-10_18-57-14.wav,44100,16,60,1,bioacoustic_index,512,2000,8000,1.93110931440685,NA 
rayol-farm2_2019-05-10_18-59-14.wav,44100,16,60,1,bioacoustic_index,512,2000,8000,1.85687600952141,NA 
rayol-farm2_2019-05-10_19-01-14.wav,44100,16,60,1,bioacoustic_index,512,2000,8000,2.96359419967492,NA 
rayol-farm2_2019-05-10_19-03-14.wav,44100,16,60,1,bioacoustic_index,512,2000,8000,2.63749816256809,NA 
rayol-farm2_2019-05-10_19-05-15.wav,44100,16,60,1,bioacoustic_index,512,2000,8000,2.36217058746682,NA 
rayol-farm2_2019-05-10_19-07-15.wav,44100,16,60,1,bioacoustic_index,512,2000,8000,1.50401140075891,NA 
rayol-farm2_2019-05-10_19-09-15.wav,44100,16,60,1,bioacoustic_index,512,2000,8000,1.63184405003174,NA 
rayol-farm2_2019-05-10_19-11-15.wav,44100,16,60,1,bioacoustic_index,512,2000,8000,1.39669242946586,NA 
rayol-farm2_2019-05-10_19-13-15.wav,44100,16,60,1,bioacoustic_index,512,2000,8000,1.71157767095003,NA 
rayol-farm2_2019-05-10_19-15-15.wav,44100,16,60,1,bioacoustic_index,512,2000,8000,1.72266002284776,NA 
rayol-farm2_2019-05-10_19-17-15.wav,44100,16,60,1,bioacoustic_index,512,2000,8000,1.42684907525333,NA 
rayol-farm2_2019-05-10_19-19-15.wav,44100,16,60,1,bioacoustic_index,512,2000,8000,1.30460013459995,NA 
rayol-farm2_2019-05-10_19-21-16.wav,44100,16,60,1,bioacoustic_index,512,2000,8000,1.54679772140244,NA 
rayol-farm2_2019-05-10_19-23-16.wav,44100,16,60,1,bioacoustic_index,512,2000,8000,1.84592775032012,NA 
rayol-farm2_2019-05-10_19-25-16.wav,44100,16,60,1,bioacoustic_index,512,2000,8000,1.82416740206376,NA 
rayol-farm2_2019-05-10_19-27-16.wav,44100,16,60,1,bioacoustic_index,512,2000,8000,1.52946723842334,NA 
rayol-farm2_2019-05-10_19-29-16.wav,44100,16,60,1,bioacoustic_index,512,2000,8000,1.92943338193201,NA 
rayol-farm2_2019-05-10_19-31-16.wav,44100,16,60,1,bioacoustic_index,512,2000,8000,2.04235974646274,NA 
rayol-farm2_2019-05-10_19-33-16.wav,44100,16,60,1,bioacoustic_index,512,2000,8000,2.49762763760357,NA 
rayol-farm2_2019-05-10_19-35-16.wav,44100,16,60,1,bioacoustic_index,512,2000,8000,1.88347266750298,NA 
rayol-farm2_2019-05-10_19-37-16.wav,44100,16,60,1,bioacoustic_index,512,2000,8000,1.93755926812303,NA 
rayol-farm2_2019-05-10_19-39-17.wav,44100,16,60,1,bioacoustic_index,512,2000,8000,1.71651286845762,NA 
rayol-farm2_2019-05-10_19-41-17.wav,44100,16,60,1,bioacoustic_index,512,2000,8000,1.70402328854143,NA 
rayol-farm2_2019-05-10_19-43-17.wav,44100,16,60,1,bioacoustic_index,512,2000,8000,2.64196196435548,NA 
rayol-farm2_2019-05-10_19-45-17.wav,44100,16,60,1,bioacoustic_index,512,2000,8000,1.39303756982483,NA 
rayol-farm2_2019-05-10_19-47-17.wav,44100,16,60,1,bioacoustic_index,512,2000,8000,1.35938990792517,NA 
rayol-farm2_2019-05-10_19-49-17.wav,44100,16,60,1,bioacoustic_index,512,2000,8000,1.45064330256865,NA 
rayol-farm2_2019-05-10_19-51-17.wav,44100,16,60,1,bioacoustic_index,512,2000,8000,1.35856837774847,NA 
rayol-farm2_2019-05-10_19-53-17.wav,44100,16,60,1,bioacoustic_index,512,2000,8000,1.62216998867446,NA 
rayol-farm2_2019-05-10_19-55-18.wav,44100,16,60,1,bioacoustic_index,512,2000,8000,1.52937249752906,NA 
rayol-farm2_2019-05-10_19-57-18.wav,44100,16,60,1,bioacoustic_index,512,2000,8000,2.0287317154026,NA 
rayol-farm2_2019-05-10_19-59-18.wav,44100,16,60,1,bioacoustic_index,512,2000,8000,1.48492296822827,NA 
rayol-farm2_2019-05-10_20-01-18.wav,44100,16,60,1,bioacoustic_index,512,2000,8000,1.63315227333301,NA 
rayol-farm2_2019-05-10_20-03-18.wav,44100,16,60,1,bioacoustic_index,512,2000,8000,2.1045566011444,NA 
rayol-farm2_2019-05-10_20-05-18.wav,44100,16,60,1,bioacoustic_index,512,2000,8000,1.96784627373088,NA 
rayol-farm2_2019-05-10_20-07-18.wav,44100,16,60,1,bioacoustic_index,512,2000,8000,1.86875639598631,NA 
rayol-farm2_2019-05-10_20-09-18.wav,44100,16,60,1,bioacoustic_index,512,2000,8000,1.52985864465485,NA 
rayol-farm2_2019-05-10_20-11-19.wav,44100,16,60,1,bioacoustic_index,512,2000,8000,1.41843852042524,NA 
rayol-farm2_2019-05-10_20-13-19.wav,44100,16,60,1,bioacoustic_index,512,2000,8000,1.72453547322491,NA 
rayol-farm2_2019-05-10_20-15-19.wav,44100,16,60,1,bioacoustic_index,512,2000,8000,2.43213298750093,NA 
rayol-farm2_2019-05-10_20-17-19.wav,44100,16,60,1,bioacoustic_index,512,2000,8000,1.62146515334475,NA 
rayol-farm2_2019-05-10_20-19-19.wav,44100,16,60,1,bioacoustic_index,512,2000,8000,1.39173959620082,NA 
rayol-farm2_2019-05-10_20-21-19.wav,44100,16,60,1,bioacoustic_index,512,2000,8000,1.73319588816945,NA 
rayol-farm2_2019-05-10_20-23-19.wav,44100,16,60,1,bioacoustic_index,512,2000,8000,1.69763664524719,NA 
rayol-farm2_2019-05-10_20-25-19.wav,44100,16,60,1,bioacoustic_index,512,2000,8000,2.12389383203712,NA 
rayol-farm2_2019-05-10_20-27-20.wav,44100,16,60,1,bioacoustic_index,512,2000,8000,1.50620533722562,NA 
rayol-farm2_2019-05-10_20-29-20.wav,44100,16,60,1,bioacoustic_index,512,2000,8000,1.82558106544041,NA 
rayol-farm2_2019-05-10_20-31-20.wav,44100,16,60,1,bioacoustic_index,512,2000,8000,1.83402752334337,NA 
rayol-farm2_2019-05-10_20-33-20.wav,44100,16,60,1,bioacoustic_index,512,2000,8000,2.16565905471208,NA 
rayol-farm2_2019-05-10_20-35-20.wav,44100,16,60,1,bioacoustic_index,512,2000,8000,1.49772798476832,NA 
rayol-farm2_2019-05-10_20-37-20.wav,44100,16,60,1,bioacoustic_index,512,2000,8000,1.78674267201499,NA 
rayol-farm2_2019-05-10_20-39-20.wav,44100,16,60,1,bioacoustic_index,512,2000,8000,1.80661691404488,NA 
rayol-farm2_2019-05-10_20-41-20.wav,44100,16,60,1,bioacoustic_index,512,2000,8000,1.72332339334738,NA 
rayol-farm2_2019-05-10_20-43-21.wav,44100,16,60,1,bioacoustic_index,512,2000,8000,1.91136893199632,NA 
rayol-farm2_2019-05-10_20-45-21.wav,44100,16,60,1,bioacoustic_index,512,2000,8000,2.09374029631718,NA 
rayol-farm2_2019-05-10_20-47-21.wav,44100,16,60,1,bioacoustic_index,512,2000,8000,2.22316797133621,NA 
rayol-farm2_2019-05-10_20-49-21.wav,44100,16,60,1,bioacoustic_index,512,2000,8000,1.924200513644,NA 
rayol-farm2_2019-05-10_20-51-21.wav,44100,16,60,1,bioacoustic_index,512,2000,8000,2.02170152567319,NA 
rayol-farm2_2019-05-10_20-53-21.wav,44100,16,60,1,bioacoustic_index,512,2000,8000,1.85750134480348,NA 
rayol-farm2_2019-05-10_20-55-21.wav,44100,16,60,1,bioacoustic_index,512,2000,8000,1.96191005379119,NA 
rayol-farm2_2019-05-10_20-57-21.wav,44100,16,60,1,bioacoustic_index,512,2000,8000,1.74287767276783,NA 
rayol-farm2_2019-05-10_20-59-22.wav,44100,16,60,1,bioacoustic_index,512,2000,8000,1.98282798219935,NA 
rayol-farm2_2019-05-10_21-01-22.wav,44100,16,60,1,bioacoustic_index,512,2000,8000,1.6808780197245,NA 
rayol-farm2_2019-05-10_21-03-22.wav,44100,16,60,1,bioacoustic_index,512,2000,8000,1.91597369871983,NA 
rayol-farm2_2019-05-10_21-05-22.wav,44100,16,60,1,bioacoustic_index,512,2000,8000,1.85969219170126,NA 
rayol-farm2_2019-05-10_21-07-22.wav,44100,16,60,1,bioacoustic_index,512,2000,8000,1.84705980511898,NA 
rayol-farm2_2019-05-10_21-09-22.wav,44100,16,60,1,bioacoustic_index,512,2000,8000,4.74199543451176,NA 
rayol-farm2_2019-05-10_21-11-22.wav,44100,16,60,1,bioacoustic_index,512,2000,8000,1.86580018526441,NA 
rayol-farm2_2019-05-10_21-13-22.wav,44100,16,60,1,bioacoustic_index,512,2000,8000,1.60788825136192,NA 
rayol-farm2_2019-05-10_21-15-22.wav,44100,16,60,1,bioacoustic_index,512,2000,8000,1.77245057495349,NA 
rayol-farm2_2019-05-10_21-17-23.wav,44100,16,60,1,bioacoustic_index,512,2000,8000,1.53014395510708,NA 
rayol-farm2_2019-05-10_21-19-23.wav,44100,16,60,1,bioacoustic_index,512,2000,8000,1.35985411985533,NA 
rayol-farm2_2019-05-10_21-21-23.wav,44100,16,60,1,bioacoustic_index,512,2000,8000,1.37933186507285,NA 
rayol-farm2_2019-05-10_21-23-23.wav,44100,16,60,1,bioacoustic_index,512,2000,8000,1.43510716073499,NA 
rayol-farm2_2019-05-10_21-25-23.wav,44100,16,60,1,bioacoustic_index,512,2000,8000,1.50718239438837,NA 
rayol-farm2_2019-05-10_21-27-23.wav,44100,16,60,1,bioacoustic_index,512,2000,8000,1.33849065795203,NA 
rayol-farm2_2019-05-10_21-29-23.wav,44100,16,60,1,bioacoustic_index,512,2000,8000,1.36583527713491,NA 
rayol-farm2_2019-05-10_21-31-23.wav,44100,16,60,1,bioacoustic_index,512,2000,8000,1.50351307133002,NA 
rayol-farm2_2019-05-10_21-33-24.wav,44100,16,60,1,bioacoustic_index,512,2000,8000,1.22066407885132,NA 
rayol-farm2_2019-05-10_21-35-24.wav,44100,16,60,1,bioacoustic_index,512,2000,8000,1.29896851933128,NA 
rayol-farm2_2019-05-10_21-37-24.wav,44100,16,60,1,bioacoustic_index,512,2000,8000,1.25048222454392,NA 
rayol-farm2_2019-05-10_21-39-24.wav,44100,16,60,1,bioacoustic_index,512,2000,8000,1.25183004528617,NA 
rayol-farm2_2019-05-10_21-41-24.wav,44100,16,60,1,bioacoustic_index,512,2000,8000,1.37986049068446,NA 
rayol-farm2_2019-05-10_21-43-24.wav,44100,16,60,1,bioacoustic_index,512,2000,8000,1.27930582524071,NA 
rayol-farm2_2019-05-10_21-45-24.wav,44100,16,60,1,bioacoustic_index,512,2000,8000,1.31244335935972,NA 
rayol-farm2_2019-05-10_21-47-24.wav,44100,16,60,1,bioacoustic_index,512,2000,8000,1.2728102308438,NA 
rayol-farm2_2019-05-10_21-49-25.wav,44100,16,60,1,bioacoustic_index,512,2000,8000,1.40908955798757,NA 
rayol-farm2_2019-05-10_21-51-25.wav,44100,16,60,1,bioacoustic_index,512,2000,8000,1.33531932376348,NA 
rayol-farm2_2019-05-10_21-53-25.wav,44100,16,60,1,bioacoustic_index,512,2000,8000,1.41825127832978,NA 
rayol-farm2_2019-05-10_21-55-25.wav,44100,16,60,1,bioacoustic_index,512,2000,8000,1.44179012601175,NA 
rayol-farm2_2019-05-10_21-57-25.wav,44100,16,60,1,bioacoustic_index,512,2000,8000,1.20953798514872,NA 
rayol-farm2_2019-05-10_21-59-25.wav,44100,16,60,1,bioacoustic_index,512,2000,8000,1.27366672591806,NA 
rayol-farm2_2019-05-10_22-01-25.wav,44100,16,60,1,bioacoustic_index,512,2000,8000,1.2304609620314,NA 
rayol-farm2_2019-05-10_22-03-25.wav,44100,16,60,1,bioacoustic_index,512,2000,8000,1.30749585287695,NA 
rayol-farm2_2019-05-10_22-05-25.wav,44100,16,60,1,bioacoustic_index,512,2000,8000,1.30688861142982,NA 
rayol-farm2_2019-05-10_22-07-26.wav,44100,16,60,1,bioacoustic_index,512,2000,8000,1.30729195128738,NA 
rayol-farm2_2019-05-10_22-09-26.wav,44100,16,60,1,bioacoustic_index,512,2000,8000,1.30176539911963,NA 
rayol-farm2_2019-05-10_22-11-26.wav,44100,16,60,1,bioacoustic_index,512,2000,8000,1.2763419837965,NA 
rayol-farm2_2019-05-10_22-13-26.wav,44100,16,60,1,bioacoustic_index,512,2000,8000,1.35644232416113,NA 
rayol-farm2_2019-05-10_22-15-26.wav,44100,16,60,1,bioacoustic_index,512,2000,8000,1.48065423561284,NA 
rayol-farm2_2019-05-10_22-17-26.wav,44100,16,60,1,bioacoustic_index,512,2000,8000,1.49092601566361,NA 
rayol-farm2_2019-05-10_22-19-26.wav,44100,16,60,1,bioacoustic_index,512,2000,8000,1.46703255777784,NA 
rayol-farm2_2019-05-10_22-21-26.wav,44100,16,60,1,bioacoustic_index,512,2000,8000,1.476541697825,NA 
rayol-farm2_2019-05-10_22-23-27.wav,44100,16,60,1,bioacoustic_index,512,2000,8000,1.42511237976477,NA 
rayol-farm2_2019-05-10_22-25-27.wav,44100,16,60,1,bioacoustic_index,512,2000,8000,1.46220898998189,NA 
rayol-farm2_2019-05-10_22-27-27.wav,44100,16,60,1,bioacoustic_index,512,2000,8000,1.48339235307893,NA 
rayol-farm2_2019-05-10_22-29-27.wav,44100,16,60,1,bioacoustic_index,512,2000,8000,1.51853185440665,NA 
rayol-farm2_2019-05-10_22-31-27.wav,44100,16,60,1,bioacoustic_index,512,2000,8000,1.4686128836821,NA 
rayol-farm2_2019-05-10_22-33-27.wav,44100,16,60,1,bioacoustic_index,512,2000,8000,1.52383381387232,NA 
rayol-farm2_2019-05-10_22-35-27.wav,44100,16,60,1,bioacoustic_index,512,2000,8000,1.38665291982188,NA 
rayol-farm2_2019-05-10_22-37-27.wav,44100,16,60,1,bioacoustic_index,512,2000,8000,1.42045565858784,NA 
rayol-farm2_2019-05-10_22-39-28.wav,44100,16,60,1,bioacoustic_index,512,2000,8000,1.44517639240622,NA 
rayol-farm2_2019-05-10_22-41-28.wav,44100,16,60,1,bioacoustic_index,512,2000,8000,1.41814046649796,NA 
rayol-farm2_2019-05-10_22-43-28.wav,44100,16,60,1,bioacoustic_index,512,2000,8000,1.61975836280027,NA 
rayol-farm2_2019-05-10_22-45-28.wav,44100,16,60,1,bioacoustic_index,512,2000,8000,1.40167926311757,NA 
rayol-farm2_2019-05-10_22-47-28.wav,44100,16,60,1,bioacoustic_index,512,2000,8000,1.38682720538965,NA 
rayol-farm2_2019-05-10_22-49-28.wav,44100,16,60,1,bioacoustic_index,512,2000,8000,1.3437949091749,NA 
rayol-farm2_2019-05-10_22-51-28.wav,44100,16,60,1,bioacoustic_index,512,2000,8000,1.32231639431842,NA 
rayol-farm2_2019-05-10_22-53-28.wav,44100,16,60,1,bioacoustic_index,512,2000,8000,1.37664581035612,NA 
rayol-farm2_2019-05-10_22-55-29.wav,44100,16,60,1,bioacoustic_index,512,2000,8000,1.35605377639126,NA 
rayol-farm2_2019-05-10_22-57-29.wav,44100,16,60,1,bioacoustic_index,512,2000,8000,1.26499885951776,NA 
rayol-farm2_2019-05-10_22-59-29.wav,44100,16,60,1,bioacoustic_index,512,2000,8000,1.31608350176378,NA 
rayol-farm2_2019-05-10_23-01-29.wav,44100,16,60,1,bioacoustic_index,512,2000,8000,1.3278464082193,NA 
rayol-farm2_2019-05-10_23-03-29.wav,44100,16,60,1,bioacoustic_index,512,2000,8000,1.28481828470353,NA 
rayol-farm2_2019-05-10_23-05-29.wav,44100,16,60,1,bioacoustic_index,512,2000,8000,1.33425262451723,NA 
rayol-farm2_2019-05-10_23-07-29.wav,44100,16,60,1,bioacoustic_index,512,2000,8000,1.26488587085634,NA 
rayol-farm2_2019-05-10_23-09-29.wav,44100,16,60,1,bioacoustic_index,512,2000,8000,1.31817657996819,NA 
rayol-farm2_2019-05-10_23-11-29.wav,44100,16,60,1,bioacoustic_index,512,2000,8000,1.33996088270104,NA 
rayol-farm2_2019-05-10_23-13-30.wav,44100,16,60,1,bioacoustic_index,512,2000,8000,1.28726145213845,NA 
rayol-farm2_2019-05-10_23-15-30.wav,44100,16,60,1,bioacoustic_index,512,2000,8000,1.41568859715793,NA 
rayol-farm2_2019-05-10_23-17-30.wav,44100,16,60,1,bioacoustic_index,512,2000,8000,1.34756602692875,NA 
rayol-farm2_2019-05-10_23-19-30.wav,44100,16,60,1,bioacoustic_index,512,2000,8000,1.31329214455454,NA 
rayol-farm2_2019-05-10_23-21-30.wav,44100,16,60,1,bioacoustic_index,512,2000,8000,1.24552557303376,NA 
rayol-farm2_2019-05-10_23-23-30.wav,44100,16,60,1,bioacoustic_index,512,2000,8000,1.35409115585922,NA 
rayol-farm2_2019-05-10_23-25-30.wav,44100,16,60,1,bioacoustic_index,512,2000,8000,1.28578364328358,NA 
rayol-farm2_2019-05-10_23-27-30.wav,44100,16,60,1,bioacoustic_index,512,2000,8000,1.29553405567594,NA 
rayol-farm2_2019-05-10_23-29-31.wav,44100,16,60,1,bioacoustic_index,512,2000,8000,1.2635681880236,NA 
rayol-farm2_2019-05-10_23-31-31.wav,44100,16,60,1,bioacoustic_index,512,2000,8000,1.28144196480117,NA 
rayol-farm2_2019-05-10_23-33-31.wav,44100,16,60,1,bioacoustic_index,512,2000,8000,1.28384368596069,NA 
rayol-farm2_2019-05-10_23-35-31.wav,44100,16,60,1,bioacoustic_index,512,2000,8000,1.27434311657,NA 
rayol-farm2_2019-05-10_23-37-31.wav,44100,16,60,1,bioacoustic_index,512,2000,8000,1.28650557815747,NA 
rayol-farm2_2019-05-10_23-39-31.wav,44100,16,60,1,bioacoustic_index,512,2000,8000,1.30852935451211,NA 
rayol-farm2_2019-05-10_23-41-31.wav,44100,16,60,1,bioacoustic_index,512,2000,8000,1.24922480839406,NA 
rayol-farm2_2019-05-10_23-43-31.wav,44100,16,60,1,bioacoustic_index,512,2000,8000,1.31204758952732,NA 
rayol-farm2_2019-05-10_23-45-32.wav,44100,16,60,1,bioacoustic_index,512,2000,8000,1.38184505986633,NA 
rayol-farm2_2019-05-10_23-47-32.wav,44100,16,60,1,bioacoustic_index,512,2000,8000,1.29808024362829,NA 
rayol-farm2_2019-05-10_23-49-32.wav,44100,16,60,1,bioacoustic_index,512,2000,8000,1.31231505670892,NA 
rayol-farm2_2019-05-10_23-51-32.wav,44100,16,60,1,bioacoustic_index,512,2000,8000,1.30988407129522,NA 
rayol-farm2_2019-05-10_23-53-32.wav,44100,16,60,1,bioacoustic_index,512,2000,8000,1.38045623186,NA 
rayol-farm2_2019-05-10_23-55-32.wav,44100,16,60,1,bioacoustic_index,512,2000,8000,1.27008987064815,NA 
rayol-farm2_2019-05-10_23-57-32.wav,44100,16,60,1,bioacoustic_index,512,2000,8000,1.29193463416702,NA 
rayol-farm2_2019-05-10_23-59-32.wav,44100,16,60,1,bioacoustic_index,512,2000,8000,1.28423366336171,NA
