FILENAME,SAMPLINGRATE,BIT,DURATION,CHANNELS,INDEX,FFT_W,MIN_FREQ,MAX_FREQ,J,LEFT_CHANNEL,RIGHT_CHANNEL
rayol-farm2_2019-03-23_00-01-09.wav,44100,16,60,1,acoustic_complexity,512,1,NA,5,1839.51964862468,NA 
rayol-farm2_2019-03-23_00-03-09.wav,44100,16,60,1,acoustic_complexity,512,1,NA,5,1839.4906091714,NA 
rayol-farm2_2019-03-23_00-05-09.wav,44100,16,60,1,acoustic_complexity,512,1,NA,5,1825.0101604683,NA 
rayol-farm2_2019-03-23_00-07-09.wav,44100,16,60,1,acoustic_complexity,512,1,NA,5,1824.38516431578,NA 
rayol-farm2_2019-03-23_00-09-09.wav,44100,16,60,1,acoustic_complexity,512,1,NA,5,1817.66132589995,NA 
rayol-farm2_2019-03-23_00-11-10.wav,44100,16,60,1,acoustic_complexity,512,1,NA,5,1819.36930677947,NA 
rayol-farm2_2019-03-23_00-13-10.wav,44100,16,60,1,acoustic_complexity,512,1,NA,5,1831.13136903053,NA 
rayol-farm2_2019-03-23_00-15-10.wav,44100,16,60,1,acoustic_complexity,512,1,NA,5,1817.18274413838,NA 
rayol-farm2_2019-03-23_00-17-10.wav,44100,16,60,1,acoustic_complexity,512,1,NA,5,1820.29887146069,NA 
rayol-farm2_2019-03-23_00-19-10.wav,44100,16,60,1,acoustic_complexity,512,1,NA,5,1847.92336602051,NA 
rayol-farm2_2019-03-23_00-21-10.wav,44100,16,60,1,acoustic_complexity,512,1,NA,5,1849.60442189534,NA 
rayol-farm2_2019-03-23_00-23-10.wav,44100,16,60,1,acoustic_complexity,512,1,NA,5,1835.72741053982,NA 
rayol-farm2_2019-03-23_00-25-10.wav,44100,16,60,1,acoustic_complexity,512,1,NA,5,1821.1705162139,NA 
rayol-farm2_2019-03-23_00-27-11.wav,44100,16,60,1,acoustic_complexity,512,1,NA,5,1826.00740514652,NA 
rayol-farm2_2019-03-23_00-29-11.wav,44100,16,60,1,acoustic_complexity,512,1,NA,5,1818.66150555347,NA 
rayol-farm2_2019-03-23_00-31-11.wav,44100,16,60,1,acoustic_complexity,512,1,NA,5,1827.48305256718,NA 
rayol-farm2_2019-03-23_00-33-11.wav,44100,16,60,1,acoustic_complexity,512,1,NA,5,1822.47885860084,NA 
rayol-farm2_2019-03-23_00-35-11.wav,44100,16,60,1,acoustic_complexity,512,1,NA,5,1839.55022644534,NA 
rayol-farm2_2019-03-23_00-37-11.wav,44100,16,60,1,acoustic_complexity,512,1,NA,5,1826.34669244829,NA 
rayol-farm2_2019-03-23_00-39-11.wav,44100,16,60,1,acoustic_complexity,512,1,NA,5,1850.20015104257,NA 
rayol-farm2_2019-03-23_00-41-11.wav,44100,16,60,1,acoustic_complexity,512,1,NA,5,1888.18357097229,NA 
rayol-farm2_2019-03-23_00-43-12.wav,44100,16,60,1,acoustic_complexity,512,1,NA,5,1868.99747237677,NA 
rayol-farm2_2019-03-23_00-45-12.wav,44100,16,60,1,acoustic_complexity,512,1,NA,5,1869.18550169559,NA 
rayol-farm2_2019-03-23_00-47-12.wav,44100,16,60,1,acoustic_complexity,512,1,NA,5,1874.57861323552,NA 
rayol-farm2_2019-03-23_00-49-12.wav,44100,16,60,1,acoustic_complexity,512,1,NA,5,1878.3295434734,NA 
rayol-farm2_2019-03-23_00-51-12.wav,44100,16,60,1,acoustic_complexity,512,1,NA,5,1872.64861949847,NA 
rayol-farm2_2019-03-23_00-53-12.wav,44100,16,60,1,acoustic_complexity,512,1,NA,5,1864.90207516713,NA 
rayol-farm2_2019-03-23_00-55-12.wav,44100,16,60,1,acoustic_complexity,512,1,NA,5,1876.86434063255,NA 
rayol-farm2_2019-03-23_00-57-12.wav,44100,16,60,1,acoustic_complexity,512,1,NA,5,1864.19035146694,NA 
rayol-farm2_2019-03-23_00-59-12.wav,44100,16,60,1,acoustic_complexity,512,1,NA,5,1830.39382339623,NA 
rayol-farm2_2019-03-23_01-01-13.wav,44100,16,60,1,acoustic_complexity,512,1,NA,5,1826.52026466809,NA 
rayol-farm2_2019-03-23_01-03-13.wav,44100,16,60,1,acoustic_complexity,512,1,NA,5,1839.89220902605,NA 
rayol-farm2_2019-03-23_01-05-13.wav,44100,16,60,1,acoustic_complexity,512,1,NA,5,1844.40699781556,NA 
rayol-farm2_2019-03-23_01-07-13.wav,44100,16,60,1,acoustic_complexity,512,1,NA,5,1817.84869484832,NA 
rayol-farm2_2019-03-23_01-09-13.wav,44100,16,60,1,acoustic_complexity,512,1,NA,5,1821.38875754618,NA 
rayol-farm2_2019-03-23_01-11-13.wav,44100,16,60,1,acoustic_complexity,512,1,NA,5,1819.09673973451,NA 
rayol-farm2_2019-03-23_01-13-13.wav,44100,16,60,1,acoustic_complexity,512,1,NA,5,1807.00983816272,NA 
rayol-farm2_2019-03-23_01-15-13.wav,44100,16,60,1,acoustic_complexity,512,1,NA,5,1808.67426602207,NA 
rayol-farm2_2019-03-23_01-17-14.wav,44100,16,60,1,acoustic_complexity,512,1,NA,5,1813.89943657947,NA 
rayol-farm2_2019-03-23_01-19-14.wav,44100,16,60,1,acoustic_complexity,512,1,NA,5,1812.1415742727,NA 
rayol-farm2_2019-03-23_01-21-14.wav,44100,16,60,1,acoustic_complexity,512,1,NA,5,1826.90928297844,NA 
rayol-farm2_2019-03-23_01-23-14.wav,44100,16,60,1,acoustic_complexity,512,1,NA,5,1839.60272082357,NA 
rayol-farm2_2019-03-23_01-25-14.wav,44100,16,60,1,acoustic_complexity,512,1,NA,5,1820.71998377247,NA 
rayol-farm2_2019-03-23_01-27-14.wav,44100,16,60,1,acoustic_complexity,512,1,NA,5,1823.57481977856,NA 
rayol-farm2_2019-03-23_01-29-14.wav,44100,16,60,1,acoustic_complexity,512,1,NA,5,1820.95094356479,NA 
rayol-farm2_2019-03-23_01-31-14.wav,44100,16,60,1,acoustic_complexity,512,1,NA,5,1819.7500873107,NA 
rayol-farm2_2019-03-23_01-33-15.wav,44100,16,60,1,acoustic_complexity,512,1,NA,5,1815.37731858482,NA 
rayol-farm2_2019-03-23_01-35-15.wav,44100,16,60,1,acoustic_complexity,512,1,NA,5,1821.98573375627,NA 
rayol-farm2_2019-03-23_01-37-15.wav,44100,16,60,1,acoustic_complexity,512,1,NA,5,1817.77761540719,NA 
rayol-farm2_2019-03-23_01-39-15.wav,44100,16,60,1,acoustic_complexity,512,1,NA,5,1825.98957817537,NA 
rayol-farm2_2019-03-23_01-41-15.wav,44100,16,60,1,acoustic_complexity,512,1,NA,5,1832.01110708553,NA 
rayol-farm2_2019-03-23_01-43-15.wav,44100,16,60,1,acoustic_complexity,512,1,NA,5,1852.58490809213,NA 
rayol-farm2_2019-03-23_01-45-15.wav,44100,16,60,1,acoustic_complexity,512,1,NA,5,1846.01962590279,NA 
rayol-farm2_2019-03-23_01-47-15.wav,44100,16,60,1,acoustic_complexity,512,1,NA,5,1821.64197319026,NA 
rayol-farm2_2019-03-23_01-49-16.wav,44100,16,60,1,acoustic_complexity,512,1,NA,5,1812.6825804793,NA 
rayol-farm2_2019-03-23_01-51-16.wav,44100,16,60,1,acoustic_complexity,512,1,NA,5,1827.40106402349,NA 
rayol-farm2_2019-03-23_01-53-16.wav,44100,16,60,1,acoustic_complexity,512,1,NA,5,1805.54506629103,NA 
rayol-farm2_2019-03-23_01-55-16.wav,44100,16,60,1,acoustic_complexity,512,1,NA,5,1822.33671720456,NA 
rayol-farm2_2019-03-23_01-57-16.wav,44100,16,60,1,acoustic_complexity,512,1,NA,5,1814.51147430461,NA 
rayol-farm2_2019-03-23_01-59-16.wav,44100,16,60,1,acoustic_complexity,512,1,NA,5,1805.70576568933,NA 
rayol-farm2_2019-03-23_02-01-16.wav,44100,16,60,1,acoustic_complexity,512,1,NA,5,1816.27285915466,NA 
rayol-farm2_2019-03-23_02-03-16.wav,44100,16,60,1,acoustic_complexity,512,1,NA,5,1816.93765180823,NA 
rayol-farm2_2019-03-23_02-05-16.wav,44100,16,60,1,acoustic_complexity,512,1,NA,5,1852.44263181816,NA 
rayol-farm2_2019-03-23_02-07-17.wav,44100,16,60,1,acoustic_complexity,512,1,NA,5,1831.12537017832,NA 
rayol-farm2_2019-03-23_02-09-17.wav,44100,16,60,1,acoustic_complexity,512,1,NA,5,1828.14624041022,NA 
rayol-farm2_2019-03-23_02-11-17.wav,44100,16,60,1,acoustic_complexity,512,1,NA,5,1823.76960164486,NA 
rayol-farm2_2019-03-23_02-13-17.wav,44100,16,60,1,acoustic_complexity,512,1,NA,5,1819.09354437734,NA 
rayol-farm2_2019-03-23_02-15-17.wav,44100,16,60,1,acoustic_complexity,512,1,NA,5,1831.90241512655,NA 
rayol-farm2_2019-03-23_02-17-17.wav,44100,16,60,1,acoustic_complexity,512,1,NA,5,1813.34470105131,NA 
rayol-farm2_2019-03-23_02-19-17.wav,44100,16,60,1,acoustic_complexity,512,1,NA,5,1816.54060026951,NA 
rayol-farm2_2019-03-23_02-21-17.wav,44100,16,60,1,acoustic_complexity,512,1,NA,5,1822.22792423597,NA 
rayol-farm2_2019-03-23_02-23-18.wav,44100,16,60,1,acoustic_complexity,512,1,NA,5,1824.27260894481,NA 
rayol-farm2_2019-03-23_02-25-18.wav,44100,16,60,1,acoustic_complexity,512,1,NA,5,1817.7143703702,NA 
rayol-farm2_2019-03-23_02-27-18.wav,44100,16,60,1,acoustic_complexity,512,1,NA,5,1841.62736070592,NA 
rayol-farm2_2019-03-23_02-29-18.wav,44100,16,60,1,acoustic_complexity,512,1,NA,5,1841.97310381371,NA 
rayol-farm2_2019-03-23_02-31-18.wav,44100,16,60,1,acoustic_complexity,512,1,NA,5,1818.23790347204,NA 
rayol-farm2_2019-03-23_02-33-18.wav,44100,16,60,1,acoustic_complexity,512,1,NA,5,1819.45553612704,NA 
rayol-farm2_2019-03-23_02-35-18.wav,44100,16,60,1,acoustic_complexity,512,1,NA,5,1815.41389753248,NA 
rayol-farm2_2019-03-23_02-37-18.wav,44100,16,60,1,acoustic_complexity,512,1,NA,5,1819.74653579209,NA 
rayol-farm2_2019-03-23_02-39-19.wav,44100,16,60,1,acoustic_complexity,512,1,NA,5,1807.94657279515,NA 
rayol-farm2_2019-03-23_02-41-19.wav,44100,16,60,1,acoustic_complexity,512,1,NA,5,1829.0362270016,NA 
rayol-farm2_2019-03-23_02-43-19.wav,44100,16,60,1,acoustic_complexity,512,1,NA,5,1813.03570461101,NA 
rayol-farm2_2019-03-23_02-45-19.wav,44100,16,60,1,acoustic_complexity,512,1,NA,5,1817.66030910898,NA 
rayol-farm2_2019-03-23_02-47-19.wav,44100,16,60,1,acoustic_complexity,512,1,NA,5,1830.04569677763,NA 
rayol-farm2_2019-03-23_02-49-19.wav,44100,16,60,1,acoustic_complexity,512,1,NA,5,1837.87007493528,NA 
rayol-farm2_2019-03-23_02-51-19.wav,44100,16,60,1,acoustic_complexity,512,1,NA,5,1824.62972989592,NA 
rayol-farm2_2019-03-23_02-53-19.wav,44100,16,60,1,acoustic_complexity,512,1,NA,5,1819.44832221646,NA 
rayol-farm2_2019-03-23_02-55-20.wav,44100,16,60,1,acoustic_complexity,512,1,NA,5,1823.32284518997,NA 
rayol-farm2_2019-03-23_02-57-20.wav,44100,16,60,1,acoustic_complexity,512,1,NA,5,1808.57284051859,NA 
rayol-farm2_2019-03-23_02-59-20.wav,44100,16,60,1,acoustic_complexity,512,1,NA,5,1813.32536281991,NA 
rayol-farm2_2019-03-23_03-01-20.wav,44100,16,60,1,acoustic_complexity,512,1,NA,5,1808.78489921656,NA 
rayol-farm2_2019-03-23_03-03-20.wav,44100,16,60,1,acoustic_complexity,512,1,NA,5,1821.06390559698,NA 
rayol-farm2_2019-03-23_03-05-20.wav,44100,16,60,1,acoustic_complexity,512,1,NA,5,1809.80864783565,NA 
rayol-farm2_2019-03-23_03-07-20.wav,44100,16,60,1,acoustic_complexity,512,1,NA,5,1826.0566582247,NA 
rayol-farm2_2019-03-23_03-09-20.wav,44100,16,60,1,acoustic_complexity,512,1,NA,5,1831.829656041,NA 
rayol-farm2_2019-03-23_03-11-20.wav,44100,16,60,1,acoustic_complexity,512,1,NA,5,1831.26567412402,NA 
rayol-farm2_2019-03-23_03-13-21.wav,44100,16,60,1,acoustic_complexity,512,1,NA,5,1810.60583973871,NA 
rayol-farm2_2019-03-23_03-15-21.wav,44100,16,60,1,acoustic_complexity,512,1,NA,5,1821.38838425371,NA 
rayol-farm2_2019-03-23_03-17-21.wav,44100,16,60,1,acoustic_complexity,512,1,NA,5,1808.8533503247,NA 
rayol-farm2_2019-03-23_03-19-21.wav,44100,16,60,1,acoustic_complexity,512,1,NA,5,1813.38603413605,NA 
rayol-farm2_2019-03-23_03-21-21.wav,44100,16,60,1,acoustic_complexity,512,1,NA,5,1827.68221353709,NA 
rayol-farm2_2019-03-23_03-23-21.wav,44100,16,60,1,acoustic_complexity,512,1,NA,5,1828.85576891928,NA 
rayol-farm2_2019-03-23_03-25-21.wav,44100,16,60,1,acoustic_complexity,512,1,NA,5,1813.75548600213,NA 
rayol-farm2_2019-03-23_03-27-21.wav,44100,16,60,1,acoustic_complexity,512,1,NA,5,1811.2967517998,NA 
rayol-farm2_2019-03-23_03-29-22.wav,44100,16,60,1,acoustic_complexity,512,1,NA,5,1846.09404921162,NA 
rayol-farm2_2019-03-23_03-31-22.wav,44100,16,60,1,acoustic_complexity,512,1,NA,5,1832.57245956521,NA 
rayol-farm2_2019-03-23_03-33-22.wav,44100,16,60,1,acoustic_complexity,512,1,NA,5,1813.96921258291,NA 
rayol-farm2_2019-03-23_03-35-22.wav,44100,16,60,1,acoustic_complexity,512,1,NA,5,1821.2993345932,NA 
rayol-farm2_2019-03-23_03-37-22.wav,44100,16,60,1,acoustic_complexity,512,1,NA,5,1815.16505683207,NA 
rayol-farm2_2019-03-23_03-39-22.wav,44100,16,60,1,acoustic_complexity,512,1,NA,5,1812.56683552913,NA 
rayol-farm2_2019-03-23_03-41-22.wav,44100,16,60,1,acoustic_complexity,512,1,NA,5,1818.04009794293,NA 
rayol-farm2_2019-03-23_03-43-22.wav,44100,16,60,1,acoustic_complexity,512,1,NA,5,1813.63437739543,NA 
rayol-farm2_2019-03-23_03-45-23.wav,44100,16,60,1,acoustic_complexity,512,1,NA,5,1808.29841646507,NA 
rayol-farm2_2019-03-23_03-47-23.wav,44100,16,60,1,acoustic_complexity,512,1,NA,5,1820.92264843459,NA 
rayol-farm2_2019-03-23_03-49-23.wav,44100,16,60,1,acoustic_complexity,512,1,NA,5,1813.05509904782,NA 
rayol-farm2_2019-03-23_03-51-23.wav,44100,16,60,1,acoustic_complexity,512,1,NA,5,1814.79060453042,NA 
rayol-farm2_2019-03-23_03-53-23.wav,44100,16,60,1,acoustic_complexity,512,1,NA,5,1833.17013124754,NA 
rayol-farm2_2019-03-23_03-55-23.wav,44100,16,60,1,acoustic_complexity,512,1,NA,5,1816.93223700158,NA 
rayol-farm2_2019-03-23_03-57-23.wav,44100,16,60,1,acoustic_complexity,512,1,NA,5,1811.39826585082,NA 
rayol-farm2_2019-03-23_03-59-23.wav,44100,16,60,1,acoustic_complexity,512,1,NA,5,1815.38726383516,NA 
rayol-farm2_2019-03-23_04-01-24.wav,44100,16,60,1,acoustic_complexity,512,1,NA,5,1810.99618635774,NA 
rayol-farm2_2019-03-23_04-03-24.wav,44100,16,60,1,acoustic_complexity,512,1,NA,5,1817.16438824627,NA 
rayol-farm2_2019-03-23_04-05-24.wav,44100,16,60,1,acoustic_complexity,512,1,NA,5,1805.4505498391,NA 
rayol-farm2_2019-03-23_04-07-24.wav,44100,16,60,1,acoustic_complexity,512,1,NA,5,1811.22179021588,NA 
rayol-farm2_2019-03-23_04-09-24.wav,44100,16,60,1,acoustic_complexity,512,1,NA,5,1802.89468442845,NA 
rayol-farm2_2019-03-23_04-11-24.wav,44100,16,60,1,acoustic_complexity,512,1,NA,5,1829.69274698847,NA 
rayol-farm2_2019-03-23_04-13-24.wav,44100,16,60,1,acoustic_complexity,512,1,NA,5,1820.35455916168,NA 
rayol-farm2_2019-03-23_04-15-24.wav,44100,16,60,1,acoustic_complexity,512,1,NA,5,1818.43819029325,NA 
rayol-farm2_2019-03-23_04-17-25.wav,44100,16,60,1,acoustic_complexity,512,1,NA,5,1820.08375411832,NA 
rayol-farm2_2019-03-23_04-19-25.wav,44100,16,60,1,acoustic_complexity,512,1,NA,5,1809.588599276,NA 
rayol-farm2_2019-03-23_04-21-25.wav,44100,16,60,1,acoustic_complexity,512,1,NA,5,1810.9623295934,NA 
rayol-farm2_2019-03-23_04-23-25.wav,44100,16,60,1,acoustic_complexity,512,1,NA,5,1796.51327363707,NA 
rayol-farm2_2019-03-23_04-25-25.wav,44100,16,60,1,acoustic_complexity,512,1,NA,5,1810.23697265965,NA 
rayol-farm2_2019-03-23_04-27-25.wav,44100,16,60,1,acoustic_complexity,512,1,NA,5,1804.14448766214,NA 
rayol-farm2_2019-03-23_04-29-25.wav,44100,16,60,1,acoustic_complexity,512,1,NA,5,1828.73211570853,NA 
rayol-farm2_2019-03-23_04-31-25.wav,44100,16,60,1,acoustic_complexity,512,1,NA,5,1823.43647741035,NA 
rayol-farm2_2019-03-23_04-33-25.wav,44100,16,60,1,acoustic_complexity,512,1,NA,5,1821.10741870712,NA 
rayol-farm2_2019-03-23_04-35-26.wav,44100,16,60,1,acoustic_complexity,512,1,NA,5,1816.89553505603,NA 
rayol-farm2_2019-03-23_04-37-26.wav,44100,16,60,1,acoustic_complexity,512,1,NA,5,1824.0460910198,NA 
rayol-farm2_2019-03-23_04-39-26.wav,44100,16,60,1,acoustic_complexity,512,1,NA,5,1817.36789501529,NA 
rayol-farm2_2019-03-23_04-41-26.wav,44100,16,60,1,acoustic_complexity,512,1,NA,5,1811.40401794114,NA 
rayol-farm2_2019-03-23_04-43-26.wav,44100,16,60,1,acoustic_complexity,512,1,NA,5,1813.33452334752,NA 
rayol-farm2_2019-03-23_04-45-26.wav,44100,16,60,1,acoustic_complexity,512,1,NA,5,1811.47064748809,NA 
rayol-farm2_2019-03-23_04-47-26.wav,44100,16,60,1,acoustic_complexity,512,1,NA,5,1806.32841593304,NA 
rayol-farm2_2019-03-23_04-49-26.wav,44100,16,60,1,acoustic_complexity,512,1,NA,5,1806.45996596767,NA 
rayol-farm2_2019-03-23_04-51-27.wav,44100,16,60,1,acoustic_complexity,512,1,NA,5,1819.65047959572,NA 
rayol-farm2_2019-03-23_04-53-27.wav,44100,16,60,1,acoustic_complexity,512,1,NA,5,1815.4206447677,NA 
rayol-farm2_2019-03-23_04-55-27.wav,44100,16,60,1,acoustic_complexity,512,1,NA,5,1814.47055517115,NA 
rayol-farm2_2019-03-23_04-57-27.wav,44100,16,60,1,acoustic_complexity,512,1,NA,5,1816.68142937553,NA 
rayol-farm2_2019-03-23_04-59-27.wav,44100,16,60,1,acoustic_complexity,512,1,NA,5,1825.94525043725,NA 
rayol-farm2_2019-03-23_05-01-27.wav,44100,16,60,1,acoustic_complexity,512,1,NA,5,1816.81198283469,NA 
rayol-farm2_2019-03-23_05-03-27.wav,44100,16,60,1,acoustic_complexity,512,1,NA,5,1815.77872926014,NA 
rayol-farm2_2019-03-23_05-05-27.wav,44100,16,60,1,acoustic_complexity,512,1,NA,5,1815.89844218754,NA 
rayol-farm2_2019-03-23_05-07-28.wav,44100,16,60,1,acoustic_complexity,512,1,NA,5,1814.91321639538,NA 
rayol-farm2_2019-03-23_05-09-28.wav,44100,16,60,1,acoustic_complexity,512,1,NA,5,1809.59181840254,NA 
rayol-farm2_2019-03-23_05-11-28.wav,44100,16,60,1,acoustic_complexity,512,1,NA,5,1841.25457064829,NA 
rayol-farm2_2019-03-23_05-13-28.wav,44100,16,60,1,acoustic_complexity,512,1,NA,5,1831.51081388404,NA 
rayol-farm2_2019-03-23_05-15-28.wav,44100,16,60,1,acoustic_complexity,512,1,NA,5,1817.57147266855,NA 
rayol-farm2_2019-03-23_05-17-28.wav,44100,16,60,1,acoustic_complexity,512,1,NA,5,1828.33205579167,NA 
rayol-farm2_2019-03-23_05-19-28.wav,44100,16,60,1,acoustic_complexity,512,1,NA,5,1813.9500793735,NA 
rayol-farm2_2019-03-23_05-21-28.wav,44100,16,60,1,acoustic_complexity,512,1,NA,5,1804.36805053782,NA 
rayol-farm2_2019-03-23_05-23-29.wav,44100,16,60,1,acoustic_complexity,512,1,NA,5,1817.9871045348,NA 
rayol-farm2_2019-03-23_05-25-29.wav,44100,16,60,1,acoustic_complexity,512,1,NA,5,1820.83078933118,NA 
rayol-farm2_2019-03-23_05-27-29.wav,44100,16,60,1,acoustic_complexity,512,1,NA,5,1831.39727473871,NA 
rayol-farm2_2019-03-23_05-29-29.wav,44100,16,60,1,acoustic_complexity,512,1,NA,5,1821.27358320093,NA 
rayol-farm2_2019-03-23_05-31-29.wav,44100,16,60,1,acoustic_complexity,512,1,NA,5,1890.83948468738,NA 
rayol-farm2_2019-03-23_05-33-29.wav,44100,16,60,1,acoustic_complexity,512,1,NA,5,1851.0692434931,NA 
rayol-farm2_2019-03-23_05-35-29.wav,44100,16,60,1,acoustic_complexity,512,1,NA,5,1841.05066087287,NA 
rayol-farm2_2019-03-23_05-37-29.wav,44100,16,60,1,acoustic_complexity,512,1,NA,5,1809.21415946379,NA 
rayol-farm2_2019-03-23_05-39-29.wav,44100,16,60,1,acoustic_complexity,512,1,NA,5,1824.58948854219,NA 
rayol-farm2_2019-03-23_05-41-30.wav,44100,16,60,1,acoustic_complexity,512,1,NA,5,1830.83942309065,NA 
rayol-farm2_2019-03-23_05-43-30.wav,44100,16,60,1,acoustic_complexity,512,1,NA,5,1806.63903880215,NA 
rayol-farm2_2019-03-23_05-45-30.wav,44100,16,60,1,acoustic_complexity,512,1,NA,5,1800.99384923438,NA 
rayol-farm2_2019-03-23_05-47-30.wav,44100,16,60,1,acoustic_complexity,512,1,NA,5,1815.93664647384,NA 
rayol-farm2_2019-03-23_05-49-30.wav,44100,16,60,1,acoustic_complexity,512,1,NA,5,1821.71739986442,NA 
rayol-farm2_2019-03-23_05-51-30.wav,44100,16,60,1,acoustic_complexity,512,1,NA,5,1821.71283126839,NA 
rayol-farm2_2019-03-23_05-53-30.wav,44100,16,60,1,acoustic_complexity,512,1,NA,5,1833.08427654082,NA 
rayol-farm2_2019-03-23_05-55-30.wav,44100,16,60,1,acoustic_complexity,512,1,NA,5,1881.83625014664,NA 
rayol-farm2_2019-03-23_05-57-31.wav,44100,16,60,1,acoustic_complexity,512,1,NA,5,1861.61266673605,NA 
rayol-farm2_2019-03-23_05-59-31.wav,44100,16,60,1,acoustic_complexity,512,1,NA,5,1824.63347075046,NA 
rayol-farm2_2019-03-23_06-01-31.wav,44100,16,60,1,acoustic_complexity,512,1,NA,5,1835.00134163815,NA 
rayol-farm2_2019-03-23_06-03-31.wav,44100,16,60,1,acoustic_complexity,512,1,NA,5,1824.51372969438,NA 
rayol-farm2_2019-03-23_06-05-31.wav,44100,16,60,1,acoustic_complexity,512,1,NA,5,1865.76443126016,NA 
rayol-farm2_2019-03-23_06-07-31.wav,44100,16,60,1,acoustic_complexity,512,1,NA,5,1808.60481112044,NA 
rayol-farm2_2019-03-23_06-09-31.wav,44100,16,60,1,acoustic_complexity,512,1,NA,5,1813.75124292055,NA 
rayol-farm2_2019-03-23_06-11-31.wav,44100,16,60,1,acoustic_complexity,512,1,NA,5,1835.86675046263,NA 
rayol-farm2_2019-03-23_06-13-32.wav,44100,16,60,1,acoustic_complexity,512,1,NA,5,1820.05306121647,NA 
rayol-farm2_2019-03-23_06-15-32.wav,44100,16,60,1,acoustic_complexity,512,1,NA,5,1851.56991077851,NA 
rayol-farm2_2019-03-23_06-17-32.wav,44100,16,60,1,acoustic_complexity,512,1,NA,5,1830.44526775863,NA 
rayol-farm2_2019-03-23_06-19-32.wav,44100,16,60,1,acoustic_complexity,512,1,NA,5,1812.83004500709,NA 
rayol-farm2_2019-03-23_06-21-32.wav,44100,16,60,1,acoustic_complexity,512,1,NA,5,1830.68060181715,NA 
rayol-farm2_2019-03-23_06-23-32.wav,44100,16,60,1,acoustic_complexity,512,1,NA,5,1837.98433865107,NA 
rayol-farm2_2019-03-23_06-25-32.wav,44100,16,60,1,acoustic_complexity,512,1,NA,5,1838.26539192072,NA 
rayol-farm2_2019-03-23_06-27-32.wav,44100,16,60,1,acoustic_complexity,512,1,NA,5,1814.99902586252,NA 
rayol-farm2_2019-03-23_06-29-33.wav,44100,16,60,1,acoustic_complexity,512,1,NA,5,1818.91095412303,NA 
rayol-farm2_2019-03-23_06-31-33.wav,44100,16,60,1,acoustic_complexity,512,1,NA,5,1824.22183175468,NA 
rayol-farm2_2019-03-23_06-33-33.wav,44100,16,60,1,acoustic_complexity,512,1,NA,5,1810.79933066448,NA 
rayol-farm2_2019-03-23_06-35-33.wav,44100,16,60,1,acoustic_complexity,512,1,NA,5,1830.50093022109,NA 
rayol-farm2_2019-03-23_06-37-33.wav,44100,16,60,1,acoustic_complexity,512,1,NA,5,1840.37077246108,NA 
rayol-farm2_2019-03-23_06-39-33.wav,44100,16,60,1,acoustic_complexity,512,1,NA,5,1860.94499106257,NA 
rayol-farm2_2019-03-23_06-41-33.wav,44100,16,60,1,acoustic_complexity,512,1,NA,5,1822.76385938706,NA 
rayol-farm2_2019-03-23_06-43-33.wav,44100,16,60,1,acoustic_complexity,512,1,NA,5,1821.5784771376,NA 
rayol-farm2_2019-03-23_06-45-34.wav,44100,16,60,1,acoustic_complexity,512,1,NA,5,1822.72467774041,NA 
rayol-farm2_2019-03-23_06-47-34.wav,44100,16,60,1,acoustic_complexity,512,1,NA,5,1828.86259076482,NA 
rayol-farm2_2019-03-23_06-49-34.wav,44100,16,60,1,acoustic_complexity,512,1,NA,5,1825.33585020025,NA 
rayol-farm2_2019-03-23_06-51-34.wav,44100,16,60,1,acoustic_complexity,512,1,NA,5,1859.14551102589,NA 
rayol-farm2_2019-03-23_06-53-34.wav,44100,16,60,1,acoustic_complexity,512,1,NA,5,1829.78976797178,NA 
rayol-farm2_2019-03-23_06-55-34.wav,44100,16,60,1,acoustic_complexity,512,1,NA,5,1830.60247472748,NA 
rayol-farm2_2019-03-23_06-57-34.wav,44100,16,60,1,acoustic_complexity,512,1,NA,5,1836.98658464958,NA 
rayol-farm2_2019-03-23_06-59-34.wav,44100,16,60,1,acoustic_complexity,512,1,NA,5,1840.72006326323,NA 
rayol-farm2_2019-03-23_07-01-34.wav,44100,16,60,1,acoustic_complexity,512,1,NA,5,1815.00689207951,NA 
rayol-farm2_2019-03-23_07-03-35.wav,44100,16,60,1,acoustic_complexity,512,1,NA,5,1824.57382392744,NA 
rayol-farm2_2019-03-23_07-05-35.wav,44100,16,60,1,acoustic_complexity,512,1,NA,5,1809.83850092024,NA 
rayol-farm2_2019-03-23_07-07-35.wav,44100,16,60,1,acoustic_complexity,512,1,NA,5,1818.35845538196,NA 
rayol-farm2_2019-03-23_07-09-35.wav,44100,16,60,1,acoustic_complexity,512,1,NA,5,1821.61445441988,NA 
rayol-farm2_2019-03-23_07-11-35.wav,44100,16,60,1,acoustic_complexity,512,1,NA,5,1827.68625036793,NA 
rayol-farm2_2019-03-23_07-13-35.wav,44100,16,60,1,acoustic_complexity,512,1,NA,5,1844.56716006212,NA 
rayol-farm2_2019-03-23_07-15-35.wav,44100,16,60,1,acoustic_complexity,512,1,NA,5,1814.20969554079,NA 
rayol-farm2_2019-03-23_07-17-35.wav,44100,16,60,1,acoustic_complexity,512,1,NA,5,1844.09835493247,NA 
rayol-farm2_2019-03-23_07-19-36.wav,44100,16,60,1,acoustic_complexity,512,1,NA,5,1867.18511343487,NA 
rayol-farm2_2019-03-23_07-21-36.wav,44100,16,60,1,acoustic_complexity,512,1,NA,5,1842.42864660991,NA 
rayol-farm2_2019-03-23_07-23-36.wav,44100,16,60,1,acoustic_complexity,512,1,NA,5,1831.376470735,NA 
rayol-farm2_2019-03-23_07-25-36.wav,44100,16,60,1,acoustic_complexity,512,1,NA,5,1836.27948722179,NA 
rayol-farm2_2019-03-23_07-27-36.wav,44100,16,60,1,acoustic_complexity,512,1,NA,5,1793.19034064611,NA 
rayol-farm2_2019-03-23_07-29-36.wav,44100,16,60,1,acoustic_complexity,512,1,NA,5,1834.69146668195,NA 
rayol-farm2_2019-03-23_07-31-36.wav,44100,16,60,1,acoustic_complexity,512,1,NA,5,1815.83895682276,NA 
rayol-farm2_2019-03-23_07-33-36.wav,44100,16,60,1,acoustic_complexity,512,1,NA,5,1835.48658992579,NA 
rayol-farm2_2019-03-23_07-35-37.wav,44100,16,60,1,acoustic_complexity,512,1,NA,5,1823.81785302652,NA 
rayol-farm2_2019-03-23_07-37-37.wav,44100,16,60,1,acoustic_complexity,512,1,NA,5,1835.52798804865,NA 
rayol-farm2_2019-03-23_07-39-37.wav,44100,16,60,1,acoustic_complexity,512,1,NA,5,1834.67467631694,NA 
rayol-farm2_2019-03-23_07-41-37.wav,44100,16,60,1,acoustic_complexity,512,1,NA,5,1839.39797793988,NA 
rayol-farm2_2019-03-23_07-43-37.wav,44100,16,60,1,acoustic_complexity,512,1,NA,5,1822.20732611807,NA 
rayol-farm2_2019-03-23_07-45-37.wav,44100,16,60,1,acoustic_complexity,512,1,NA,5,1817.25714348414,NA 
rayol-farm2_2019-03-23_07-47-37.wav,44100,16,60,1,acoustic_complexity,512,1,NA,5,1825.62558738871,NA 
rayol-farm2_2019-03-23_07-49-37.wav,44100,16,60,1,acoustic_complexity,512,1,NA,5,1831.93296178107,NA 
rayol-farm2_2019-03-23_07-51-38.wav,44100,16,60,1,acoustic_complexity,512,1,NA,5,1821.75394910967,NA 
rayol-farm2_2019-03-23_07-53-38.wav,44100,16,60,1,acoustic_complexity,512,1,NA,5,1848.98315428878,NA 
rayol-farm2_2019-03-23_07-55-38.wav,44100,16,60,1,acoustic_complexity,512,1,NA,5,1840.15682776431,NA 
rayol-farm2_2019-03-23_07-57-38.wav,44100,16,60,1,acoustic_complexity,512,1,NA,5,1835.87647121025,NA 
rayol-farm2_2019-03-23_07-59-38.wav,44100,16,60,1,acoustic_complexity,512,1,NA,5,1831.93326076553,NA 
rayol-farm2_2019-03-23_08-01-38.wav,44100,16,60,1,acoustic_complexity,512,1,NA,5,1830.32500229649,NA 
rayol-farm2_2019-03-23_08-03-38.wav,44100,16,60,1,acoustic_complexity,512,1,NA,5,1808.83051096914,NA 
rayol-farm2_2019-03-23_08-05-38.wav,44100,16,60,1,acoustic_complexity,512,1,NA,5,1820.5639826703,NA 
rayol-farm2_2019-03-23_08-07-38.wav,44100,16,60,1,acoustic_complexity,512,1,NA,5,1831.85851188505,NA 
rayol-farm2_2019-03-23_08-09-39.wav,44100,16,60,1,acoustic_complexity,512,1,NA,5,1815.42670957337,NA 
rayol-farm2_2019-03-23_08-11-39.wav,44100,16,60,1,acoustic_complexity,512,1,NA,5,1823.52505654744,NA 
rayol-farm2_2019-03-23_08-13-39.wav,44100,16,60,1,acoustic_complexity,512,1,NA,5,1833.91686920223,NA 
rayol-farm2_2019-03-23_08-15-39.wav,44100,16,60,1,acoustic_complexity,512,1,NA,5,1830.95228675347,NA 
rayol-farm2_2019-03-23_08-17-39.wav,44100,16,60,1,acoustic_complexity,512,1,NA,5,1846.98540355662,NA 
rayol-farm2_2019-03-23_08-19-39.wav,44100,16,60,1,acoustic_complexity,512,1,NA,5,1837.05870900854,NA 
rayol-farm2_2019-03-23_08-21-39.wav,44100,16,60,1,acoustic_complexity,512,1,NA,5,1839.05872983017,NA 
rayol-farm2_2019-03-23_08-23-39.wav,44100,16,60,1,acoustic_complexity,512,1,NA,5,1824.42810325562,NA 
rayol-farm2_2019-03-23_08-25-40.wav,44100,16,60,1,acoustic_complexity,512,1,NA,5,1816.44397550265,NA 
rayol-farm2_2019-03-23_08-27-40.wav,44100,16,60,1,acoustic_complexity,512,1,NA,5,1857.65764704447,NA 
rayol-farm2_2019-03-23_08-29-40.wav,44100,16,60,1,acoustic_complexity,512,1,NA,5,1828.40178920277,NA 
rayol-farm2_2019-03-23_08-31-40.wav,44100,16,60,1,acoustic_complexity,512,1,NA,5,1820.93730908763,NA 
rayol-farm2_2019-03-23_08-33-40.wav,44100,16,60,1,acoustic_complexity,512,1,NA,5,1811.77052598178,NA 
rayol-farm2_2019-03-23_08-35-40.wav,44100,16,60,1,acoustic_complexity,512,1,NA,5,1830.37262527113,NA 
rayol-farm2_2019-03-23_08-37-40.wav,44100,16,60,1,acoustic_complexity,512,1,NA,5,1835.77953540335,NA 
rayol-farm2_2019-03-23_08-39-40.wav,44100,16,60,1,acoustic_complexity,512,1,NA,5,1831.12700550816,NA 
rayol-farm2_2019-03-23_08-41-41.wav,44100,16,60,1,acoustic_complexity,512,1,NA,5,1837.12706280046,NA 
rayol-farm2_2019-03-23_08-43-41.wav,44100,16,60,1,acoustic_complexity,512,1,NA,5,1832.71597772768,NA 
rayol-farm2_2019-03-23_08-45-41.wav,44100,16,60,1,acoustic_complexity,512,1,NA,5,1831.32746939906,NA 
rayol-farm2_2019-03-23_08-47-41.wav,44100,16,60,1,acoustic_complexity,512,1,NA,5,1824.05586957413,NA 
rayol-farm2_2019-03-23_08-49-41.wav,44100,16,60,1,acoustic_complexity,512,1,NA,5,1814.35370676119,NA 
rayol-farm2_2019-03-23_08-51-41.wav,44100,16,60,1,acoustic_complexity,512,1,NA,5,1818.35883997192,NA 
rayol-farm2_2019-03-23_08-53-41.wav,44100,16,60,1,acoustic_complexity,512,1,NA,5,1833.74490626494,NA 
rayol-farm2_2019-03-23_08-55-41.wav,44100,16,60,1,acoustic_complexity,512,1,NA,5,1833.14962833217,NA 
rayol-farm2_2019-03-23_08-57-42.wav,44100,16,60,1,acoustic_complexity,512,1,NA,5,1833.68769933478,NA 
rayol-farm2_2019-03-23_08-59-42.wav,44100,16,60,1,acoustic_complexity,512,1,NA,5,1833.13633135607,NA 
rayol-farm2_2019-03-23_09-01-42.wav,44100,16,60,1,acoustic_complexity,512,1,NA,5,1834.52434674539,NA 
rayol-farm2_2019-03-23_09-03-42.wav,44100,16,60,1,acoustic_complexity,512,1,NA,5,1830.86595746308,NA 
rayol-farm2_2019-03-23_09-05-42.wav,44100,16,60,1,acoustic_complexity,512,1,NA,5,1828.58599079739,NA 
rayol-farm2_2019-03-23_09-07-42.wav,44100,16,60,1,acoustic_complexity,512,1,NA,5,1828.5280944517,NA 
rayol-farm2_2019-03-23_09-09-42.wav,44100,16,60,1,acoustic_complexity,512,1,NA,5,1823.93994329455,NA 
rayol-farm2_2019-03-23_09-11-42.wav,44100,16,60,1,acoustic_complexity,512,1,NA,5,1828.33415070788,NA 
rayol-farm2_2019-03-23_09-13-42.wav,44100,16,60,1,acoustic_complexity,512,1,NA,5,1838.58270165028,NA 
rayol-farm2_2019-03-23_09-15-43.wav,44100,16,60,1,acoustic_complexity,512,1,NA,5,1843.55442455433,NA 
rayol-farm2_2019-03-23_09-17-43.wav,44100,16,60,1,acoustic_complexity,512,1,NA,5,1847.96806039585,NA 
rayol-farm2_2019-03-23_09-19-43.wav,44100,16,60,1,acoustic_complexity,512,1,NA,5,1847.66061452732,NA 
rayol-farm2_2019-03-23_09-21-43.wav,44100,16,60,1,acoustic_complexity,512,1,NA,5,1866.71968750925,NA 
rayol-farm2_2019-03-23_09-23-43.wav,44100,16,60,1,acoustic_complexity,512,1,NA,5,1845.72849348265,NA 
rayol-farm2_2019-03-23_09-25-43.wav,44100,16,60,1,acoustic_complexity,512,1,NA,5,1833.93235537315,NA 
rayol-farm2_2019-03-23_09-27-43.wav,44100,16,60,1,acoustic_complexity,512,1,NA,5,1826.72167557844,NA 
rayol-farm2_2019-03-23_09-29-43.wav,44100,16,60,1,acoustic_complexity,512,1,NA,5,1818.50562559659,NA 
rayol-farm2_2019-03-23_09-31-44.wav,44100,16,60,1,acoustic_complexity,512,1,NA,5,1812.02610748366,NA 
rayol-farm2_2019-03-23_09-33-44.wav,44100,16,60,1,acoustic_complexity,512,1,NA,5,1837.47509201488,NA 
rayol-farm2_2019-03-23_09-35-44.wav,44100,16,60,1,acoustic_complexity,512,1,NA,5,1832.326923025,NA 
rayol-farm2_2019-03-23_09-37-44.wav,44100,16,60,1,acoustic_complexity,512,1,NA,5,1839.4244045871,NA 
rayol-farm2_2019-03-23_09-39-44.wav,44100,16,60,1,acoustic_complexity,512,1,NA,5,1851.04683899345,NA 
rayol-farm2_2019-03-23_09-41-44.wav,44100,16,60,1,acoustic_complexity,512,1,NA,5,1847.11520162694,NA 
rayol-farm2_2019-03-23_09-43-44.wav,44100,16,60,1,acoustic_complexity,512,1,NA,5,1834.34160774908,NA 
rayol-farm2_2019-03-23_09-45-44.wav,44100,16,60,1,acoustic_complexity,512,1,NA,5,1846.63190812673,NA 
rayol-farm2_2019-03-23_09-47-45.wav,44100,16,60,1,acoustic_complexity,512,1,NA,5,1830.12661079157,NA 
rayol-farm2_2019-03-23_09-49-45.wav,44100,16,60,1,acoustic_complexity,512,1,NA,5,1827.26499957728,NA 
rayol-farm2_2019-03-23_09-51-45.wav,44100,16,60,1,acoustic_complexity,512,1,NA,5,1823.60662496494,NA 
rayol-farm2_2019-03-23_09-53-45.wav,44100,16,60,1,acoustic_complexity,512,1,NA,5,1820.02153809051,NA 
rayol-farm2_2019-03-23_09-55-45.wav,44100,16,60,1,acoustic_complexity,512,1,NA,5,1833.05569457981,NA 
rayol-farm2_2019-03-23_09-57-45.wav,44100,16,60,1,acoustic_complexity,512,1,NA,5,1845.62325483301,NA 
rayol-farm2_2019-03-23_09-59-45.wav,44100,16,60,1,acoustic_complexity,512,1,NA,5,1835.05801315598,NA 
rayol-farm2_2019-03-23_10-01-45.wav,44100,16,60,1,acoustic_complexity,512,1,NA,5,1833.43398092511,NA 
rayol-farm2_2019-03-23_10-03-46.wav,44100,16,60,1,acoustic_complexity,512,1,NA,5,1834.41669113484,NA 
rayol-farm2_2019-03-23_10-05-46.wav,44100,16,60,1,acoustic_complexity,512,1,NA,5,1833.25303021403,NA 
rayol-farm2_2019-03-23_10-07-46.wav,44100,16,60,1,acoustic_complexity,512,1,NA,5,1819.98722361043,NA 
rayol-farm2_2019-03-23_10-09-46.wav,44100,16,60,1,acoustic_complexity,512,1,NA,5,1820.10884948875,NA 
rayol-farm2_2019-03-23_10-11-46.wav,44100,16,60,1,acoustic_complexity,512,1,NA,5,1846.40276120011,NA 
rayol-farm2_2019-03-23_10-13-46.wav,44100,16,60,1,acoustic_complexity,512,1,NA,5,1879.11086601986,NA 
rayol-farm2_2019-03-23_10-15-46.wav,44100,16,60,1,acoustic_complexity,512,1,NA,5,1824.47135440345,NA 
rayol-farm2_2019-03-23_10-17-46.wav,44100,16,60,1,acoustic_complexity,512,1,NA,5,1816.52742057267,NA 
rayol-farm2_2019-03-23_10-19-46.wav,44100,16,60,1,acoustic_complexity,512,1,NA,5,1837.29598256299,NA 
rayol-farm2_2019-03-23_10-21-47.wav,44100,16,60,1,acoustic_complexity,512,1,NA,5,1847.30957991577,NA 
rayol-farm2_2019-03-23_10-23-47.wav,44100,16,60,1,acoustic_complexity,512,1,NA,5,1842.54161096614,NA 
rayol-farm2_2019-03-23_10-25-47.wav,44100,16,60,1,acoustic_complexity,512,1,NA,5,1832.79210838536,NA 
rayol-farm2_2019-03-23_10-27-47.wav,44100,16,60,1,acoustic_complexity,512,1,NA,5,1834.81019103813,NA 
rayol-farm2_2019-03-23_10-29-47.wav,44100,16,60,1,acoustic_complexity,512,1,NA,5,1820.35410155858,NA 
rayol-farm2_2019-03-23_10-31-47.wav,44100,16,60,1,acoustic_complexity,512,1,NA,5,1820.05624903828,NA 
rayol-farm2_2019-03-23_10-33-47.wav,44100,16,60,1,acoustic_complexity,512,1,NA,5,1823.06464743191,NA 
rayol-farm2_2019-03-23_10-35-47.wav,44100,16,60,1,acoustic_complexity,512,1,NA,5,1828.67744289296,NA 
rayol-farm2_2019-03-23_10-37-48.wav,44100,16,60,1,acoustic_complexity,512,1,NA,5,1840.10348691782,NA 
rayol-farm2_2019-03-23_10-39-48.wav,44100,16,60,1,acoustic_complexity,512,1,NA,5,1858.40333690183,NA 
rayol-farm2_2019-03-23_10-41-48.wav,44100,16,60,1,acoustic_complexity,512,1,NA,5,1847.19158169032,NA 
rayol-farm2_2019-03-23_10-43-48.wav,44100,16,60,1,acoustic_complexity,512,1,NA,5,1848.77104771974,NA 
rayol-farm2_2019-03-23_10-45-48.wav,44100,16,60,1,acoustic_complexity,512,1,NA,5,1835.82395499979,NA 
rayol-farm2_2019-03-23_10-47-48.wav,44100,16,60,1,acoustic_complexity,512,1,NA,5,1834.22744794002,NA 
rayol-farm2_2019-03-23_10-49-48.wav,44100,16,60,1,acoustic_complexity,512,1,NA,5,1843.59995710228,NA 
rayol-farm2_2019-03-23_10-51-48.wav,44100,16,60,1,acoustic_complexity,512,1,NA,5,1855.03992959513,NA 
rayol-farm2_2019-03-23_10-53-49.wav,44100,16,60,1,acoustic_complexity,512,1,NA,5,1849.39449153339,NA 
rayol-farm2_2019-03-23_10-55-49.wav,44100,16,60,1,acoustic_complexity,512,1,NA,5,1847.83371190771,NA 
rayol-farm2_2019-03-23_10-57-49.wav,44100,16,60,1,acoustic_complexity,512,1,NA,5,1836.03664689994,NA 
rayol-farm2_2019-03-23_10-59-49.wav,44100,16,60,1,acoustic_complexity,512,1,NA,5,1850.98115491785,NA 
rayol-farm2_2019-03-23_11-01-49.wav,44100,16,60,1,acoustic_complexity,512,1,NA,5,1863.68850427858,NA 
rayol-farm2_2019-03-23_11-03-49.wav,44100,16,60,1,acoustic_complexity,512,1,NA,5,1848.77537002495,NA 
rayol-farm2_2019-03-23_11-05-49.wav,44100,16,60,1,acoustic_complexity,512,1,NA,5,1853.24525392776,NA 
rayol-farm2_2019-03-23_11-07-49.wav,44100,16,60,1,acoustic_complexity,512,1,NA,5,1819.11091761682,NA 
rayol-farm2_2019-03-23_11-09-50.wav,44100,16,60,1,acoustic_complexity,512,1,NA,5,1824.41258800057,NA 
rayol-farm2_2019-03-23_11-11-50.wav,44100,16,60,1,acoustic_complexity,512,1,NA,5,1815.09425975295,NA 
rayol-farm2_2019-03-23_11-13-50.wav,44100,16,60,1,acoustic_complexity,512,1,NA,5,1833.1572340344,NA 
rayol-farm2_2019-03-23_11-15-50.wav,44100,16,60,1,acoustic_complexity,512,1,NA,5,1848.63057812057,NA 
rayol-farm2_2019-03-23_11-17-50.wav,44100,16,60,1,acoustic_complexity,512,1,NA,5,1831.42065992116,NA 
rayol-farm2_2019-03-23_11-19-50.wav,44100,16,60,1,acoustic_complexity,512,1,NA,5,1832.10519885884,NA 
rayol-farm2_2019-03-23_11-21-50.wav,44100,16,60,1,acoustic_complexity,512,1,NA,5,1834.88557971756,NA 
rayol-farm2_2019-03-23_11-23-50.wav,44100,16,60,1,acoustic_complexity,512,1,NA,5,1829.63157960354,NA 
rayol-farm2_2019-03-23_11-25-51.wav,44100,16,60,1,acoustic_complexity,512,1,NA,5,1836.75830572499,NA 
rayol-farm2_2019-03-23_11-27-51.wav,44100,16,60,1,acoustic_complexity,512,1,NA,5,1819.10377511648,NA 
rayol-farm2_2019-03-23_11-29-51.wav,44100,16,60,1,acoustic_complexity,512,1,NA,5,1815.91752630933,NA 
rayol-farm2_2019-03-23_11-31-51.wav,44100,16,60,1,acoustic_complexity,512,1,NA,5,1832.64758921239,NA 
rayol-farm2_2019-03-23_11-33-51.wav,44100,16,60,1,acoustic_complexity,512,1,NA,5,1831.70267121595,NA 
rayol-farm2_2019-03-23_11-35-51.wav,44100,16,60,1,acoustic_complexity,512,1,NA,5,1825.55903858183,NA 
rayol-farm2_2019-03-23_11-37-51.wav,44100,16,60,1,acoustic_complexity,512,1,NA,5,1841.05624692363,NA 
rayol-farm2_2019-03-23_11-39-51.wav,44100,16,60,1,acoustic_complexity,512,1,NA,5,1824.6128801161,NA 
rayol-farm2_2019-03-23_11-41-51.wav,44100,16,60,1,acoustic_complexity,512,1,NA,5,1819.33719203126,NA 
rayol-farm2_2019-03-23_11-43-52.wav,44100,16,60,1,acoustic_complexity,512,1,NA,5,1822.88049110978,NA 
rayol-farm2_2019-03-23_11-45-52.wav,44100,16,60,1,acoustic_complexity,512,1,NA,5,1827.02801165592,NA 
rayol-farm2_2019-03-23_11-47-52.wav,44100,16,60,1,acoustic_complexity,512,1,NA,5,1817.25280060283,NA 
rayol-farm2_2019-03-23_11-49-52.wav,44100,16,60,1,acoustic_complexity,512,1,NA,5,1836.1530198084,NA 
rayol-farm2_2019-03-23_11-51-52.wav,44100,16,60,1,acoustic_complexity,512,1,NA,5,1853.95680189885,NA 
rayol-farm2_2019-03-23_11-53-52.wav,44100,16,60,1,acoustic_complexity,512,1,NA,5,1842.71884108726,NA 
rayol-farm2_2019-03-23_11-55-52.wav,44100,16,60,1,acoustic_complexity,512,1,NA,5,1851.70678357071,NA 
rayol-farm2_2019-03-23_11-57-52.wav,44100,16,60,1,acoustic_complexity,512,1,NA,5,1861.09088382864,NA 
rayol-farm2_2019-03-23_11-59-53.wav,44100,16,60,1,acoustic_complexity,512,1,NA,5,1820.27978734915,NA 
rayol-farm2_2019-03-23_12-01-53.wav,44100,16,60,1,acoustic_complexity,512,1,NA,5,1819.93369040995,NA 
rayol-farm2_2019-03-23_12-03-53.wav,44100,16,60,1,acoustic_complexity,512,1,NA,5,1828.07429494708,NA 
rayol-farm2_2019-03-23_12-05-53.wav,44100,16,60,1,acoustic_complexity,512,1,NA,5,1825.73395649278,NA 
rayol-farm2_2019-03-23_12-07-53.wav,44100,16,60,1,acoustic_complexity,512,1,NA,5,1826.60500738729,NA 
rayol-farm2_2019-03-23_12-09-53.wav,44100,16,60,1,acoustic_complexity,512,1,NA,5,1842.46602368373,NA 
rayol-farm2_2019-03-23_12-11-53.wav,44100,16,60,1,acoustic_complexity,512,1,NA,5,1850.99657971154,NA 
rayol-farm2_2019-03-23_12-13-53.wav,44100,16,60,1,acoustic_complexity,512,1,NA,5,1865.80910038056,NA 
rayol-farm2_2019-03-23_12-15-54.wav,44100,16,60,1,acoustic_complexity,512,1,NA,5,1819.59474748952,NA 
rayol-farm2_2019-03-23_12-17-54.wav,44100,16,60,1,acoustic_complexity,512,1,NA,5,1818.39445159414,NA 
rayol-farm2_2019-03-23_12-19-54.wav,44100,16,60,1,acoustic_complexity,512,1,NA,5,1806.58437634269,NA 
rayol-farm2_2019-03-23_12-21-54.wav,44100,16,60,1,acoustic_complexity,512,1,NA,5,1827.14016635881,NA 
rayol-farm2_2019-03-23_12-23-54.wav,44100,16,60,1,acoustic_complexity,512,1,NA,5,1843.84404902464,NA 
rayol-farm2_2019-03-23_12-25-54.wav,44100,16,60,1,acoustic_complexity,512,1,NA,5,1839.8054080979,NA 
rayol-farm2_2019-03-23_12-27-54.wav,44100,16,60,1,acoustic_complexity,512,1,NA,5,1835.77330233437,NA 
rayol-farm2_2019-03-23_12-29-54.wav,44100,16,60,1,acoustic_complexity,512,1,NA,5,1830.24195151677,NA 
rayol-farm2_2019-03-23_12-31-55.wav,44100,16,60,1,acoustic_complexity,512,1,NA,5,1823.65631537485,NA 
rayol-farm2_2019-03-23_12-33-55.wav,44100,16,60,1,acoustic_complexity,512,1,NA,5,1802.21544220357,NA 
rayol-farm2_2019-03-23_12-35-55.wav,44100,16,60,1,acoustic_complexity,512,1,NA,5,1818.79572103142,NA 
rayol-farm2_2019-03-23_12-37-55.wav,44100,16,60,1,acoustic_complexity,512,1,NA,5,1809.2639086384,NA 
rayol-farm2_2019-03-23_12-39-55.wav,44100,16,60,1,acoustic_complexity,512,1,NA,5,1817.73514491935,NA 
rayol-farm2_2019-03-23_12-41-55.wav,44100,16,60,1,acoustic_complexity,512,1,NA,5,1824.81618482659,NA 
rayol-farm2_2019-03-23_12-43-55.wav,44100,16,60,1,acoustic_complexity,512,1,NA,5,1829.50376527581,NA 
rayol-farm2_2019-03-23_12-45-55.wav,44100,16,60,1,acoustic_complexity,512,1,NA,5,1823.94357617492,NA 
rayol-farm2_2019-03-23_12-47-55.wav,44100,16,60,1,acoustic_complexity,512,1,NA,5,1828.26238314719,NA 
rayol-farm2_2019-03-23_12-49-56.wav,44100,16,60,1,acoustic_complexity,512,1,NA,5,1806.10864034591,NA 
rayol-farm2_2019-03-23_12-51-56.wav,44100,16,60,1,acoustic_complexity,512,1,NA,5,1808.65753852544,NA 
rayol-farm2_2019-03-23_12-53-56.wav,44100,16,60,1,acoustic_complexity,512,1,NA,5,1817.48100565869,NA 
rayol-farm2_2019-03-23_12-55-56.wav,44100,16,60,1,acoustic_complexity,512,1,NA,5,1821.39585265411,NA 
rayol-farm2_2019-03-23_12-57-56.wav,44100,16,60,1,acoustic_complexity,512,1,NA,5,1808.3489502824,NA 
rayol-farm2_2019-03-23_12-59-56.wav,44100,16,60,1,acoustic_complexity,512,1,NA,5,1833.53514373181,NA 
rayol-farm2_2019-03-23_13-01-56.wav,44100,16,60,1,acoustic_complexity,512,1,NA,5,1814.21818493998,NA 
rayol-farm2_2019-03-23_13-03-56.wav,44100,16,60,1,acoustic_complexity,512,1,NA,5,1830.1415067454,NA 
rayol-farm2_2019-03-23_13-05-57.wav,44100,16,60,1,acoustic_complexity,512,1,NA,5,1853.14647677003,NA 
rayol-farm2_2019-03-23_13-07-57.wav,44100,16,60,1,acoustic_complexity,512,1,NA,5,1834.37094030517,NA 
rayol-farm2_2019-03-23_13-09-57.wav,44100,16,60,1,acoustic_complexity,512,1,NA,5,1817.17051973246,NA 
rayol-farm2_2019-03-23_13-11-57.wav,44100,16,60,1,acoustic_complexity,512,1,NA,5,1822.44133476922,NA 
rayol-farm2_2019-03-23_13-13-57.wav,44100,16,60,1,acoustic_complexity,512,1,NA,5,1804.24188497836,NA 
rayol-farm2_2019-03-23_13-15-57.wav,44100,16,60,1,acoustic_complexity,512,1,NA,5,1824.82772308718,NA 
rayol-farm2_2019-03-23_13-17-57.wav,44100,16,60,1,acoustic_complexity,512,1,NA,5,1831.86973783972,NA 
rayol-farm2_2019-03-23_13-19-57.wav,44100,16,60,1,acoustic_complexity,512,1,NA,5,1829.48087161594,NA 
rayol-farm2_2019-03-23_13-21-58.wav,44100,16,60,1,acoustic_complexity,512,1,NA,5,1834.97447730909,NA 
rayol-farm2_2019-03-23_13-23-58.wav,44100,16,60,1,acoustic_complexity,512,1,NA,5,1850.30006009969,NA 
rayol-farm2_2019-03-23_13-25-58.wav,44100,16,60,1,acoustic_complexity,512,1,NA,5,1836.47897230143,NA 
rayol-farm2_2019-03-23_13-27-58.wav,44100,16,60,1,acoustic_complexity,512,1,NA,5,1834.96364072291,NA 
rayol-farm2_2019-03-23_13-29-58.wav,44100,16,60,1,acoustic_complexity,512,1,NA,5,1832.20132978576,NA 
rayol-farm2_2019-03-23_13-31-58.wav,44100,16,60,1,acoustic_complexity,512,1,NA,5,1821.82252475461,NA 
rayol-farm2_2019-03-23_13-33-58.wav,44100,16,60,1,acoustic_complexity,512,1,NA,5,1816.85830820383,NA 
rayol-farm2_2019-03-23_13-35-58.wav,44100,16,60,1,acoustic_complexity,512,1,NA,5,1806.22072426883,NA 
rayol-farm2_2019-03-23_13-37-59.wav,44100,16,60,1,acoustic_complexity,512,1,NA,5,1840.042033547,NA 
rayol-farm2_2019-03-23_13-39-59.wav,44100,16,60,1,acoustic_complexity,512,1,NA,5,1821.32556612213,NA 
rayol-farm2_2019-03-23_13-41-59.wav,44100,16,60,1,acoustic_complexity,512,1,NA,5,1830.99946240248,NA 
rayol-farm2_2019-03-23_13-43-59.wav,44100,16,60,1,acoustic_complexity,512,1,NA,5,1823.67794647554,NA 
rayol-farm2_2019-03-23_13-45-59.wav,44100,16,60,1,acoustic_complexity,512,1,NA,5,1813.71875391866,NA 
rayol-farm2_2019-03-23_13-47-59.wav,44100,16,60,1,acoustic_complexity,512,1,NA,5,1820.66378388872,NA 
rayol-farm2_2019-03-23_13-49-59.wav,44100,16,60,1,acoustic_complexity,512,1,NA,5,1813.94280505452,NA 
rayol-farm2_2019-03-23_13-51-59.wav,44100,16,60,1,acoustic_complexity,512,1,NA,5,1808.59102235417,NA 
rayol-farm2_2019-03-23_13-54-00.wav,44100,16,60,1,acoustic_complexity,512,1,NA,5,1823.85729397761,NA 
rayol-farm2_2019-03-23_13-56-00.wav,44100,16,60,1,acoustic_complexity,512,1,NA,5,1835.07624049659,NA 
rayol-farm2_2019-03-23_13-58-00.wav,44100,16,60,1,acoustic_complexity,512,1,NA,5,1855.13495315792,NA 
rayol-farm2_2019-03-23_14-00-00.wav,44100,16,60,1,acoustic_complexity,512,1,NA,5,1833.67341411829,NA 
rayol-farm2_2019-03-23_14-02-00.wav,44100,16,60,1,acoustic_complexity,512,1,NA,5,1823.66873022857,NA 
rayol-farm2_2019-03-23_14-04-00.wav,44100,16,60,1,acoustic_complexity,512,1,NA,5,1803.38164270131,NA 
rayol-farm2_2019-03-23_14-06-00.wav,44100,16,60,1,acoustic_complexity,512,1,NA,5,1817.44090822814,NA 
rayol-farm2_2019-03-23_14-08-00.wav,44100,16,60,1,acoustic_complexity,512,1,NA,5,1855.08262099854,NA 
rayol-farm2_2019-03-23_14-10-00.wav,44100,16,60,1,acoustic_complexity,512,1,NA,5,1821.4514618007,NA 
rayol-farm2_2019-03-23_14-12-01.wav,44100,16,60,1,acoustic_complexity,512,1,NA,5,1825.18905034874,NA 
rayol-farm2_2019-03-23_14-14-01.wav,44100,16,60,1,acoustic_complexity,512,1,NA,5,1823.16008790016,NA 
rayol-farm2_2019-03-23_14-16-01.wav,44100,16,60,1,acoustic_complexity,512,1,NA,5,1832.66808003152,NA 
rayol-farm2_2019-03-23_14-18-01.wav,44100,16,60,1,acoustic_complexity,512,1,NA,5,1846.30149886418,NA 
rayol-farm2_2019-03-23_14-20-01.wav,44100,16,60,1,acoustic_complexity,512,1,NA,5,1842.4326592357,NA 
rayol-farm2_2019-03-23_14-22-01.wav,44100,16,60,1,acoustic_complexity,512,1,NA,5,1824.88615756927,NA 
rayol-farm2_2019-03-23_14-24-01.wav,44100,16,60,1,acoustic_complexity,512,1,NA,5,1824.37455166005,NA 
rayol-farm2_2019-03-23_14-26-01.wav,44100,16,60,1,acoustic_complexity,512,1,NA,5,1819.84358562149,NA 
rayol-farm2_2019-03-23_14-28-02.wav,44100,16,60,1,acoustic_complexity,512,1,NA,5,1801.82319857499,NA 
rayol-farm2_2019-03-23_14-30-02.wav,44100,16,60,1,acoustic_complexity,512,1,NA,5,1805.09204631262,NA 
rayol-farm2_2019-03-23_14-32-02.wav,44100,16,60,1,acoustic_complexity,512,1,NA,5,1825.85651698495,NA 
rayol-farm2_2019-03-23_14-34-02.wav,44100,16,60,1,acoustic_complexity,512,1,NA,5,1834.60406740738,NA 
rayol-farm2_2019-03-23_14-36-02.wav,44100,16,60,1,acoustic_complexity,512,1,NA,5,1835.60416070262,NA 
rayol-farm2_2019-03-23_14-38-02.wav,44100,16,60,1,acoustic_complexity,512,1,NA,5,1854.9290227453,NA 
rayol-farm2_2019-03-23_14-40-02.wav,44100,16,60,1,acoustic_complexity,512,1,NA,5,1849.49263715199,NA 
rayol-farm2_2019-03-23_14-42-02.wav,44100,16,60,1,acoustic_complexity,512,1,NA,5,1838.1728464579,NA 
rayol-farm2_2019-03-23_14-44-03.wav,44100,16,60,1,acoustic_complexity,512,1,NA,5,1811.7106128551,NA 
rayol-farm2_2019-03-23_14-46-03.wav,44100,16,60,1,acoustic_complexity,512,1,NA,5,1823.74292036392,NA 
rayol-farm2_2019-03-23_14-48-03.wav,44100,16,60,1,acoustic_complexity,512,1,NA,5,1812.05924569543,NA 
rayol-farm2_2019-03-23_14-50-03.wav,44100,16,60,1,acoustic_complexity,512,1,NA,5,1825.63578319307,NA 
rayol-farm2_2019-03-23_14-52-03.wav,44100,16,60,1,acoustic_complexity,512,1,NA,5,1845.41332351314,NA 
rayol-farm2_2019-03-23_14-54-03.wav,44100,16,60,1,acoustic_complexity,512,1,NA,5,1839.38244158973,NA 
rayol-farm2_2019-03-23_14-56-03.wav,44100,16,60,1,acoustic_complexity,512,1,NA,5,1840.04083990514,NA 
rayol-farm2_2019-03-23_14-58-03.wav,44100,16,60,1,acoustic_complexity,512,1,NA,5,1829.98153014588,NA 
rayol-farm2_2019-03-23_15-00-03.wav,44100,16,60,1,acoustic_complexity,512,1,NA,5,1842.39262374899,NA 
rayol-farm2_2019-03-23_15-02-04.wav,44100,16,60,1,acoustic_complexity,512,1,NA,5,1832.73993807679,NA 
rayol-farm2_2019-03-23_15-04-04.wav,44100,16,60,1,acoustic_complexity,512,1,NA,5,1855.56602147733,NA 
rayol-farm2_2019-03-23_15-06-04.wav,44100,16,60,1,acoustic_complexity,512,1,NA,5,1820.88729413513,NA 
rayol-farm2_2019-03-23_15-08-04.wav,44100,16,60,1,acoustic_complexity,512,1,NA,5,1833.73235995637,NA 
rayol-farm2_2019-03-23_15-10-04.wav,44100,16,60,1,acoustic_complexity,512,1,NA,5,1840.65673087275,NA 
rayol-farm2_2019-03-23_15-12-04.wav,44100,16,60,1,acoustic_complexity,512,1,NA,5,1836.64998988441,NA 
rayol-farm2_2019-03-23_15-14-04.wav,44100,16,60,1,acoustic_complexity,512,1,NA,5,1828.7600285455,NA 
rayol-farm2_2019-03-23_15-16-04.wav,44100,16,60,1,acoustic_complexity,512,1,NA,5,1833.94720790183,NA 
rayol-farm2_2019-03-23_15-18-05.wav,44100,16,60,1,acoustic_complexity,512,1,NA,5,1835.57435539399,NA 
rayol-farm2_2019-03-23_15-20-05.wav,44100,16,60,1,acoustic_complexity,512,1,NA,5,1838.36844883242,NA 
rayol-farm2_2019-03-23_15-22-05.wav,44100,16,60,1,acoustic_complexity,512,1,NA,5,1828.59320517571,NA 
rayol-farm2_2019-03-23_15-24-05.wav,44100,16,60,1,acoustic_complexity,512,1,NA,5,1819.9412270764,NA 
rayol-farm2_2019-03-23_15-26-05.wav,44100,16,60,1,acoustic_complexity,512,1,NA,5,1826.33694771192,NA 
rayol-farm2_2019-03-23_15-28-05.wav,44100,16,60,1,acoustic_complexity,512,1,NA,5,1836.59881108976,NA 
rayol-farm2_2019-03-23_15-30-05.wav,44100,16,60,1,acoustic_complexity,512,1,NA,5,1835.75183368643,NA 
rayol-farm2_2019-03-23_15-32-05.wav,44100,16,60,1,acoustic_complexity,512,1,NA,5,1787.27269445547,NA 
rayol-farm2_2019-03-23_15-34-06.wav,44100,16,60,1,acoustic_complexity,512,1,NA,5,1841.22539782146,NA 
rayol-farm2_2019-03-23_15-36-06.wav,44100,16,60,1,acoustic_complexity,512,1,NA,5,1849.93865876846,NA 
rayol-farm2_2019-03-23_15-38-06.wav,44100,16,60,1,acoustic_complexity,512,1,NA,5,1846.078850744,NA 
rayol-farm2_2019-03-23_15-40-06.wav,44100,16,60,1,acoustic_complexity,512,1,NA,5,1819.69680290197,NA 
rayol-farm2_2019-03-23_15-42-06.wav,44100,16,60,1,acoustic_complexity,512,1,NA,5,1825.12043768416,NA 
rayol-farm2_2019-03-23_15-44-06.wav,44100,16,60,1,acoustic_complexity,512,1,NA,5,1832.60571976579,NA 
rayol-farm2_2019-03-23_15-46-06.wav,44100,16,60,1,acoustic_complexity,512,1,NA,5,1836.86373678244,NA 
rayol-farm2_2019-03-23_15-48-06.wav,44100,16,60,1,acoustic_complexity,512,1,NA,5,1824.18406295921,NA 
rayol-farm2_2019-03-23_15-50-07.wav,44100,16,60,1,acoustic_complexity,512,1,NA,5,1843.80428702728,NA 
rayol-farm2_2019-03-23_15-52-07.wav,44100,16,60,1,acoustic_complexity,512,1,NA,5,1850.31344373476,NA 
rayol-farm2_2019-03-23_15-54-07.wav,44100,16,60,1,acoustic_complexity,512,1,NA,5,1871.14599999313,NA 
rayol-farm2_2019-03-23_15-56-07.wav,44100,16,60,1,acoustic_complexity,512,1,NA,5,1840.05070792619,NA 
rayol-farm2_2019-03-23_15-58-07.wav,44100,16,60,1,acoustic_complexity,512,1,NA,5,1833.58135451727,NA 
rayol-farm2_2019-03-23_16-00-07.wav,44100,16,60,1,acoustic_complexity,512,1,NA,5,1823.17799177116,NA 
rayol-farm2_2019-03-23_16-02-07.wav,44100,16,60,1,acoustic_complexity,512,1,NA,5,1828.18840437131,NA 
rayol-farm2_2019-03-23_16-04-07.wav,44100,16,60,1,acoustic_complexity,512,1,NA,5,1813.83816232423,NA 
rayol-farm2_2019-03-23_16-06-08.wav,44100,16,60,1,acoustic_complexity,512,1,NA,5,1838.1921450382,NA 
rayol-farm2_2019-03-23_16-08-08.wav,44100,16,60,1,acoustic_complexity,512,1,NA,5,1838.980952701,NA 
rayol-farm2_2019-03-23_16-10-08.wav,44100,16,60,1,acoustic_complexity,512,1,NA,5,1830.57617832712,NA 
rayol-farm2_2019-03-23_16-12-08.wav,44100,16,60,1,acoustic_complexity,512,1,NA,5,1844.00708336127,NA 
rayol-farm2_2019-03-23_16-14-08.wav,44100,16,60,1,acoustic_complexity,512,1,NA,5,1846.0283839156,NA 
rayol-farm2_2019-03-23_16-16-08.wav,44100,16,60,1,acoustic_complexity,512,1,NA,5,1842.27034514469,NA 
rayol-farm2_2019-03-23_16-18-08.wav,44100,16,60,1,acoustic_complexity,512,1,NA,5,1855.23171786808,NA 
rayol-farm2_2019-03-23_16-20-08.wav,44100,16,60,1,acoustic_complexity,512,1,NA,5,1909.34460116859,NA 
rayol-farm2_2019-03-23_16-22-08.wav,44100,16,60,1,acoustic_complexity,512,1,NA,5,1835.42255112707,NA 
rayol-farm2_2019-03-23_16-24-09.wav,44100,16,60,1,acoustic_complexity,512,1,NA,5,1860.86969985864,NA 
rayol-farm2_2019-03-23_16-26-09.wav,44100,16,60,1,acoustic_complexity,512,1,NA,5,1803.34292590199,NA 
rayol-farm2_2019-03-23_16-28-09.wav,44100,16,60,1,acoustic_complexity,512,1,NA,5,1830.25273890157,NA 
rayol-farm2_2019-03-23_16-30-09.wav,44100,16,60,1,acoustic_complexity,512,1,NA,5,1856.53399223043,NA 
rayol-farm2_2019-03-23_16-32-09.wav,44100,16,60,1,acoustic_complexity,512,1,NA,5,1851.72267919692,NA 
rayol-farm2_2019-03-23_16-34-09.wav,44100,16,60,1,acoustic_complexity,512,1,NA,5,1831.27463787881,NA 
rayol-farm2_2019-03-23_16-36-09.wav,44100,16,60,1,acoustic_complexity,512,1,NA,5,1847.85135444405,NA 
rayol-farm2_2019-03-23_16-38-09.wav,44100,16,60,1,acoustic_complexity,512,1,NA,5,1826.72975589251,NA 
rayol-farm2_2019-03-23_16-40-10.wav,44100,16,60,1,acoustic_complexity,512,1,NA,5,1821.20155048193,NA 
rayol-farm2_2019-03-23_16-42-10.wav,44100,16,60,1,acoustic_complexity,512,1,NA,5,1822.65093673007,NA 
rayol-farm2_2019-03-23_16-44-10.wav,44100,16,60,1,acoustic_complexity,512,1,NA,5,1826.93479028846,NA 
rayol-farm2_2019-03-23_16-46-10.wav,44100,16,60,1,acoustic_complexity,512,1,NA,5,1839.83604157931,NA 
rayol-farm2_2019-03-23_16-48-10.wav,44100,16,60,1,acoustic_complexity,512,1,NA,5,1832.55747238609,NA 
rayol-farm2_2019-03-23_16-50-10.wav,44100,16,60,1,acoustic_complexity,512,1,NA,5,1827.95485018557,NA 
rayol-farm2_2019-03-23_16-52-10.wav,44100,16,60,1,acoustic_complexity,512,1,NA,5,1844.5086927704,NA 
rayol-farm2_2019-03-23_16-54-10.wav,44100,16,60,1,acoustic_complexity,512,1,NA,5,1832.90677024541,NA 
rayol-farm2_2019-03-23_16-56-11.wav,44100,16,60,1,acoustic_complexity,512,1,NA,5,1828.02640565428,NA 
rayol-farm2_2019-03-23_16-58-11.wav,44100,16,60,1,acoustic_complexity,512,1,NA,5,1802.11404745681,NA 
rayol-farm2_2019-03-23_17-00-11.wav,44100,16,60,1,acoustic_complexity,512,1,NA,5,1807.64703278038,NA 
rayol-farm2_2019-03-23_17-02-11.wav,44100,16,60,1,acoustic_complexity,512,1,NA,5,1802.48378772132,NA 
rayol-farm2_2019-03-23_17-04-11.wav,44100,16,60,1,acoustic_complexity,512,1,NA,5,1856.82885843962,NA 
rayol-farm2_2019-03-23_17-06-11.wav,44100,16,60,1,acoustic_complexity,512,1,NA,5,1826.78172146058,NA 
rayol-farm2_2019-03-23_17-08-11.wav,44100,16,60,1,acoustic_complexity,512,1,NA,5,1852.85340269695,NA 
rayol-farm2_2019-03-23_17-10-11.wav,44100,16,60,1,acoustic_complexity,512,1,NA,5,1857.78765767759,NA 
rayol-farm2_2019-03-23_17-12-12.wav,44100,16,60,1,acoustic_complexity,512,1,NA,5,1851.38969145386,NA 
rayol-farm2_2019-03-23_17-14-12.wav,44100,16,60,1,acoustic_complexity,512,1,NA,5,1834.44847737112,NA 
rayol-farm2_2019-03-23_17-16-12.wav,44100,16,60,1,acoustic_complexity,512,1,NA,5,1830.13812560994,NA 
rayol-farm2_2019-03-23_17-18-12.wav,44100,16,60,1,acoustic_complexity,512,1,NA,5,1816.81159501392,NA 
rayol-farm2_2019-03-23_17-20-12.wav,44100,16,60,1,acoustic_complexity,512,1,NA,5,1830.97189291867,NA 
rayol-farm2_2019-03-23_17-22-12.wav,44100,16,60,1,acoustic_complexity,512,1,NA,5,1854.86995598453,NA 
rayol-farm2_2019-03-23_17-24-12.wav,44100,16,60,1,acoustic_complexity,512,1,NA,5,1847.03064914488,NA 
rayol-farm2_2019-03-23_17-26-12.wav,44100,16,60,1,acoustic_complexity,512,1,NA,5,1826.17523885755,NA 
rayol-farm2_2019-03-23_17-28-12.wav,44100,16,60,1,acoustic_complexity,512,1,NA,5,1836.02503560969,NA 
rayol-farm2_2019-03-23_17-30-13.wav,44100,16,60,1,acoustic_complexity,512,1,NA,5,1819.83929466658,NA 
rayol-farm2_2019-03-23_17-32-13.wav,44100,16,60,1,acoustic_complexity,512,1,NA,5,1842.88959100276,NA 
rayol-farm2_2019-03-23_17-34-13.wav,44100,16,60,1,acoustic_complexity,512,1,NA,5,1849.13880881853,NA 
rayol-farm2_2019-03-23_17-36-13.wav,44100,16,60,1,acoustic_complexity,512,1,NA,5,1868.27595562523,NA 
rayol-farm2_2019-03-23_17-38-13.wav,44100,16,60,1,acoustic_complexity,512,1,NA,5,1822.7329950511,NA 
rayol-farm2_2019-03-23_17-40-13.wav,44100,16,60,1,acoustic_complexity,512,1,NA,5,1822.90920636572,NA 
rayol-farm2_2019-03-23_17-42-13.wav,44100,16,60,1,acoustic_complexity,512,1,NA,5,1815.171471285,NA 
rayol-farm2_2019-03-23_17-44-13.wav,44100,16,60,1,acoustic_complexity,512,1,NA,5,1815.22579826801,NA 
rayol-farm2_2019-03-23_17-46-14.wav,44100,16,60,1,acoustic_complexity,512,1,NA,5,1837.61758317664,NA 
rayol-farm2_2019-03-23_17-48-14.wav,44100,16,60,1,acoustic_complexity,512,1,NA,5,1822.9380208717,NA 
rayol-farm2_2019-03-23_17-50-14.wav,44100,16,60,1,acoustic_complexity,512,1,NA,5,1832.7056705391,NA 
rayol-farm2_2019-03-23_17-52-14.wav,44100,16,60,1,acoustic_complexity,512,1,NA,5,1832.43891223609,NA 
rayol-farm2_2019-03-23_17-54-14.wav,44100,16,60,1,acoustic_complexity,512,1,NA,5,1822.22599788047,NA 
rayol-farm2_2019-03-23_17-56-14.wav,44100,16,60,1,acoustic_complexity,512,1,NA,5,1841.66912535988,NA 
rayol-farm2_2019-03-23_17-58-14.wav,44100,16,60,1,acoustic_complexity,512,1,NA,5,1817.25471349827,NA 
rayol-farm2_2019-03-23_18-00-14.wav,44100,16,60,1,acoustic_complexity,512,1,NA,5,1799.61905538796,NA 
rayol-farm2_2019-03-23_18-02-15.wav,44100,16,60,1,acoustic_complexity,512,1,NA,5,1810.26352479652,NA 
rayol-farm2_2019-03-23_18-04-15.wav,44100,16,60,1,acoustic_complexity,512,1,NA,5,1826.83324498429,NA 
rayol-farm2_2019-03-23_18-06-15.wav,44100,16,60,1,acoustic_complexity,512,1,NA,5,1814.2203535264,NA 
rayol-farm2_2019-03-23_18-08-15.wav,44100,16,60,1,acoustic_complexity,512,1,NA,5,1814.3541277352,NA 
rayol-farm2_2019-03-23_18-10-15.wav,44100,16,60,1,acoustic_complexity,512,1,NA,5,1838.6085949534,NA 
rayol-farm2_2019-03-23_18-12-15.wav,44100,16,60,1,acoustic_complexity,512,1,NA,5,1813.70031798644,NA 
rayol-farm2_2019-03-23_18-14-15.wav,44100,16,60,1,acoustic_complexity,512,1,NA,5,1826.70693425077,NA 
rayol-farm2_2019-03-23_18-16-15.wav,44100,16,60,1,acoustic_complexity,512,1,NA,5,1826.44535400622,NA 
rayol-farm2_2019-03-23_18-18-16.wav,44100,16,60,1,acoustic_complexity,512,1,NA,5,1803.80829762456,NA 
rayol-farm2_2019-03-23_18-20-16.wav,44100,16,60,1,acoustic_complexity,512,1,NA,5,1814.22444866032,NA 
rayol-farm2_2019-03-23_18-22-16.wav,44100,16,60,1,acoustic_complexity,512,1,NA,5,1815.00970194934,NA 
rayol-farm2_2019-03-23_18-24-16.wav,44100,16,60,1,acoustic_complexity,512,1,NA,5,1815.80302937029,NA 
rayol-farm2_2019-03-23_18-26-16.wav,44100,16,60,1,acoustic_complexity,512,1,NA,5,1820.16219074575,NA 
rayol-farm2_2019-03-23_18-28-16.wav,44100,16,60,1,acoustic_complexity,512,1,NA,5,1825.92003363419,NA 
rayol-farm2_2019-03-23_18-30-16.wav,44100,16,60,1,acoustic_complexity,512,1,NA,5,1818.54994086367,NA 
rayol-farm2_2019-03-23_18-32-16.wav,44100,16,60,1,acoustic_complexity,512,1,NA,5,1843.41622297632,NA 
rayol-farm2_2019-03-23_18-34-16.wav,44100,16,60,1,acoustic_complexity,512,1,NA,5,1824.51435551002,NA 
rayol-farm2_2019-03-23_18-36-17.wav,44100,16,60,1,acoustic_complexity,512,1,NA,5,1841.02688654391,NA 
rayol-farm2_2019-03-23_18-38-17.wav,44100,16,60,1,acoustic_complexity,512,1,NA,5,1853.75625559954,NA 
rayol-farm2_2019-03-23_18-40-17.wav,44100,16,60,1,acoustic_complexity,512,1,NA,5,1814.10632535528,NA 
rayol-farm2_2019-03-23_18-42-17.wav,44100,16,60,1,acoustic_complexity,512,1,NA,5,1826.19516115517,NA 
rayol-farm2_2019-03-23_18-44-17.wav,44100,16,60,1,acoustic_complexity,512,1,NA,5,2084.90732841873,NA 
rayol-farm2_2019-03-23_18-46-17.wav,44100,16,60,1,acoustic_complexity,512,1,NA,5,1868.68055889979,NA 
rayol-farm2_2019-03-23_18-48-17.wav,44100,16,60,1,acoustic_complexity,512,1,NA,5,1842.44886726278,NA 
rayol-farm2_2019-03-23_18-50-17.wav,44100,16,60,1,acoustic_complexity,512,1,NA,5,1820.06024329379,NA 
rayol-farm2_2019-03-23_18-52-18.wav,44100,16,60,1,acoustic_complexity,512,1,NA,5,1804.4636476654,NA 
rayol-farm2_2019-03-23_18-54-18.wav,44100,16,60,1,acoustic_complexity,512,1,NA,5,1815.36621007434,NA 
rayol-farm2_2019-03-23_18-56-18.wav,44100,16,60,1,acoustic_complexity,512,1,NA,5,1813.15244692887,NA 
rayol-farm2_2019-03-23_18-58-18.wav,44100,16,60,1,acoustic_complexity,512,1,NA,5,1836.51840839635,NA 
rayol-farm2_2019-03-23_19-00-18.wav,44100,16,60,1,acoustic_complexity,512,1,NA,5,1824.05877835332,NA 
rayol-farm2_2019-03-23_19-02-18.wav,44100,16,60,1,acoustic_complexity,512,1,NA,5,1807.33325013135,NA 
rayol-farm2_2019-03-23_19-04-18.wav,44100,16,60,1,acoustic_complexity,512,1,NA,5,1817.75808477037,NA 
rayol-farm2_2019-03-23_19-06-18.wav,44100,16,60,1,acoustic_complexity,512,1,NA,5,1818.90625904271,NA 
rayol-farm2_2019-03-23_19-08-19.wav,44100,16,60,1,acoustic_complexity,512,1,NA,5,1808.50228865751,NA 
rayol-farm2_2019-03-23_19-10-19.wav,44100,16,60,1,acoustic_complexity,512,1,NA,5,1815.13695240643,NA 
rayol-farm2_2019-03-23_19-12-19.wav,44100,16,60,1,acoustic_complexity,512,1,NA,5,1817.22857469467,NA 
rayol-farm2_2019-03-23_19-14-19.wav,44100,16,60,1,acoustic_complexity,512,1,NA,5,1810.58580284222,NA 
rayol-farm2_2019-03-23_19-16-19.wav,44100,16,60,1,acoustic_complexity,512,1,NA,5,1824.46573716023,NA 
rayol-farm2_2019-03-23_19-18-19.wav,44100,16,60,1,acoustic_complexity,512,1,NA,5,1843.67786840642,NA 
rayol-farm2_2019-03-23_19-20-19.wav,44100,16,60,1,acoustic_complexity,512,1,NA,5,1817.96820156296,NA 
rayol-farm2_2019-03-23_19-22-19.wav,44100,16,60,1,acoustic_complexity,512,1,NA,5,1823.28521201566,NA 
rayol-farm2_2019-03-23_19-24-20.wav,44100,16,60,1,acoustic_complexity,512,1,NA,5,1805.05233499594,NA 
rayol-farm2_2019-03-23_19-26-20.wav,44100,16,60,1,acoustic_complexity,512,1,NA,5,1814.75591594176,NA 
rayol-farm2_2019-03-23_19-28-20.wav,44100,16,60,1,acoustic_complexity,512,1,NA,5,1818.91701550539,NA 
rayol-farm2_2019-03-23_19-30-20.wav,44100,16,60,1,acoustic_complexity,512,1,NA,5,1822.86227852233,NA 
rayol-farm2_2019-03-23_19-32-20.wav,44100,16,60,1,acoustic_complexity,512,1,NA,5,1815.92091389599,NA 
rayol-farm2_2019-03-23_19-34-20.wav,44100,16,60,1,acoustic_complexity,512,1,NA,5,1814.57931973979,NA 
rayol-farm2_2019-03-23_19-36-20.wav,44100,16,60,1,acoustic_complexity,512,1,NA,5,1810.05157049543,NA 
rayol-farm2_2019-03-23_19-38-20.wav,44100,16,60,1,acoustic_complexity,512,1,NA,5,1832.80667751443,NA 
rayol-farm2_2019-03-23_19-40-20.wav,44100,16,60,1,acoustic_complexity,512,1,NA,5,1813.47807938487,NA 
rayol-farm2_2019-03-23_19-42-21.wav,44100,16,60,1,acoustic_complexity,512,1,NA,5,1816.45516926026,NA 
rayol-farm2_2019-03-23_19-44-21.wav,44100,16,60,1,acoustic_complexity,512,1,NA,5,1825.14153016841,NA 
rayol-farm2_2019-03-23_19-46-21.wav,44100,16,60,1,acoustic_complexity,512,1,NA,5,1807.75188347988,NA 
rayol-farm2_2019-03-23_19-48-21.wav,44100,16,60,1,acoustic_complexity,512,1,NA,5,1820.58822301459,NA 
rayol-farm2_2019-03-23_19-50-21.wav,44100,16,60,1,acoustic_complexity,512,1,NA,5,1816.66288770443,NA 
rayol-farm2_2019-03-23_19-52-21.wav,44100,16,60,1,acoustic_complexity,512,1,NA,5,1811.83075797184,NA 
rayol-farm2_2019-03-23_19-54-21.wav,44100,16,60,1,acoustic_complexity,512,1,NA,5,1815.25609478455,NA 
rayol-farm2_2019-03-23_19-56-21.wav,44100,16,60,1,acoustic_complexity,512,1,NA,5,1816.47018404053,NA 
rayol-farm2_2019-03-23_19-58-22.wav,44100,16,60,1,acoustic_complexity,512,1,NA,5,1817.49600598912,NA 
rayol-farm2_2019-03-23_20-00-22.wav,44100,16,60,1,acoustic_complexity,512,1,NA,5,1829.78794931099,NA 
rayol-farm2_2019-03-23_20-02-22.wav,44100,16,60,1,acoustic_complexity,512,1,NA,5,1813.95233843021,NA 
rayol-farm2_2019-03-23_20-04-22.wav,44100,16,60,1,acoustic_complexity,512,1,NA,5,1819.03948720877,NA 
rayol-farm2_2019-03-23_20-06-22.wav,44100,16,60,1,acoustic_complexity,512,1,NA,5,1801.84614246153,NA 
rayol-farm2_2019-03-23_20-08-22.wav,44100,16,60,1,acoustic_complexity,512,1,NA,5,1801.46931032835,NA 
rayol-farm2_2019-03-23_20-10-22.wav,44100,16,60,1,acoustic_complexity,512,1,NA,5,1812.58652536542,NA 
rayol-farm2_2019-03-23_20-12-22.wav,44100,16,60,1,acoustic_complexity,512,1,NA,5,1815.95977266606,NA 
rayol-farm2_2019-03-23_20-14-23.wav,44100,16,60,1,acoustic_complexity,512,1,NA,5,1816.04255099262,NA 
rayol-farm2_2019-03-23_20-16-23.wav,44100,16,60,1,acoustic_complexity,512,1,NA,5,1812.3091877787,NA 
rayol-farm2_2019-03-23_20-18-23.wav,44100,16,60,1,acoustic_complexity,512,1,NA,5,1801.19883212447,NA 
rayol-farm2_2019-03-23_20-20-23.wav,44100,16,60,1,acoustic_complexity,512,1,NA,5,1816.78891390618,NA 
rayol-farm2_2019-03-23_20-22-23.wav,44100,16,60,1,acoustic_complexity,512,1,NA,5,1833.13595149849,NA 
rayol-farm2_2019-03-23_20-24-23.wav,44100,16,60,1,acoustic_complexity,512,1,NA,5,1818.51845366497,NA 
rayol-farm2_2019-03-23_20-26-23.wav,44100,16,60,1,acoustic_complexity,512,1,NA,5,1816.52241437177,NA 
rayol-farm2_2019-03-23_20-28-23.wav,44100,16,60,1,acoustic_complexity,512,1,NA,5,1830.20524192991,NA 
rayol-farm2_2019-03-23_20-30-24.wav,44100,16,60,1,acoustic_complexity,512,1,NA,5,1813.49327037057,NA 
rayol-farm2_2019-03-23_20-32-24.wav,44100,16,60,1,acoustic_complexity,512,1,NA,5,1821.39329410062,NA 
rayol-farm2_2019-03-23_20-34-24.wav,44100,16,60,1,acoustic_complexity,512,1,NA,5,1804.18228302292,NA 
rayol-farm2_2019-03-23_20-36-24.wav,44100,16,60,1,acoustic_complexity,512,1,NA,5,1822.6519510539,NA 
rayol-farm2_2019-03-23_20-38-24.wav,44100,16,60,1,acoustic_complexity,512,1,NA,5,1804.88803068029,NA 
rayol-farm2_2019-03-23_20-40-24.wav,44100,16,60,1,acoustic_complexity,512,1,NA,5,1808.36037063027,NA 
rayol-farm2_2019-03-23_20-42-24.wav,44100,16,60,1,acoustic_complexity,512,1,NA,5,1814.2409348057,NA 
rayol-farm2_2019-03-23_20-44-24.wav,44100,16,60,1,acoustic_complexity,512,1,NA,5,1815.63551777746,NA 
rayol-farm2_2019-03-23_20-46-24.wav,44100,16,60,1,acoustic_complexity,512,1,NA,5,1818.65394892674,NA 
rayol-farm2_2019-03-23_20-48-25.wav,44100,16,60,1,acoustic_complexity,512,1,NA,5,1831.89818394476,NA 
rayol-farm2_2019-03-23_20-50-25.wav,44100,16,60,1,acoustic_complexity,512,1,NA,5,1828.55877734496,NA 
rayol-farm2_2019-03-23_20-52-25.wav,44100,16,60,1,acoustic_complexity,512,1,NA,5,1812.55761750009,NA 
rayol-farm2_2019-03-23_20-54-25.wav,44100,16,60,1,acoustic_complexity,512,1,NA,5,1812.52622328764,NA 
rayol-farm2_2019-03-23_20-56-25.wav,44100,16,60,1,acoustic_complexity,512,1,NA,5,1814.28013145987,NA 
rayol-farm2_2019-03-23_20-58-25.wav,44100,16,60,1,acoustic_complexity,512,1,NA,5,1808.65384149151,NA 
rayol-farm2_2019-03-23_21-00-25.wav,44100,16,60,1,acoustic_complexity,512,1,NA,5,1799.30354607438,NA 
rayol-farm2_2019-03-23_21-02-25.wav,44100,16,60,1,acoustic_complexity,512,1,NA,5,1809.96706000459,NA 
rayol-farm2_2019-03-23_21-04-26.wav,44100,16,60,1,acoustic_complexity,512,1,NA,5,1797.68742945704,NA 
rayol-farm2_2019-03-23_21-06-26.wav,44100,16,60,1,acoustic_complexity,512,1,NA,5,1808.0493370522,NA 
rayol-farm2_2019-03-23_21-08-26.wav,44100,16,60,1,acoustic_complexity,512,1,NA,5,1820.96763787181,NA 
rayol-farm2_2019-03-23_21-10-26.wav,44100,16,60,1,acoustic_complexity,512,1,NA,5,1831.30500229674,NA 
rayol-farm2_2019-03-23_21-12-26.wav,44100,16,60,1,acoustic_complexity,512,1,NA,5,1807.2975933963,NA 
rayol-farm2_2019-03-23_21-14-26.wav,44100,16,60,1,acoustic_complexity,512,1,NA,5,1818.69305759278,NA 
rayol-farm2_2019-03-23_21-16-26.wav,44100,16,60,1,acoustic_complexity,512,1,NA,5,1799.63962272483,NA 
rayol-farm2_2019-03-23_21-18-26.wav,44100,16,60,1,acoustic_complexity,512,1,NA,5,1813.75867892364,NA 
rayol-farm2_2019-03-23_21-20-27.wav,44100,16,60,1,acoustic_complexity,512,1,NA,5,1812.64125845676,NA 
rayol-farm2_2019-03-23_21-22-27.wav,44100,16,60,1,acoustic_complexity,512,1,NA,5,1808.36083002312,NA 
rayol-farm2_2019-03-23_21-24-27.wav,44100,16,60,1,acoustic_complexity,512,1,NA,5,1817.57256238735,NA 
rayol-farm2_2019-03-23_21-26-27.wav,44100,16,60,1,acoustic_complexity,512,1,NA,5,1805.69176358471,NA 
rayol-farm2_2019-03-23_21-28-27.wav,44100,16,60,1,acoustic_complexity,512,1,NA,5,1809.71470419101,NA 
rayol-farm2_2019-03-23_21-30-27.wav,44100,16,60,1,acoustic_complexity,512,1,NA,5,1803.30245021557,NA 
rayol-farm2_2019-03-23_21-32-27.wav,44100,16,60,1,acoustic_complexity,512,1,NA,5,1800.6465710422,NA 
rayol-farm2_2019-03-23_21-34-27.wav,44100,16,60,1,acoustic_complexity,512,1,NA,5,1807.74329890773,NA 
rayol-farm2_2019-03-23_21-36-28.wav,44100,16,60,1,acoustic_complexity,512,1,NA,5,1823.38635979882,NA 
rayol-farm2_2019-03-23_21-38-28.wav,44100,16,60,1,acoustic_complexity,512,1,NA,5,1812.88475491131,NA 
rayol-farm2_2019-03-23_21-40-28.wav,44100,16,60,1,acoustic_complexity,512,1,NA,5,1804.92592220505,NA 
rayol-farm2_2019-03-23_21-42-28.wav,44100,16,60,1,acoustic_complexity,512,1,NA,5,1816.36562305941,NA 
rayol-farm2_2019-03-23_21-44-28.wav,44100,16,60,1,acoustic_complexity,512,1,NA,5,1819.79363801376,NA 
rayol-farm2_2019-03-23_21-46-28.wav,44100,16,60,1,acoustic_complexity,512,1,NA,5,1804.31499904622,NA 
rayol-farm2_2019-03-23_21-48-28.wav,44100,16,60,1,acoustic_complexity,512,1,NA,5,1815.43374029389,NA 
rayol-farm2_2019-03-23_21-50-28.wav,44100,16,60,1,acoustic_complexity,512,1,NA,5,1814.2197694924,NA 
rayol-farm2_2019-03-23_21-52-28.wav,44100,16,60,1,acoustic_complexity,512,1,NA,5,1810.50659720086,NA 
rayol-farm2_2019-03-23_21-54-29.wav,44100,16,60,1,acoustic_complexity,512,1,NA,5,1819.30591562378,NA 
rayol-farm2_2019-03-23_21-56-29.wav,44100,16,60,1,acoustic_complexity,512,1,NA,5,1826.37483385777,NA 
rayol-farm2_2019-03-23_21-58-29.wav,44100,16,60,1,acoustic_complexity,512,1,NA,5,1807.61687604819,NA 
rayol-farm2_2019-03-23_22-00-29.wav,44100,16,60,1,acoustic_complexity,512,1,NA,5,1827.12182305187,NA 
rayol-farm2_2019-03-23_22-02-29.wav,44100,16,60,1,acoustic_complexity,512,1,NA,5,1812.73932810627,NA 
rayol-farm2_2019-03-23_22-04-29.wav,44100,16,60,1,acoustic_complexity,512,1,NA,5,1807.24406246839,NA 
rayol-farm2_2019-03-23_22-06-29.wav,44100,16,60,1,acoustic_complexity,512,1,NA,5,1815.1644289414,NA 
rayol-farm2_2019-03-23_22-08-29.wav,44100,16,60,1,acoustic_complexity,512,1,NA,5,1806.41791630574,NA 
rayol-farm2_2019-03-23_22-10-30.wav,44100,16,60,1,acoustic_complexity,512,1,NA,5,1823.86035746517,NA 
rayol-farm2_2019-03-23_22-12-30.wav,44100,16,60,1,acoustic_complexity,512,1,NA,5,1813.45047715631,NA 
rayol-farm2_2019-03-23_22-14-30.wav,44100,16,60,1,acoustic_complexity,512,1,NA,5,1806.63393482224,NA 
rayol-farm2_2019-03-23_22-16-30.wav,44100,16,60,1,acoustic_complexity,512,1,NA,5,1818.85924190926,NA 
rayol-farm2_2019-03-23_22-18-30.wav,44100,16,60,1,acoustic_complexity,512,1,NA,5,1827.98319485944,NA 
rayol-farm2_2019-03-23_22-20-30.wav,44100,16,60,1,acoustic_complexity,512,1,NA,5,1820.17516303399,NA 
rayol-farm2_2019-03-23_22-22-30.wav,44100,16,60,1,acoustic_complexity,512,1,NA,5,1816.20569019142,NA 
rayol-farm2_2019-03-23_22-24-30.wav,44100,16,60,1,acoustic_complexity,512,1,NA,5,1803.796437704,NA 
rayol-farm2_2019-03-23_22-26-30.wav,44100,16,60,1,acoustic_complexity,512,1,NA,5,1808.24076832054,NA 
rayol-farm2_2019-03-23_22-28-31.wav,44100,16,60,1,acoustic_complexity,512,1,NA,5,1807.32266238684,NA 
rayol-farm2_2019-03-23_22-30-31.wav,44100,16,60,1,acoustic_complexity,512,1,NA,5,1819.42918442862,NA 
rayol-farm2_2019-03-23_22-32-31.wav,44100,16,60,1,acoustic_complexity,512,1,NA,5,1807.26900058453,NA 
rayol-farm2_2019-03-23_22-34-31.wav,44100,16,60,1,acoustic_complexity,512,1,NA,5,1809.70341497617,NA 
rayol-farm2_2019-03-23_22-36-31.wav,44100,16,60,1,acoustic_complexity,512,1,NA,5,1809.05752982602,NA 
rayol-farm2_2019-03-23_22-38-31.wav,44100,16,60,1,acoustic_complexity,512,1,NA,5,1806.97212656094,NA 
rayol-farm2_2019-03-23_22-40-31.wav,44100,16,60,1,acoustic_complexity,512,1,NA,5,1824.07712045055,NA 
rayol-farm2_2019-03-23_22-42-31.wav,44100,16,60,1,acoustic_complexity,512,1,NA,5,1820.56563668024,NA 
rayol-farm2_2019-03-23_22-44-32.wav,44100,16,60,1,acoustic_complexity,512,1,NA,5,1816.1086785277,NA 
rayol-farm2_2019-03-23_22-46-32.wav,44100,16,60,1,acoustic_complexity,512,1,NA,5,1813.32081334701,NA 
rayol-farm2_2019-03-23_22-48-32.wav,44100,16,60,1,acoustic_complexity,512,1,NA,5,1812.8259450296,NA 
rayol-farm2_2019-03-23_22-50-32.wav,44100,16,60,1,acoustic_complexity,512,1,NA,5,1810.76739192648,NA 
rayol-farm2_2019-03-23_22-52-32.wav,44100,16,60,1,acoustic_complexity,512,1,NA,5,1815.16494079103,NA 
rayol-farm2_2019-03-23_22-54-32.wav,44100,16,60,1,acoustic_complexity,512,1,NA,5,1813.53546150776,NA 
rayol-farm2_2019-03-23_22-56-32.wav,44100,16,60,1,acoustic_complexity,512,1,NA,5,1812.00679490553,NA 
rayol-farm2_2019-03-23_22-58-32.wav,44100,16,60,1,acoustic_complexity,512,1,NA,5,1803.65740191683,NA 
rayol-farm2_2019-03-23_23-00-33.wav,44100,16,60,1,acoustic_complexity,512,1,NA,5,1813.94270681195,NA 
rayol-farm2_2019-03-23_23-02-33.wav,44100,16,60,1,acoustic_complexity,512,1,NA,5,1799.61653519809,NA 
rayol-farm2_2019-03-23_23-04-33.wav,44100,16,60,1,acoustic_complexity,512,1,NA,5,1810.93458703893,NA 
rayol-farm2_2019-03-23_23-06-33.wav,44100,16,60,1,acoustic_complexity,512,1,NA,5,1808.58272735893,NA 
rayol-farm2_2019-03-23_23-08-33.wav,44100,16,60,1,acoustic_complexity,512,1,NA,5,1821.81817147749,NA 
rayol-farm2_2019-03-23_23-10-33.wav,44100,16,60,1,acoustic_complexity,512,1,NA,5,1816.0668111535,NA 
rayol-farm2_2019-03-23_23-12-33.wav,44100,16,60,1,acoustic_complexity,512,1,NA,5,1805.66455327848,NA 
rayol-farm2_2019-03-23_23-14-33.wav,44100,16,60,1,acoustic_complexity,512,1,NA,5,1803.72169506998,NA 
rayol-farm2_2019-03-23_23-16-34.wav,44100,16,60,1,acoustic_complexity,512,1,NA,5,1815.65240700439,NA 
rayol-farm2_2019-03-23_23-18-34.wav,44100,16,60,1,acoustic_complexity,512,1,NA,5,1827.45958835467,NA 
rayol-farm2_2019-03-23_23-20-34.wav,44100,16,60,1,acoustic_complexity,512,1,NA,5,1813.18012674243,NA 
rayol-farm2_2019-03-23_23-22-34.wav,44100,16,60,1,acoustic_complexity,512,1,NA,5,1818.25879113104,NA 
rayol-farm2_2019-03-23_23-24-34.wav,44100,16,60,1,acoustic_complexity,512,1,NA,5,1826.47259201999,NA 
rayol-farm2_2019-03-23_23-26-34.wav,44100,16,60,1,acoustic_complexity,512,1,NA,5,1808.85312151457,NA 
rayol-farm2_2019-03-23_23-28-34.wav,44100,16,60,1,acoustic_complexity,512,1,NA,5,1822.59274108489,NA 
rayol-farm2_2019-03-23_23-30-34.wav,44100,16,60,1,acoustic_complexity,512,1,NA,5,1822.95542290797,NA 
rayol-farm2_2019-03-23_23-32-34.wav,44100,16,60,1,acoustic_complexity,512,1,NA,5,1819.57131194282,NA 
rayol-farm2_2019-03-23_23-34-35.wav,44100,16,60,1,acoustic_complexity,512,1,NA,5,1815.48290445067,NA 
rayol-farm2_2019-03-23_23-36-35.wav,44100,16,60,1,acoustic_complexity,512,1,NA,5,1800.39916561918,NA 
rayol-farm2_2019-03-23_23-38-35.wav,44100,16,60,1,acoustic_complexity,512,1,NA,5,1814.85459905165,NA 
rayol-farm2_2019-03-23_23-40-35.wav,44100,16,60,1,acoustic_complexity,512,1,NA,5,1806.75806701278,NA 
rayol-farm2_2019-03-23_23-42-35.wav,44100,16,60,1,acoustic_complexity,512,1,NA,5,1815.18662255171,NA 
rayol-farm2_2019-03-23_23-44-35.wav,44100,16,60,1,acoustic_complexity,512,1,NA,5,1813.72971919983,NA 
rayol-farm2_2019-03-23_23-46-35.wav,44100,16,60,1,acoustic_complexity,512,1,NA,5,1820.1910873621,NA 
rayol-farm2_2019-03-23_23-48-35.wav,44100,16,60,1,acoustic_complexity,512,1,NA,5,1810.85767361634,NA 
rayol-farm2_2019-03-23_23-50-36.wav,44100,16,60,1,acoustic_complexity,512,1,NA,5,1827.88423398096,NA 
rayol-farm2_2019-03-23_23-52-36.wav,44100,16,60,1,acoustic_complexity,512,1,NA,5,1819.09841523462,NA 
rayol-farm2_2019-03-23_23-54-36.wav,44100,16,60,1,acoustic_complexity,512,1,NA,5,1802.24423600635,NA 
rayol-farm2_2019-03-23_23-56-36.wav,44100,16,60,1,acoustic_complexity,512,1,NA,5,1827.86246323915,NA 
rayol-farm2_2019-03-23_23-58-36.wav,44100,16,60,1,acoustic_complexity,512,1,NA,5,1827.02012799535,NA
