FILENAME,SAMPLINGRATE,BIT,DURATION,CHANNELS,INDEX,FFT_W,ANTHRO_MIN,ANTHRO_MAX,BIO_MIN,BIO_MAX,LEFT_CHANNEL,RIGHT_CHANNEL
rayol-farm2_2019-05-22_11-02-11.wav,44100,16,60,1,ndsi,1024,1000,2000,2000,11000,0.929365862865942,NA 
rayol-farm2_2019-05-22_11-04-11.wav,44100,16,60,1,ndsi,1024,1000,2000,2000,11000,0.921693658514957,NA 
rayol-farm2_2019-05-22_11-16-12.wav,44100,16,60,1,ndsi,1024,1000,2000,2000,11000,0.717304543271745,NA 
rayol-farm2_2019-05-22_11-18-12.wav,44100,16,60,1,ndsi,1024,1000,2000,2000,11000,0.897052234839367,NA 
rayol-farm2_2019-05-22_11-20-12.wav,44100,16,60,1,ndsi,1024,1000,2000,2000,11000,0.89191957424581,NA 
rayol-farm2_2019-05-22_11-22-12.wav,44100,16,60,1,ndsi,1024,1000,2000,2000,11000,0.924936522937408,NA 
rayol-farm2_2019-05-22_11-24-13.wav,44100,16,60,1,ndsi,1024,1000,2000,2000,11000,0.897948956773761,NA 
rayol-farm2_2019-05-22_11-26-13.wav,44100,16,59.87,1,ndsi,1024,1000,2000,2000,11000,0.293167290811214,NA 
rayol-farm2_2019-05-22_11-28-13.wav,44100,16,60,1,ndsi,1024,1000,2000,2000,11000,0.771601531459305,NA 
rayol-farm2_2019-05-22_11-30-13.wav,44100,16,60,1,ndsi,1024,1000,2000,2000,11000,0.938303403294805,NA 
rayol-farm2_2019-05-22_11-34-13.wav,44100,16,60,1,ndsi,1024,1000,2000,2000,11000,0.924409033418606,NA 
rayol-farm2_2019-05-22_11-36-13.wav,44100,16,60,1,ndsi,1024,1000,2000,2000,11000,0.931552177734023,NA 
rayol-farm2_2019-05-22_11-38-13.wav,44100,16,60,1,ndsi,1024,1000,2000,2000,11000,0.941764199176336,NA 
rayol-farm2_2019-05-22_11-40-14.wav,44100,16,60,1,ndsi,1024,1000,2000,2000,11000,0.943906194638482,NA 
rayol-farm2_2019-05-22_11-42-14.wav,44100,16,60,1,ndsi,1024,1000,2000,2000,11000,0.913662097963268,NA 
rayol-farm2_2019-05-22_11-44-14.wav,44100,16,60,1,ndsi,1024,1000,2000,2000,11000,0.931763265288379,NA 
rayol-farm2_2019-05-22_11-46-14.wav,44100,16,60,1,ndsi,1024,1000,2000,2000,11000,0.905401892114873,NA 
rayol-farm2_2019-05-22_11-48-15.wav,44100,16,60,1,ndsi,1024,1000,2000,2000,11000,0.908593594833827,NA 
rayol-farm2_2019-05-22_11-50-15.wav,44100,16,60,1,ndsi,1024,1000,2000,2000,11000,0.928344421831057,NA 
rayol-farm2_2019-05-22_11-52-15.wav,44100,16,60,1,ndsi,1024,1000,2000,2000,11000,0.946492829817448,NA 
rayol-farm2_2019-05-22_11-54-15.wav,44100,16,60,1,ndsi,1024,1000,2000,2000,11000,0.917863360136849,NA 
rayol-farm2_2019-05-22_11-56-15.wav,44100,16,60,1,ndsi,1024,1000,2000,2000,11000,0.946862897242865,NA 
rayol-farm2_2019-05-22_11-58-15.wav,44100,16,60,1,ndsi,1024,1000,2000,2000,11000,0.465824255535513,NA 
rayol-farm2_2019-05-22_12-00-16.wav,44100,16,60,1,ndsi,1024,1000,2000,2000,11000,0.921726176328738,NA 
rayol-farm2_2019-05-22_12-03-42.wav,44100,16,60,1,ndsi,1024,1000,2000,2000,11000,0.69746609266977,NA 
rayol-farm2_2019-05-22_12-05-42.wav,44100,16,60,1,ndsi,1024,1000,2000,2000,11000,0.575814811280714,NA 
rayol-farm2_2019-05-22_12-07-42.wav,44100,16,60,1,ndsi,1024,1000,2000,2000,11000,0.404372714148315,NA 
rayol-farm2_2019-05-22_12-09-42.wav,44100,16,60,1,ndsi,1024,1000,2000,2000,11000,0.794134073983436,NA 
rayol-farm2_2019-05-22_12-11-42.wav,44100,16,60,1,ndsi,1024,1000,2000,2000,11000,0.814458769664088,NA 
rayol-farm2_2019-05-22_12-13-43.wav,44100,16,60,1,ndsi,1024,1000,2000,2000,11000,0.482451824403568,NA 
rayol-farm2_2019-05-22_12-15-43.wav,44100,16,60,1,ndsi,1024,1000,2000,2000,11000,0.865921180618506,NA 
rayol-farm2_2019-05-22_12-17-43.wav,44100,16,60,1,ndsi,1024,1000,2000,2000,11000,0.674604439534709,NA 
rayol-farm2_2019-05-22_12-19-43.wav,44100,16,60,1,ndsi,1024,1000,2000,2000,11000,0.942142635073276,NA 
rayol-farm2_2019-05-22_12-21-43.wav,44100,16,60,1,ndsi,1024,1000,2000,2000,11000,0.927317528779857,NA 
rayol-farm2_2019-05-22_12-23-43.wav,44100,16,60,1,ndsi,1024,1000,2000,2000,11000,0.899257385597732,NA 
rayol-farm2_2019-05-22_12-25-43.wav,44100,16,60,1,ndsi,1024,1000,2000,2000,11000,0.884606590855045,NA 
rayol-farm2_2019-05-22_12-27-43.wav,44100,16,60,1,ndsi,1024,1000,2000,2000,11000,0.903562054180489,NA 
rayol-farm2_2019-05-22_12-29-44.wav,44100,16,60,1,ndsi,1024,1000,2000,2000,11000,0.590163147662981,NA 
rayol-farm2_2019-05-22_12-31-44.wav,44100,16,60,1,ndsi,1024,1000,2000,2000,11000,0.911731792124747,NA 
rayol-farm2_2019-05-22_12-33-44.wav,44100,16,60,1,ndsi,1024,1000,2000,2000,11000,0.912944723452015,NA 
rayol-farm2_2019-05-22_12-35-44.wav,44100,16,60,1,ndsi,1024,1000,2000,2000,11000,0.917776529724084,NA 
rayol-farm2_2019-05-22_12-37-44.wav,44100,16,60,1,ndsi,1024,1000,2000,2000,11000,0.921464990528738,NA 
rayol-farm2_2019-05-22_12-39-44.wav,44100,16,60,1,ndsi,1024,1000,2000,2000,11000,0.912636030638694,NA 
rayol-farm2_2019-05-22_12-49-45.wav,44100,16,60,1,ndsi,1024,1000,2000,2000,11000,0.92200085102047,NA 
rayol-farm2_2019-05-22_12-51-45.wav,44100,16,60,1,ndsi,1024,1000,2000,2000,11000,0.921027112554039,NA 
rayol-farm2_2019-05-22_12-55-45.wav,44100,16,60,1,ndsi,1024,1000,2000,2000,11000,0.901284465467369,NA 
rayol-farm2_2019-05-22_13-01-46.wav,44100,16,60,1,ndsi,1024,1000,2000,2000,11000,0.833411157236655,NA 
rayol-farm2_2019-05-22_13-03-46.wav,44100,16,60,1,ndsi,1024,1000,2000,2000,11000,0.690293975917375,NA 
rayol-farm2_2019-05-22_13-05-46.wav,44100,16,60,1,ndsi,1024,1000,2000,2000,11000,0.726709768086612,NA 
rayol-farm2_2019-05-22_13-09-46.wav,44100,16,60,1,ndsi,1024,1000,2000,2000,11000,0.62847531545596,NA 
rayol-farm2_2019-05-22_13-11-46.wav,44100,16,60,1,ndsi,1024,1000,2000,2000,11000,0.889927254390926,NA 
rayol-farm2_2019-05-22_13-13-46.wav,44100,16,60,1,ndsi,1024,1000,2000,2000,11000,0.646805021364013,NA 
rayol-farm2_2019-05-22_13-15-46.wav,44100,16,60,1,ndsi,1024,1000,2000,2000,11000,0.830256266456993,NA 
rayol-farm2_2019-05-22_13-17-47.wav,44100,16,60,1,ndsi,1024,1000,2000,2000,11000,0.717019009102886,NA 
rayol-farm2_2019-05-22_13-19-47.wav,44100,16,60,1,ndsi,1024,1000,2000,2000,11000,0.82331858650039,NA 
rayol-farm2_2019-05-22_13-21-47.wav,44100,16,60,1,ndsi,1024,1000,2000,2000,11000,0.706254467093146,NA 
rayol-farm2_2019-05-22_13-23-47.wav,44100,16,60,1,ndsi,1024,1000,2000,2000,11000,0.90137801080579,NA 
rayol-farm2_2019-05-22_13-25-47.wav,44100,16,60,1,ndsi,1024,1000,2000,2000,11000,0.450333950579972,NA 
rayol-farm2_2019-05-22_13-27-47.wav,44100,16,60,1,ndsi,1024,1000,2000,2000,11000,0.827903311661701,NA 
rayol-farm2_2019-05-22_13-29-47.wav,44100,16,60,1,ndsi,1024,1000,2000,2000,11000,0.789151132033051,NA 
rayol-farm2_2019-05-22_13-31-47.wav,44100,16,60,1,ndsi,1024,1000,2000,2000,11000,0.796277733876088,NA 
rayol-farm2_2019-05-22_13-33-48.wav,44100,16,60,1,ndsi,1024,1000,2000,2000,11000,0.895013811695504,NA 
rayol-farm2_2019-05-22_13-35-48.wav,44100,16,60,1,ndsi,1024,1000,2000,2000,11000,0.742271876839882,NA 
rayol-farm2_2019-05-22_13-37-48.wav,44100,16,60,1,ndsi,1024,1000,2000,2000,11000,0.888169663949288,NA 
rayol-farm2_2019-05-22_13-39-48.wav,44100,16,60,1,ndsi,1024,1000,2000,2000,11000,0.888472187518569,NA 
rayol-farm2_2019-05-22_13-41-48.wav,44100,16,60,1,ndsi,1024,1000,2000,2000,11000,0.822408595190865,NA 
rayol-farm2_2019-05-22_13-43-48.wav,44100,16,60,1,ndsi,1024,1000,2000,2000,11000,0.722599807208302,NA 
rayol-farm2_2019-05-22_13-45-48.wav,44100,16,60,1,ndsi,1024,1000,2000,2000,11000,0.844957562679432,NA 
rayol-farm2_2019-05-22_13-47-48.wav,44100,16,60,1,ndsi,1024,1000,2000,2000,11000,0.851216428581205,NA 
rayol-farm2_2019-05-22_13-49-49.wav,44100,16,60,1,ndsi,1024,1000,2000,2000,11000,0.803736055260519,NA 
rayol-farm2_2019-05-22_13-51-49.wav,44100,16,60,1,ndsi,1024,1000,2000,2000,11000,0.846112415961002,NA 
rayol-farm2_2019-05-22_13-53-49.wav,44100,16,60,1,ndsi,1024,1000,2000,2000,11000,0.534051123810957,NA 
rayol-farm2_2019-05-22_13-55-49.wav,44100,16,60,1,ndsi,1024,1000,2000,2000,11000,0.763785592557909,NA 
rayol-farm2_2019-05-22_13-57-49.wav,44100,16,60,1,ndsi,1024,1000,2000,2000,11000,0.820671154128965,NA 
rayol-farm2_2019-05-22_13-59-49.wav,44100,16,60,1,ndsi,1024,1000,2000,2000,11000,0.887083845692388,NA 
rayol-farm2_2019-05-22_14-01-49.wav,44100,16,60,1,ndsi,1024,1000,2000,2000,11000,0.86939310484345,NA 
rayol-farm2_2019-05-22_14-03-49.wav,44100,16,60,1,ndsi,1024,1000,2000,2000,11000,0.137912162191004,NA 
rayol-farm2_2019-05-22_14-05-50.wav,44100,16,60,1,ndsi,1024,1000,2000,2000,11000,0.900623928331555,NA 
rayol-farm2_2019-05-22_14-07-50.wav,44100,16,60,1,ndsi,1024,1000,2000,2000,11000,0.895387928350335,NA 
rayol-farm2_2019-05-22_14-09-50.wav,44100,16,60,1,ndsi,1024,1000,2000,2000,11000,0.703695751486126,NA 
rayol-farm2_2019-05-22_14-11-50.wav,44100,16,60,1,ndsi,1024,1000,2000,2000,11000,0.856854850328697,NA 
rayol-farm2_2019-05-22_14-13-50.wav,44100,16,60,1,ndsi,1024,1000,2000,2000,11000,0.835002974072882,NA 
rayol-farm2_2019-05-22_14-15-50.wav,44100,16,60,1,ndsi,1024,1000,2000,2000,11000,0.856255708064275,NA 
rayol-farm2_2019-05-22_14-17-50.wav,44100,16,60,1,ndsi,1024,1000,2000,2000,11000,0.888619123008951,NA 
rayol-farm2_2019-05-22_14-19-50.wav,44100,16,60,1,ndsi,1024,1000,2000,2000,11000,0.490042798069815,NA 
rayol-farm2_2019-05-22_14-21-51.wav,44100,16,60,1,ndsi,1024,1000,2000,2000,11000,0.915965639917229,NA 
rayol-farm2_2019-05-22_14-23-51.wav,44100,16,60,1,ndsi,1024,1000,2000,2000,11000,0.337063317503411,NA 
rayol-farm2_2019-05-22_14-25-51.wav,44100,16,60,1,ndsi,1024,1000,2000,2000,11000,0.933472394603568,NA 
rayol-farm2_2019-05-22_14-27-51.wav,44100,16,60,1,ndsi,1024,1000,2000,2000,11000,0.919372362754061,NA 
rayol-farm2_2019-05-22_14-29-51.wav,44100,16,60,1,ndsi,1024,1000,2000,2000,11000,0.747186221070233,NA 
rayol-farm2_2019-05-22_14-31-51.wav,44100,16,60,1,ndsi,1024,1000,2000,2000,11000,0.90525277656905,NA 
rayol-farm2_2019-05-22_14-33-51.wav,44100,16,60,1,ndsi,1024,1000,2000,2000,11000,0.927470249467504,NA 
rayol-farm2_2019-05-22_14-55-53.wav,44100,16,60,1,ndsi,1024,1000,2000,2000,11000,0.937086126785447,NA 
rayol-farm2_2019-05-22_14-59-53.wav,44100,16,60,1,ndsi,1024,1000,2000,2000,11000,0.948881585268112,NA 
rayol-farm2_2019-05-22_15-01-53.wav,44100,16,60,1,ndsi,1024,1000,2000,2000,11000,0.945819740942598,NA 
rayol-farm2_2019-05-22_15-03-53.wav,44100,16,60,1,ndsi,1024,1000,2000,2000,11000,0.943512792933624,NA 
rayol-farm2_2019-05-22_15-07-53.wav,44100,16,60,1,ndsi,1024,1000,2000,2000,11000,0.953845526736351,NA 
rayol-farm2_2019-05-22_15-09-53.wav,44100,16,60,1,ndsi,1024,1000,2000,2000,11000,0.951741647292379,NA 
rayol-farm2_2019-05-22_15-13-54.wav,44100,16,60,1,ndsi,1024,1000,2000,2000,11000,0.467243933852211,NA 
rayol-farm2_2019-05-22_15-15-54.wav,44100,16,60,1,ndsi,1024,1000,2000,2000,11000,0.934925816922897,NA 
rayol-farm2_2019-05-22_15-17-54.wav,44100,16,60,1,ndsi,1024,1000,2000,2000,11000,0.94365257908996,NA 
rayol-farm2_2019-05-22_15-19-54.wav,44100,16,60,1,ndsi,1024,1000,2000,2000,11000,0.938450306237315,NA 
rayol-farm2_2019-05-22_15-21-54.wav,44100,16,60,1,ndsi,1024,1000,2000,2000,11000,0.924783424938211,NA 
rayol-farm2_2019-05-22_15-23-54.wav,44100,16,60,1,ndsi,1024,1000,2000,2000,11000,0.93235911067791,NA 
rayol-farm2_2019-05-22_15-25-54.wav,44100,16,60,1,ndsi,1024,1000,2000,2000,11000,0.89056921267019,NA 
rayol-farm2_2019-05-22_15-27-55.wav,44100,16,60,1,ndsi,1024,1000,2000,2000,11000,0.905709079640187,NA 
rayol-farm2_2019-05-22_15-29-55.wav,44100,16,60,1,ndsi,1024,1000,2000,2000,11000,0.934873334853433,NA 
rayol-farm2_2019-05-22_15-31-55.wav,44100,16,60,1,ndsi,1024,1000,2000,2000,11000,0.943688952984593,NA 
rayol-farm2_2019-05-22_15-33-55.wav,44100,16,60,1,ndsi,1024,1000,2000,2000,11000,0.936081263386539,NA 
rayol-farm2_2019-05-22_15-35-55.wav,44100,16,60,1,ndsi,1024,1000,2000,2000,11000,0.949079321081183,NA 
rayol-farm2_2019-05-22_15-37-55.wav,44100,16,60,1,ndsi,1024,1000,2000,2000,11000,0.929264608457456,NA 
rayol-farm2_2019-05-22_15-39-55.wav,44100,16,60,1,ndsi,1024,1000,2000,2000,11000,0.926992625191555,NA 
rayol-farm2_2019-05-22_15-41-55.wav,44100,16,60,1,ndsi,1024,1000,2000,2000,11000,0.915879006200973,NA 
rayol-farm2_2019-05-22_15-43-56.wav,44100,16,60,1,ndsi,1024,1000,2000,2000,11000,0.698504660264753,NA 
rayol-farm2_2019-05-22_15-45-56.wav,44100,16,60,1,ndsi,1024,1000,2000,2000,11000,0.637058274765851,NA 
rayol-farm2_2019-05-22_15-47-56.wav,44100,16,60,1,ndsi,1024,1000,2000,2000,11000,0.887581244606006,NA 
rayol-farm2_2019-05-22_15-49-56.wav,44100,16,60,1,ndsi,1024,1000,2000,2000,11000,0.927406680632592,NA 
rayol-farm2_2019-05-22_15-51-56.wav,44100,16,60,1,ndsi,1024,1000,2000,2000,11000,0.921624832209528,NA 
rayol-farm2_2019-05-22_15-53-56.wav,44100,16,60,1,ndsi,1024,1000,2000,2000,11000,0.228290803345243,NA 
rayol-farm2_2019-05-22_15-55-56.wav,44100,16,60,1,ndsi,1024,1000,2000,2000,11000,0.562186425974622,NA 
rayol-farm2_2019-05-22_15-57-56.wav,44100,16,60,1,ndsi,1024,1000,2000,2000,11000,0.717306575252878,NA 
rayol-farm2_2019-05-22_15-59-56.wav,44100,16,60,1,ndsi,1024,1000,2000,2000,11000,0.447927789770127,NA 
rayol-farm2_2019-05-22_16-01-57.wav,44100,16,60,1,ndsi,1024,1000,2000,2000,11000,0.882303713789623,NA 
rayol-farm2_2019-05-22_16-03-57.wav,44100,16,60,1,ndsi,1024,1000,2000,2000,11000,0.873645192811559,NA 
rayol-farm2_2019-05-22_16-05-57.wav,44100,16,60,1,ndsi,1024,1000,2000,2000,11000,0.946904016207915,NA 
rayol-farm2_2019-05-22_16-07-57.wav,44100,16,60,1,ndsi,1024,1000,2000,2000,11000,0.839410507686927,NA 
rayol-farm2_2019-05-22_16-09-57.wav,44100,16,60,1,ndsi,1024,1000,2000,2000,11000,0.932481475899494,NA 
rayol-farm2_2019-05-22_16-11-57.wav,44100,16,60,1,ndsi,1024,1000,2000,2000,11000,0.943429592417409,NA 
rayol-farm2_2019-05-22_16-13-57.wav,44100,16,60,1,ndsi,1024,1000,2000,2000,11000,0.954635809771376,NA 
rayol-farm2_2019-05-22_16-15-57.wav,44100,16,60,1,ndsi,1024,1000,2000,2000,11000,0.482188520808867,NA 
rayol-farm2_2019-05-22_16-17-58.wav,44100,16,60,1,ndsi,1024,1000,2000,2000,11000,0.951620599179711,NA 
rayol-farm2_2019-05-22_16-19-58.wav,44100,16,60,1,ndsi,1024,1000,2000,2000,11000,0.952939978834445,NA 
rayol-farm2_2019-05-22_16-21-58.wav,44100,16,60,1,ndsi,1024,1000,2000,2000,11000,0.929761559767466,NA 
rayol-farm2_2019-05-22_16-23-58.wav,44100,16,60,1,ndsi,1024,1000,2000,2000,11000,0.938946272046982,NA 
rayol-farm2_2019-05-22_16-25-58.wav,44100,16,60,1,ndsi,1024,1000,2000,2000,11000,0.913842430292442,NA 
rayol-farm2_2019-05-22_16-27-58.wav,44100,16,60,1,ndsi,1024,1000,2000,2000,11000,0.883585785655029,NA 
rayol-farm2_2019-05-22_16-29-58.wav,44100,16,60,1,ndsi,1024,1000,2000,2000,11000,0.841698254545694,NA 
rayol-farm2_2019-05-22_16-31-58.wav,44100,16,60,1,ndsi,1024,1000,2000,2000,11000,0.908094597895519,NA 
rayol-farm2_2019-05-22_16-33-59.wav,44100,16,60,1,ndsi,1024,1000,2000,2000,11000,0.937872458095217,NA 
rayol-farm2_2019-05-22_16-35-59.wav,44100,16,60,1,ndsi,1024,1000,2000,2000,11000,0.924880771491863,NA 
rayol-farm2_2019-05-22_16-37-59.wav,44100,16,60,1,ndsi,1024,1000,2000,2000,11000,0.937152922911429,NA 
rayol-farm2_2019-05-22_16-39-59.wav,44100,16,60,1,ndsi,1024,1000,2000,2000,11000,0.944786851857543,NA 
rayol-farm2_2019-05-22_16-41-59.wav,44100,16,60,1,ndsi,1024,1000,2000,2000,11000,0.942490294368868,NA 
rayol-farm2_2019-05-22_16-43-59.wav,44100,16,60,1,ndsi,1024,1000,2000,2000,11000,0.94007936969141,NA 
rayol-farm2_2019-05-22_16-45-59.wav,44100,16,60,1,ndsi,1024,1000,2000,2000,11000,0.927907499472653,NA 
rayol-farm2_2019-05-22_16-47-59.wav,44100,16,60,1,ndsi,1024,1000,2000,2000,11000,0.948143133894645,NA 
rayol-farm2_2019-05-22_16-50-00.wav,44100,16,60,1,ndsi,1024,1000,2000,2000,11000,0.822865416956856,NA 
rayol-farm2_2019-05-22_16-52-00.wav,44100,16,60,1,ndsi,1024,1000,2000,2000,11000,0.904350332977467,NA 
rayol-farm2_2019-05-22_16-54-00.wav,44100,16,60,1,ndsi,1024,1000,2000,2000,11000,0.949272707141939,NA 
rayol-farm2_2019-05-22_16-56-00.wav,44100,16,60,1,ndsi,1024,1000,2000,2000,11000,0.797294212283164,NA 
rayol-farm2_2019-05-22_16-58-00.wav,44100,16,60,1,ndsi,1024,1000,2000,2000,11000,0.904513911416399,NA 
rayol-farm2_2019-05-22_17-00-00.wav,44100,16,60,1,ndsi,1024,1000,2000,2000,11000,0.946801688448744,NA 
rayol-farm2_2019-05-22_17-02-00.wav,44100,16,60,1,ndsi,1024,1000,2000,2000,11000,0.734776332470299,NA 
rayol-farm2_2019-05-22_17-04-00.wav,44100,16,60,1,ndsi,1024,1000,2000,2000,11000,0.833407344156072,NA 
rayol-farm2_2019-05-22_17-06-01.wav,44100,16,60,1,ndsi,1024,1000,2000,2000,11000,0.936894145774647,NA 
rayol-farm2_2019-05-22_17-08-01.wav,44100,16,60,1,ndsi,1024,1000,2000,2000,11000,0.929516145905482,NA 
rayol-farm2_2019-05-22_17-10-01.wav,44100,16,60,1,ndsi,1024,1000,2000,2000,11000,0.903309162690135,NA 
rayol-farm2_2019-05-22_17-12-01.wav,44100,16,60,1,ndsi,1024,1000,2000,2000,11000,0.935296694410043,NA 
rayol-farm2_2019-05-22_17-14-01.wav,44100,16,60,1,ndsi,1024,1000,2000,2000,11000,0.860689474655939,NA 
rayol-farm2_2019-05-22_17-16-01.wav,44100,16,60,1,ndsi,1024,1000,2000,2000,11000,0.934323333753501,NA 
rayol-farm2_2019-05-22_17-18-01.wav,44100,16,60,1,ndsi,1024,1000,2000,2000,11000,0.932301529497976,NA 
rayol-farm2_2019-05-22_17-20-01.wav,44100,16,60,1,ndsi,1024,1000,2000,2000,11000,0.942127144504976,NA 
rayol-farm2_2019-05-22_17-22-01.wav,44100,16,60,1,ndsi,1024,1000,2000,2000,11000,0.94397987219969,NA 
rayol-farm2_2019-05-22_17-24-02.wav,44100,16,60,1,ndsi,1024,1000,2000,2000,11000,0.940021707354065,NA 
rayol-farm2_2019-05-22_17-26-02.wav,44100,16,60,1,ndsi,1024,1000,2000,2000,11000,0.935489947290673,NA 
rayol-farm2_2019-05-22_17-28-02.wav,44100,16,60,1,ndsi,1024,1000,2000,2000,11000,0.869727554814868,NA 
rayol-farm2_2019-05-22_17-30-02.wav,44100,16,60,1,ndsi,1024,1000,2000,2000,11000,0.935530627450537,NA 
rayol-farm2_2019-05-22_17-32-02.wav,44100,16,60,1,ndsi,1024,1000,2000,2000,11000,0.872875930654516,NA 
rayol-farm2_2019-05-22_17-34-02.wav,44100,16,60,1,ndsi,1024,1000,2000,2000,11000,0.909138132086071,NA 
rayol-farm2_2019-05-22_17-36-02.wav,44100,16,60,1,ndsi,1024,1000,2000,2000,11000,0.905419688186501,NA 
rayol-farm2_2019-05-22_17-38-02.wav,44100,16,60,1,ndsi,1024,1000,2000,2000,11000,0.867882003517993,NA 
rayol-farm2_2019-05-22_17-40-03.wav,44100,16,60,1,ndsi,1024,1000,2000,2000,11000,0.932229956412067,NA 
rayol-farm2_2019-05-22_17-42-03.wav,44100,16,60,1,ndsi,1024,1000,2000,2000,11000,0.926470307366243,NA 
rayol-farm2_2019-05-22_17-44-03.wav,44100,16,60,1,ndsi,1024,1000,2000,2000,11000,0.882892877729025,NA 
rayol-farm2_2019-05-22_17-46-03.wav,44100,16,60,1,ndsi,1024,1000,2000,2000,11000,0.926561408928499,NA 
rayol-farm2_2019-05-22_17-48-03.wav,44100,16,60,1,ndsi,1024,1000,2000,2000,11000,0.949915728504386,NA 
rayol-farm2_2019-05-22_17-50-03.wav,44100,16,60,1,ndsi,1024,1000,2000,2000,11000,0.949673508806872,NA 
rayol-farm2_2019-05-22_17-52-03.wav,44100,16,60,1,ndsi,1024,1000,2000,2000,11000,0.951314723369107,NA 
rayol-farm2_2019-05-22_17-54-03.wav,44100,16,60,1,ndsi,1024,1000,2000,2000,11000,0.955538343284861,NA 
rayol-farm2_2019-05-22_17-56-04.wav,44100,16,60,1,ndsi,1024,1000,2000,2000,11000,0.948095357891533,NA 
rayol-farm2_2019-05-22_17-58-04.wav,44100,16,60,1,ndsi,1024,1000,2000,2000,11000,0.951146829780231,NA 
rayol-farm2_2019-05-22_18-00-04.wav,44100,16,60,1,ndsi,1024,1000,2000,2000,11000,0.948784256895121,NA 
rayol-farm2_2019-05-22_18-02-04.wav,44100,16,60,1,ndsi,1024,1000,2000,2000,11000,0.917424211106875,NA 
rayol-farm2_2019-05-22_18-04-04.wav,44100,16,60,1,ndsi,1024,1000,2000,2000,11000,0.944375926444493,NA 
rayol-farm2_2019-05-22_18-06-04.wav,44100,16,60,1,ndsi,1024,1000,2000,2000,11000,0.948702389650256,NA 
rayol-farm2_2019-05-22_18-08-04.wav,44100,16,60,1,ndsi,1024,1000,2000,2000,11000,0.964245820651202,NA 
rayol-farm2_2019-05-22_18-10-04.wav,44100,16,60,1,ndsi,1024,1000,2000,2000,11000,0.899899655951481,NA 
rayol-farm2_2019-05-22_18-12-05.wav,44100,16,60,1,ndsi,1024,1000,2000,2000,11000,0.898731498238382,NA 
rayol-farm2_2019-05-22_18-14-05.wav,44100,16,60,1,ndsi,1024,1000,2000,2000,11000,0.668283315268985,NA 
rayol-farm2_2019-05-22_18-16-05.wav,44100,16,60,1,ndsi,1024,1000,2000,2000,11000,0.881642234313515,NA 
rayol-farm2_2019-05-22_18-18-05.wav,44100,16,60,1,ndsi,1024,1000,2000,2000,11000,0.907026342977656,NA 
rayol-farm2_2019-05-22_18-20-05.wav,44100,16,60,1,ndsi,1024,1000,2000,2000,11000,0.946310732577884,NA 
rayol-farm2_2019-05-22_18-22-05.wav,44100,16,60,1,ndsi,1024,1000,2000,2000,11000,0.857972066371903,NA 
rayol-farm2_2019-05-22_18-24-05.wav,44100,16,60,1,ndsi,1024,1000,2000,2000,11000,0.929270670581399,NA 
rayol-farm2_2019-05-22_18-26-05.wav,44100,16,60,1,ndsi,1024,1000,2000,2000,11000,0.930646432399662,NA 
rayol-farm2_2019-05-22_18-28-05.wav,44100,16,60,1,ndsi,1024,1000,2000,2000,11000,0.939854641719041,NA 
rayol-farm2_2019-05-22_18-30-06.wav,44100,16,60,1,ndsi,1024,1000,2000,2000,11000,0.943627490705904,NA 
rayol-farm2_2019-05-22_18-32-06.wav,44100,16,60,1,ndsi,1024,1000,2000,2000,11000,0.950706856752085,NA 
rayol-farm2_2019-05-22_18-34-06.wav,44100,16,60,1,ndsi,1024,1000,2000,2000,11000,0.945970206769559,NA 
rayol-farm2_2019-05-22_18-36-06.wav,44100,16,60,1,ndsi,1024,1000,2000,2000,11000,0.94883910311492,NA 
rayol-farm2_2019-05-22_18-38-06.wav,44100,16,60,1,ndsi,1024,1000,2000,2000,11000,0.945504581396275,NA 
rayol-farm2_2019-05-22_18-40-06.wav,44100,16,60,1,ndsi,1024,1000,2000,2000,11000,0.929082418980947,NA 
rayol-farm2_2019-05-22_18-42-06.wav,44100,16,60,1,ndsi,1024,1000,2000,2000,11000,0.934264219087754,NA 
rayol-farm2_2019-05-22_18-44-06.wav,44100,16,60,1,ndsi,1024,1000,2000,2000,11000,0.948942647904275,NA 
rayol-farm2_2019-05-22_18-46-07.wav,44100,16,60,1,ndsi,1024,1000,2000,2000,11000,0.93891421367651,NA 
rayol-farm2_2019-05-22_18-48-07.wav,44100,16,60,1,ndsi,1024,1000,2000,2000,11000,0.950560169647796,NA 
rayol-farm2_2019-05-22_18-50-07.wav,44100,16,60,1,ndsi,1024,1000,2000,2000,11000,0.95105959924483,NA 
rayol-farm2_2019-05-22_18-52-07.wav,44100,16,60,1,ndsi,1024,1000,2000,2000,11000,0.947959953864737,NA 
rayol-farm2_2019-05-22_18-54-07.wav,44100,16,60,1,ndsi,1024,1000,2000,2000,11000,0.946391808786321,NA 
rayol-farm2_2019-05-22_18-56-07.wav,44100,16,60,1,ndsi,1024,1000,2000,2000,11000,0.949762960669156,NA 
rayol-farm2_2019-05-22_18-58-07.wav,44100,16,60,1,ndsi,1024,1000,2000,2000,11000,0.949989073142262,NA 
rayol-farm2_2019-05-22_19-00-07.wav,44100,16,60,1,ndsi,1024,1000,2000,2000,11000,0.939158386951431,NA 
rayol-farm2_2019-05-22_19-02-08.wav,44100,16,60,1,ndsi,1024,1000,2000,2000,11000,0.956618766698803,NA 
rayol-farm2_2019-05-22_19-04-08.wav,44100,16,60,1,ndsi,1024,1000,2000,2000,11000,0.947289316804444,NA 
rayol-farm2_2019-05-22_19-06-08.wav,44100,16,60,1,ndsi,1024,1000,2000,2000,11000,0.952957136315404,NA 
rayol-farm2_2019-05-22_19-08-08.wav,44100,16,60,1,ndsi,1024,1000,2000,2000,11000,0.959863370047127,NA 
rayol-farm2_2019-05-22_19-10-08.wav,44100,16,60,1,ndsi,1024,1000,2000,2000,11000,0.957097817274369,NA 
rayol-farm2_2019-05-22_19-12-08.wav,44100,16,60,1,ndsi,1024,1000,2000,2000,11000,0.9592681857541,NA 
rayol-farm2_2019-05-22_19-14-08.wav,44100,16,60,1,ndsi,1024,1000,2000,2000,11000,0.902059436922586,NA 
rayol-farm2_2019-05-22_19-16-08.wav,44100,16,60,1,ndsi,1024,1000,2000,2000,11000,0.930962599613414,NA 
rayol-farm2_2019-05-22_19-18-09.wav,44100,16,60,1,ndsi,1024,1000,2000,2000,11000,0.944781445772457,NA 
rayol-farm2_2019-05-22_19-20-09.wav,44100,16,60,1,ndsi,1024,1000,2000,2000,11000,0.805873523410334,NA 
rayol-farm2_2019-05-22_19-22-09.wav,44100,16,60,1,ndsi,1024,1000,2000,2000,11000,0.927055760803181,NA 
rayol-farm2_2019-05-22_19-24-09.wav,44100,16,60,1,ndsi,1024,1000,2000,2000,11000,0.945386050951751,NA 
rayol-farm2_2019-05-22_19-26-09.wav,44100,16,60,1,ndsi,1024,1000,2000,2000,11000,0.947095007063422,NA 
rayol-farm2_2019-05-22_19-28-09.wav,44100,16,60,1,ndsi,1024,1000,2000,2000,11000,0.948769782931684,NA 
rayol-farm2_2019-05-22_19-30-09.wav,44100,16,60,1,ndsi,1024,1000,2000,2000,11000,0.947980025442531,NA 
rayol-farm2_2019-05-22_19-32-09.wav,44100,16,60,1,ndsi,1024,1000,2000,2000,11000,0.944398276409527,NA 
rayol-farm2_2019-05-22_19-34-09.wav,44100,16,60,1,ndsi,1024,1000,2000,2000,11000,0.936751169361218,NA 
rayol-farm2_2019-05-22_19-36-10.wav,44100,16,60,1,ndsi,1024,1000,2000,2000,11000,0.941398713132681,NA 
rayol-farm2_2019-05-22_19-38-10.wav,44100,16,60,1,ndsi,1024,1000,2000,2000,11000,0.946226116084268,NA 
rayol-farm2_2019-05-22_19-40-10.wav,44100,16,60,1,ndsi,1024,1000,2000,2000,11000,0.947651823808378,NA 
rayol-farm2_2019-05-22_19-42-10.wav,44100,16,60,1,ndsi,1024,1000,2000,2000,11000,0.942806631785098,NA 
rayol-farm2_2019-05-22_19-44-10.wav,44100,16,60,1,ndsi,1024,1000,2000,2000,11000,0.948779728122575,NA 
rayol-farm2_2019-05-22_19-46-10.wav,44100,16,60,1,ndsi,1024,1000,2000,2000,11000,0.938456755793752,NA 
rayol-farm2_2019-05-22_19-48-10.wav,44100,16,60,1,ndsi,1024,1000,2000,2000,11000,0.948947075147698,NA 
rayol-farm2_2019-05-22_19-50-10.wav,44100,16,60,1,ndsi,1024,1000,2000,2000,11000,0.947377652875181,NA 
rayol-farm2_2019-05-22_19-52-11.wav,44100,16,60,1,ndsi,1024,1000,2000,2000,11000,0.948099470298882,NA 
rayol-farm2_2019-05-22_19-54-11.wav,44100,16,60,1,ndsi,1024,1000,2000,2000,11000,0.954727850300883,NA 
rayol-farm2_2019-05-22_19-56-11.wav,44100,16,60,1,ndsi,1024,1000,2000,2000,11000,0.946498879112802,NA 
rayol-farm2_2019-05-22_19-58-11.wav,44100,16,60,1,ndsi,1024,1000,2000,2000,11000,0.946723359713399,NA 
rayol-farm2_2019-05-22_20-00-11.wav,44100,16,60,1,ndsi,1024,1000,2000,2000,11000,0.938885909711988,NA 
rayol-farm2_2019-05-22_20-02-11.wav,44100,16,60,1,ndsi,1024,1000,2000,2000,11000,0.941033271412633,NA 
rayol-farm2_2019-05-22_20-04-11.wav,44100,16,60,1,ndsi,1024,1000,2000,2000,11000,0.924625489411101,NA 
rayol-farm2_2019-05-22_20-06-11.wav,44100,16,60,1,ndsi,1024,1000,2000,2000,11000,0.946315102648548,NA 
rayol-farm2_2019-05-22_20-08-12.wav,44100,16,60,1,ndsi,1024,1000,2000,2000,11000,0.949123975001939,NA 
rayol-farm2_2019-05-22_20-10-12.wav,44100,16,60,1,ndsi,1024,1000,2000,2000,11000,0.947850253350887,NA 
rayol-farm2_2019-05-22_20-12-12.wav,44100,16,60,1,ndsi,1024,1000,2000,2000,11000,0.945981841952594,NA 
rayol-farm2_2019-05-22_20-14-12.wav,44100,16,60,1,ndsi,1024,1000,2000,2000,11000,0.937806524600494,NA 
rayol-farm2_2019-05-22_20-16-12.wav,44100,16,60,1,ndsi,1024,1000,2000,2000,11000,0.903951456079101,NA 
rayol-farm2_2019-05-22_20-18-12.wav,44100,16,60,1,ndsi,1024,1000,2000,2000,11000,0.917657503850792,NA 
rayol-farm2_2019-05-22_20-20-12.wav,44100,16,60,1,ndsi,1024,1000,2000,2000,11000,0.947263659520157,NA 
rayol-farm2_2019-05-22_20-22-12.wav,44100,16,60,1,ndsi,1024,1000,2000,2000,11000,0.9409107590159,NA 
rayol-farm2_2019-05-22_20-24-13.wav,44100,16,60,1,ndsi,1024,1000,2000,2000,11000,0.941173511437032,NA 
rayol-farm2_2019-05-22_20-26-13.wav,44100,16,60,1,ndsi,1024,1000,2000,2000,11000,0.933980934797905,NA 
rayol-farm2_2019-05-22_20-28-13.wav,44100,16,60,1,ndsi,1024,1000,2000,2000,11000,0.946655435352029,NA 
rayol-farm2_2019-05-22_20-30-13.wav,44100,16,60,1,ndsi,1024,1000,2000,2000,11000,0.938343222635078,NA 
rayol-farm2_2019-05-22_20-32-13.wav,44100,16,60,1,ndsi,1024,1000,2000,2000,11000,0.924265987625045,NA 
rayol-farm2_2019-05-22_20-34-13.wav,44100,16,60,1,ndsi,1024,1000,2000,2000,11000,0.947780714293534,NA 
rayol-farm2_2019-05-22_20-36-13.wav,44100,16,60,1,ndsi,1024,1000,2000,2000,11000,0.93492181597713,NA 
rayol-farm2_2019-05-22_20-38-13.wav,44100,16,60,1,ndsi,1024,1000,2000,2000,11000,0.936951633758694,NA 
rayol-farm2_2019-05-22_20-40-13.wav,44100,16,60,1,ndsi,1024,1000,2000,2000,11000,0.93780040378598,NA 
rayol-farm2_2019-05-22_20-42-14.wav,44100,16,60,1,ndsi,1024,1000,2000,2000,11000,0.917389730281573,NA 
rayol-farm2_2019-05-22_20-44-14.wav,44100,16,60,1,ndsi,1024,1000,2000,2000,11000,0.927823717861356,NA 
rayol-farm2_2019-05-22_20-46-14.wav,44100,16,60,1,ndsi,1024,1000,2000,2000,11000,0.956444597244559,NA 
rayol-farm2_2019-05-22_20-48-14.wav,44100,16,60,1,ndsi,1024,1000,2000,2000,11000,0.934140097596065,NA 
rayol-farm2_2019-05-22_20-50-14.wav,44100,16,60,1,ndsi,1024,1000,2000,2000,11000,0.943215326786368,NA 
rayol-farm2_2019-05-22_20-52-14.wav,44100,16,60,1,ndsi,1024,1000,2000,2000,11000,0.945179491563145,NA 
rayol-farm2_2019-05-22_20-54-14.wav,44100,16,60,1,ndsi,1024,1000,2000,2000,11000,0.964788808675035,NA 
rayol-farm2_2019-05-22_20-56-14.wav,44100,16,60,1,ndsi,1024,1000,2000,2000,11000,0.962635036147615,NA 
rayol-farm2_2019-05-22_20-58-15.wav,44100,16,60,1,ndsi,1024,1000,2000,2000,11000,0.950720318734643,NA 
rayol-farm2_2019-05-22_21-00-15.wav,44100,16,60,1,ndsi,1024,1000,2000,2000,11000,0.942471167902387,NA 
rayol-farm2_2019-05-22_21-02-15.wav,44100,16,60,1,ndsi,1024,1000,2000,2000,11000,0.946134874425572,NA 
rayol-farm2_2019-05-22_21-04-15.wav,44100,16,60,1,ndsi,1024,1000,2000,2000,11000,0.944255244103904,NA 
rayol-farm2_2019-05-22_21-06-15.wav,44100,16,60,1,ndsi,1024,1000,2000,2000,11000,0.945222407824737,NA 
rayol-farm2_2019-05-22_21-08-15.wav,44100,16,60,1,ndsi,1024,1000,2000,2000,11000,0.939536446516831,NA 
rayol-farm2_2019-05-22_21-10-15.wav,44100,16,60,1,ndsi,1024,1000,2000,2000,11000,0.928426677695523,NA 
rayol-farm2_2019-05-22_21-12-15.wav,44100,16,60,1,ndsi,1024,1000,2000,2000,11000,0.945153274044157,NA 
rayol-farm2_2019-05-22_21-14-16.wav,44100,16,60,1,ndsi,1024,1000,2000,2000,11000,0.914496618037326,NA 
rayol-farm2_2019-05-22_21-16-16.wav,44100,16,60,1,ndsi,1024,1000,2000,2000,11000,0.93987892796849,NA 
rayol-farm2_2019-05-22_21-18-16.wav,44100,16,60,1,ndsi,1024,1000,2000,2000,11000,0.949350887800861,NA 
rayol-farm2_2019-05-22_21-20-16.wav,44100,16,60,1,ndsi,1024,1000,2000,2000,11000,0.945468756895244,NA 
rayol-farm2_2019-05-22_21-22-16.wav,44100,16,60,1,ndsi,1024,1000,2000,2000,11000,0.931468716692103,NA 
rayol-farm2_2019-05-22_21-24-16.wav,44100,16,60,1,ndsi,1024,1000,2000,2000,11000,0.93776765420394,NA 
rayol-farm2_2019-05-22_21-26-16.wav,44100,16,60,1,ndsi,1024,1000,2000,2000,11000,0.942960691465798,NA 
rayol-farm2_2019-05-22_21-28-16.wav,44100,16,60,1,ndsi,1024,1000,2000,2000,11000,0.946507234897362,NA 
rayol-farm2_2019-05-22_21-30-17.wav,44100,16,60,1,ndsi,1024,1000,2000,2000,11000,0.945265439930224,NA 
rayol-farm2_2019-05-22_21-32-17.wav,44100,16,60,1,ndsi,1024,1000,2000,2000,11000,0.946615622082169,NA 
rayol-farm2_2019-05-22_21-34-17.wav,44100,16,60,1,ndsi,1024,1000,2000,2000,11000,0.946983206541767,NA 
rayol-farm2_2019-05-22_21-36-17.wav,44100,16,60,1,ndsi,1024,1000,2000,2000,11000,0.947057583252502,NA 
rayol-farm2_2019-05-22_21-38-17.wav,44100,16,60,1,ndsi,1024,1000,2000,2000,11000,0.945842574882538,NA 
rayol-farm2_2019-05-22_21-40-17.wav,44100,16,60,1,ndsi,1024,1000,2000,2000,11000,0.946175946713895,NA 
rayol-farm2_2019-05-22_21-42-17.wav,44100,16,60,1,ndsi,1024,1000,2000,2000,11000,0.946422722506349,NA 
rayol-farm2_2019-05-22_21-44-17.wav,44100,16,60,1,ndsi,1024,1000,2000,2000,11000,0.943907393180674,NA 
rayol-farm2_2019-05-22_21-46-17.wav,44100,16,60,1,ndsi,1024,1000,2000,2000,11000,0.94516547687121,NA 
rayol-farm2_2019-05-22_21-48-18.wav,44100,16,60,1,ndsi,1024,1000,2000,2000,11000,0.94530798605648,NA 
rayol-farm2_2019-05-22_21-50-18.wav,44100,16,60,1,ndsi,1024,1000,2000,2000,11000,0.945318190745831,NA 
rayol-farm2_2019-05-22_21-52-18.wav,44100,16,60,1,ndsi,1024,1000,2000,2000,11000,0.945900029729543,NA 
rayol-farm2_2019-05-22_21-54-18.wav,44100,16,60,1,ndsi,1024,1000,2000,2000,11000,0.945794562340424,NA 
rayol-farm2_2019-05-22_21-56-18.wav,44100,16,60,1,ndsi,1024,1000,2000,2000,11000,0.944821804030282,NA 
rayol-farm2_2019-05-22_21-58-18.wav,44100,16,60,1,ndsi,1024,1000,2000,2000,11000,0.944549949141823,NA 
rayol-farm2_2019-05-22_22-00-18.wav,44100,16,60,1,ndsi,1024,1000,2000,2000,11000,0.945130924976057,NA 
rayol-farm2_2019-05-22_22-02-18.wav,44100,16,60,1,ndsi,1024,1000,2000,2000,11000,0.94548608996393,NA 
rayol-farm2_2019-05-22_22-04-19.wav,44100,16,60,1,ndsi,1024,1000,2000,2000,11000,0.944677651018289,NA 
rayol-farm2_2019-05-22_22-06-19.wav,44100,16,60,1,ndsi,1024,1000,2000,2000,11000,0.944171494714559,NA 
rayol-farm2_2019-05-22_22-08-19.wav,44100,16,60,1,ndsi,1024,1000,2000,2000,11000,0.945705095605096,NA 
rayol-farm2_2019-05-22_22-10-19.wav,44100,16,60,1,ndsi,1024,1000,2000,2000,11000,0.945026279181279,NA 
rayol-farm2_2019-05-22_22-12-19.wav,44100,16,60,1,ndsi,1024,1000,2000,2000,11000,0.944486672595966,NA 
rayol-farm2_2019-05-22_22-14-19.wav,44100,16,60,1,ndsi,1024,1000,2000,2000,11000,0.944786451082548,NA 
rayol-farm2_2019-05-22_22-16-19.wav,44100,16,60,1,ndsi,1024,1000,2000,2000,11000,0.943937461208756,NA 
rayol-farm2_2019-05-22_22-18-19.wav,44100,16,60,1,ndsi,1024,1000,2000,2000,11000,0.943952025901957,NA 
rayol-farm2_2019-05-22_22-20-20.wav,44100,16,60,1,ndsi,1024,1000,2000,2000,11000,0.944854927279092,NA 
rayol-farm2_2019-05-22_22-22-20.wav,44100,16,60,1,ndsi,1024,1000,2000,2000,11000,0.945149589365301,NA 
rayol-farm2_2019-05-22_22-24-20.wav,44100,16,60,1,ndsi,1024,1000,2000,2000,11000,0.943809972583684,NA 
rayol-farm2_2019-05-22_22-26-20.wav,44100,16,60,1,ndsi,1024,1000,2000,2000,11000,0.944477858981281,NA 
rayol-farm2_2019-05-22_22-28-20.wav,44100,16,60,1,ndsi,1024,1000,2000,2000,11000,0.944202978856206,NA 
rayol-farm2_2019-05-22_22-30-20.wav,44100,16,60,1,ndsi,1024,1000,2000,2000,11000,0.94482095240047,NA 
rayol-farm2_2019-05-22_22-32-20.wav,44100,16,60,1,ndsi,1024,1000,2000,2000,11000,0.945055778524063,NA 
rayol-farm2_2019-05-22_22-34-20.wav,44100,16,60,1,ndsi,1024,1000,2000,2000,11000,0.943289942212036,NA 
rayol-farm2_2019-05-22_22-36-21.wav,44100,16,60,1,ndsi,1024,1000,2000,2000,11000,0.944176617658681,NA 
rayol-farm2_2019-05-22_22-38-21.wav,44100,16,60,1,ndsi,1024,1000,2000,2000,11000,0.943910008134396,NA 
rayol-farm2_2019-05-22_22-40-21.wav,44100,16,60,1,ndsi,1024,1000,2000,2000,11000,0.944274156853645,NA 
rayol-farm2_2019-05-22_22-42-21.wav,44100,16,60,1,ndsi,1024,1000,2000,2000,11000,0.944291342679419,NA 
rayol-farm2_2019-05-22_22-44-21.wav,44100,16,60,1,ndsi,1024,1000,2000,2000,11000,0.944111163946203,NA 
rayol-farm2_2019-05-22_22-46-21.wav,44100,16,60,1,ndsi,1024,1000,2000,2000,11000,0.943198257132615,NA 
rayol-farm2_2019-05-22_22-48-21.wav,44100,16,60,1,ndsi,1024,1000,2000,2000,11000,0.944441757474366,NA 
rayol-farm2_2019-05-22_22-50-21.wav,44100,16,60,1,ndsi,1024,1000,2000,2000,11000,0.943047019135295,NA 
rayol-farm2_2019-05-22_22-52-22.wav,44100,16,60,1,ndsi,1024,1000,2000,2000,11000,0.943738816260535,NA 
rayol-farm2_2019-05-22_22-54-22.wav,44100,16,60,1,ndsi,1024,1000,2000,2000,11000,0.943614915274579,NA 
rayol-farm2_2019-05-22_22-56-22.wav,44100,16,60,1,ndsi,1024,1000,2000,2000,11000,0.942844492643503,NA 
rayol-farm2_2019-05-22_22-58-22.wav,44100,16,60,1,ndsi,1024,1000,2000,2000,11000,0.943693901110389,NA 
rayol-farm2_2019-05-22_23-00-22.wav,44100,16,60,1,ndsi,1024,1000,2000,2000,11000,0.943856763326556,NA 
rayol-farm2_2019-05-22_23-02-22.wav,44100,16,60,1,ndsi,1024,1000,2000,2000,11000,0.926672950890112,NA 
rayol-farm2_2019-05-22_23-04-22.wav,44100,16,60,1,ndsi,1024,1000,2000,2000,11000,0.941922112053282,NA 
rayol-farm2_2019-05-22_23-06-22.wav,44100,16,60,1,ndsi,1024,1000,2000,2000,11000,0.941762084946213,NA 
rayol-farm2_2019-05-22_23-08-22.wav,44100,16,60,1,ndsi,1024,1000,2000,2000,11000,0.924719276698409,NA 
rayol-farm2_2019-05-22_23-10-23.wav,44100,16,60,1,ndsi,1024,1000,2000,2000,11000,0.938438905777233,NA 
rayol-farm2_2019-05-22_23-12-23.wav,44100,16,60,1,ndsi,1024,1000,2000,2000,11000,0.941496107248468,NA 
rayol-farm2_2019-05-22_23-14-23.wav,44100,16,60,1,ndsi,1024,1000,2000,2000,11000,0.942309865831089,NA 
rayol-farm2_2019-05-22_23-16-23.wav,44100,16,60,1,ndsi,1024,1000,2000,2000,11000,0.938449914079426,NA 
rayol-farm2_2019-05-22_23-18-23.wav,44100,16,60,1,ndsi,1024,1000,2000,2000,11000,0.943887573172182,NA 
rayol-farm2_2019-05-22_23-20-23.wav,44100,16,60,1,ndsi,1024,1000,2000,2000,11000,0.942725413701598,NA 
rayol-farm2_2019-05-22_23-22-23.wav,44100,16,60,1,ndsi,1024,1000,2000,2000,11000,0.942744072970445,NA 
rayol-farm2_2019-05-22_23-24-23.wav,44100,16,60,1,ndsi,1024,1000,2000,2000,11000,0.943829391249259,NA 
rayol-farm2_2019-05-22_23-26-24.wav,44100,16,60,1,ndsi,1024,1000,2000,2000,11000,0.942237751639814,NA 
rayol-farm2_2019-05-22_23-28-24.wav,44100,16,60,1,ndsi,1024,1000,2000,2000,11000,0.827819120149453,NA 
rayol-farm2_2019-05-22_23-30-24.wav,44100,16,60,1,ndsi,1024,1000,2000,2000,11000,0.680151961476694,NA 
rayol-farm2_2019-05-22_23-32-24.wav,44100,16,60,1,ndsi,1024,1000,2000,2000,11000,0.943757117046833,NA 
rayol-farm2_2019-05-22_23-34-24.wav,44100,16,60,1,ndsi,1024,1000,2000,2000,11000,0.943394845085383,NA 
rayol-farm2_2019-05-22_23-36-24.wav,44100,16,60,1,ndsi,1024,1000,2000,2000,11000,0.944113262794216,NA 
rayol-farm2_2019-05-22_23-38-24.wav,44100,16,60,1,ndsi,1024,1000,2000,2000,11000,0.942935877398581,NA 
rayol-farm2_2019-05-22_23-40-24.wav,44100,16,60,1,ndsi,1024,1000,2000,2000,11000,0.943227904981482,NA 
rayol-farm2_2019-05-22_23-42-25.wav,44100,16,60,1,ndsi,1024,1000,2000,2000,11000,0.941729989865084,NA 
rayol-farm2_2019-05-22_23-44-25.wav,44100,16,60,1,ndsi,1024,1000,2000,2000,11000,0.937514210505386,NA 
rayol-farm2_2019-05-22_23-46-25.wav,44100,16,60,1,ndsi,1024,1000,2000,2000,11000,0.940585978811171,NA 
rayol-farm2_2019-05-22_23-48-25.wav,44100,16,60,1,ndsi,1024,1000,2000,2000,11000,0.942573873866123,NA 
rayol-farm2_2019-05-22_23-50-25.wav,44100,16,60,1,ndsi,1024,1000,2000,2000,11000,0.935295197245342,NA 
rayol-farm2_2019-05-22_23-52-25.wav,44100,16,60,1,ndsi,1024,1000,2000,2000,11000,0.941673756919634,NA 
rayol-farm2_2019-05-22_23-54-25.wav,44100,16,60,1,ndsi,1024,1000,2000,2000,11000,0.942034012582603,NA 
rayol-farm2_2019-05-22_23-56-25.wav,44100,16,60,1,ndsi,1024,1000,2000,2000,11000,0.943518699304716,NA 
rayol-farm2_2019-05-22_23-58-26.wav,44100,16,60,1,ndsi,1024,1000,2000,2000,11000,0.942218099776775,NA
