FILENAME,SAMPLINGRATE,BIT,DURATION,CHANNELS,INDEX,WL,ENVT,MSMOOTH,KSMOOTH,LEFT_CHANNEL,RIGHT_CHANNEL
rayol-farm2_2019-03-29_00-01-21.wav,44100,16,60,1,H,512,hil,NULL,NULL,0.895934099819305,NA 
rayol-farm2_2019-03-29_00-03-21.wav,44100,16,60,1,H,512,hil,NULL,NULL,0.897196477261317,NA 
rayol-farm2_2019-03-29_00-05-21.wav,44100,16,60,1,H,512,hil,NULL,NULL,0.896994307706919,NA 
rayol-farm2_2019-03-29_00-07-21.wav,44100,16,60,1,H,512,hil,NULL,NULL,0.892430614864671,NA 
rayol-farm2_2019-03-29_00-09-21.wav,44100,16,60,1,H,512,hil,NULL,NULL,0.892552834268267,NA 
rayol-farm2_2019-03-29_00-11-21.wav,44100,16,60,1,H,512,hil,NULL,NULL,0.898453224191308,NA 
rayol-farm2_2019-03-29_00-13-22.wav,44100,16,60,1,H,512,hil,NULL,NULL,0.89099547549055,NA 
rayol-farm2_2019-03-29_00-15-22.wav,44100,16,60,1,H,512,hil,NULL,NULL,0.897790653739246,NA 
rayol-farm2_2019-03-29_00-17-22.wav,44100,16,60,1,H,512,hil,NULL,NULL,0.896658320888979,NA 
rayol-farm2_2019-03-29_00-19-22.wav,44100,16,60,1,H,512,hil,NULL,NULL,0.896106367206983,NA 
rayol-farm2_2019-03-29_00-21-22.wav,44100,16,60,1,H,512,hil,NULL,NULL,0.896460524160269,NA 
rayol-farm2_2019-03-29_00-23-22.wav,44100,16,60,1,H,512,hil,NULL,NULL,0.897040790571755,NA 
rayol-farm2_2019-03-29_00-25-22.wav,44100,16,60,1,H,512,hil,NULL,NULL,0.897337536229351,NA 
rayol-farm2_2019-03-29_00-27-22.wav,44100,16,60,1,H,512,hil,NULL,NULL,0.892538032489545,NA 
rayol-farm2_2019-03-29_00-29-23.wav,44100,16,60,1,H,512,hil,NULL,NULL,0.882101195235999,NA 
rayol-farm2_2019-03-29_00-31-23.wav,44100,16,60,1,H,512,hil,NULL,NULL,0.898118113719405,NA 
rayol-farm2_2019-03-29_00-33-23.wav,44100,16,60,1,H,512,hil,NULL,NULL,0.898093529877728,NA 
rayol-farm2_2019-03-29_00-35-23.wav,44100,16,60,1,H,512,hil,NULL,NULL,0.898350190512971,NA 
rayol-farm2_2019-03-29_00-37-23.wav,44100,16,60,1,H,512,hil,NULL,NULL,0.898142619148801,NA 
rayol-farm2_2019-03-29_00-39-23.wav,44100,16,60,1,H,512,hil,NULL,NULL,0.898529304653189,NA 
rayol-farm2_2019-03-29_00-41-23.wav,44100,16,60,1,H,512,hil,NULL,NULL,0.89797584091652,NA 
rayol-farm2_2019-03-29_00-43-23.wav,44100,16,60,1,H,512,hil,NULL,NULL,0.897170332641814,NA 
rayol-farm2_2019-03-29_00-45-24.wav,44100,16,60,1,H,512,hil,NULL,NULL,0.898139392546859,NA 
rayol-farm2_2019-03-29_00-47-24.wav,44100,16,60,1,H,512,hil,NULL,NULL,0.892823534764212,NA 
rayol-farm2_2019-03-29_00-49-24.wav,44100,16,60,1,H,512,hil,NULL,NULL,0.892539760335704,NA 
rayol-farm2_2019-03-29_00-51-24.wav,44100,16,60,1,H,512,hil,NULL,NULL,0.897041017265286,NA 
rayol-farm2_2019-03-29_00-53-24.wav,44100,16,60,1,H,512,hil,NULL,NULL,0.896982822074975,NA 
rayol-farm2_2019-03-29_00-55-24.wav,44100,16,60,1,H,512,hil,NULL,NULL,0.898486220738887,NA 
rayol-farm2_2019-03-29_00-57-24.wav,44100,16,60,1,H,512,hil,NULL,NULL,0.898047606134692,NA 
rayol-farm2_2019-03-29_00-59-24.wav,44100,16,60,1,H,512,hil,NULL,NULL,0.898386543069939,NA 
rayol-farm2_2019-03-29_01-01-24.wav,44100,16,60,1,H,512,hil,NULL,NULL,0.897648161499928,NA 
rayol-farm2_2019-03-29_01-03-25.wav,44100,16,60,1,H,512,hil,NULL,NULL,0.898201746283147,NA 
rayol-farm2_2019-03-29_01-05-25.wav,44100,16,60,1,H,512,hil,NULL,NULL,0.890854795392848,NA 
rayol-farm2_2019-03-29_01-07-25.wav,44100,16,60,1,H,512,hil,NULL,NULL,0.893098006802082,NA 
rayol-farm2_2019-03-29_01-09-25.wav,44100,16,60,1,H,512,hil,NULL,NULL,0.894065280211897,NA 
rayol-farm2_2019-03-29_01-11-25.wav,44100,16,60,1,H,512,hil,NULL,NULL,0.898010265774824,NA 
rayol-farm2_2019-03-29_01-13-25.wav,44100,16,60,1,H,512,hil,NULL,NULL,0.897620545259359,NA 
rayol-farm2_2019-03-29_01-15-25.wav,44100,16,60,1,H,512,hil,NULL,NULL,0.896708224862947,NA 
rayol-farm2_2019-03-29_01-17-25.wav,44100,16,60,1,H,512,hil,NULL,NULL,0.897800969547718,NA 
rayol-farm2_2019-03-29_01-19-26.wav,44100,16,60,1,H,512,hil,NULL,NULL,0.897062996586115,NA 
rayol-farm2_2019-03-29_01-21-26.wav,44100,16,60,1,H,512,hil,NULL,NULL,0.889663187959086,NA 
rayol-farm2_2019-03-29_01-23-26.wav,44100,16,60,1,H,512,hil,NULL,NULL,0.895368608608395,NA 
rayol-farm2_2019-03-29_01-25-26.wav,44100,16,60,1,H,512,hil,NULL,NULL,0.894867432491201,NA 
rayol-farm2_2019-03-29_01-27-26.wav,44100,16,60,1,H,512,hil,NULL,NULL,0.892491265802024,NA 
rayol-farm2_2019-03-29_01-29-26.wav,44100,16,60,1,H,512,hil,NULL,NULL,0.893241551589092,NA 
rayol-farm2_2019-03-29_01-31-26.wav,44100,16,60,1,H,512,hil,NULL,NULL,0.898555980902732,NA 
rayol-farm2_2019-03-29_01-33-26.wav,44100,16,60,1,H,512,hil,NULL,NULL,0.897975286533698,NA 
rayol-farm2_2019-03-29_01-35-27.wav,44100,16,60,1,H,512,hil,NULL,NULL,0.898222673715978,NA 
rayol-farm2_2019-03-29_01-37-27.wav,44100,16,60,1,H,512,hil,NULL,NULL,0.897682776569551,NA 
rayol-farm2_2019-03-29_01-39-27.wav,44100,16,60,1,H,512,hil,NULL,NULL,0.897806662257124,NA 
rayol-farm2_2019-03-29_01-41-27.wav,44100,16,60,1,H,512,hil,NULL,NULL,0.897662280989929,NA 
rayol-farm2_2019-03-29_01-43-27.wav,44100,16,60,1,H,512,hil,NULL,NULL,0.897409796126124,NA 
rayol-farm2_2019-03-29_01-45-27.wav,44100,16,60,1,H,512,hil,NULL,NULL,0.896783895125008,NA 
rayol-farm2_2019-03-29_01-47-27.wav,44100,16,60,1,H,512,hil,NULL,NULL,0.893538793056589,NA 
rayol-farm2_2019-03-29_01-49-27.wav,44100,16,60,1,H,512,hil,NULL,NULL,0.894094090019275,NA 
rayol-farm2_2019-03-29_01-51-27.wav,44100,16,60,1,H,512,hil,NULL,NULL,0.896425019045433,NA 
rayol-farm2_2019-03-29_01-53-28.wav,44100,16,60,1,H,512,hil,NULL,NULL,0.896294941632255,NA 
rayol-farm2_2019-03-29_01-55-28.wav,44100,16,60,1,H,512,hil,NULL,NULL,0.897413240933257,NA 
rayol-farm2_2019-03-29_01-57-28.wav,44100,16,60,1,H,512,hil,NULL,NULL,0.897187355373783,NA 
rayol-farm2_2019-03-29_01-59-28.wav,44100,16,60,1,H,512,hil,NULL,NULL,0.898770240286528,NA 
rayol-farm2_2019-03-29_02-01-28.wav,44100,16,60,1,H,512,hil,NULL,NULL,0.898882307821051,NA 
rayol-farm2_2019-03-29_02-03-28.wav,44100,16,60,1,H,512,hil,NULL,NULL,0.898185299826511,NA 
rayol-farm2_2019-03-29_02-05-28.wav,44100,16,60,1,H,512,hil,NULL,NULL,0.89758996070975,NA 
rayol-farm2_2019-03-29_02-07-28.wav,44100,16,60,1,H,512,hil,NULL,NULL,0.893568924403468,NA 
rayol-farm2_2019-03-29_02-09-29.wav,44100,16,60,1,H,512,hil,NULL,NULL,0.89413816749187,NA 
rayol-farm2_2019-03-29_02-11-29.wav,44100,16,60,1,H,512,hil,NULL,NULL,0.897384809363917,NA 
rayol-farm2_2019-03-29_02-13-29.wav,44100,16,60,1,H,512,hil,NULL,NULL,0.896941830957433,NA 
rayol-farm2_2019-03-29_02-15-29.wav,44100,16,60,1,H,512,hil,NULL,NULL,0.897133265757874,NA 
rayol-farm2_2019-03-29_02-17-29.wav,44100,16,60,1,H,512,hil,NULL,NULL,0.897579571814867,NA 
rayol-farm2_2019-03-29_02-19-29.wav,44100,16,60,1,H,512,hil,NULL,NULL,0.896663836920533,NA 
rayol-farm2_2019-03-29_02-21-29.wav,44100,16,60,1,H,512,hil,NULL,NULL,0.896888465627493,NA 
rayol-farm2_2019-03-29_02-23-29.wav,44100,16,60,1,H,512,hil,NULL,NULL,0.894750590308983,NA 
rayol-farm2_2019-03-29_02-25-30.wav,44100,16,60,1,H,512,hil,NULL,NULL,0.895343947565736,NA 
rayol-farm2_2019-03-29_02-27-30.wav,44100,16,60,1,H,512,hil,NULL,NULL,0.891363338755075,NA 
rayol-farm2_2019-03-29_02-29-30.wav,44100,16,60,1,H,512,hil,NULL,NULL,0.891368493554228,NA 
rayol-farm2_2019-03-29_02-31-30.wav,44100,16,60,1,H,512,hil,NULL,NULL,0.897118884391065,NA 
rayol-farm2_2019-03-29_02-33-30.wav,44100,16,60,1,H,512,hil,NULL,NULL,0.891300789895923,NA 
rayol-farm2_2019-03-29_02-35-30.wav,44100,16,60,1,H,512,hil,NULL,NULL,0.876687606779573,NA 
rayol-farm2_2019-03-29_02-37-30.wav,44100,16,60,1,H,512,hil,NULL,NULL,0.895333395391257,NA 
rayol-farm2_2019-03-29_02-39-30.wav,44100,16,60,1,H,512,hil,NULL,NULL,0.897120679855889,NA 
rayol-farm2_2019-03-29_02-41-31.wav,44100,16,60,1,H,512,hil,NULL,NULL,0.896395806345298,NA 
rayol-farm2_2019-03-29_02-43-31.wav,44100,16,60,1,H,512,hil,NULL,NULL,0.896336841322806,NA 
rayol-farm2_2019-03-29_02-45-31.wav,44100,16,60,1,H,512,hil,NULL,NULL,0.896978277466895,NA 
rayol-farm2_2019-03-29_02-47-31.wav,44100,16,60,1,H,512,hil,NULL,NULL,0.894241355435738,NA 
rayol-farm2_2019-03-29_02-49-31.wav,44100,16,60,1,H,512,hil,NULL,NULL,0.893067370186082,NA 
rayol-farm2_2019-03-29_02-51-31.wav,44100,16,60,1,H,512,hil,NULL,NULL,0.891846575518694,NA 
rayol-farm2_2019-03-29_02-53-31.wav,44100,16,60,1,H,512,hil,NULL,NULL,0.896303807488577,NA 
rayol-farm2_2019-03-29_02-55-31.wav,44100,16,60,1,H,512,hil,NULL,NULL,0.896287720629721,NA 
rayol-farm2_2019-03-29_02-57-31.wav,44100,16,60,1,H,512,hil,NULL,NULL,0.897216867938728,NA 
rayol-farm2_2019-03-29_02-59-32.wav,44100,16,60,1,H,512,hil,NULL,NULL,0.896002965887065,NA 
rayol-farm2_2019-03-29_03-01-32.wav,44100,16,60,1,H,512,hil,NULL,NULL,0.896763308843972,NA 
rayol-farm2_2019-03-29_03-03-32.wav,44100,16,60,1,H,512,hil,NULL,NULL,0.896946541189832,NA 
rayol-farm2_2019-03-29_03-05-32.wav,44100,16,60,1,H,512,hil,NULL,NULL,0.896976675934399,NA 
rayol-farm2_2019-03-29_03-07-32.wav,44100,16,60,1,H,512,hil,NULL,NULL,0.897258813018309,NA 
rayol-farm2_2019-03-29_03-09-32.wav,44100,16,60,1,H,512,hil,NULL,NULL,0.891988832313863,NA 
rayol-farm2_2019-03-29_03-11-32.wav,44100,16,60,1,H,512,hil,NULL,NULL,0.893359919252159,NA 
rayol-farm2_2019-03-29_03-13-32.wav,44100,16,60,1,H,512,hil,NULL,NULL,0.896774532109887,NA 
rayol-farm2_2019-03-29_03-15-33.wav,44100,16,60,1,H,512,hil,NULL,NULL,0.897013718202808,NA 
rayol-farm2_2019-03-29_03-17-33.wav,44100,16,60,1,H,512,hil,NULL,NULL,0.896716348088759,NA 
rayol-farm2_2019-03-29_03-19-33.wav,44100,16,60,1,H,512,hil,NULL,NULL,0.89617128179135,NA 
rayol-farm2_2019-03-29_03-21-33.wav,44100,16,60,1,H,512,hil,NULL,NULL,0.897611802939083,NA 
rayol-farm2_2019-03-29_03-23-33.wav,44100,16,60,1,H,512,hil,NULL,NULL,0.897607457634661,NA 
rayol-farm2_2019-03-29_03-25-33.wav,44100,16,60,1,H,512,hil,NULL,NULL,0.896599475885102,NA 
rayol-farm2_2019-03-29_03-27-33.wav,44100,16,60,1,H,512,hil,NULL,NULL,0.895820931036344,NA 
rayol-farm2_2019-03-29_03-29-33.wav,44100,16,60,1,H,512,hil,NULL,NULL,0.888493640476091,NA 
rayol-farm2_2019-03-29_03-31-34.wav,44100,16,60,1,H,512,hil,NULL,NULL,0.888735284913178,NA 
rayol-farm2_2019-03-29_03-33-34.wav,44100,16,60,1,H,512,hil,NULL,NULL,0.894778800556566,NA 
rayol-farm2_2019-03-29_03-35-34.wav,44100,16,60,1,H,512,hil,NULL,NULL,0.89669027759483,NA 
rayol-farm2_2019-03-29_03-37-34.wav,44100,16,60,1,H,512,hil,NULL,NULL,0.896861877900393,NA 
rayol-farm2_2019-03-29_03-39-34.wav,44100,16,60,1,H,512,hil,NULL,NULL,0.895741284343369,NA 
rayol-farm2_2019-03-29_03-41-34.wav,44100,16,60,1,H,512,hil,NULL,NULL,0.896511951892323,NA 
rayol-farm2_2019-03-29_03-43-34.wav,44100,16,60,1,H,512,hil,NULL,NULL,0.89630088942128,NA 
rayol-farm2_2019-03-29_03-45-34.wav,44100,16,60,1,H,512,hil,NULL,NULL,0.892402830047933,NA 
rayol-farm2_2019-03-29_03-47-35.wav,44100,16,60,1,H,512,hil,NULL,NULL,0.894080479553355,NA 
rayol-farm2_2019-03-29_03-49-35.wav,44100,16,60,1,H,512,hil,NULL,NULL,0.89748193125208,NA 
rayol-farm2_2019-03-29_03-51-35.wav,44100,16,60,1,H,512,hil,NULL,NULL,0.891899276399013,NA 
rayol-farm2_2019-03-29_03-53-35.wav,44100,16,60,1,H,512,hil,NULL,NULL,0.892873665712043,NA 
rayol-farm2_2019-03-29_03-55-35.wav,44100,16,60,1,H,512,hil,NULL,NULL,0.895873426727719,NA 
rayol-farm2_2019-03-29_03-57-35.wav,44100,16,60,1,H,512,hil,NULL,NULL,0.895097917567224,NA 
rayol-farm2_2019-03-29_03-59-35.wav,44100,16,60,1,H,512,hil,NULL,NULL,0.894803214047833,NA 
rayol-farm2_2019-03-29_04-01-35.wav,44100,16,60,1,H,512,hil,NULL,NULL,0.89410161471282,NA 
rayol-farm2_2019-03-29_04-03-35.wav,44100,16,60,1,H,512,hil,NULL,NULL,0.895684846767217,NA 
rayol-farm2_2019-03-29_04-05-36.wav,44100,16,60,1,H,512,hil,NULL,NULL,0.89624218568934,NA 
rayol-farm2_2019-03-29_04-07-36.wav,44100,16,60,1,H,512,hil,NULL,NULL,0.896187393610524,NA 
rayol-farm2_2019-03-29_04-09-36.wav,44100,16,60,1,H,512,hil,NULL,NULL,0.895819738967858,NA 
rayol-farm2_2019-03-29_04-11-36.wav,44100,16,60,1,H,512,hil,NULL,NULL,0.896827199038771,NA 
rayol-farm2_2019-03-29_04-13-36.wav,44100,16,60,1,H,512,hil,NULL,NULL,0.891203125931159,NA 
rayol-farm2_2019-03-29_04-15-36.wav,44100,16,60,1,H,512,hil,NULL,NULL,0.89324295022542,NA 
rayol-farm2_2019-03-29_04-17-36.wav,44100,16,60,1,H,512,hil,NULL,NULL,0.897351898561292,NA 
rayol-farm2_2019-03-29_04-19-36.wav,44100,16,60,1,H,512,hil,NULL,NULL,0.897967629747868,NA 
rayol-farm2_2019-03-29_04-21-37.wav,44100,16,60,1,H,512,hil,NULL,NULL,0.896989368713353,NA 
rayol-farm2_2019-03-29_04-23-37.wav,44100,16,60,1,H,512,hil,NULL,NULL,0.897214464687024,NA 
rayol-farm2_2019-03-29_04-25-37.wav,44100,16,60,1,H,512,hil,NULL,NULL,0.897560375790569,NA 
rayol-farm2_2019-03-29_04-27-37.wav,44100,16,60,1,H,512,hil,NULL,NULL,0.897266646162827,NA 
rayol-farm2_2019-03-29_04-29-37.wav,44100,16,60,1,H,512,hil,NULL,NULL,0.896197879159541,NA 
rayol-farm2_2019-03-29_04-31-37.wav,44100,16,60,1,H,512,hil,NULL,NULL,0.887062208423492,NA 
rayol-farm2_2019-03-29_04-33-37.wav,44100,16,60,1,H,512,hil,NULL,NULL,0.893360951551259,NA 
rayol-farm2_2019-03-29_04-35-37.wav,44100,16,60,1,H,512,hil,NULL,NULL,0.892399802014484,NA 
rayol-farm2_2019-03-29_04-37-38.wav,44100,16,60,1,H,512,hil,NULL,NULL,0.895216772122691,NA 
rayol-farm2_2019-03-29_04-39-38.wav,44100,16,60,1,H,512,hil,NULL,NULL,0.897929407335479,NA 
rayol-farm2_2019-03-29_04-41-38.wav,44100,16,60,1,H,512,hil,NULL,NULL,0.897409982128005,NA 
rayol-farm2_2019-03-29_04-43-38.wav,44100,16,60,1,H,512,hil,NULL,NULL,0.896946849715973,NA 
rayol-farm2_2019-03-29_04-45-38.wav,44100,16,60,1,H,512,hil,NULL,NULL,0.760800961649896,NA 
rayol-farm2_2019-03-29_04-47-38.wav,44100,16,60,1,H,512,hil,NULL,NULL,0.895810218573974,NA 
rayol-farm2_2019-03-29_04-49-38.wav,44100,16,60,1,H,512,hil,NULL,NULL,0.895197242576025,NA 
rayol-farm2_2019-03-29_04-51-38.wav,44100,16,60,1,H,512,hil,NULL,NULL,0.89127512281944,NA 
rayol-farm2_2019-03-29_04-53-38.wav,44100,16,60,1,H,512,hil,NULL,NULL,0.867458923160425,NA 
rayol-farm2_2019-03-29_04-55-39.wav,44100,16,60,1,H,512,hil,NULL,NULL,0.893506681534064,NA 
rayol-farm2_2019-03-29_04-57-39.wav,44100,16,60,1,H,512,hil,NULL,NULL,0.893365493142341,NA 
rayol-farm2_2019-03-29_04-59-39.wav,44100,16,60,1,H,512,hil,NULL,NULL,0.846906316721523,NA 
rayol-farm2_2019-03-29_05-01-39.wav,44100,16,60,1,H,512,hil,NULL,NULL,0.89175309719912,NA 
rayol-farm2_2019-03-29_05-03-39.wav,44100,16,60,1,H,512,hil,NULL,NULL,0.897399364128915,NA 
rayol-farm2_2019-03-29_05-05-39.wav,44100,16,60,1,H,512,hil,NULL,NULL,0.896462388872476,NA 
rayol-farm2_2019-03-29_05-07-39.wav,44100,16,60,1,H,512,hil,NULL,NULL,0.889499050346511,NA 
rayol-farm2_2019-03-29_05-09-39.wav,44100,16,60,1,H,512,hil,NULL,NULL,0.896775369024596,NA 
rayol-farm2_2019-03-29_05-11-40.wav,44100,16,60,1,H,512,hil,NULL,NULL,0.896954137608085,NA 
rayol-farm2_2019-03-29_05-13-40.wav,44100,16,60,1,H,512,hil,NULL,NULL,0.897290277170568,NA 
rayol-farm2_2019-03-29_05-15-40.wav,44100,16,60,1,H,512,hil,NULL,NULL,0.896664985659509,NA 
rayol-farm2_2019-03-29_05-17-40.wav,44100,16,60,1,H,512,hil,NULL,NULL,0.891614157102323,NA 
rayol-farm2_2019-03-29_05-19-40.wav,44100,16,60,1,H,512,hil,NULL,NULL,0.893724254605552,NA 
rayol-farm2_2019-03-29_05-21-40.wav,44100,16,60,1,H,512,hil,NULL,NULL,0.89681852840081,NA 
rayol-farm2_2019-03-29_05-23-40.wav,44100,16,60,1,H,512,hil,NULL,NULL,0.896673169939799,NA 
rayol-farm2_2019-03-29_05-25-40.wav,44100,16,60,1,H,512,hil,NULL,NULL,0.894991694504215,NA 
rayol-farm2_2019-03-29_05-27-41.wav,44100,16,60,1,H,512,hil,NULL,NULL,0.896603184624745,NA 
rayol-farm2_2019-03-29_05-29-41.wav,44100,16,60,1,H,512,hil,NULL,NULL,0.896950681164234,NA 
rayol-farm2_2019-03-29_05-31-41.wav,44100,16,60,1,H,512,hil,NULL,NULL,0.886943215660278,NA 
rayol-farm2_2019-03-29_05-33-41.wav,44100,16,60,1,H,512,hil,NULL,NULL,0.89541532084731,NA 
rayol-farm2_2019-03-29_05-35-41.wav,44100,16,60,1,H,512,hil,NULL,NULL,0.896708092397999,NA 
rayol-farm2_2019-03-29_05-37-41.wav,44100,16,60,1,H,512,hil,NULL,NULL,0.893568131508217,NA 
rayol-farm2_2019-03-29_05-39-41.wav,44100,16,60,1,H,512,hil,NULL,NULL,0.896665632295542,NA 
rayol-farm2_2019-03-29_05-41-41.wav,44100,16,60,1,H,512,hil,NULL,NULL,0.903157971543801,NA 
rayol-farm2_2019-03-29_05-43-42.wav,44100,16,60,1,H,512,hil,NULL,NULL,0.902877188468301,NA 
rayol-farm2_2019-03-29_05-45-42.wav,44100,16,60,1,H,512,hil,NULL,NULL,0.904247186351674,NA 
rayol-farm2_2019-03-29_05-47-42.wav,44100,16,60,1,H,512,hil,NULL,NULL,0.902809429701528,NA 
rayol-farm2_2019-03-29_05-49-42.wav,44100,16,60,1,H,512,hil,NULL,NULL,0.900541308452275,NA 
rayol-farm2_2019-03-29_05-51-42.wav,44100,16,60,1,H,512,hil,NULL,NULL,0.903632699798578,NA 
rayol-farm2_2019-03-29_05-53-42.wav,44100,16,60,1,H,512,hil,NULL,NULL,0.90210067746696,NA 
rayol-farm2_2019-03-29_05-55-42.wav,44100,16,60,1,H,512,hil,NULL,NULL,0.896836950792751,NA 
rayol-farm2_2019-03-29_05-57-42.wav,44100,16,60,1,H,512,hil,NULL,NULL,0.898341777746342,NA 
rayol-farm2_2019-03-29_05-59-42.wav,44100,16,60,1,H,512,hil,NULL,NULL,0.891598633018588,NA 
rayol-farm2_2019-03-29_06-01-43.wav,44100,16,60,1,H,512,hil,NULL,NULL,0.897269129355124,NA 
rayol-farm2_2019-03-29_06-03-43.wav,44100,16,60,1,H,512,hil,NULL,NULL,0.900994060486131,NA 
rayol-farm2_2019-03-29_06-05-43.wav,44100,16,60,1,H,512,hil,NULL,NULL,0.900467144959568,NA 
rayol-farm2_2019-03-29_06-07-43.wav,44100,16,60,1,H,512,hil,NULL,NULL,0.897569591330427,NA 
rayol-farm2_2019-03-29_06-09-43.wav,44100,16,60,1,H,512,hil,NULL,NULL,0.8908470680388,NA 
rayol-farm2_2019-03-29_06-11-43.wav,44100,16,60,1,H,512,hil,NULL,NULL,0.873885345723736,NA 
rayol-farm2_2019-03-29_06-13-43.wav,44100,16,60,1,H,512,hil,NULL,NULL,0.883490990167672,NA 
rayol-farm2_2019-03-29_06-15-43.wav,44100,16,60,1,H,512,hil,NULL,NULL,0.859185586830389,NA 
rayol-farm2_2019-03-29_06-17-44.wav,44100,16,60,1,H,512,hil,NULL,NULL,0.889018228498403,NA 
rayol-farm2_2019-03-29_06-19-44.wav,44100,16,60,1,H,512,hil,NULL,NULL,0.886118792057861,NA 
rayol-farm2_2019-03-29_06-21-44.wav,44100,16,60,1,H,512,hil,NULL,NULL,0.894824462308554,NA 
rayol-farm2_2019-03-29_06-23-44.wav,44100,16,60,1,H,512,hil,NULL,NULL,0.880612488795938,NA 
rayol-farm2_2019-03-29_06-25-44.wav,44100,16,60,1,H,512,hil,NULL,NULL,0.894739456052982,NA 
rayol-farm2_2019-03-29_06-27-44.wav,44100,16,60,1,H,512,hil,NULL,NULL,0.900009457817744,NA 
rayol-farm2_2019-03-29_06-29-44.wav,44100,16,60,1,H,512,hil,NULL,NULL,0.896130868006283,NA 
rayol-farm2_2019-03-29_06-31-44.wav,44100,16,60,1,H,512,hil,NULL,NULL,0.898859932731758,NA 
rayol-farm2_2019-03-29_06-33-45.wav,44100,16,60,1,H,512,hil,NULL,NULL,0.897443837274193,NA 
rayol-farm2_2019-03-29_06-35-45.wav,44100,16,60,1,H,512,hil,NULL,NULL,0.894197107896816,NA 
rayol-farm2_2019-03-29_06-37-45.wav,44100,16,60,1,H,512,hil,NULL,NULL,0.896857694321424,NA 
rayol-farm2_2019-03-29_06-39-45.wav,44100,16,60,1,H,512,hil,NULL,NULL,0.897845562024275,NA 
rayol-farm2_2019-03-29_06-41-45.wav,44100,16,60,1,H,512,hil,NULL,NULL,0.891883828462457,NA 
rayol-farm2_2019-03-29_06-43-45.wav,44100,16,60,1,H,512,hil,NULL,NULL,0.885921687232675,NA 
rayol-farm2_2019-03-29_06-45-45.wav,44100,16,60,1,H,512,hil,NULL,NULL,0.893182367206864,NA 
rayol-farm2_2019-03-29_06-47-45.wav,44100,16,60,1,H,512,hil,NULL,NULL,0.867671162263176,NA 
rayol-farm2_2019-03-29_06-49-46.wav,44100,16,60,1,H,512,hil,NULL,NULL,0.893656542477679,NA 
rayol-farm2_2019-03-29_06-51-46.wav,44100,16,60,1,H,512,hil,NULL,NULL,0.862531431662096,NA 
rayol-farm2_2019-03-29_06-53-46.wav,44100,16,60,1,H,512,hil,NULL,NULL,0.893281161414291,NA 
rayol-farm2_2019-03-29_06-55-46.wav,44100,16,60,1,H,512,hil,NULL,NULL,0.895678264306114,NA 
rayol-farm2_2019-03-29_06-57-46.wav,44100,16,60,1,H,512,hil,NULL,NULL,0.896395025892205,NA 
rayol-farm2_2019-03-29_06-59-46.wav,44100,16,60,1,H,512,hil,NULL,NULL,0.889116162476704,NA 
rayol-farm2_2019-03-29_07-01-46.wav,44100,16,60,1,H,512,hil,NULL,NULL,0.889605652299312,NA 
rayol-farm2_2019-03-29_07-03-46.wav,44100,16,60,1,H,512,hil,NULL,NULL,0.889613153103034,NA 
rayol-farm2_2019-03-29_07-05-46.wav,44100,16,60,1,H,512,hil,NULL,NULL,0.890540301020459,NA 
rayol-farm2_2019-03-29_07-07-47.wav,44100,16,60,1,H,512,hil,NULL,NULL,0.892196816866134,NA 
rayol-farm2_2019-03-29_07-09-47.wav,44100,16,60,1,H,512,hil,NULL,NULL,0.884820513106203,NA 
rayol-farm2_2019-03-29_07-11-47.wav,44100,16,60,1,H,512,hil,NULL,NULL,0.88975664832836,NA 
rayol-farm2_2019-03-29_07-13-47.wav,44100,16,60,1,H,512,hil,NULL,NULL,0.891101613286268,NA 
rayol-farm2_2019-03-29_07-15-47.wav,44100,16,60,1,H,512,hil,NULL,NULL,0.896682127879623,NA 
rayol-farm2_2019-03-29_07-17-47.wav,44100,16,60,1,H,512,hil,NULL,NULL,0.889634377706931,NA 
rayol-farm2_2019-03-29_07-19-47.wav,44100,16,60,1,H,512,hil,NULL,NULL,0.88871496192026,NA 
rayol-farm2_2019-03-29_07-21-47.wav,44100,16,60,1,H,512,hil,NULL,NULL,0.895038018819622,NA 
rayol-farm2_2019-03-29_07-23-48.wav,44100,16,60,1,H,512,hil,NULL,NULL,0.898268982990104,NA 
rayol-farm2_2019-03-29_07-25-48.wav,44100,16,60,1,H,512,hil,NULL,NULL,0.890417788383646,NA 
rayol-farm2_2019-03-29_07-27-48.wav,44100,16,60,1,H,512,hil,NULL,NULL,0.889642234817832,NA 
rayol-farm2_2019-03-29_07-29-48.wav,44100,16,60,1,H,512,hil,NULL,NULL,0.895127050336944,NA 
rayol-farm2_2019-03-29_07-31-48.wav,44100,16,60,1,H,512,hil,NULL,NULL,0.86955192977775,NA 
rayol-farm2_2019-03-29_07-33-48.wav,44100,16,60,1,H,512,hil,NULL,NULL,0.893853641385905,NA 
rayol-farm2_2019-03-29_07-35-48.wav,44100,16,60,1,H,512,hil,NULL,NULL,0.892973827106004,NA 
rayol-farm2_2019-03-29_07-37-48.wav,44100,16,60,1,H,512,hil,NULL,NULL,0.892386584772987,NA 
rayol-farm2_2019-03-29_07-39-49.wav,44100,16,60,1,H,512,hil,NULL,NULL,0.88732304920243,NA 
rayol-farm2_2019-03-29_07-41-49.wav,44100,16,60,1,H,512,hil,NULL,NULL,0.893934512217949,NA 
rayol-farm2_2019-03-29_07-43-49.wav,44100,16,60,1,H,512,hil,NULL,NULL,0.888147069794183,NA 
rayol-farm2_2019-03-29_07-45-49.wav,44100,16,60,1,H,512,hil,NULL,NULL,0.889775290057874,NA 
rayol-farm2_2019-03-29_07-47-49.wav,44100,16,60,1,H,512,hil,NULL,NULL,0.630342205572685,NA 
rayol-farm2_2019-03-29_07-49-49.wav,44100,16,60,1,H,512,hil,NULL,NULL,0.924025100998184,NA 
rayol-farm2_2019-03-29_07-51-49.wav,44100,16,60,1,H,512,hil,NULL,NULL,0.895211562970131,NA 
rayol-farm2_2019-03-29_07-53-49.wav,44100,16,60,1,H,512,hil,NULL,NULL,0.50689763235315,NA 
rayol-farm2_2019-03-29_07-55-50.wav,44100,16,60,1,H,512,hil,NULL,NULL,0.879404514793469,NA 
rayol-farm2_2019-03-29_07-57-50.wav,44100,16,60,1,H,512,hil,NULL,NULL,0.869781013738897,NA 
rayol-farm2_2019-03-29_07-59-50.wav,44100,16,60,1,H,512,hil,NULL,NULL,0.886834074196781,NA 
rayol-farm2_2019-03-29_08-01-50.wav,44100,16,60,1,H,512,hil,NULL,NULL,0.864871549634124,NA 
rayol-farm2_2019-03-29_08-03-50.wav,44100,16,60,1,H,512,hil,NULL,NULL,0.867240098141108,NA 
rayol-farm2_2019-03-29_08-05-50.wav,44100,16,60,1,H,512,hil,NULL,NULL,0.857385945819133,NA 
rayol-farm2_2019-03-29_08-07-50.wav,44100,16,60,1,H,512,hil,NULL,NULL,0.878851625724168,NA 
rayol-farm2_2019-03-29_08-09-50.wav,44100,16,60,1,H,512,hil,NULL,NULL,0.87897688481198,NA 
rayol-farm2_2019-03-29_08-11-51.wav,44100,16,60,1,H,512,hil,NULL,NULL,0.885651200339152,NA 
rayol-farm2_2019-03-29_08-13-51.wav,44100,16,60,1,H,512,hil,NULL,NULL,0.882475495782461,NA 
rayol-farm2_2019-03-29_08-15-51.wav,44100,16,60,1,H,512,hil,NULL,NULL,0.868923878877073,NA 
rayol-farm2_2019-03-29_08-17-51.wav,44100,16,60,1,H,512,hil,NULL,NULL,0.858820959963945,NA 
rayol-farm2_2019-03-29_08-19-51.wav,44100,16,60,1,H,512,hil,NULL,NULL,0.864746713664076,NA 
rayol-farm2_2019-03-29_08-21-51.wav,44100,16,60,1,H,512,hil,NULL,NULL,0.886365558672483,NA 
rayol-farm2_2019-03-29_08-23-51.wav,44100,16,60,1,H,512,hil,NULL,NULL,0.887330857596279,NA 
rayol-farm2_2019-03-29_08-25-51.wav,44100,16,60,1,H,512,hil,NULL,NULL,0.874803640163672,NA 
rayol-farm2_2019-03-29_08-27-51.wav,44100,16,60,1,H,512,hil,NULL,NULL,0.857932953851809,NA 
rayol-farm2_2019-03-29_08-29-52.wav,44100,16,60,1,H,512,hil,NULL,NULL,0.902064804844398,NA 
rayol-farm2_2019-03-29_08-31-52.wav,44100,16,60,1,H,512,hil,NULL,NULL,0.894361064243014,NA 
rayol-farm2_2019-03-29_08-33-52.wav,44100,16,60,1,H,512,hil,NULL,NULL,0.899908958176979,NA 
rayol-farm2_2019-03-29_08-35-52.wav,44100,16,60,1,H,512,hil,NULL,NULL,0.881972631050045,NA 
rayol-farm2_2019-03-29_08-37-52.wav,44100,16,60,1,H,512,hil,NULL,NULL,0.794672478821232,NA 
rayol-farm2_2019-03-29_08-39-52.wav,44100,16,60,1,H,512,hil,NULL,NULL,0.865057601483193,NA 
rayol-farm2_2019-03-29_08-41-52.wav,44100,16,60,1,H,512,hil,NULL,NULL,0.875781031071254,NA 
rayol-farm2_2019-03-29_08-43-52.wav,44100,16,60,1,H,512,hil,NULL,NULL,0.880022787023491,NA 
rayol-farm2_2019-03-29_08-45-53.wav,44100,16,60,1,H,512,hil,NULL,NULL,0.885187967825732,NA 
rayol-farm2_2019-03-29_08-47-53.wav,44100,16,60,1,H,512,hil,NULL,NULL,0.860914412433964,NA 
rayol-farm2_2019-03-29_08-49-53.wav,44100,16,60,1,H,512,hil,NULL,NULL,0.873599403207086,NA 
rayol-farm2_2019-03-29_08-51-53.wav,44100,16,60,1,H,512,hil,NULL,NULL,0.869915478192024,NA 
rayol-farm2_2019-03-29_08-53-53.wav,44100,16,60,1,H,512,hil,NULL,NULL,0.886476417932953,NA 
rayol-farm2_2019-03-29_08-55-53.wav,44100,16,60,1,H,512,hil,NULL,NULL,0.884898915493186,NA 
rayol-farm2_2019-03-29_08-57-53.wav,44100,16,60,1,H,512,hil,NULL,NULL,0.861637859242839,NA 
rayol-farm2_2019-03-29_08-59-53.wav,44100,16,60,1,H,512,hil,NULL,NULL,0.767784127156545,NA 
rayol-farm2_2019-03-29_09-01-54.wav,44100,16,60,1,H,512,hil,NULL,NULL,0.850671600486456,NA 
rayol-farm2_2019-03-29_09-03-54.wav,44100,16,60,1,H,512,hil,NULL,NULL,0.878407276505541,NA 
rayol-farm2_2019-03-29_09-05-54.wav,44100,16,60,1,H,512,hil,NULL,NULL,0.877880987499669,NA 
rayol-farm2_2019-03-29_09-07-54.wav,44100,16,60,1,H,512,hil,NULL,NULL,0.877415429040818,NA 
rayol-farm2_2019-03-29_09-09-54.wav,44100,16,60,1,H,512,hil,NULL,NULL,0.825043812522133,NA 
rayol-farm2_2019-03-29_09-11-54.wav,44100,16,60,1,H,512,hil,NULL,NULL,0.861159010504987,NA 
rayol-farm2_2019-03-29_09-13-54.wav,44100,16,60,1,H,512,hil,NULL,NULL,0.883100349196274,NA 
rayol-farm2_2019-03-29_09-15-54.wav,44100,16,60,1,H,512,hil,NULL,NULL,0.884986432966113,NA 
rayol-farm2_2019-03-29_09-17-55.wav,44100,16,60,1,H,512,hil,NULL,NULL,0.872755301312322,NA 
rayol-farm2_2019-03-29_09-19-55.wav,44100,16,60,1,H,512,hil,NULL,NULL,0.868677396300633,NA 
rayol-farm2_2019-03-29_09-21-55.wav,44100,16,60,1,H,512,hil,NULL,NULL,0.874720099585899,NA 
rayol-farm2_2019-03-29_09-23-55.wav,44100,16,60,1,H,512,hil,NULL,NULL,0.869398293297499,NA 
rayol-farm2_2019-03-29_09-25-55.wav,44100,16,60,1,H,512,hil,NULL,NULL,0.866172472138198,NA 
rayol-farm2_2019-03-29_09-27-55.wav,44100,16,60,1,H,512,hil,NULL,NULL,0.883714002271122,NA 
rayol-farm2_2019-03-29_09-29-55.wav,44100,16,60,1,H,512,hil,NULL,NULL,0.824078987294369,NA 
rayol-farm2_2019-03-29_09-31-55.wav,44100,16,60,1,H,512,hil,NULL,NULL,0.836664039387175,NA 
rayol-farm2_2019-03-29_09-33-56.wav,44100,16,60,1,H,512,hil,NULL,NULL,0.863689264649215,NA 
rayol-farm2_2019-03-29_09-35-56.wav,44100,16,60,1,H,512,hil,NULL,NULL,0.77562999859449,NA 
rayol-farm2_2019-03-29_09-37-56.wav,44100,16,60,1,H,512,hil,NULL,NULL,0.848367771205319,NA 
rayol-farm2_2019-03-29_09-39-56.wav,44100,16,60,1,H,512,hil,NULL,NULL,0.868272831900463,NA 
rayol-farm2_2019-03-29_09-41-56.wav,44100,16,60,1,H,512,hil,NULL,NULL,0.891588419398674,NA 
rayol-farm2_2019-03-29_09-43-56.wav,44100,16,60,1,H,512,hil,NULL,NULL,0.794505949988403,NA 
rayol-farm2_2019-03-29_09-45-56.wav,44100,16,60,1,H,512,hil,NULL,NULL,0.862672306658137,NA 
rayol-farm2_2019-03-29_09-47-56.wav,44100,16,60,1,H,512,hil,NULL,NULL,0.855256605751424,NA 
rayol-farm2_2019-03-29_09-49-56.wav,44100,16,60,1,H,512,hil,NULL,NULL,0.80189669275311,NA 
rayol-farm2_2019-03-29_09-51-57.wav,44100,16,60,1,H,512,hil,NULL,NULL,0.803617250354173,NA 
rayol-farm2_2019-03-29_09-53-57.wav,44100,16,60,1,H,512,hil,NULL,NULL,0.77547722918332,NA 
rayol-farm2_2019-03-29_09-55-57.wav,44100,16,60,1,H,512,hil,NULL,NULL,0.827641544998934,NA 
rayol-farm2_2019-03-29_09-57-57.wav,44100,16,60,1,H,512,hil,NULL,NULL,0.875776235260323,NA 
rayol-farm2_2019-03-29_09-59-57.wav,44100,16,60,1,H,512,hil,NULL,NULL,0.874881158672678,NA 
rayol-farm2_2019-03-29_10-01-57.wav,44100,16,60,1,H,512,hil,NULL,NULL,0.834984804219056,NA 
rayol-farm2_2019-03-29_10-03-57.wav,44100,16,60,1,H,512,hil,NULL,NULL,0.818325874471634,NA 
rayol-farm2_2019-03-29_10-05-57.wav,44100,16,60,1,H,512,hil,NULL,NULL,0.802443044785473,NA 
rayol-farm2_2019-03-29_10-07-58.wav,44100,16,60,1,H,512,hil,NULL,NULL,0.848347126544391,NA 
rayol-farm2_2019-03-29_10-09-58.wav,44100,16,60,1,H,512,hil,NULL,NULL,0.770343577210253,NA 
rayol-farm2_2019-03-29_10-11-58.wav,44100,16,60,1,H,512,hil,NULL,NULL,0.843053514275261,NA 
rayol-farm2_2019-03-29_10-13-58.wav,44100,16,60,1,H,512,hil,NULL,NULL,0.822181439533052,NA 
rayol-farm2_2019-03-29_10-15-58.wav,44100,16,60,1,H,512,hil,NULL,NULL,0.871386373723817,NA 
rayol-farm2_2019-03-29_10-17-58.wav,44100,16,60,1,H,512,hil,NULL,NULL,0.837532246540358,NA 
rayol-farm2_2019-03-29_10-19-58.wav,44100,16,60,1,H,512,hil,NULL,NULL,0.84928353048593,NA 
rayol-farm2_2019-03-29_10-21-58.wav,44100,16,60,1,H,512,hil,NULL,NULL,0.837606587528542,NA 
rayol-farm2_2019-03-29_10-23-59.wav,44100,16,60,1,H,512,hil,NULL,NULL,0.844503421610103,NA 
rayol-farm2_2019-03-29_10-25-59.wav,44100,16,60,1,H,512,hil,NULL,NULL,0.838473630056322,NA 
rayol-farm2_2019-03-29_10-27-59.wav,44100,16,60,1,H,512,hil,NULL,NULL,0.824352655662525,NA 
rayol-farm2_2019-03-29_10-29-59.wav,44100,16,60,1,H,512,hil,NULL,NULL,0.848908317086562,NA 
rayol-farm2_2019-03-29_10-31-59.wav,44100,16,60,1,H,512,hil,NULL,NULL,0.867046894184604,NA 
rayol-farm2_2019-03-29_10-33-59.wav,44100,16,60,1,H,512,hil,NULL,NULL,0.795930540415451,NA 
rayol-farm2_2019-03-29_10-35-59.wav,44100,16,60,1,H,512,hil,NULL,NULL,0.871627758959096,NA 
rayol-farm2_2019-03-29_10-37-59.wav,44100,16,60,1,H,512,hil,NULL,NULL,0.847880823752905,NA 
rayol-farm2_2019-03-29_10-40-00.wav,44100,16,60,1,H,512,hil,NULL,NULL,0.779869922612923,NA 
rayol-farm2_2019-03-29_10-42-00.wav,44100,16,60,1,H,512,hil,NULL,NULL,0.874212524401916,NA 
rayol-farm2_2019-03-29_10-44-00.wav,44100,16,60,1,H,512,hil,NULL,NULL,0.714430472211052,NA 
rayol-farm2_2019-03-29_10-46-00.wav,44100,16,60,1,H,512,hil,NULL,NULL,0.831168497182653,NA 
rayol-farm2_2019-03-29_10-48-00.wav,44100,16,60,1,H,512,hil,NULL,NULL,0.786920093242575,NA 
rayol-farm2_2019-03-29_10-50-00.wav,44100,16,60,1,H,512,hil,NULL,NULL,0.853962054939459,NA 
rayol-farm2_2019-03-29_10-52-00.wav,44100,16,60,1,H,512,hil,NULL,NULL,0.874775555567419,NA 
rayol-farm2_2019-03-29_10-54-00.wav,44100,16,60,1,H,512,hil,NULL,NULL,0.854604248286682,NA 
rayol-farm2_2019-03-29_10-56-00.wav,44100,16,60,1,H,512,hil,NULL,NULL,0.718243853201002,NA 
rayol-farm2_2019-03-29_10-58-01.wav,44100,16,60,1,H,512,hil,NULL,NULL,0.826054544631627,NA 
rayol-farm2_2019-03-29_11-00-01.wav,44100,16,60,1,H,512,hil,NULL,NULL,0.777404994918749,NA 
rayol-farm2_2019-03-29_11-02-01.wav,44100,16,60,1,H,512,hil,NULL,NULL,0.827217943609199,NA 
rayol-farm2_2019-03-29_11-04-01.wav,44100,16,60,1,H,512,hil,NULL,NULL,0.767651159321583,NA 
rayol-farm2_2019-03-29_11-06-01.wav,44100,16,60,1,H,512,hil,NULL,NULL,0.802794296734122,NA 
rayol-farm2_2019-03-29_11-08-01.wav,44100,16,60,1,H,512,hil,NULL,NULL,0.697418971956962,NA 
rayol-farm2_2019-03-29_11-10-01.wav,44100,16,60,1,H,512,hil,NULL,NULL,0.784713549062809,NA 
rayol-farm2_2019-03-29_11-12-01.wav,44100,16,60,1,H,512,hil,NULL,NULL,0.847111790301996,NA 
rayol-farm2_2019-03-29_11-14-02.wav,44100,16,60,1,H,512,hil,NULL,NULL,0.742667982607417,NA 
rayol-farm2_2019-03-29_11-16-02.wav,44100,16,60,1,H,512,hil,NULL,NULL,0.816511601921749,NA 
rayol-farm2_2019-03-29_11-18-02.wav,44100,16,60,1,H,512,hil,NULL,NULL,0.743453140674135,NA 
rayol-farm2_2019-03-29_11-20-02.wav,44100,16,60,1,H,512,hil,NULL,NULL,0.84253965718066,NA 
rayol-farm2_2019-03-29_11-22-02.wav,44100,16,60,1,H,512,hil,NULL,NULL,0.741789689526826,NA 
rayol-farm2_2019-03-29_11-24-02.wav,44100,16,60,1,H,512,hil,NULL,NULL,0.750159437312144,NA 
rayol-farm2_2019-03-29_11-26-02.wav,44100,16,60,1,H,512,hil,NULL,NULL,0.771659378641829,NA 
rayol-farm2_2019-03-29_11-28-02.wav,44100,16,60,1,H,512,hil,NULL,NULL,0.817183319950494,NA 
rayol-farm2_2019-03-29_11-30-02.wav,44100,16,60,1,H,512,hil,NULL,NULL,0.827427063305931,NA 
rayol-farm2_2019-03-29_11-32-03.wav,44100,16,60,1,H,512,hil,NULL,NULL,0.771412909034001,NA 
rayol-farm2_2019-03-29_11-34-03.wav,44100,16,60,1,H,512,hil,NULL,NULL,0.871546305637422,NA 
rayol-farm2_2019-03-29_11-36-03.wav,44100,16,60,1,H,512,hil,NULL,NULL,0.740014336328733,NA 
rayol-farm2_2019-03-29_11-38-03.wav,44100,16,60,1,H,512,hil,NULL,NULL,0.755342493125327,NA 
rayol-farm2_2019-03-29_11-40-03.wav,44100,16,60,1,H,512,hil,NULL,NULL,0.860391259809833,NA 
rayol-farm2_2019-03-29_11-42-03.wav,44100,16,60,1,H,512,hil,NULL,NULL,0.720300447178412,NA 
rayol-farm2_2019-03-29_11-44-03.wav,44100,16,60,1,H,512,hil,NULL,NULL,0.729851005569571,NA 
rayol-farm2_2019-03-29_11-46-03.wav,44100,16,60,1,H,512,hil,NULL,NULL,0.808022700671324,NA 
rayol-farm2_2019-03-29_11-48-04.wav,44100,16,60,1,H,512,hil,NULL,NULL,0.739104005840649,NA 
rayol-farm2_2019-03-29_11-50-04.wav,44100,16,60,1,H,512,hil,NULL,NULL,0.758018471087453,NA 
rayol-farm2_2019-03-29_11-52-04.wav,44100,16,60,1,H,512,hil,NULL,NULL,0.720604494749829,NA 
rayol-farm2_2019-03-29_11-54-04.wav,44100,16,60,1,H,512,hil,NULL,NULL,0.815821212579236,NA 
rayol-farm2_2019-03-29_11-56-04.wav,44100,16,60,1,H,512,hil,NULL,NULL,0.753516359270928,NA 
rayol-farm2_2019-03-29_11-58-04.wav,44100,16,60,1,H,512,hil,NULL,NULL,0.817416845990812,NA 
rayol-farm2_2019-03-29_12-00-04.wav,44100,16,60,1,H,512,hil,NULL,NULL,0.796852749424819,NA 
rayol-farm2_2019-03-29_12-02-04.wav,44100,16,60,1,H,512,hil,NULL,NULL,0.799806625578398,NA 
rayol-farm2_2019-03-29_12-04-05.wav,44100,16,60,1,H,512,hil,NULL,NULL,0.789464729368807,NA 
rayol-farm2_2019-03-29_12-06-05.wav,44100,16,60,1,H,512,hil,NULL,NULL,0.691071532666174,NA 
rayol-farm2_2019-03-29_12-08-05.wav,44100,16,60,1,H,512,hil,NULL,NULL,0.683755569833798,NA 
rayol-farm2_2019-03-29_12-10-05.wav,44100,16,60,1,H,512,hil,NULL,NULL,0.757559299998832,NA 
rayol-farm2_2019-03-29_12-12-05.wav,44100,16,60,1,H,512,hil,NULL,NULL,0.739134416371321,NA 
rayol-farm2_2019-03-29_12-14-05.wav,44100,16,60,1,H,512,hil,NULL,NULL,0.829929311189664,NA 
rayol-farm2_2019-03-29_12-16-05.wav,44100,16,60,1,H,512,hil,NULL,NULL,0.705056129978661,NA 
rayol-farm2_2019-03-29_12-18-05.wav,44100,16,60,1,H,512,hil,NULL,NULL,0.713848695883179,NA 
rayol-farm2_2019-03-29_12-20-06.wav,44100,16,60,1,H,512,hil,NULL,NULL,0.781332130673248,NA 
rayol-farm2_2019-03-29_12-22-06.wav,44100,16,60,1,H,512,hil,NULL,NULL,0.753570041291003,NA 
rayol-farm2_2019-03-29_12-24-06.wav,44100,16,60,1,H,512,hil,NULL,NULL,0.837750952633747,NA 
rayol-farm2_2019-03-29_12-26-06.wav,44100,16,60,1,H,512,hil,NULL,NULL,0.653924282142505,NA 
rayol-farm2_2019-03-29_12-28-06.wav,44100,16,60,1,H,512,hil,NULL,NULL,0.840141777312329,NA 
rayol-farm2_2019-03-29_12-30-06.wav,44100,16,60,1,H,512,hil,NULL,NULL,0.789355257989444,NA 
rayol-farm2_2019-03-29_12-32-06.wav,44100,16,60,1,H,512,hil,NULL,NULL,0.765231877465964,NA 
rayol-farm2_2019-03-29_12-34-06.wav,44100,16,60,1,H,512,hil,NULL,NULL,0.646891664937719,NA 
rayol-farm2_2019-03-29_12-36-07.wav,44100,16,60,1,H,512,hil,NULL,NULL,0.864928640977578,NA 
rayol-farm2_2019-03-29_12-38-07.wav,44100,16,60,1,H,512,hil,NULL,NULL,0.720501278281242,NA 
rayol-farm2_2019-03-29_12-40-07.wav,44100,16,60,1,H,512,hil,NULL,NULL,0.80675258890402,NA 
rayol-farm2_2019-03-29_12-42-07.wav,44100,16,60,1,H,512,hil,NULL,NULL,0.763926790905586,NA 
rayol-farm2_2019-03-29_12-44-07.wav,44100,16,60,1,H,512,hil,NULL,NULL,0.782240314944286,NA 
rayol-farm2_2019-03-29_12-46-07.wav,44100,16,60,1,H,512,hil,NULL,NULL,0.744568211644992,NA 
rayol-farm2_2019-03-29_12-48-07.wav,44100,16,60,1,H,512,hil,NULL,NULL,0.727819820962882,NA 
rayol-farm2_2019-03-29_12-50-07.wav,44100,16,60,1,H,512,hil,NULL,NULL,0.671694452504933,NA 
rayol-farm2_2019-03-29_12-52-07.wav,44100,16,60,1,H,512,hil,NULL,NULL,0.765438835279103,NA 
rayol-farm2_2019-03-29_12-54-08.wav,44100,16,60,1,H,512,hil,NULL,NULL,0.776018238932365,NA 
rayol-farm2_2019-03-29_12-56-08.wav,44100,16,60,1,H,512,hil,NULL,NULL,0.675968714792305,NA 
rayol-farm2_2019-03-29_12-58-08.wav,44100,16,60,1,H,512,hil,NULL,NULL,0.6668612483636,NA 
rayol-farm2_2019-03-29_13-00-08.wav,44100,16,60,1,H,512,hil,NULL,NULL,0.823678998097933,NA 
rayol-farm2_2019-03-29_13-02-08.wav,44100,16,60,1,H,512,hil,NULL,NULL,0.870376795059944,NA 
rayol-farm2_2019-03-29_13-04-08.wav,44100,16,60,1,H,512,hil,NULL,NULL,0.790112221058532,NA 
rayol-farm2_2019-03-29_13-06-08.wav,44100,16,60,1,H,512,hil,NULL,NULL,0.786543137888902,NA 
rayol-farm2_2019-03-29_13-08-08.wav,44100,16,60,1,H,512,hil,NULL,NULL,0.772277546395677,NA 
rayol-farm2_2019-03-29_13-10-09.wav,44100,16,60,1,H,512,hil,NULL,NULL,0.770828771219143,NA 
rayol-farm2_2019-03-29_13-12-09.wav,44100,16,60,1,H,512,hil,NULL,NULL,0.834988984321303,NA 
rayol-farm2_2019-03-29_13-14-09.wav,44100,16,60,1,H,512,hil,NULL,NULL,0.760153984992818,NA 
rayol-farm2_2019-03-29_13-16-09.wav,44100,16,60,1,H,512,hil,NULL,NULL,0.812584551659923,NA 
rayol-farm2_2019-03-29_13-18-09.wav,44100,16,60,1,H,512,hil,NULL,NULL,0.743177552486679,NA 
rayol-farm2_2019-03-29_13-20-09.wav,44100,16,60,1,H,512,hil,NULL,NULL,0.694451600382065,NA 
rayol-farm2_2019-03-29_13-22-09.wav,44100,16,60,1,H,512,hil,NULL,NULL,0.687416756816691,NA 
rayol-farm2_2019-03-29_13-24-09.wav,44100,16,60,1,H,512,hil,NULL,NULL,0.664940775342206,NA 
rayol-farm2_2019-03-29_13-26-10.wav,44100,16,60,1,H,512,hil,NULL,NULL,0.702104182337673,NA 
rayol-farm2_2019-03-29_13-28-10.wav,44100,16,60,1,H,512,hil,NULL,NULL,0.728470170441575,NA 
rayol-farm2_2019-03-29_13-30-10.wav,44100,16,60,1,H,512,hil,NULL,NULL,0.731626927914098,NA 
rayol-farm2_2019-03-29_13-32-10.wav,44100,16,60,1,H,512,hil,NULL,NULL,0.788222110190433,NA 
rayol-farm2_2019-03-29_13-34-10.wav,44100,16,60,1,H,512,hil,NULL,NULL,0.815357930289322,NA 
rayol-farm2_2019-03-29_13-36-10.wav,44100,16,60,1,H,512,hil,NULL,NULL,0.784222896986386,NA 
rayol-farm2_2019-03-29_13-38-10.wav,44100,16,60,1,H,512,hil,NULL,NULL,0.778315882997968,NA 
rayol-farm2_2019-03-29_13-40-10.wav,44100,16,60,1,H,512,hil,NULL,NULL,0.671946891413297,NA 
rayol-farm2_2019-03-29_13-42-10.wav,44100,16,60,1,H,512,hil,NULL,NULL,0.747290301925563,NA 
rayol-farm2_2019-03-29_13-44-11.wav,44100,16,60,1,H,512,hil,NULL,NULL,0.730083152867535,NA 
rayol-farm2_2019-03-29_13-46-11.wav,44100,16,60,1,H,512,hil,NULL,NULL,0.748213549902604,NA 
rayol-farm2_2019-03-29_13-48-11.wav,44100,16,60,1,H,512,hil,NULL,NULL,0.762989337853354,NA 
rayol-farm2_2019-03-29_13-50-11.wav,44100,16,60,1,H,512,hil,NULL,NULL,0.792212824034832,NA 
rayol-farm2_2019-03-29_13-52-11.wav,44100,16,60,1,H,512,hil,NULL,NULL,0.746320809744565,NA 
rayol-farm2_2019-03-29_13-54-11.wav,44100,16,60,1,H,512,hil,NULL,NULL,0.760431899061491,NA 
rayol-farm2_2019-03-29_13-56-11.wav,44100,16,60,1,H,512,hil,NULL,NULL,0.654133662930008,NA 
rayol-farm2_2019-03-29_13-58-11.wav,44100,16,60,1,H,512,hil,NULL,NULL,0.841523202304232,NA 
rayol-farm2_2019-03-29_14-00-12.wav,44100,16,60,1,H,512,hil,NULL,NULL,0.8162400159949,NA 
rayol-farm2_2019-03-29_14-02-12.wav,44100,16,60,1,H,512,hil,NULL,NULL,0.812158390244505,NA 
rayol-farm2_2019-03-29_14-04-12.wav,44100,16,60,1,H,512,hil,NULL,NULL,0.848845803280366,NA 
rayol-farm2_2019-03-29_14-06-12.wav,44100,16,60,1,H,512,hil,NULL,NULL,0.8677059566085,NA 
rayol-farm2_2019-03-29_14-08-12.wav,44100,16,60,1,H,512,hil,NULL,NULL,0.813437251297409,NA 
rayol-farm2_2019-03-29_14-10-12.wav,44100,16,60,1,H,512,hil,NULL,NULL,0.88428825304216,NA 
rayol-farm2_2019-03-29_14-12-12.wav,44100,16,60,1,H,512,hil,NULL,NULL,0.871940385645749,NA 
rayol-farm2_2019-03-29_14-14-12.wav,44100,16,60,1,H,512,hil,NULL,NULL,0.885168869012089,NA 
rayol-farm2_2019-03-29_14-16-13.wav,44100,16,60,1,H,512,hil,NULL,NULL,0.854001993756428,NA 
rayol-farm2_2019-03-29_14-18-13.wav,44100,16,60,1,H,512,hil,NULL,NULL,0.841121641976836,NA 
rayol-farm2_2019-03-29_14-20-13.wav,44100,16,60,1,H,512,hil,NULL,NULL,0.826198928492412,NA 
rayol-farm2_2019-03-29_14-22-13.wav,44100,16,60,1,H,512,hil,NULL,NULL,0.878946077885558,NA 
rayol-farm2_2019-03-29_14-24-13.wav,44100,16,60,1,H,512,hil,NULL,NULL,0.879812109707802,NA 
rayol-farm2_2019-03-29_14-26-13.wav,44100,16,60,1,H,512,hil,NULL,NULL,0.8890611662899,NA 
rayol-farm2_2019-03-29_14-28-13.wav,44100,16,60,1,H,512,hil,NULL,NULL,0.831837911434114,NA 
rayol-farm2_2019-03-29_14-30-13.wav,44100,16,60,1,H,512,hil,NULL,NULL,0.89051802705575,NA 
rayol-farm2_2019-03-29_14-32-13.wav,44100,16,60,1,H,512,hil,NULL,NULL,0.872205012570456,NA 
rayol-farm2_2019-03-29_14-34-14.wav,44100,16,60,1,H,512,hil,NULL,NULL,0.882308428279912,NA 
rayol-farm2_2019-03-29_14-36-14.wav,44100,16,60,1,H,512,hil,NULL,NULL,0.864747578189413,NA 
rayol-farm2_2019-03-29_14-38-14.wav,44100,16,60,1,H,512,hil,NULL,NULL,0.877899888781588,NA 
rayol-farm2_2019-03-29_14-40-14.wav,44100,16,60,1,H,512,hil,NULL,NULL,0.875369884069201,NA 
rayol-farm2_2019-03-29_14-42-14.wav,44100,16,60,1,H,512,hil,NULL,NULL,0.857405045124361,NA 
rayol-farm2_2019-03-29_14-44-14.wav,44100,16,60,1,H,512,hil,NULL,NULL,0.875565737994875,NA 
rayol-farm2_2019-03-29_14-46-14.wav,44100,16,60,1,H,512,hil,NULL,NULL,0.867392877043727,NA 
rayol-farm2_2019-03-29_14-48-14.wav,44100,16,60,1,H,512,hil,NULL,NULL,0.880530886263749,NA 
rayol-farm2_2019-03-29_14-50-15.wav,44100,16,60,1,H,512,hil,NULL,NULL,0.838995734979824,NA 
rayol-farm2_2019-03-29_14-52-15.wav,44100,16,60,1,H,512,hil,NULL,NULL,0.881211194859531,NA 
rayol-farm2_2019-03-29_14-54-15.wav,44100,16,60,1,H,512,hil,NULL,NULL,0.861054977392077,NA 
rayol-farm2_2019-03-29_14-56-15.wav,44100,16,60,1,H,512,hil,NULL,NULL,0.876409939132864,NA 
rayol-farm2_2019-03-29_14-58-15.wav,44100,16,60,1,H,512,hil,NULL,NULL,0.883027810472051,NA 
rayol-farm2_2019-03-29_15-00-15.wav,44100,16,60,1,H,512,hil,NULL,NULL,0.87047103926432,NA 
rayol-farm2_2019-03-29_15-02-15.wav,44100,16,60,1,H,512,hil,NULL,NULL,0.867972193193071,NA 
rayol-farm2_2019-03-29_15-04-15.wav,44100,16,60,1,H,512,hil,NULL,NULL,0.837140201905834,NA 
rayol-farm2_2019-03-29_15-06-16.wav,44100,16,60,1,H,512,hil,NULL,NULL,0.86294293027228,NA 
rayol-farm2_2019-03-29_15-08-16.wav,44100,16,60,1,H,512,hil,NULL,NULL,0.846758123817652,NA 
rayol-farm2_2019-03-29_15-10-16.wav,44100,16,60,1,H,512,hil,NULL,NULL,0.801643202336497,NA 
rayol-farm2_2019-03-29_15-12-16.wav,44100,16,60,1,H,512,hil,NULL,NULL,0.795506305517492,NA 
rayol-farm2_2019-03-29_15-14-16.wav,44100,16,60,1,H,512,hil,NULL,NULL,0.818285897756739,NA 
rayol-farm2_2019-03-29_15-16-16.wav,44100,16,60,1,H,512,hil,NULL,NULL,0.89011063253004,NA 
rayol-farm2_2019-03-29_15-18-16.wav,44100,16,60,1,H,512,hil,NULL,NULL,0.87482592160538,NA 
rayol-farm2_2019-03-29_15-20-16.wav,44100,16,60,1,H,512,hil,NULL,NULL,0.857979059382712,NA 
rayol-farm2_2019-03-29_15-22-16.wav,44100,16,60,1,H,512,hil,NULL,NULL,0.854272445227916,NA 
rayol-farm2_2019-03-29_15-24-17.wav,44100,16,60,1,H,512,hil,NULL,NULL,0.874249879320347,NA 
rayol-farm2_2019-03-29_15-26-17.wav,44100,16,60,1,H,512,hil,NULL,NULL,0.883126689570259,NA 
rayol-farm2_2019-03-29_15-28-17.wav,44100,16,60,1,H,512,hil,NULL,NULL,0.859260129617188,NA 
rayol-farm2_2019-03-29_15-30-17.wav,44100,16,60,1,H,512,hil,NULL,NULL,0.865715194870459,NA 
rayol-farm2_2019-03-29_15-32-17.wav,44100,16,60,1,H,512,hil,NULL,NULL,0.878567524524522,NA 
rayol-farm2_2019-03-29_15-34-17.wav,44100,16,60,1,H,512,hil,NULL,NULL,0.807799487294091,NA 
rayol-farm2_2019-03-29_15-36-17.wav,44100,16,60,1,H,512,hil,NULL,NULL,0.822339855367611,NA 
rayol-farm2_2019-03-29_15-38-17.wav,44100,16,60,1,H,512,hil,NULL,NULL,0.757927799661646,NA 
rayol-farm2_2019-03-29_15-40-18.wav,44100,16,60,1,H,512,hil,NULL,NULL,0.894902938030357,NA 
rayol-farm2_2019-03-29_15-42-18.wav,44100,16,60,1,H,512,hil,NULL,NULL,0.844583533763798,NA 
rayol-farm2_2019-03-29_15-44-18.wav,44100,16,60,1,H,512,hil,NULL,NULL,0.869893515442266,NA 
rayol-farm2_2019-03-29_15-46-18.wav,44100,16,60,1,H,512,hil,NULL,NULL,0.859631521935358,NA 
rayol-farm2_2019-03-29_15-48-18.wav,44100,16,60,1,H,512,hil,NULL,NULL,0.831233133469027,NA 
rayol-farm2_2019-03-29_15-50-18.wav,44100,16,60,1,H,512,hil,NULL,NULL,0.856481537784767,NA 
rayol-farm2_2019-03-29_15-52-18.wav,44100,16,60,1,H,512,hil,NULL,NULL,0.84930052250456,NA 
rayol-farm2_2019-03-29_15-54-18.wav,44100,16,60,1,H,512,hil,NULL,NULL,0.872336684871423,NA 
rayol-farm2_2019-03-29_15-56-19.wav,44100,16,60,1,H,512,hil,NULL,NULL,0.880276294305164,NA 
rayol-farm2_2019-03-29_15-58-19.wav,44100,16,60,1,H,512,hil,NULL,NULL,0.886072079706088,NA 
rayol-farm2_2019-03-29_16-00-19.wav,44100,16,60,1,H,512,hil,NULL,NULL,0.868198754144035,NA 
rayol-farm2_2019-03-29_16-02-19.wav,44100,16,60,1,H,512,hil,NULL,NULL,0.891544517667741,NA 
rayol-farm2_2019-03-29_16-04-19.wav,44100,16,60,1,H,512,hil,NULL,NULL,0.847108639747315,NA 
rayol-farm2_2019-03-29_16-06-19.wav,44100,16,60,1,H,512,hil,NULL,NULL,0.888994492507767,NA 
rayol-farm2_2019-03-29_16-08-19.wav,44100,16,60,1,H,512,hil,NULL,NULL,0.890042485965181,NA 
rayol-farm2_2019-03-29_16-10-19.wav,44100,16,60,1,H,512,hil,NULL,NULL,0.86250237128737,NA 
rayol-farm2_2019-03-29_16-12-20.wav,44100,16,60,1,H,512,hil,NULL,NULL,0.830367618492002,NA 
rayol-farm2_2019-03-29_16-14-20.wav,44100,16,60,1,H,512,hil,NULL,NULL,0.894562504742505,NA 
rayol-farm2_2019-03-29_16-16-20.wav,44100,16,60,1,H,512,hil,NULL,NULL,0.858071167901284,NA 
rayol-farm2_2019-03-29_16-18-20.wav,44100,16,60,1,H,512,hil,NULL,NULL,0.875972532453827,NA 
rayol-farm2_2019-03-29_16-20-20.wav,44100,16,60,1,H,512,hil,NULL,NULL,0.881254525639335,NA 
rayol-farm2_2019-03-29_16-22-20.wav,44100,16,60,1,H,512,hil,NULL,NULL,0.86633070193862,NA 
rayol-farm2_2019-03-29_16-24-20.wav,44100,16,60,1,H,512,hil,NULL,NULL,0.889960971818277,NA 
rayol-farm2_2019-03-29_16-26-20.wav,44100,16,60,1,H,512,hil,NULL,NULL,0.850674623126914,NA 
rayol-farm2_2019-03-29_16-28-20.wav,44100,16,60,1,H,512,hil,NULL,NULL,0.860474426783419,NA 
rayol-farm2_2019-03-29_16-30-21.wav,44100,16,60,1,H,512,hil,NULL,NULL,0.867368089604878,NA 
rayol-farm2_2019-03-29_16-32-21.wav,44100,16,60,1,H,512,hil,NULL,NULL,0.870404164498705,NA 
rayol-farm2_2019-03-29_16-34-21.wav,44100,16,60,1,H,512,hil,NULL,NULL,0.853754603361668,NA 
rayol-farm2_2019-03-29_16-36-21.wav,44100,16,60,1,H,512,hil,NULL,NULL,0.860336720362777,NA 
rayol-farm2_2019-03-29_16-38-21.wav,44100,16,60,1,H,512,hil,NULL,NULL,0.808133681998214,NA 
rayol-farm2_2019-03-29_16-40-21.wav,44100,16,60,1,H,512,hil,NULL,NULL,0.883771284137097,NA 
rayol-farm2_2019-03-29_16-42-21.wav,44100,16,60,1,H,512,hil,NULL,NULL,0.878554382766095,NA 
rayol-farm2_2019-03-29_16-44-21.wav,44100,16,60,1,H,512,hil,NULL,NULL,0.855274258711796,NA 
rayol-farm2_2019-03-29_16-46-22.wav,44100,16,60,1,H,512,hil,NULL,NULL,0.826953340669458,NA 
rayol-farm2_2019-03-29_16-48-22.wav,44100,16,60,1,H,512,hil,NULL,NULL,0.830549438286966,NA 
rayol-farm2_2019-03-29_16-50-22.wav,44100,16,60,1,H,512,hil,NULL,NULL,0.871056112931537,NA 
rayol-farm2_2019-03-29_16-52-22.wav,44100,16,60,1,H,512,hil,NULL,NULL,0.887005949103422,NA 
rayol-farm2_2019-03-29_16-54-22.wav,44100,16,60,1,H,512,hil,NULL,NULL,0.895900221238383,NA 
rayol-farm2_2019-03-29_16-56-22.wav,44100,16,60,1,H,512,hil,NULL,NULL,0.873031171740634,NA 
rayol-farm2_2019-03-29_16-58-22.wav,44100,16,60,1,H,512,hil,NULL,NULL,0.836980120211425,NA 
rayol-farm2_2019-03-29_17-00-22.wav,44100,16,60,1,H,512,hil,NULL,NULL,0.893711193993609,NA 
rayol-farm2_2019-03-29_17-02-23.wav,44100,16,60,1,H,512,hil,NULL,NULL,0.834604544890044,NA 
rayol-farm2_2019-03-29_17-04-23.wav,44100,16,60,1,H,512,hil,NULL,NULL,0.832979352306742,NA 
rayol-farm2_2019-03-29_17-06-23.wav,44100,16,60,1,H,512,hil,NULL,NULL,0.825675479066028,NA 
rayol-farm2_2019-03-29_17-08-23.wav,44100,16,60,1,H,512,hil,NULL,NULL,0.875741022182437,NA 
rayol-farm2_2019-03-29_17-10-23.wav,44100,16,60,1,H,512,hil,NULL,NULL,0.862294846489752,NA 
rayol-farm2_2019-03-29_17-12-23.wav,44100,16,60,1,H,512,hil,NULL,NULL,0.893406196178614,NA 
rayol-farm2_2019-03-29_17-14-23.wav,44100,16,60,1,H,512,hil,NULL,NULL,0.847727114834779,NA 
rayol-farm2_2019-03-29_17-16-23.wav,44100,16,60,1,H,512,hil,NULL,NULL,0.890787464410446,NA 
rayol-farm2_2019-03-29_17-18-23.wav,44100,16,60,1,H,512,hil,NULL,NULL,0.895375183151202,NA 
rayol-farm2_2019-03-29_17-20-24.wav,44100,16,60,1,H,512,hil,NULL,NULL,0.893585291559015,NA 
rayol-farm2_2019-03-29_17-22-24.wav,44100,16,60,1,H,512,hil,NULL,NULL,0.895359921829774,NA 
rayol-farm2_2019-03-29_17-24-24.wav,44100,16,60,1,H,512,hil,NULL,NULL,0.870554090430708,NA 
rayol-farm2_2019-03-29_17-26-24.wav,44100,16,60,1,H,512,hil,NULL,NULL,0.891227773391278,NA 
rayol-farm2_2019-03-29_17-28-24.wav,44100,16,60,1,H,512,hil,NULL,NULL,0.865536800493325,NA 
rayol-farm2_2019-03-29_17-30-24.wav,44100,16,60,1,H,512,hil,NULL,NULL,0.881224438743504,NA 
rayol-farm2_2019-03-29_17-32-24.wav,44100,16,60,1,H,512,hil,NULL,NULL,0.895109236276725,NA 
rayol-farm2_2019-03-29_17-34-24.wav,44100,16,60,1,H,512,hil,NULL,NULL,0.881491183675235,NA 
rayol-farm2_2019-03-29_17-36-25.wav,44100,16,60,1,H,512,hil,NULL,NULL,0.898658551400406,NA 
rayol-farm2_2019-03-29_17-38-25.wav,44100,16,60,1,H,512,hil,NULL,NULL,0.894429515946871,NA 
rayol-farm2_2019-03-29_17-40-25.wav,44100,16,60,1,H,512,hil,NULL,NULL,0.893619819694841,NA 
rayol-farm2_2019-03-29_17-42-25.wav,44100,16,60,1,H,512,hil,NULL,NULL,0.894762870046758,NA 
rayol-farm2_2019-03-29_17-44-25.wav,44100,16,60,1,H,512,hil,NULL,NULL,0.892136354472234,NA 
rayol-farm2_2019-03-29_17-46-25.wav,44100,16,60,1,H,512,hil,NULL,NULL,0.885865238282807,NA 
rayol-farm2_2019-03-29_17-48-25.wav,44100,16,60,1,H,512,hil,NULL,NULL,0.874641965078407,NA 
rayol-farm2_2019-03-29_17-50-25.wav,44100,16,60,1,H,512,hil,NULL,NULL,0.883678305412435,NA 
rayol-farm2_2019-03-29_17-52-26.wav,44100,16,60,1,H,512,hil,NULL,NULL,0.889998640950744,NA 
rayol-farm2_2019-03-29_17-54-26.wav,44100,16,60,1,H,512,hil,NULL,NULL,0.868270883159301,NA 
rayol-farm2_2019-03-29_17-56-26.wav,44100,16,60,1,H,512,hil,NULL,NULL,0.860459016964883,NA 
rayol-farm2_2019-03-29_17-58-26.wav,44100,16,60,1,H,512,hil,NULL,NULL,0.900083499388658,NA 
rayol-farm2_2019-03-29_18-00-26.wav,44100,16,60,1,H,512,hil,NULL,NULL,0.889038102395149,NA 
rayol-farm2_2019-03-29_18-02-26.wav,44100,16,60,1,H,512,hil,NULL,NULL,0.893780568996668,NA 
rayol-farm2_2019-03-29_18-04-26.wav,44100,16,60,1,H,512,hil,NULL,NULL,0.880529683872629,NA 
rayol-farm2_2019-03-29_18-06-26.wav,44100,16,60,1,H,512,hil,NULL,NULL,0.893247656842157,NA 
rayol-farm2_2019-03-29_18-08-27.wav,44100,16,60,1,H,512,hil,NULL,NULL,0.882287985714307,NA 
rayol-farm2_2019-03-29_18-10-27.wav,44100,16,60,1,H,512,hil,NULL,NULL,0.883642997423866,NA 
rayol-farm2_2019-03-29_18-12-27.wav,44100,16,60,1,H,512,hil,NULL,NULL,0.889378463752974,NA 
rayol-farm2_2019-03-29_18-14-27.wav,44100,16,60,1,H,512,hil,NULL,NULL,0.892298347705485,NA 
rayol-farm2_2019-03-29_18-16-27.wav,44100,16,60,1,H,512,hil,NULL,NULL,0.894353872523839,NA 
rayol-farm2_2019-03-29_18-18-27.wav,44100,16,60,1,H,512,hil,NULL,NULL,0.893658668472091,NA 
rayol-farm2_2019-03-29_18-20-27.wav,44100,16,60,1,H,512,hil,NULL,NULL,0.897598744915518,NA 
rayol-farm2_2019-03-29_18-22-27.wav,44100,16,60,1,H,512,hil,NULL,NULL,0.895983882885445,NA 
rayol-farm2_2019-03-29_18-24-27.wav,44100,16,60,1,H,512,hil,NULL,NULL,0.893419921874537,NA 
rayol-farm2_2019-03-29_18-26-28.wav,44100,16,60,1,H,512,hil,NULL,NULL,0.888295777568821,NA 
rayol-farm2_2019-03-29_18-28-28.wav,44100,16,60,1,H,512,hil,NULL,NULL,0.896523083021092,NA 
rayol-farm2_2019-03-29_18-30-28.wav,44100,16,60,1,H,512,hil,NULL,NULL,0.896839489344927,NA 
rayol-farm2_2019-03-29_18-32-28.wav,44100,16,60,1,H,512,hil,NULL,NULL,0.895169372879715,NA 
rayol-farm2_2019-03-29_18-34-28.wav,44100,16,60,1,H,512,hil,NULL,NULL,0.892378316661437,NA 
rayol-farm2_2019-03-29_18-36-28.wav,44100,16,60,1,H,512,hil,NULL,NULL,0.892272763469506,NA 
rayol-farm2_2019-03-29_18-38-28.wav,44100,16,60,1,H,512,hil,NULL,NULL,0.883741585511007,NA 
rayol-farm2_2019-03-29_18-40-28.wav,44100,16,60,1,H,512,hil,NULL,NULL,0.889883117253913,NA 
rayol-farm2_2019-03-29_18-42-29.wav,44100,16,60,1,H,512,hil,NULL,NULL,0.897372975184284,NA 
rayol-farm2_2019-03-29_18-44-29.wav,44100,16,60,1,H,512,hil,NULL,NULL,0.897926172776969,NA 
rayol-farm2_2019-03-29_18-46-29.wav,44100,16,60,1,H,512,hil,NULL,NULL,0.896598082176403,NA 
rayol-farm2_2019-03-29_18-48-29.wav,44100,16,60,1,H,512,hil,NULL,NULL,0.900085112217632,NA 
rayol-farm2_2019-03-29_18-50-29.wav,44100,16,60,1,H,512,hil,NULL,NULL,0.903017231337641,NA 
rayol-farm2_2019-03-29_18-52-29.wav,44100,16,60,1,H,512,hil,NULL,NULL,0.899514190097758,NA 
rayol-farm2_2019-03-29_18-54-29.wav,44100,16,60,1,H,512,hil,NULL,NULL,0.896577242281501,NA 
rayol-farm2_2019-03-29_18-56-29.wav,44100,16,60,1,H,512,hil,NULL,NULL,0.893377154457051,NA 
rayol-farm2_2019-03-29_18-58-30.wav,44100,16,60,1,H,512,hil,NULL,NULL,0.886789515710443,NA 
rayol-farm2_2019-03-29_19-00-30.wav,44100,16,60,1,H,512,hil,NULL,NULL,0.885045132465272,NA 
rayol-farm2_2019-03-29_19-02-30.wav,44100,16,60,1,H,512,hil,NULL,NULL,0.88421599249403,NA 
rayol-farm2_2019-03-29_19-04-30.wav,44100,16,60,1,H,512,hil,NULL,NULL,0.892965409369722,NA 
rayol-farm2_2019-03-29_19-06-30.wav,44100,16,60,1,H,512,hil,NULL,NULL,0.886828913774347,NA 
rayol-farm2_2019-03-29_19-08-30.wav,44100,16,60,1,H,512,hil,NULL,NULL,0.894949232607284,NA 
rayol-farm2_2019-03-29_19-10-30.wav,44100,16,60,1,H,512,hil,NULL,NULL,0.893152061135064,NA 
rayol-farm2_2019-03-29_19-12-30.wav,44100,16,60,1,H,512,hil,NULL,NULL,0.887708977057908,NA 
rayol-farm2_2019-03-29_19-14-31.wav,44100,16,60,1,H,512,hil,NULL,NULL,0.89330292436046,NA 
rayol-farm2_2019-03-29_19-16-31.wav,44100,16,60,1,H,512,hil,NULL,NULL,0.892342330358696,NA 
rayol-farm2_2019-03-29_19-18-31.wav,44100,16,60,1,H,512,hil,NULL,NULL,0.890714672022143,NA 
rayol-farm2_2019-03-29_19-20-31.wav,44100,16,60,1,H,512,hil,NULL,NULL,0.890757080059452,NA 
rayol-farm2_2019-03-29_19-22-31.wav,44100,16,60,1,H,512,hil,NULL,NULL,0.885478683681166,NA 
rayol-farm2_2019-03-29_19-24-31.wav,44100,16,60,1,H,512,hil,NULL,NULL,0.882683109720383,NA 
rayol-farm2_2019-03-29_19-26-31.wav,44100,16,60,1,H,512,hil,NULL,NULL,0.891166695664417,NA 
rayol-farm2_2019-03-29_19-28-31.wav,44100,16,60,1,H,512,hil,NULL,NULL,0.880036503176001,NA 
rayol-farm2_2019-03-29_19-30-31.wav,44100,16,60,1,H,512,hil,NULL,NULL,0.883760063370219,NA 
rayol-farm2_2019-03-29_19-32-32.wav,44100,16,60,1,H,512,hil,NULL,NULL,0.892875734165516,NA 
rayol-farm2_2019-03-29_19-34-32.wav,44100,16,60,1,H,512,hil,NULL,NULL,0.896591120341897,NA 
rayol-farm2_2019-03-29_19-36-32.wav,44100,16,60,1,H,512,hil,NULL,NULL,0.89025411317021,NA 
rayol-farm2_2019-03-29_19-38-32.wav,44100,16,60,1,H,512,hil,NULL,NULL,0.892016635418325,NA 
rayol-farm2_2019-03-29_19-40-32.wav,44100,16,60,1,H,512,hil,NULL,NULL,0.891446379837355,NA 
rayol-farm2_2019-03-29_19-42-32.wav,44100,16,60,1,H,512,hil,NULL,NULL,0.890141094616703,NA 
rayol-farm2_2019-03-29_19-44-32.wav,44100,16,60,1,H,512,hil,NULL,NULL,0.891464140200241,NA 
rayol-farm2_2019-03-29_19-46-32.wav,44100,16,60,1,H,512,hil,NULL,NULL,0.889315709139121,NA 
rayol-farm2_2019-03-29_19-48-33.wav,44100,16,60,1,H,512,hil,NULL,NULL,0.89283703224514,NA 
rayol-farm2_2019-03-29_19-50-33.wav,44100,16,60,1,H,512,hil,NULL,NULL,0.895135087858274,NA 
rayol-farm2_2019-03-29_19-52-33.wav,44100,16,60,1,H,512,hil,NULL,NULL,0.896352141981769,NA 
rayol-farm2_2019-03-29_19-54-33.wav,44100,16,60,1,H,512,hil,NULL,NULL,0.895523370848664,NA 
rayol-farm2_2019-03-29_19-56-33.wav,44100,16,60,1,H,512,hil,NULL,NULL,0.896291699681108,NA 
rayol-farm2_2019-03-29_19-58-33.wav,44100,16,60,1,H,512,hil,NULL,NULL,0.886141905536751,NA 
rayol-farm2_2019-03-29_20-00-33.wav,44100,16,60,1,H,512,hil,NULL,NULL,0.89690739901573,NA 
rayol-farm2_2019-03-29_20-02-33.wav,44100,16,60,1,H,512,hil,NULL,NULL,0.89754543049138,NA 
rayol-farm2_2019-03-29_20-04-34.wav,44100,16,60,1,H,512,hil,NULL,NULL,0.895969549258497,NA 
rayol-farm2_2019-03-29_20-06-34.wav,44100,16,60,1,H,512,hil,NULL,NULL,0.894133230984091,NA 
rayol-farm2_2019-03-29_20-08-34.wav,44100,16,60,1,H,512,hil,NULL,NULL,0.893194317864778,NA 
rayol-farm2_2019-03-29_20-10-34.wav,44100,16,60,1,H,512,hil,NULL,NULL,0.893603704691736,NA 
rayol-farm2_2019-03-29_20-12-34.wav,44100,16,60,1,H,512,hil,NULL,NULL,0.898085121742855,NA 
rayol-farm2_2019-03-29_20-14-34.wav,44100,16,60,1,H,512,hil,NULL,NULL,0.896546203336269,NA 
rayol-farm2_2019-03-29_20-16-34.wav,44100,16,60,1,H,512,hil,NULL,NULL,0.897090389991972,NA 
rayol-farm2_2019-03-29_20-18-34.wav,44100,16,60,1,H,512,hil,NULL,NULL,0.895570714492676,NA 
rayol-farm2_2019-03-29_20-20-35.wav,44100,16,60,1,H,512,hil,NULL,NULL,0.893703801489269,NA 
rayol-farm2_2019-03-29_20-22-35.wav,44100,16,60,1,H,512,hil,NULL,NULL,0.896861956308563,NA 
rayol-farm2_2019-03-29_20-24-35.wav,44100,16,60,1,H,512,hil,NULL,NULL,0.896196526082098,NA 
rayol-farm2_2019-03-29_20-26-35.wav,44100,16,60,1,H,512,hil,NULL,NULL,0.891971210220806,NA 
rayol-farm2_2019-03-29_20-28-35.wav,44100,16,60,1,H,512,hil,NULL,NULL,0.894080824726287,NA 
rayol-farm2_2019-03-29_20-30-35.wav,44100,16,60,1,H,512,hil,NULL,NULL,0.89429404936079,NA 
rayol-farm2_2019-03-29_20-32-35.wav,44100,16,60,1,H,512,hil,NULL,NULL,0.891796129794365,NA 
rayol-farm2_2019-03-29_20-34-35.wav,44100,16,60,1,H,512,hil,NULL,NULL,0.884213157562696,NA 
rayol-farm2_2019-03-29_20-36-35.wav,44100,16,60,1,H,512,hil,NULL,NULL,0.894664271064466,NA 
rayol-farm2_2019-03-29_20-38-36.wav,44100,16,60,1,H,512,hil,NULL,NULL,0.893308908854361,NA 
rayol-farm2_2019-03-29_20-40-36.wav,44100,16,60,1,H,512,hil,NULL,NULL,0.897510808789097,NA 
rayol-farm2_2019-03-29_20-42-36.wav,44100,16,60,1,H,512,hil,NULL,NULL,0.892983393683487,NA 
rayol-farm2_2019-03-29_20-44-36.wav,44100,16,60,1,H,512,hil,NULL,NULL,0.896465872070139,NA 
rayol-farm2_2019-03-29_20-46-36.wav,44100,16,60,1,H,512,hil,NULL,NULL,0.88835890009344,NA 
rayol-farm2_2019-03-29_20-48-36.wav,44100,16,60,1,H,512,hil,NULL,NULL,0.885848075412272,NA 
rayol-farm2_2019-03-29_20-50-36.wav,44100,16,60,1,H,512,hil,NULL,NULL,0.894607473836526,NA 
rayol-farm2_2019-03-29_20-52-36.wav,44100,16,60,1,H,512,hil,NULL,NULL,0.893712968580919,NA 
rayol-farm2_2019-03-29_20-54-37.wav,44100,16,60,1,H,512,hil,NULL,NULL,0.892256980077541,NA 
rayol-farm2_2019-03-29_20-56-37.wav,44100,16,60,1,H,512,hil,NULL,NULL,0.89161182108605,NA 
rayol-farm2_2019-03-29_20-58-37.wav,44100,16,60,1,H,512,hil,NULL,NULL,0.894846934849532,NA 
rayol-farm2_2019-03-29_21-00-37.wav,44100,16,60,1,H,512,hil,NULL,NULL,0.898291886863085,NA 
rayol-farm2_2019-03-29_21-02-37.wav,44100,16,60,1,H,512,hil,NULL,NULL,0.893859320949518,NA 
rayol-farm2_2019-03-29_21-04-37.wav,44100,16,60,1,H,512,hil,NULL,NULL,0.897804445034922,NA 
rayol-farm2_2019-03-29_21-06-37.wav,44100,16,60,1,H,512,hil,NULL,NULL,0.897595452346943,NA 
rayol-farm2_2019-03-29_21-08-37.wav,44100,16,60,1,H,512,hil,NULL,NULL,0.898133310024198,NA 
rayol-farm2_2019-03-29_21-10-38.wav,44100,16,60,1,H,512,hil,NULL,NULL,0.897875011279141,NA 
rayol-farm2_2019-03-29_21-12-38.wav,44100,16,60,1,H,512,hil,NULL,NULL,0.896570530410391,NA 
rayol-farm2_2019-03-29_21-14-38.wav,44100,16,60,1,H,512,hil,NULL,NULL,0.89691628177273,NA 
rayol-farm2_2019-03-29_21-16-38.wav,44100,16,60,1,H,512,hil,NULL,NULL,0.892873767797054,NA 
rayol-farm2_2019-03-29_21-18-38.wav,44100,16,60,1,H,512,hil,NULL,NULL,0.889653412852758,NA 
rayol-farm2_2019-03-29_21-20-38.wav,44100,16,60,1,H,512,hil,NULL,NULL,0.892001439368497,NA 
rayol-farm2_2019-03-29_21-22-38.wav,44100,16,60,1,H,512,hil,NULL,NULL,0.896484561105535,NA 
rayol-farm2_2019-03-29_21-24-38.wav,44100,16,60,1,H,512,hil,NULL,NULL,0.88497796040202,NA 
rayol-farm2_2019-03-29_21-26-39.wav,44100,16,60,1,H,512,hil,NULL,NULL,0.897269842125528,NA 
rayol-farm2_2019-03-29_21-28-39.wav,44100,16,60,1,H,512,hil,NULL,NULL,0.897368105619919,NA 
rayol-farm2_2019-03-29_21-30-39.wav,44100,16,60,1,H,512,hil,NULL,NULL,0.898389821085849,NA 
rayol-farm2_2019-03-29_21-32-39.wav,44100,16,60,1,H,512,hil,NULL,NULL,0.897212101794291,NA 
rayol-farm2_2019-03-29_21-34-39.wav,44100,16,60,1,H,512,hil,NULL,NULL,0.898668115373116,NA 
rayol-farm2_2019-03-29_21-36-39.wav,44100,16,60,1,H,512,hil,NULL,NULL,0.898087431651715,NA 
rayol-farm2_2019-03-29_21-38-39.wav,44100,16,60,1,H,512,hil,NULL,NULL,0.895271567617477,NA 
rayol-farm2_2019-03-29_21-40-39.wav,44100,16,60,1,H,512,hil,NULL,NULL,0.892566329730702,NA 
rayol-farm2_2019-03-29_21-42-40.wav,44100,16,60,1,H,512,hil,NULL,NULL,0.8919888790163,NA 
rayol-farm2_2019-03-29_21-44-40.wav,44100,16,60,1,H,512,hil,NULL,NULL,0.88625718593418,NA 
rayol-farm2_2019-03-29_21-46-40.wav,44100,16,60,1,H,512,hil,NULL,NULL,0.894058390866373,NA 
rayol-farm2_2019-03-29_21-48-40.wav,44100,16,60,1,H,512,hil,NULL,NULL,0.896502281071004,NA 
rayol-farm2_2019-03-29_21-50-40.wav,44100,16,60,1,H,512,hil,NULL,NULL,0.898595142366652,NA 
rayol-farm2_2019-03-29_21-52-40.wav,44100,16,60,1,H,512,hil,NULL,NULL,0.898741861778323,NA 
rayol-farm2_2019-03-29_21-54-40.wav,44100,16,60,1,H,512,hil,NULL,NULL,0.894983437983837,NA 
rayol-farm2_2019-03-29_21-56-40.wav,44100,16,60,1,H,512,hil,NULL,NULL,0.897334714550586,NA 
rayol-farm2_2019-03-29_21-58-41.wav,44100,16,60,1,H,512,hil,NULL,NULL,0.899074997522529,NA 
rayol-farm2_2019-03-29_22-00-41.wav,44100,16,60,1,H,512,hil,NULL,NULL,0.898108275114625,NA 
rayol-farm2_2019-03-29_22-02-41.wav,44100,16,60,1,H,512,hil,NULL,NULL,0.898335592911216,NA 
rayol-farm2_2019-03-29_22-04-41.wav,44100,16,60,1,H,512,hil,NULL,NULL,0.893615646502789,NA 
rayol-farm2_2019-03-29_22-06-41.wav,44100,16,60,1,H,512,hil,NULL,NULL,0.893063340341841,NA 
rayol-farm2_2019-03-29_22-08-41.wav,44100,16,60,1,H,512,hil,NULL,NULL,0.892402543602155,NA 
rayol-farm2_2019-03-29_22-10-41.wav,44100,16,60,1,H,512,hil,NULL,NULL,0.897011917003914,NA 
rayol-farm2_2019-03-29_22-12-41.wav,44100,16,60,1,H,512,hil,NULL,NULL,0.892029870726245,NA 
rayol-farm2_2019-03-29_22-14-41.wav,44100,16,60,1,H,512,hil,NULL,NULL,0.895874576950315,NA 
rayol-farm2_2019-03-29_22-16-42.wav,44100,16,60,1,H,512,hil,NULL,NULL,0.898568386714167,NA 
rayol-farm2_2019-03-29_22-18-42.wav,44100,16,60,1,H,512,hil,NULL,NULL,0.89163325564659,NA 
rayol-farm2_2019-03-29_22-20-42.wav,44100,16,60,1,H,512,hil,NULL,NULL,0.898721252042061,NA 
rayol-farm2_2019-03-29_22-22-42.wav,44100,16,60,1,H,512,hil,NULL,NULL,0.898236004753341,NA 
rayol-farm2_2019-03-29_22-24-42.wav,44100,16,60,1,H,512,hil,NULL,NULL,0.896577394728916,NA 
rayol-farm2_2019-03-29_22-26-42.wav,44100,16,60,1,H,512,hil,NULL,NULL,0.897103817384363,NA 
rayol-farm2_2019-03-29_22-28-42.wav,44100,16,60,1,H,512,hil,NULL,NULL,0.890758382636892,NA 
rayol-farm2_2019-03-29_22-30-42.wav,44100,16,60,1,H,512,hil,NULL,NULL,0.893878673321627,NA 
rayol-farm2_2019-03-29_22-32-43.wav,44100,16,60,1,H,512,hil,NULL,NULL,0.889932069343567,NA 
rayol-farm2_2019-03-29_22-34-43.wav,44100,16,60,1,H,512,hil,NULL,NULL,0.898235682775912,NA 
rayol-farm2_2019-03-29_22-36-43.wav,44100,16,60,1,H,512,hil,NULL,NULL,0.892295907844001,NA 
rayol-farm2_2019-03-29_22-38-43.wav,44100,16,60,1,H,512,hil,NULL,NULL,0.895138497436868,NA 
rayol-farm2_2019-03-29_22-40-43.wav,44100,16,60,1,H,512,hil,NULL,NULL,0.893721580107936,NA 
rayol-farm2_2019-03-29_22-42-43.wav,44100,16,60,1,H,512,hil,NULL,NULL,0.89256804640715,NA 
rayol-farm2_2019-03-29_22-44-43.wav,44100,16,60,1,H,512,hil,NULL,NULL,0.893195348861263,NA 
rayol-farm2_2019-03-29_22-46-43.wav,44100,16,60,1,H,512,hil,NULL,NULL,0.897747249985207,NA 
rayol-farm2_2019-03-29_22-48-44.wav,44100,16,60,1,H,512,hil,NULL,NULL,0.898064425641847,NA 
rayol-farm2_2019-03-29_22-50-44.wav,44100,16,60,1,H,512,hil,NULL,NULL,0.89809749218368,NA 
rayol-farm2_2019-03-29_22-52-44.wav,44100,16,60,1,H,512,hil,NULL,NULL,0.894605952544688,NA 
rayol-farm2_2019-03-29_22-54-44.wav,44100,16,60,1,H,512,hil,NULL,NULL,0.894324323015807,NA 
rayol-farm2_2019-03-29_22-56-44.wav,44100,16,60,1,H,512,hil,NULL,NULL,0.892843153740441,NA 
rayol-farm2_2019-03-29_22-58-44.wav,44100,16,60,1,H,512,hil,NULL,NULL,0.888715156644686,NA 
rayol-farm2_2019-03-29_23-00-44.wav,44100,16,60,1,H,512,hil,NULL,NULL,0.897407153010155,NA 
rayol-farm2_2019-03-29_23-02-44.wav,44100,16,60,1,H,512,hil,NULL,NULL,0.889943006484,NA 
rayol-farm2_2019-03-29_23-04-45.wav,44100,16,60,1,H,512,hil,NULL,NULL,0.89718638595527,NA 
rayol-farm2_2019-03-29_23-06-45.wav,44100,16,60,1,H,512,hil,NULL,NULL,0.896171946769395,NA 
rayol-farm2_2019-03-29_23-08-45.wav,44100,16,60,1,H,512,hil,NULL,NULL,0.896703692292714,NA 
rayol-farm2_2019-03-29_23-10-45.wav,44100,16,60,1,H,512,hil,NULL,NULL,0.890591569624314,NA 
rayol-farm2_2019-03-29_23-12-45.wav,44100,16,60,1,H,512,hil,NULL,NULL,0.896953804913334,NA 
rayol-farm2_2019-03-29_23-14-45.wav,44100,16,60,1,H,512,hil,NULL,NULL,0.895516680726006,NA 
rayol-farm2_2019-03-29_23-16-45.wav,44100,16,60,1,H,512,hil,NULL,NULL,0.89682979817096,NA 
rayol-farm2_2019-03-29_23-18-45.wav,44100,16,60,1,H,512,hil,NULL,NULL,0.892033859450496,NA 
rayol-farm2_2019-03-29_23-20-45.wav,44100,16,60,1,H,512,hil,NULL,NULL,0.884648175708283,NA 
rayol-farm2_2019-03-29_23-22-46.wav,44100,16,60,1,H,512,hil,NULL,NULL,0.893421662713478,NA 
rayol-farm2_2019-03-29_23-24-46.wav,44100,16,60,1,H,512,hil,NULL,NULL,0.897030989409072,NA 
rayol-farm2_2019-03-29_23-26-46.wav,44100,16,60,1,H,512,hil,NULL,NULL,0.897734636254906,NA 
rayol-farm2_2019-03-29_23-28-46.wav,44100,16,60,1,H,512,hil,NULL,NULL,0.897551075974521,NA 
rayol-farm2_2019-03-29_23-30-46.wav,44100,16,60,1,H,512,hil,NULL,NULL,0.896431342529915,NA 
rayol-farm2_2019-03-29_23-32-46.wav,44100,16,60,1,H,512,hil,NULL,NULL,0.897864847701419,NA 
rayol-farm2_2019-03-29_23-34-46.wav,44100,16,60,1,H,512,hil,NULL,NULL,0.896361616011335,NA 
rayol-farm2_2019-03-29_23-36-46.wav,44100,16,60,1,H,512,hil,NULL,NULL,0.897787391321803,NA 
rayol-farm2_2019-03-29_23-38-47.wav,44100,16,60,1,H,512,hil,NULL,NULL,0.895701541732908,NA 
rayol-farm2_2019-03-29_23-40-47.wav,44100,16,60,1,H,512,hil,NULL,NULL,0.89612240783256,NA 
rayol-farm2_2019-03-29_23-42-47.wav,44100,16,60,1,H,512,hil,NULL,NULL,0.895499235095741,NA 
rayol-farm2_2019-03-29_23-44-47.wav,44100,16,60,1,H,512,hil,NULL,NULL,0.892195242418021,NA 
rayol-farm2_2019-03-29_23-46-47.wav,44100,16,60,1,H,512,hil,NULL,NULL,0.887995177747129,NA 
rayol-farm2_2019-03-29_23-48-47.wav,44100,16,60,1,H,512,hil,NULL,NULL,0.892469236320882,NA 
rayol-farm2_2019-03-29_23-50-47.wav,44100,16,60,1,H,512,hil,NULL,NULL,0.89707125878556,NA 
rayol-farm2_2019-03-29_23-52-47.wav,44100,16,60,1,H,512,hil,NULL,NULL,0.896703452761821,NA 
rayol-farm2_2019-03-29_23-54-48.wav,44100,16,60,1,H,512,hil,NULL,NULL,0.896300873388725,NA 
rayol-farm2_2019-03-29_23-56-48.wav,44100,16,60,1,H,512,hil,NULL,NULL,0.89626886004418,NA 
rayol-farm2_2019-03-29_23-58-48.wav,44100,16,60,1,H,512,hil,NULL,NULL,0.895998722739755,NA
