FILENAME,SAMPLINGRATE,BIT,DURATION,CHANNELS,INDEX,FFT_W,MIN_FREQ,MAX_FREQ,LEFT_CHANNEL,RIGHT_CHANNEL
rayol-farm2_2019-05-02_00-00-25.wav,44100,16,60,1,bioacoustic_index,512,2000,8000,1.23242525650114,NA 
rayol-farm2_2019-05-02_00-02-25.wav,44100,16,60,1,bioacoustic_index,512,2000,8000,1.28052775109361,NA 
rayol-farm2_2019-05-02_00-04-26.wav,44100,16,60,1,bioacoustic_index,512,2000,8000,1.24224219508725,NA 
rayol-farm2_2019-05-02_00-06-26.wav,44100,16,60,1,bioacoustic_index,512,2000,8000,1.35675184199469,NA 
rayol-farm2_2019-05-02_00-08-26.wav,44100,16,60,1,bioacoustic_index,512,2000,8000,1.26412977273782,NA 
rayol-farm2_2019-05-02_00-10-26.wav,44100,16,60,1,bioacoustic_index,512,2000,8000,1.3275712446529,NA 
rayol-farm2_2019-05-02_00-12-26.wav,44100,16,60,1,bioacoustic_index,512,2000,8000,1.3856043872193,NA 
rayol-farm2_2019-05-02_00-14-26.wav,44100,16,60,1,bioacoustic_index,512,2000,8000,1.33685398699133,NA 
rayol-farm2_2019-05-02_00-16-26.wav,44100,16,60,1,bioacoustic_index,512,2000,8000,1.36679548861533,NA 
rayol-farm2_2019-05-02_00-18-26.wav,44100,16,60,1,bioacoustic_index,512,2000,8000,1.29403441725331,NA 
rayol-farm2_2019-05-02_00-20-27.wav,44100,16,60,1,bioacoustic_index,512,2000,8000,1.34162311209304,NA 
rayol-farm2_2019-05-02_00-22-27.wav,44100,16,60,1,bioacoustic_index,512,2000,8000,1.34081617867949,NA 
rayol-farm2_2019-05-02_00-24-27.wav,44100,16,60,1,bioacoustic_index,512,2000,8000,1.29772761179964,NA 
rayol-farm2_2019-05-02_00-26-27.wav,44100,16,60,1,bioacoustic_index,512,2000,8000,1.21665739588434,NA 
rayol-farm2_2019-05-02_00-28-27.wav,44100,16,60,1,bioacoustic_index,512,2000,8000,1.89722546336358,NA 
rayol-farm2_2019-05-02_00-30-27.wav,44100,16,60,1,bioacoustic_index,512,2000,8000,1.83187799075449,NA 
rayol-farm2_2019-05-02_00-32-27.wav,44100,16,60,1,bioacoustic_index,512,2000,8000,2.16551075323453,NA 
rayol-farm2_2019-05-02_00-34-27.wav,44100,16,60,1,bioacoustic_index,512,2000,8000,2.57327955256772,NA 
rayol-farm2_2019-05-02_00-36-27.wav,44100,16,60,1,bioacoustic_index,512,2000,8000,2.33271853268042,NA 
rayol-farm2_2019-05-02_00-38-28.wav,44100,16,60,1,bioacoustic_index,512,2000,8000,2.22621809984897,NA 
rayol-farm2_2019-05-02_00-40-28.wav,44100,16,60,1,bioacoustic_index,512,2000,8000,2.4744763501871,NA 
rayol-farm2_2019-05-02_00-42-28.wav,44100,16,60,1,bioacoustic_index,512,2000,8000,2.10041096660102,NA 
rayol-farm2_2019-05-02_00-44-28.wav,44100,16,60,1,bioacoustic_index,512,2000,8000,2.31708652506231,NA 
rayol-farm2_2019-05-02_00-46-28.wav,44100,16,60,1,bioacoustic_index,512,2000,8000,2.47786440104044,NA 
rayol-farm2_2019-05-02_00-48-28.wav,44100,16,60,1,bioacoustic_index,512,2000,8000,2.44322755111577,NA 
rayol-farm2_2019-05-02_00-50-28.wav,44100,16,60,1,bioacoustic_index,512,2000,8000,2.45286786806351,NA 
rayol-farm2_2019-05-02_00-52-28.wav,44100,16,60,1,bioacoustic_index,512,2000,8000,2.58395956246753,NA 
rayol-farm2_2019-05-02_00-54-29.wav,44100,16,60,1,bioacoustic_index,512,2000,8000,2.46599971437515,NA 
rayol-farm2_2019-05-02_00-56-29.wav,44100,16,60,1,bioacoustic_index,512,2000,8000,2.24620706549777,NA 
rayol-farm2_2019-05-02_00-58-29.wav,44100,16,60,1,bioacoustic_index,512,2000,8000,2.63173872891777,NA 
rayol-farm2_2019-05-02_01-00-29.wav,44100,16,60,1,bioacoustic_index,512,2000,8000,2.77217997224981,NA 
rayol-farm2_2019-05-02_01-02-29.wav,44100,16,60,1,bioacoustic_index,512,2000,8000,2.50487950626234,NA 
rayol-farm2_2019-05-02_01-04-29.wav,44100,16,60,1,bioacoustic_index,512,2000,8000,2.52229899939368,NA 
rayol-farm2_2019-05-02_01-06-29.wav,44100,16,60,1,bioacoustic_index,512,2000,8000,2.69171535103419,NA 
rayol-farm2_2019-05-02_01-08-29.wav,44100,16,60,1,bioacoustic_index,512,2000,8000,2.14093192669464,NA 
rayol-farm2_2019-05-02_01-10-30.wav,44100,16,60,1,bioacoustic_index,512,2000,8000,2.54486069460385,NA 
rayol-farm2_2019-05-02_01-12-30.wav,44100,16,60,1,bioacoustic_index,512,2000,8000,2.83645368057303,NA 
rayol-farm2_2019-05-02_01-14-30.wav,44100,16,60,1,bioacoustic_index,512,2000,8000,2.63798375432778,NA 
rayol-farm2_2019-05-02_01-16-30.wav,44100,16,60,1,bioacoustic_index,512,2000,8000,2.70940609237859,NA 
rayol-farm2_2019-05-02_01-18-30.wav,44100,16,60,1,bioacoustic_index,512,2000,8000,2.58045957432338,NA 
rayol-farm2_2019-05-02_01-20-30.wav,44100,16,60,1,bioacoustic_index,512,2000,8000,1.56013680356047,NA 
rayol-farm2_2019-05-02_01-22-30.wav,44100,16,60,1,bioacoustic_index,512,2000,8000,1.82681861480057,NA 
rayol-farm2_2019-05-02_01-24-30.wav,44100,16,60,1,bioacoustic_index,512,2000,8000,2.13069034051256,NA 
rayol-farm2_2019-05-02_01-26-31.wav,44100,16,60,1,bioacoustic_index,512,2000,8000,2.49633919625169,NA 
rayol-farm2_2019-05-02_01-28-31.wav,44100,16,60,1,bioacoustic_index,512,2000,8000,2.64202031419578,NA 
rayol-farm2_2019-05-02_01-30-31.wav,44100,16,60,1,bioacoustic_index,512,2000,8000,2.26443379272812,NA 
rayol-farm2_2019-05-02_01-32-31.wav,44100,16,60,1,bioacoustic_index,512,2000,8000,1.74322375651624,NA 
rayol-farm2_2019-05-02_01-34-31.wav,44100,16,60,1,bioacoustic_index,512,2000,8000,2.32147454483518,NA 
rayol-farm2_2019-05-02_01-36-31.wav,44100,16,60,1,bioacoustic_index,512,2000,8000,2.68763876895335,NA 
rayol-farm2_2019-05-02_01-38-31.wav,44100,16,60,1,bioacoustic_index,512,2000,8000,2.41641573699798,NA 
rayol-farm2_2019-05-02_01-40-31.wav,44100,16,60,1,bioacoustic_index,512,2000,8000,2.75219908071556,NA 
rayol-farm2_2019-05-02_01-42-31.wav,44100,16,60,1,bioacoustic_index,512,2000,8000,2.56610732341444,NA 
rayol-farm2_2019-05-02_01-44-32.wav,44100,16,60,1,bioacoustic_index,512,2000,8000,2.37567325176889,NA 
rayol-farm2_2019-05-02_01-46-32.wav,44100,16,60,1,bioacoustic_index,512,2000,8000,2.58682907877196,NA 
rayol-farm2_2019-05-02_01-48-32.wav,44100,16,60,1,bioacoustic_index,512,2000,8000,2.2993342204081,NA 
rayol-farm2_2019-05-02_01-50-32.wav,44100,16,60,1,bioacoustic_index,512,2000,8000,2.35961317759492,NA 
rayol-farm2_2019-05-02_01-52-32.wav,44100,16,60,1,bioacoustic_index,512,2000,8000,2.79921419011633,NA 
rayol-farm2_2019-05-02_01-54-32.wav,44100,16,60,1,bioacoustic_index,512,2000,8000,1.77319954062741,NA 
rayol-farm2_2019-05-02_01-56-32.wav,44100,16,60,1,bioacoustic_index,512,2000,8000,2.24031253674001,NA 
rayol-farm2_2019-05-02_01-58-32.wav,44100,16,60,1,bioacoustic_index,512,2000,8000,2.76391836470696,NA 
rayol-farm2_2019-05-02_02-00-33.wav,44100,16,60,1,bioacoustic_index,512,2000,8000,2.4169413682902,NA 
rayol-farm2_2019-05-02_02-02-33.wav,44100,16,60,1,bioacoustic_index,512,2000,8000,2.7589756723848,NA 
rayol-farm2_2019-05-02_02-04-33.wav,44100,16,60,1,bioacoustic_index,512,2000,8000,2.74396560485988,NA 
rayol-farm2_2019-05-02_02-06-33.wav,44100,16,60,1,bioacoustic_index,512,2000,8000,2.66619952070094,NA 
rayol-farm2_2019-05-02_02-08-33.wav,44100,16,60,1,bioacoustic_index,512,2000,8000,2.85561275069856,NA 
rayol-farm2_2019-05-02_02-10-33.wav,44100,16,60,1,bioacoustic_index,512,2000,8000,3.11505016606665,NA 
rayol-farm2_2019-05-02_02-12-33.wav,44100,16,60,1,bioacoustic_index,512,2000,8000,2.54357792922003,NA 
rayol-farm2_2019-05-02_02-14-33.wav,44100,16,60,1,bioacoustic_index,512,2000,8000,2.75418586757478,NA 
rayol-farm2_2019-05-02_02-16-34.wav,44100,16,60,1,bioacoustic_index,512,2000,8000,2.56322160506775,NA 
rayol-farm2_2019-05-02_02-18-34.wav,44100,16,60,1,bioacoustic_index,512,2000,8000,2.62571533141759,NA 
rayol-farm2_2019-05-02_02-20-34.wav,44100,16,60,1,bioacoustic_index,512,2000,8000,2.91907171874224,NA 
rayol-farm2_2019-05-02_02-22-34.wav,44100,16,60,1,bioacoustic_index,512,2000,8000,2.31508826971954,NA 
rayol-farm2_2019-05-02_02-24-34.wav,44100,16,60,1,bioacoustic_index,512,2000,8000,1.93689329010688,NA 
rayol-farm2_2019-05-02_02-26-34.wav,44100,16,60,1,bioacoustic_index,512,2000,8000,2.58039841476723,NA 
rayol-farm2_2019-05-02_02-28-34.wav,44100,16,60,1,bioacoustic_index,512,2000,8000,2.17620855993144,NA 
rayol-farm2_2019-05-02_02-30-34.wav,44100,16,60,1,bioacoustic_index,512,2000,8000,2.57028637467255,NA 
rayol-farm2_2019-05-02_02-32-35.wav,44100,16,60,1,bioacoustic_index,512,2000,8000,1.83477894169589,NA 
rayol-farm2_2019-05-02_02-34-35.wav,44100,16,60,1,bioacoustic_index,512,2000,8000,2.47368715772728,NA 
rayol-farm2_2019-05-02_02-36-35.wav,44100,16,60,1,bioacoustic_index,512,2000,8000,2.14734247306605,NA 
rayol-farm2_2019-05-02_02-38-35.wav,44100,16,60,1,bioacoustic_index,512,2000,8000,1.9954002164739,NA 
rayol-farm2_2019-05-02_02-40-35.wav,44100,16,60,1,bioacoustic_index,512,2000,8000,2.11671767120127,NA 
rayol-farm2_2019-05-02_02-42-35.wav,44100,16,60,1,bioacoustic_index,512,2000,8000,2.32148512384438,NA 
rayol-farm2_2019-05-02_02-44-35.wav,44100,16,60,1,bioacoustic_index,512,2000,8000,2.74697288393448,NA 
rayol-farm2_2019-05-02_02-46-35.wav,44100,16,60,1,bioacoustic_index,512,2000,8000,2.22384998756091,NA 
rayol-farm2_2019-05-02_02-48-35.wav,44100,16,60,1,bioacoustic_index,512,2000,8000,2.29252239090615,NA 
rayol-farm2_2019-05-02_02-50-36.wav,44100,16,60,1,bioacoustic_index,512,2000,8000,2.14325555898993,NA 
rayol-farm2_2019-05-02_02-52-36.wav,44100,16,60,1,bioacoustic_index,512,2000,8000,2.22795328129161,NA 
rayol-farm2_2019-05-02_02-54-36.wav,44100,16,60,1,bioacoustic_index,512,2000,8000,2.28685746327345,NA 
rayol-farm2_2019-05-02_02-56-36.wav,44100,16,60,1,bioacoustic_index,512,2000,8000,2.61702711710868,NA 
rayol-farm2_2019-05-02_02-58-36.wav,44100,16,60,1,bioacoustic_index,512,2000,8000,2.31542579023452,NA 
rayol-farm2_2019-05-02_03-00-36.wav,44100,16,60,1,bioacoustic_index,512,2000,8000,2.38426053678304,NA 
rayol-farm2_2019-05-02_03-02-36.wav,44100,16,60,1,bioacoustic_index,512,2000,8000,2.20580551645367,NA 
rayol-farm2_2019-05-02_03-04-36.wav,44100,16,60,1,bioacoustic_index,512,2000,8000,2.31080285700719,NA 
rayol-farm2_2019-05-02_03-06-37.wav,44100,16,60,1,bioacoustic_index,512,2000,8000,2.12335516825817,NA 
rayol-farm2_2019-05-02_03-08-37.wav,44100,16,60,1,bioacoustic_index,512,2000,8000,2.29769375528508,NA 
rayol-farm2_2019-05-02_03-10-37.wav,44100,16,60,1,bioacoustic_index,512,2000,8000,2.56881728011636,NA 
rayol-farm2_2019-05-02_03-12-37.wav,44100,16,60,1,bioacoustic_index,512,2000,8000,2.32598556496989,NA 
rayol-farm2_2019-05-02_03-14-37.wav,44100,16,60,1,bioacoustic_index,512,2000,8000,2.10665917576636,NA 
rayol-farm2_2019-05-02_03-16-37.wav,44100,16,60,1,bioacoustic_index,512,2000,8000,2.35027218115616,NA 
rayol-farm2_2019-05-02_03-18-37.wav,44100,16,60,1,bioacoustic_index,512,2000,8000,2.22648006702729,NA 
rayol-farm2_2019-05-02_03-20-37.wav,44100,16,60,1,bioacoustic_index,512,2000,8000,2.33717488286675,NA 
rayol-farm2_2019-05-02_03-22-38.wav,44100,16,60,1,bioacoustic_index,512,2000,8000,2.20100683535153,NA 
rayol-farm2_2019-05-02_03-24-38.wav,44100,16,60,1,bioacoustic_index,512,2000,8000,2.44090190629585,NA 
rayol-farm2_2019-05-02_03-26-38.wav,44100,16,60,1,bioacoustic_index,512,2000,8000,2.16285258138264,NA 
rayol-farm2_2019-05-02_03-28-38.wav,44100,16,60,1,bioacoustic_index,512,2000,8000,2.41307495580342,NA 
rayol-farm2_2019-05-02_03-30-38.wav,44100,16,60,1,bioacoustic_index,512,2000,8000,2.17537072025028,NA 
rayol-farm2_2019-05-02_03-32-38.wav,44100,16,60,1,bioacoustic_index,512,2000,8000,2.28308680250949,NA 
rayol-farm2_2019-05-02_03-34-38.wav,44100,16,60,1,bioacoustic_index,512,2000,8000,1.92536465810236,NA 
rayol-farm2_2019-05-02_03-36-38.wav,44100,16,60,1,bioacoustic_index,512,2000,8000,2.71155460038501,NA 
rayol-farm2_2019-05-02_03-38-39.wav,44100,16,60,1,bioacoustic_index,512,2000,8000,2.48183019462753,NA 
rayol-farm2_2019-05-02_03-40-39.wav,44100,16,60,1,bioacoustic_index,512,2000,8000,2.64475635920522,NA 
rayol-farm2_2019-05-02_03-42-39.wav,44100,16,60,1,bioacoustic_index,512,2000,8000,2.35613765581427,NA 
rayol-farm2_2019-05-02_03-44-39.wav,44100,16,60,1,bioacoustic_index,512,2000,8000,2.38109195254893,NA 
rayol-farm2_2019-05-02_03-46-39.wav,44100,16,60,1,bioacoustic_index,512,2000,8000,2.33114246190449,NA 
rayol-farm2_2019-05-02_03-48-39.wav,44100,16,60,1,bioacoustic_index,512,2000,8000,2.32771759195343,NA 
rayol-farm2_2019-05-02_03-50-39.wav,44100,16,60,1,bioacoustic_index,512,2000,8000,2.4835057265732,NA 
rayol-farm2_2019-05-02_03-52-39.wav,44100,16,60,1,bioacoustic_index,512,2000,8000,1.83666857856613,NA 
rayol-farm2_2019-05-02_03-54-39.wav,44100,16,60,1,bioacoustic_index,512,2000,8000,1.79897801139294,NA 
rayol-farm2_2019-05-02_03-56-40.wav,44100,16,60,1,bioacoustic_index,512,2000,8000,2.46500510516471,NA 
rayol-farm2_2019-05-02_03-58-40.wav,44100,16,60,1,bioacoustic_index,512,2000,8000,2.10033642385782,NA 
rayol-farm2_2019-05-02_04-00-40.wav,44100,16,60,1,bioacoustic_index,512,2000,8000,1.83816969005184,NA 
rayol-farm2_2019-05-02_04-02-40.wav,44100,16,60,1,bioacoustic_index,512,2000,8000,2.02607014166908,NA 
rayol-farm2_2019-05-02_04-04-40.wav,44100,16,60,1,bioacoustic_index,512,2000,8000,2.20419088469462,NA 
rayol-farm2_2019-05-02_04-06-40.wav,44100,16,60,1,bioacoustic_index,512,2000,8000,2.31784687635331,NA 
rayol-farm2_2019-05-02_04-08-40.wav,44100,16,60,1,bioacoustic_index,512,2000,8000,2.09692582361715,NA 
rayol-farm2_2019-05-02_04-10-40.wav,44100,16,60,1,bioacoustic_index,512,2000,8000,2.21327087907848,NA 
rayol-farm2_2019-05-02_04-12-41.wav,44100,16,60,1,bioacoustic_index,512,2000,8000,2.18603906577822,NA 
rayol-farm2_2019-05-02_04-14-41.wav,44100,16,60,1,bioacoustic_index,512,2000,8000,1.94177478879609,NA 
rayol-farm2_2019-05-02_04-16-41.wav,44100,16,60,1,bioacoustic_index,512,2000,8000,1.92547529398493,NA 
rayol-farm2_2019-05-02_04-18-41.wav,44100,16,60,1,bioacoustic_index,512,2000,8000,1.62570244078301,NA 
rayol-farm2_2019-05-02_04-20-41.wav,44100,16,60,1,bioacoustic_index,512,2000,8000,1.90047181072434,NA 
rayol-farm2_2019-05-02_04-22-41.wav,44100,16,60,1,bioacoustic_index,512,2000,8000,1.79699311083132,NA 
rayol-farm2_2019-05-02_04-24-41.wav,44100,16,60,1,bioacoustic_index,512,2000,8000,2.37258054659193,NA 
rayol-farm2_2019-05-02_04-26-41.wav,44100,16,60,1,bioacoustic_index,512,2000,8000,2.36911165993117,NA 
rayol-farm2_2019-05-02_04-28-42.wav,44100,16,60,1,bioacoustic_index,512,2000,8000,2.23100480458459,NA 
rayol-farm2_2019-05-02_04-30-42.wav,44100,16,60,1,bioacoustic_index,512,2000,8000,2.40670488838372,NA 
rayol-farm2_2019-05-02_04-32-42.wav,44100,16,60,1,bioacoustic_index,512,2000,8000,1.96415120533513,NA 
rayol-farm2_2019-05-02_04-34-42.wav,44100,16,60,1,bioacoustic_index,512,2000,8000,2.10201563613079,NA 
rayol-farm2_2019-05-02_04-36-42.wav,44100,16,60,1,bioacoustic_index,512,2000,8000,1.95587474139846,NA 
rayol-farm2_2019-05-02_04-38-42.wav,44100,16,60,1,bioacoustic_index,512,2000,8000,2.27372568757364,NA 
rayol-farm2_2019-05-02_04-40-42.wav,44100,16,60,1,bioacoustic_index,512,2000,8000,2.21761576111321,NA 
rayol-farm2_2019-05-02_04-42-42.wav,44100,16,60,1,bioacoustic_index,512,2000,8000,2.24553572109025,NA 
rayol-farm2_2019-05-02_04-44-42.wav,44100,16,60,1,bioacoustic_index,512,2000,8000,2.1485657756442,NA 
rayol-farm2_2019-05-02_04-46-43.wav,44100,16,60,1,bioacoustic_index,512,2000,8000,1.9558197875527,NA 
rayol-farm2_2019-05-02_04-48-43.wav,44100,16,60,1,bioacoustic_index,512,2000,8000,1.93307637978032,NA 
rayol-farm2_2019-05-02_04-50-43.wav,44100,16,60,1,bioacoustic_index,512,2000,8000,2.18958835906808,NA 
rayol-farm2_2019-05-02_04-52-43.wav,44100,16,60,1,bioacoustic_index,512,2000,8000,2.44423944692966,NA 
rayol-farm2_2019-05-02_04-54-43.wav,44100,16,60,1,bioacoustic_index,512,2000,8000,2.56250193204371,NA 
rayol-farm2_2019-05-02_04-56-43.wav,44100,16,60,1,bioacoustic_index,512,2000,8000,2.17366762167939,NA 
rayol-farm2_2019-05-02_04-58-43.wav,44100,16,60,1,bioacoustic_index,512,2000,8000,1.99869766969254,NA 
rayol-farm2_2019-05-02_05-00-43.wav,44100,16,60,1,bioacoustic_index,512,2000,8000,2.40098987365224,NA 
rayol-farm2_2019-05-02_05-02-44.wav,44100,16,60,1,bioacoustic_index,512,2000,8000,2.10078679940131,NA 
rayol-farm2_2019-05-02_05-04-44.wav,44100,16,60,1,bioacoustic_index,512,2000,8000,2.63602316177589,NA 
rayol-farm2_2019-05-02_05-06-44.wav,44100,16,60,1,bioacoustic_index,512,2000,8000,2.37160146132946,NA 
rayol-farm2_2019-05-02_05-08-44.wav,44100,16,60,1,bioacoustic_index,512,2000,8000,2.29883768471879,NA 
rayol-farm2_2019-05-02_05-10-44.wav,44100,16,60,1,bioacoustic_index,512,2000,8000,2.45504612986274,NA 
rayol-farm2_2019-05-02_05-12-44.wav,44100,16,60,1,bioacoustic_index,512,2000,8000,2.47594017321153,NA 
rayol-farm2_2019-05-02_05-14-44.wav,44100,16,60,1,bioacoustic_index,512,2000,8000,2.32988286759379,NA 
rayol-farm2_2019-05-02_05-16-44.wav,44100,16,60,1,bioacoustic_index,512,2000,8000,2.28236829408736,NA 
rayol-farm2_2019-05-02_05-18-45.wav,44100,16,60,1,bioacoustic_index,512,2000,8000,2.63190138908982,NA 
rayol-farm2_2019-05-02_05-20-45.wav,44100,16,60,1,bioacoustic_index,512,2000,8000,2.32761096337312,NA 
rayol-farm2_2019-05-02_05-22-45.wav,44100,16,60,1,bioacoustic_index,512,2000,8000,2.53975210845081,NA 
rayol-farm2_2019-05-02_05-24-45.wav,44100,16,60,1,bioacoustic_index,512,2000,8000,2.61184525500239,NA 
rayol-farm2_2019-05-02_05-26-45.wav,44100,16,60,1,bioacoustic_index,512,2000,8000,3.48815479918665,NA 
rayol-farm2_2019-05-02_05-28-45.wav,44100,16,60,1,bioacoustic_index,512,2000,8000,2.85338778594929,NA 
rayol-farm2_2019-05-02_05-30-45.wav,44100,16,60,1,bioacoustic_index,512,2000,8000,3.30096527963201,NA 
rayol-farm2_2019-05-02_05-32-45.wav,44100,16,60,1,bioacoustic_index,512,2000,8000,2.96429580225634,NA 
rayol-farm2_2019-05-02_05-34-45.wav,44100,16,60,1,bioacoustic_index,512,2000,8000,2.63917631854739,NA 
rayol-farm2_2019-05-02_05-36-46.wav,44100,16,60,1,bioacoustic_index,512,2000,8000,2.11654317441865,NA 
rayol-farm2_2019-05-02_05-38-46.wav,44100,16,60,1,bioacoustic_index,512,2000,8000,2.85386917178516,NA 
rayol-farm2_2019-05-02_05-40-46.wav,44100,16,60,1,bioacoustic_index,512,2000,8000,2.90548305741647,NA 
rayol-farm2_2019-05-02_05-42-46.wav,44100,16,60,1,bioacoustic_index,512,2000,8000,3.19216758802951,NA 
rayol-farm2_2019-05-02_05-44-46.wav,44100,16,60,1,bioacoustic_index,512,2000,8000,4.0352565460518,NA 
rayol-farm2_2019-05-02_05-46-46.wav,44100,16,60,1,bioacoustic_index,512,2000,8000,3.23117902622306,NA 
rayol-farm2_2019-05-02_05-48-46.wav,44100,16,60,1,bioacoustic_index,512,2000,8000,3.4522464842918,NA 
rayol-farm2_2019-05-02_05-50-46.wav,44100,16,60,1,bioacoustic_index,512,2000,8000,3.34836888501279,NA 
rayol-farm2_2019-05-02_05-52-47.wav,44100,16,60,1,bioacoustic_index,512,2000,8000,4.75857348162152,NA 
rayol-farm2_2019-05-02_05-54-47.wav,44100,16,60,1,bioacoustic_index,512,2000,8000,3.83669397632139,NA 
rayol-farm2_2019-05-02_05-56-47.wav,44100,16,60,1,bioacoustic_index,512,2000,8000,3.37646902640974,NA 
rayol-farm2_2019-05-02_05-58-47.wav,44100,16,60,1,bioacoustic_index,512,2000,8000,3.20610811460536,NA 
rayol-farm2_2019-05-02_06-00-47.wav,44100,16,60,1,bioacoustic_index,512,2000,8000,3.33013426783199,NA 
rayol-farm2_2019-05-02_06-02-47.wav,44100,16,60,1,bioacoustic_index,512,2000,8000,2.97094971820518,NA 
rayol-farm2_2019-05-02_06-04-47.wav,44100,16,60,1,bioacoustic_index,512,2000,8000,3.35444481129132,NA 
rayol-farm2_2019-05-02_06-06-47.wav,44100,16,60,1,bioacoustic_index,512,2000,8000,3.37754941231144,NA 
rayol-farm2_2019-05-02_06-08-48.wav,44100,16,60,1,bioacoustic_index,512,2000,8000,3.96301900612439,NA 
rayol-farm2_2019-05-02_06-10-48.wav,44100,16,60,1,bioacoustic_index,512,2000,8000,3.79209902715296,NA 
rayol-farm2_2019-05-02_06-12-48.wav,44100,16,60,1,bioacoustic_index,512,2000,8000,3.40662558067589,NA 
rayol-farm2_2019-05-02_06-14-48.wav,44100,16,60,1,bioacoustic_index,512,2000,8000,3.52087332747604,NA 
rayol-farm2_2019-05-02_06-16-48.wav,44100,16,60,1,bioacoustic_index,512,2000,8000,3.24268932766278,NA 
rayol-farm2_2019-05-02_06-18-48.wav,44100,16,60,1,bioacoustic_index,512,2000,8000,2.82121410472886,NA 
rayol-farm2_2019-05-02_06-20-48.wav,44100,16,60,1,bioacoustic_index,512,2000,8000,2.60822036697817,NA 
rayol-farm2_2019-05-02_06-22-48.wav,44100,16,60,1,bioacoustic_index,512,2000,8000,2.87473421172623,NA 
rayol-farm2_2019-05-02_06-24-48.wav,44100,16,60,1,bioacoustic_index,512,2000,8000,2.42399566651044,NA 
rayol-farm2_2019-05-02_06-26-49.wav,44100,16,60,1,bioacoustic_index,512,2000,8000,2.14383986027817,NA 
rayol-farm2_2019-05-02_06-28-49.wav,44100,16,60,1,bioacoustic_index,512,2000,8000,3.25387740422528,NA 
rayol-farm2_2019-05-02_06-30-49.wav,44100,16,60,1,bioacoustic_index,512,2000,8000,2.62205005790507,NA 
rayol-farm2_2019-05-02_06-32-49.wav,44100,16,60,1,bioacoustic_index,512,2000,8000,2.86466304651463,NA 
rayol-farm2_2019-05-02_06-34-49.wav,44100,16,60,1,bioacoustic_index,512,2000,8000,3.17112479119125,NA 
rayol-farm2_2019-05-02_06-36-49.wav,44100,16,60,1,bioacoustic_index,512,2000,8000,3.90778215134674,NA 
rayol-farm2_2019-05-02_06-38-49.wav,44100,16,60,1,bioacoustic_index,512,2000,8000,3.0883733220044,NA 
rayol-farm2_2019-05-02_06-40-49.wav,44100,16,60,1,bioacoustic_index,512,2000,8000,4.22947070390508,NA 
rayol-farm2_2019-05-02_06-42-50.wav,44100,16,60,1,bioacoustic_index,512,2000,8000,4.73504762442508,NA 
rayol-farm2_2019-05-02_06-44-50.wav,44100,16,60,1,bioacoustic_index,512,2000,8000,4.43212020156143,NA 
rayol-farm2_2019-05-02_06-46-50.wav,44100,16,60,1,bioacoustic_index,512,2000,8000,2.90596763562361,NA 
rayol-farm2_2019-05-02_06-48-50.wav,44100,16,60,1,bioacoustic_index,512,2000,8000,3.35534295558423,NA 
rayol-farm2_2019-05-02_06-50-50.wav,44100,16,60,1,bioacoustic_index,512,2000,8000,2.40314663829647,NA 
rayol-farm2_2019-05-02_06-52-50.wav,44100,16,60,1,bioacoustic_index,512,2000,8000,3.23836284572002,NA 
rayol-farm2_2019-05-02_06-54-50.wav,44100,16,60,1,bioacoustic_index,512,2000,8000,3.84745323023315,NA 
rayol-farm2_2019-05-02_06-56-50.wav,44100,16,60,1,bioacoustic_index,512,2000,8000,2.25692559345529,NA 
rayol-farm2_2019-05-02_06-58-50.wav,44100,16,60,1,bioacoustic_index,512,2000,8000,1.44120921095749,NA 
rayol-farm2_2019-05-02_07-00-51.wav,44100,16,60,1,bioacoustic_index,512,2000,8000,1.84749923021461,NA 
rayol-farm2_2019-05-02_07-02-51.wav,44100,16,60,1,bioacoustic_index,512,2000,8000,2.65287842928044,NA 
rayol-farm2_2019-05-02_07-04-51.wav,44100,16,60,1,bioacoustic_index,512,2000,8000,2.37517826741937,NA 
rayol-farm2_2019-05-02_07-06-51.wav,44100,16,60,1,bioacoustic_index,512,2000,8000,2.65081723617816,NA 
rayol-farm2_2019-05-02_07-08-51.wav,44100,16,60,1,bioacoustic_index,512,2000,8000,1.96628050390273,NA 
rayol-farm2_2019-05-02_07-10-51.wav,44100,16,60,1,bioacoustic_index,512,2000,8000,3.21806104734212,NA 
rayol-farm2_2019-05-02_07-12-51.wav,44100,16,60,1,bioacoustic_index,512,2000,8000,2.3158040556026,NA 
rayol-farm2_2019-05-02_07-14-51.wav,44100,16,60,1,bioacoustic_index,512,2000,8000,2.65625058193263,NA 
rayol-farm2_2019-05-02_07-16-52.wav,44100,16,60,1,bioacoustic_index,512,2000,8000,1.75105631040894,NA 
rayol-farm2_2019-05-02_07-18-52.wav,44100,16,60,1,bioacoustic_index,512,2000,8000,2.25073585960618,NA 
rayol-farm2_2019-05-02_07-20-52.wav,44100,16,60,1,bioacoustic_index,512,2000,8000,2.76106164147024,NA 
rayol-farm2_2019-05-02_07-22-52.wav,44100,16,60,1,bioacoustic_index,512,2000,8000,2.22419189093507,NA 
rayol-farm2_2019-05-02_07-24-52.wav,44100,16,60,1,bioacoustic_index,512,2000,8000,2.34870045710797,NA 
rayol-farm2_2019-05-02_07-26-52.wav,44100,16,60,1,bioacoustic_index,512,2000,8000,2.02289078887709,NA 
rayol-farm2_2019-05-02_07-28-52.wav,44100,16,60,1,bioacoustic_index,512,2000,8000,3.55143033780433,NA 
rayol-farm2_2019-05-02_07-30-52.wav,44100,16,60,1,bioacoustic_index,512,2000,8000,2.04222910513899,NA 
rayol-farm2_2019-05-02_07-32-53.wav,44100,16,60,1,bioacoustic_index,512,2000,8000,2.55861874026058,NA 
rayol-farm2_2019-05-02_07-34-53.wav,44100,16,60,1,bioacoustic_index,512,2000,8000,2.58279306451574,NA 
rayol-farm2_2019-05-02_07-36-53.wav,44100,16,60,1,bioacoustic_index,512,2000,8000,2.75509421504309,NA 
rayol-farm2_2019-05-02_07-38-53.wav,44100,16,60,1,bioacoustic_index,512,2000,8000,3.83039921673655,NA 
rayol-farm2_2019-05-02_07-40-53.wav,44100,16,60,1,bioacoustic_index,512,2000,8000,3.85783898239788,NA 
rayol-farm2_2019-05-02_07-42-53.wav,44100,16,60,1,bioacoustic_index,512,2000,8000,3.29484123645224,NA 
rayol-farm2_2019-05-02_07-44-53.wav,44100,16,60,1,bioacoustic_index,512,2000,8000,2.5342962330263,NA 
rayol-farm2_2019-05-02_07-46-53.wav,44100,16,60,1,bioacoustic_index,512,2000,8000,2.18261222044032,NA 
rayol-farm2_2019-05-02_07-48-53.wav,44100,16,60,1,bioacoustic_index,512,2000,8000,2.26513446970579,NA 
rayol-farm2_2019-05-02_07-50-54.wav,44100,16,60,1,bioacoustic_index,512,2000,8000,3.20894774167554,NA 
rayol-farm2_2019-05-02_07-52-54.wav,44100,16,60,1,bioacoustic_index,512,2000,8000,2.23451488779568,NA 
rayol-farm2_2019-05-02_07-54-54.wav,44100,16,60,1,bioacoustic_index,512,2000,8000,2.55699297361955,NA 
rayol-farm2_2019-05-02_07-56-54.wav,44100,16,60,1,bioacoustic_index,512,2000,8000,2.2872774436352,NA 
rayol-farm2_2019-05-02_07-58-54.wav,44100,16,60,1,bioacoustic_index,512,2000,8000,2.33326828006313,NA 
rayol-farm2_2019-05-02_08-00-54.wav,44100,16,60,1,bioacoustic_index,512,2000,8000,2.07414399656019,NA 
rayol-farm2_2019-05-02_08-02-54.wav,44100,16,60,1,bioacoustic_index,512,2000,8000,2.24883993815966,NA 
rayol-farm2_2019-05-02_08-04-54.wav,44100,16,60,1,bioacoustic_index,512,2000,8000,2.62393925377589,NA 
rayol-farm2_2019-05-02_08-06-55.wav,44100,16,60,1,bioacoustic_index,512,2000,8000,2.49583269075902,NA 
rayol-farm2_2019-05-02_08-08-55.wav,44100,16,60,1,bioacoustic_index,512,2000,8000,2.45153403091486,NA 
rayol-farm2_2019-05-02_08-10-55.wav,44100,16,60,1,bioacoustic_index,512,2000,8000,4.29288689066915,NA 
rayol-farm2_2019-05-02_08-12-55.wav,44100,16,60,1,bioacoustic_index,512,2000,8000,2.69486422933482,NA 
rayol-farm2_2019-05-02_08-14-55.wav,44100,16,60,1,bioacoustic_index,512,2000,8000,2.20475245120806,NA 
rayol-farm2_2019-05-02_08-16-55.wav,44100,16,60,1,bioacoustic_index,512,2000,8000,3.82633858667486,NA 
rayol-farm2_2019-05-02_08-18-55.wav,44100,16,60,1,bioacoustic_index,512,2000,8000,2.63098131352499,NA 
rayol-farm2_2019-05-02_08-20-55.wav,44100,16,60,1,bioacoustic_index,512,2000,8000,2.71727219413667,NA 
rayol-farm2_2019-05-02_08-22-55.wav,44100,16,60,1,bioacoustic_index,512,2000,8000,2.52676538928662,NA 
rayol-farm2_2019-05-02_08-24-56.wav,44100,16,60,1,bioacoustic_index,512,2000,8000,2.93129197431387,NA 
rayol-farm2_2019-05-02_08-26-56.wav,44100,16,60,1,bioacoustic_index,512,2000,8000,2.11824906485182,NA 
rayol-farm2_2019-05-02_08-28-56.wav,44100,16,60,1,bioacoustic_index,512,2000,8000,2.29531898604018,NA 
rayol-farm2_2019-05-02_08-30-56.wav,44100,16,60,1,bioacoustic_index,512,2000,8000,2.05515282673721,NA 
rayol-farm2_2019-05-02_08-32-56.wav,44100,16,60,1,bioacoustic_index,512,2000,8000,2.24060374486435,NA 
rayol-farm2_2019-05-02_08-34-56.wav,44100,16,60,1,bioacoustic_index,512,2000,8000,2.19753723399839,NA 
rayol-farm2_2019-05-02_08-36-56.wav,44100,16,60,1,bioacoustic_index,512,2000,8000,1.95244873907958,NA 
rayol-farm2_2019-05-02_08-38-56.wav,44100,16,60,1,bioacoustic_index,512,2000,8000,2.23173219586741,NA 
rayol-farm2_2019-05-02_08-40-57.wav,44100,16,60,1,bioacoustic_index,512,2000,8000,2.12747467097174,NA 
rayol-farm2_2019-05-02_08-42-57.wav,44100,16,60,1,bioacoustic_index,512,2000,8000,2.22049502171148,NA 
rayol-farm2_2019-05-02_08-44-57.wav,44100,16,60,1,bioacoustic_index,512,2000,8000,2.15616360729056,NA 
rayol-farm2_2019-05-02_08-46-57.wav,44100,16,60,1,bioacoustic_index,512,2000,8000,1.86903417795976,NA 
rayol-farm2_2019-05-02_08-48-57.wav,44100,16,60,1,bioacoustic_index,512,2000,8000,2.57823155209286,NA 
rayol-farm2_2019-05-02_08-50-57.wav,44100,16,60,1,bioacoustic_index,512,2000,8000,2.45630600322955,NA 
rayol-farm2_2019-05-02_08-52-57.wav,44100,16,60,1,bioacoustic_index,512,2000,8000,2.16457475392792,NA 
rayol-farm2_2019-05-02_08-54-57.wav,44100,16,60,1,bioacoustic_index,512,2000,8000,2.63987152755944,NA 
rayol-farm2_2019-05-02_08-56-58.wav,44100,16,60,1,bioacoustic_index,512,2000,8000,2.6030084854673,NA 
rayol-farm2_2019-05-02_08-58-58.wav,44100,16,60,1,bioacoustic_index,512,2000,8000,2.29970013550238,NA 
rayol-farm2_2019-05-02_09-00-58.wav,44100,16,60,1,bioacoustic_index,512,2000,8000,6.39814295084237,NA 
rayol-farm2_2019-05-02_09-02-58.wav,44100,16,60,1,bioacoustic_index,512,2000,8000,4.07021647776781,NA 
rayol-farm2_2019-05-02_09-04-58.wav,44100,16,60,1,bioacoustic_index,512,2000,8000,2.48753441882297,NA 
rayol-farm2_2019-05-02_09-06-58.wav,44100,16,60,1,bioacoustic_index,512,2000,8000,2.29469436965722,NA 
rayol-farm2_2019-05-02_09-08-58.wav,44100,16,60,1,bioacoustic_index,512,2000,8000,1.8907073052013,NA 
rayol-farm2_2019-05-02_09-10-58.wav,44100,16,60,1,bioacoustic_index,512,2000,8000,1.54968462815901,NA 
rayol-farm2_2019-05-02_09-12-58.wav,44100,16,60,1,bioacoustic_index,512,2000,8000,2.1985430838572,NA 
rayol-farm2_2019-05-02_09-14-59.wav,44100,16,60,1,bioacoustic_index,512,2000,8000,1.8202916263457,NA 
rayol-farm2_2019-05-02_09-16-59.wav,44100,16,60,1,bioacoustic_index,512,2000,8000,4.19065703129561,NA 
rayol-farm2_2019-05-02_09-18-59.wav,44100,16,60,1,bioacoustic_index,512,2000,8000,1.65919813223667,NA 
rayol-farm2_2019-05-02_09-20-59.wav,44100,16,60,1,bioacoustic_index,512,2000,8000,4.15744057506702,NA 
rayol-farm2_2019-05-02_09-22-59.wav,44100,16,60,1,bioacoustic_index,512,2000,8000,2.55477101261715,NA 
rayol-farm2_2019-05-02_09-24-59.wav,44100,16,60,1,bioacoustic_index,512,2000,8000,2.01294933893529,NA 
rayol-farm2_2019-05-02_09-26-59.wav,44100,16,60,1,bioacoustic_index,512,2000,8000,2.92745400384891,NA 
rayol-farm2_2019-05-02_09-28-59.wav,44100,16,60,1,bioacoustic_index,512,2000,8000,2.66189897972263,NA 
rayol-farm2_2019-05-02_09-31-00.wav,44100,16,60,1,bioacoustic_index,512,2000,8000,1.98021463065316,NA 
rayol-farm2_2019-05-02_09-33-00.wav,44100,16,60,1,bioacoustic_index,512,2000,8000,1.96567000420574,NA 
rayol-farm2_2019-05-02_09-35-00.wav,44100,16,60,1,bioacoustic_index,512,2000,8000,2.22842471068194,NA 
rayol-farm2_2019-05-02_09-37-00.wav,44100,16,60,1,bioacoustic_index,512,2000,8000,2.45859733273266,NA 
rayol-farm2_2019-05-02_09-39-00.wav,44100,16,60,1,bioacoustic_index,512,2000,8000,3.27547709596111,NA 
rayol-farm2_2019-05-02_09-41-00.wav,44100,16,60,1,bioacoustic_index,512,2000,8000,2.79961650895365,NA 
rayol-farm2_2019-05-02_09-43-00.wav,44100,16,60,1,bioacoustic_index,512,2000,8000,2.98319036400565,NA 
rayol-farm2_2019-05-02_09-45-00.wav,44100,16,60,1,bioacoustic_index,512,2000,8000,2.71681659110733,NA 
rayol-farm2_2019-05-02_09-47-01.wav,44100,16,60,1,bioacoustic_index,512,2000,8000,2.93502465358519,NA 
rayol-farm2_2019-05-02_09-49-01.wav,44100,16,60,1,bioacoustic_index,512,2000,8000,2.87248513366183,NA 
rayol-farm2_2019-05-02_09-51-01.wav,44100,16,60,1,bioacoustic_index,512,2000,8000,2.46819614829892,NA 
rayol-farm2_2019-05-02_09-53-01.wav,44100,16,60,1,bioacoustic_index,512,2000,8000,2.4239338485707,NA 
rayol-farm2_2019-05-02_09-55-01.wav,44100,16,60,1,bioacoustic_index,512,2000,8000,2.13825024981401,NA 
rayol-farm2_2019-05-02_09-57-01.wav,44100,16,60,1,bioacoustic_index,512,2000,8000,3.23348472007837,NA 
rayol-farm2_2019-05-02_09-59-01.wav,44100,16,60,1,bioacoustic_index,512,2000,8000,2.26756509072149,NA 
rayol-farm2_2019-05-02_10-01-01.wav,44100,16,60,1,bioacoustic_index,512,2000,8000,2.93994074641326,NA 
rayol-farm2_2019-05-02_10-03-02.wav,44100,16,60,1,bioacoustic_index,512,2000,8000,3.16557543255501,NA 
rayol-farm2_2019-05-02_10-05-02.wav,44100,16,60,1,bioacoustic_index,512,2000,8000,3.06387567655222,NA 
rayol-farm2_2019-05-02_10-07-02.wav,44100,16,60,1,bioacoustic_index,512,2000,8000,2.46639670041629,NA 
rayol-farm2_2019-05-02_10-09-02.wav,44100,16,60,1,bioacoustic_index,512,2000,8000,2.41432160613221,NA 
rayol-farm2_2019-05-02_10-11-02.wav,44100,16,60,1,bioacoustic_index,512,2000,8000,2.28044266250765,NA 
rayol-farm2_2019-05-02_10-13-02.wav,44100,16,60,1,bioacoustic_index,512,2000,8000,2.1258734519864,NA 
rayol-farm2_2019-05-02_10-15-02.wav,44100,16,60,1,bioacoustic_index,512,2000,8000,2.88473771311317,NA 
rayol-farm2_2019-05-02_10-17-02.wav,44100,16,60,1,bioacoustic_index,512,2000,8000,2.90085283815688,NA 
rayol-farm2_2019-05-02_10-19-02.wav,44100,16,60,1,bioacoustic_index,512,2000,8000,2.85279122361964,NA 
rayol-farm2_2019-05-02_10-21-03.wav,44100,16,60,1,bioacoustic_index,512,2000,8000,2.85068839682246,NA 
rayol-farm2_2019-05-02_10-23-03.wav,44100,16,60,1,bioacoustic_index,512,2000,8000,2.65514512391881,NA 
rayol-farm2_2019-05-02_10-25-03.wav,44100,16,60,1,bioacoustic_index,512,2000,8000,4.05187533610547,NA 
rayol-farm2_2019-05-02_10-27-03.wav,44100,16,60,1,bioacoustic_index,512,2000,8000,2.68903007870499,NA 
rayol-farm2_2019-05-02_10-29-03.wav,44100,16,60,1,bioacoustic_index,512,2000,8000,2.43708947691153,NA 
rayol-farm2_2019-05-02_10-31-03.wav,44100,16,60,1,bioacoustic_index,512,2000,8000,2.74827762013913,NA 
rayol-farm2_2019-05-02_10-33-03.wav,44100,16,60,1,bioacoustic_index,512,2000,8000,2.90606917691357,NA 
rayol-farm2_2019-05-02_10-35-03.wav,44100,16,60,1,bioacoustic_index,512,2000,8000,2.32610371455574,NA 
rayol-farm2_2019-05-02_10-37-04.wav,44100,16,60,1,bioacoustic_index,512,2000,8000,3.2151944383627,NA 
rayol-farm2_2019-05-02_10-39-04.wav,44100,16,60,1,bioacoustic_index,512,2000,8000,2.35560690258736,NA 
rayol-farm2_2019-05-02_10-41-04.wav,44100,16,60,1,bioacoustic_index,512,2000,8000,1.94837247557348,NA 
rayol-farm2_2019-05-02_10-43-04.wav,44100,16,60,1,bioacoustic_index,512,2000,8000,2.20829536573396,NA 
rayol-farm2_2019-05-02_10-45-04.wav,44100,16,60,1,bioacoustic_index,512,2000,8000,2.32228979793278,NA 
rayol-farm2_2019-05-02_10-47-04.wav,44100,16,60,1,bioacoustic_index,512,2000,8000,2.58814632369733,NA 
rayol-farm2_2019-05-02_10-49-04.wav,44100,16,60,1,bioacoustic_index,512,2000,8000,2.70146770244153,NA 
rayol-farm2_2019-05-02_10-51-04.wav,44100,16,60,1,bioacoustic_index,512,2000,8000,2.3700997752874,NA 
rayol-farm2_2019-05-02_10-53-05.wav,44100,16,60,1,bioacoustic_index,512,2000,8000,2.83909798015927,NA 
rayol-farm2_2019-05-02_10-55-05.wav,44100,16,60,1,bioacoustic_index,512,2000,8000,3.40861654490612,NA 
rayol-farm2_2019-05-02_10-57-05.wav,44100,16,60,1,bioacoustic_index,512,2000,8000,2.8711272755849,NA 
rayol-farm2_2019-05-02_10-59-05.wav,44100,16,60,1,bioacoustic_index,512,2000,8000,1.94505252764637,NA 
rayol-farm2_2019-05-02_11-01-05.wav,44100,16,60,1,bioacoustic_index,512,2000,8000,2.34310933211535,NA 
rayol-farm2_2019-05-02_11-03-05.wav,44100,16,60,1,bioacoustic_index,512,2000,8000,2.60449775907917,NA 
rayol-farm2_2019-05-02_11-05-05.wav,44100,16,60,1,bioacoustic_index,512,2000,8000,2.72721513263128,NA 
rayol-farm2_2019-05-02_11-07-05.wav,44100,16,60,1,bioacoustic_index,512,2000,8000,2.89913795505309,NA 
rayol-farm2_2019-05-02_11-09-05.wav,44100,16,60,1,bioacoustic_index,512,2000,8000,3.34342242951439,NA 
rayol-farm2_2019-05-02_11-11-06.wav,44100,16,60,1,bioacoustic_index,512,2000,8000,2.97253780858651,NA 
rayol-farm2_2019-05-02_11-13-06.wav,44100,16,60,1,bioacoustic_index,512,2000,8000,3.04209588765442,NA 
rayol-farm2_2019-05-02_11-15-06.wav,44100,16,60,1,bioacoustic_index,512,2000,8000,2.83608324474166,NA 
rayol-farm2_2019-05-02_11-17-06.wav,44100,16,60,1,bioacoustic_index,512,2000,8000,3.10159633831211,NA 
rayol-farm2_2019-05-02_11-19-06.wav,44100,16,60,1,bioacoustic_index,512,2000,8000,3.19821101687204,NA 
rayol-farm2_2019-05-02_11-21-06.wav,44100,16,60,1,bioacoustic_index,512,2000,8000,2.55991439853846,NA 
rayol-farm2_2019-05-02_11-23-06.wav,44100,16,60,1,bioacoustic_index,512,2000,8000,3.99495674277311,NA 
rayol-farm2_2019-05-02_11-25-06.wav,44100,16,60,1,bioacoustic_index,512,2000,8000,2.85502224081102,NA 
rayol-farm2_2019-05-02_11-27-07.wav,44100,16,60,1,bioacoustic_index,512,2000,8000,2.61472978905103,NA 
rayol-farm2_2019-05-02_11-29-07.wav,44100,16,60,1,bioacoustic_index,512,2000,8000,3.48830717103443,NA 
rayol-farm2_2019-05-02_11-31-07.wav,44100,16,60,1,bioacoustic_index,512,2000,8000,4.0999022009874,NA 
rayol-farm2_2019-05-02_11-33-07.wav,44100,16,60,1,bioacoustic_index,512,2000,8000,2.47029277896523,NA 
rayol-farm2_2019-05-02_11-35-07.wav,44100,16,60,1,bioacoustic_index,512,2000,8000,3.55207792333226,NA 
rayol-farm2_2019-05-02_11-37-07.wav,44100,16,60,1,bioacoustic_index,512,2000,8000,2.32299177915863,NA 
rayol-farm2_2019-05-02_11-39-07.wav,44100,16,60,1,bioacoustic_index,512,2000,8000,2.74421525661646,NA 
rayol-farm2_2019-05-02_11-41-07.wav,44100,16,60,1,bioacoustic_index,512,2000,8000,2.47526073743365,NA 
rayol-farm2_2019-05-02_11-43-08.wav,44100,16,60,1,bioacoustic_index,512,2000,8000,2.16954738858422,NA 
rayol-farm2_2019-05-02_11-45-08.wav,44100,16,60,1,bioacoustic_index,512,2000,8000,2.52556400565682,NA 
rayol-farm2_2019-05-02_11-47-08.wav,44100,16,60,1,bioacoustic_index,512,2000,8000,2.06590825825255,NA 
rayol-farm2_2019-05-02_11-49-08.wav,44100,16,60,1,bioacoustic_index,512,2000,8000,3.02742856336368,NA 
rayol-farm2_2019-05-02_11-51-08.wav,44100,16,60,1,bioacoustic_index,512,2000,8000,3.62392881934102,NA 
rayol-farm2_2019-05-02_11-53-08.wav,44100,16,60,1,bioacoustic_index,512,2000,8000,2.62106778252025,NA 
rayol-farm2_2019-05-02_11-55-08.wav,44100,16,60,1,bioacoustic_index,512,2000,8000,3.07186947714476,NA 
rayol-farm2_2019-05-02_11-57-08.wav,44100,16,60,1,bioacoustic_index,512,2000,8000,2.19639102552253,NA 
rayol-farm2_2019-05-02_11-59-09.wav,44100,16,60,1,bioacoustic_index,512,2000,8000,3.35437785780809,NA 
rayol-farm2_2019-05-02_12-01-09.wav,44100,16,60,1,bioacoustic_index,512,2000,8000,2.36022304563637,NA 
rayol-farm2_2019-05-02_12-03-09.wav,44100,16,60,1,bioacoustic_index,512,2000,8000,3.90745950270307,NA 
rayol-farm2_2019-05-02_12-05-09.wav,44100,16,60,1,bioacoustic_index,512,2000,8000,2.06288656219114,NA 
rayol-farm2_2019-05-02_12-07-09.wav,44100,16,60,1,bioacoustic_index,512,2000,8000,2.24742438275471,NA 
rayol-farm2_2019-05-02_12-09-09.wav,44100,16,60,1,bioacoustic_index,512,2000,8000,1.64166286440844,NA 
rayol-farm2_2019-05-02_12-11-09.wav,44100,16,60,1,bioacoustic_index,512,2000,8000,2.37805294649517,NA 
rayol-farm2_2019-05-02_12-13-09.wav,44100,16,60,1,bioacoustic_index,512,2000,8000,1.81434222928855,NA 
rayol-farm2_2019-05-02_12-15-09.wav,44100,16,60,1,bioacoustic_index,512,2000,8000,1.93696149029426,NA 
rayol-farm2_2019-05-02_12-17-10.wav,44100,16,60,1,bioacoustic_index,512,2000,8000,2.10479960799557,NA 
rayol-farm2_2019-05-02_12-19-10.wav,44100,16,60,1,bioacoustic_index,512,2000,8000,1.95033273633042,NA 
rayol-farm2_2019-05-02_12-21-10.wav,44100,16,60,1,bioacoustic_index,512,2000,8000,2.00970914604762,NA 
rayol-farm2_2019-05-02_12-23-10.wav,44100,16,60,1,bioacoustic_index,512,2000,8000,1.74263609450223,NA 
rayol-farm2_2019-05-02_12-25-10.wav,44100,16,60,1,bioacoustic_index,512,2000,8000,1.84284483787321,NA 
rayol-farm2_2019-05-02_12-27-10.wav,44100,16,60,1,bioacoustic_index,512,2000,8000,2.07032597820685,NA 
rayol-farm2_2019-05-02_12-29-10.wav,44100,16,60,1,bioacoustic_index,512,2000,8000,1.82761245473858,NA 
rayol-farm2_2019-05-02_12-31-10.wav,44100,16,60,1,bioacoustic_index,512,2000,8000,2.02046453369832,NA 
rayol-farm2_2019-05-02_12-33-11.wav,44100,16,60,1,bioacoustic_index,512,2000,8000,2.34624244049004,NA 
rayol-farm2_2019-05-02_12-35-11.wav,44100,16,60,1,bioacoustic_index,512,2000,8000,2.31072261071058,NA 
rayol-farm2_2019-05-02_12-37-11.wav,44100,16,60,1,bioacoustic_index,512,2000,8000,2.42261706433719,NA 
rayol-farm2_2019-05-02_12-39-11.wav,44100,16,60,1,bioacoustic_index,512,2000,8000,1.84077894405389,NA 
rayol-farm2_2019-05-02_12-41-11.wav,44100,16,60,1,bioacoustic_index,512,2000,8000,2.20094557386477,NA 
rayol-farm2_2019-05-02_12-43-11.wav,44100,16,60,1,bioacoustic_index,512,2000,8000,2.33245029608175,NA 
rayol-farm2_2019-05-02_12-45-11.wav,44100,16,60,1,bioacoustic_index,512,2000,8000,2.29394506234848,NA 
rayol-farm2_2019-05-02_12-47-11.wav,44100,16,60,1,bioacoustic_index,512,2000,8000,1.90799167288896,NA 
rayol-farm2_2019-05-02_12-49-12.wav,44100,16,60,1,bioacoustic_index,512,2000,8000,1.69525017067894,NA 
rayol-farm2_2019-05-02_12-51-12.wav,44100,16,60,1,bioacoustic_index,512,2000,8000,1.67011481472459,NA 
rayol-farm2_2019-05-02_12-53-12.wav,44100,16,60,1,bioacoustic_index,512,2000,8000,3.98061729442169,NA 
rayol-farm2_2019-05-02_12-55-12.wav,44100,16,60,1,bioacoustic_index,512,2000,8000,3.07903069517573,NA 
rayol-farm2_2019-05-02_12-57-12.wav,44100,16,60,1,bioacoustic_index,512,2000,8000,3.65280439836351,NA 
rayol-farm2_2019-05-02_12-59-12.wav,44100,16,60,1,bioacoustic_index,512,2000,8000,2.98353644292148,NA 
rayol-farm2_2019-05-02_13-01-12.wav,44100,16,60,1,bioacoustic_index,512,2000,8000,2.92548455537602,NA 
rayol-farm2_2019-05-02_13-03-12.wav,44100,16,60,1,bioacoustic_index,512,2000,8000,3.22007747894891,NA 
rayol-farm2_2019-05-02_13-05-12.wav,44100,16,60,1,bioacoustic_index,512,2000,8000,2.7928556699653,NA 
rayol-farm2_2019-05-02_13-07-13.wav,44100,16,60,1,bioacoustic_index,512,2000,8000,3.34069459367862,NA 
rayol-farm2_2019-05-02_13-09-13.wav,44100,16,60,1,bioacoustic_index,512,2000,8000,2.45134629695152,NA 
rayol-farm2_2019-05-02_13-11-13.wav,44100,16,60,1,bioacoustic_index,512,2000,8000,2.39609653325822,NA 
rayol-farm2_2019-05-02_13-13-13.wav,44100,16,60,1,bioacoustic_index,512,2000,8000,3.03233930636804,NA 
rayol-farm2_2019-05-02_13-15-13.wav,44100,16,60,1,bioacoustic_index,512,2000,8000,2.08513860655172,NA 
rayol-farm2_2019-05-02_13-17-13.wav,44100,16,60,1,bioacoustic_index,512,2000,8000,1.93065713956372,NA 
rayol-farm2_2019-05-02_13-19-13.wav,44100,16,60,1,bioacoustic_index,512,2000,8000,3.01830536202416,NA 
rayol-farm2_2019-05-02_13-21-13.wav,44100,16,60,1,bioacoustic_index,512,2000,8000,1.81367056223999,NA 
rayol-farm2_2019-05-02_13-23-14.wav,44100,16,60,1,bioacoustic_index,512,2000,8000,2.00064338483436,NA 
rayol-farm2_2019-05-02_13-25-14.wav,44100,16,60,1,bioacoustic_index,512,2000,8000,2.34580404165622,NA 
rayol-farm2_2019-05-02_13-27-14.wav,44100,16,60,1,bioacoustic_index,512,2000,8000,2.6140321525607,NA 
rayol-farm2_2019-05-02_13-29-14.wav,44100,16,60,1,bioacoustic_index,512,2000,8000,2.73132035152971,NA 
rayol-farm2_2019-05-02_13-31-14.wav,44100,16,60,1,bioacoustic_index,512,2000,8000,4.54926447158026,NA 
rayol-farm2_2019-05-02_13-33-14.wav,44100,16,60,1,bioacoustic_index,512,2000,8000,2.7748915360623,NA 
rayol-farm2_2019-05-02_13-35-14.wav,44100,16,60,1,bioacoustic_index,512,2000,8000,2.19350032221321,NA 
rayol-farm2_2019-05-02_13-37-14.wav,44100,16,60,1,bioacoustic_index,512,2000,8000,2.92782301391149,NA 
rayol-farm2_2019-05-02_13-39-15.wav,44100,16,60,1,bioacoustic_index,512,2000,8000,2.74569210627293,NA 
rayol-farm2_2019-05-02_13-41-15.wav,44100,16,60,1,bioacoustic_index,512,2000,8000,2.32314406428677,NA 
rayol-farm2_2019-05-02_13-43-15.wav,44100,16,60,1,bioacoustic_index,512,2000,8000,2.80173600916477,NA 
rayol-farm2_2019-05-02_13-45-15.wav,44100,16,60,1,bioacoustic_index,512,2000,8000,2.62906152871872,NA 
rayol-farm2_2019-05-02_13-47-15.wav,44100,16,60,1,bioacoustic_index,512,2000,8000,2.33607088813948,NA 
rayol-farm2_2019-05-02_13-49-15.wav,44100,16,60,1,bioacoustic_index,512,2000,8000,2.96078600007604,NA 
rayol-farm2_2019-05-02_13-51-15.wav,44100,16,60,1,bioacoustic_index,512,2000,8000,3.14260273434784,NA 
rayol-farm2_2019-05-02_13-53-15.wav,44100,16,60,1,bioacoustic_index,512,2000,8000,4.04451377955695,NA 
rayol-farm2_2019-05-02_13-55-16.wav,44100,16,60,1,bioacoustic_index,512,2000,8000,3.14920541752592,NA 
rayol-farm2_2019-05-02_13-57-16.wav,44100,16,60,1,bioacoustic_index,512,2000,8000,2.09081675160217,NA 
rayol-farm2_2019-05-02_13-59-16.wav,44100,16,60,1,bioacoustic_index,512,2000,8000,2.41695141745425,NA 
rayol-farm2_2019-05-02_14-01-16.wav,44100,16,60,1,bioacoustic_index,512,2000,8000,2.68283582437731,NA 
rayol-farm2_2019-05-02_14-03-16.wav,44100,16,60,1,bioacoustic_index,512,2000,8000,2.53508657859998,NA 
rayol-farm2_2019-05-02_14-05-16.wav,44100,16,60,1,bioacoustic_index,512,2000,8000,6.8180203024389,NA 
rayol-farm2_2019-05-02_14-07-16.wav,44100,16,60,1,bioacoustic_index,512,2000,8000,6.42036467791918,NA 
rayol-farm2_2019-05-02_14-09-16.wav,44100,16,60,1,bioacoustic_index,512,2000,8000,5.64813555674889,NA 
rayol-farm2_2019-05-02_14-11-17.wav,44100,16,60,1,bioacoustic_index,512,2000,8000,4.65163811974645,NA 
rayol-farm2_2019-05-02_14-13-17.wav,44100,16,60,1,bioacoustic_index,512,2000,8000,3.72424139035579,NA 
rayol-farm2_2019-05-02_14-15-17.wav,44100,16,60,1,bioacoustic_index,512,2000,8000,5.33721567035942,NA 
rayol-farm2_2019-05-02_14-17-17.wav,44100,16,60,1,bioacoustic_index,512,2000,8000,2.90068526456081,NA 
rayol-farm2_2019-05-02_14-19-17.wav,44100,16,60,1,bioacoustic_index,512,2000,8000,4.96546222298531,NA 
rayol-farm2_2019-05-02_14-21-17.wav,44100,16,60,1,bioacoustic_index,512,2000,8000,2.93374770036022,NA 
rayol-farm2_2019-05-02_14-23-17.wav,44100,16,60,1,bioacoustic_index,512,2000,8000,2.51321879943807,NA 
rayol-farm2_2019-05-02_14-25-17.wav,44100,16,60,1,bioacoustic_index,512,2000,8000,2.42497484209992,NA 
rayol-farm2_2019-05-02_14-27-17.wav,44100,16,60,1,bioacoustic_index,512,2000,8000,3.42274833554929,NA 
rayol-farm2_2019-05-02_14-29-18.wav,44100,16,60,1,bioacoustic_index,512,2000,8000,1.91756142121165,NA 
rayol-farm2_2019-05-02_14-31-18.wav,44100,16,60,1,bioacoustic_index,512,2000,8000,2.08696273987651,NA 
rayol-farm2_2019-05-02_14-33-18.wav,44100,16,60,1,bioacoustic_index,512,2000,8000,2.13522988090107,NA 
rayol-farm2_2019-05-02_14-35-18.wav,44100,16,60,1,bioacoustic_index,512,2000,8000,1.92031362866993,NA 
rayol-farm2_2019-05-02_14-37-18.wav,44100,16,60,1,bioacoustic_index,512,2000,8000,2.10285469213053,NA 
rayol-farm2_2019-05-02_14-39-18.wav,44100,16,60,1,bioacoustic_index,512,2000,8000,1.97763450147196,NA 
rayol-farm2_2019-05-02_14-41-18.wav,44100,16,60,1,bioacoustic_index,512,2000,8000,1.67350809958487,NA 
rayol-farm2_2019-05-02_14-43-18.wav,44100,16,60,1,bioacoustic_index,512,2000,8000,1.62941396641746,NA 
rayol-farm2_2019-05-02_14-45-19.wav,44100,16,60,1,bioacoustic_index,512,2000,8000,1.55116080806391,NA 
rayol-farm2_2019-05-02_14-47-19.wav,44100,16,60,1,bioacoustic_index,512,2000,8000,2.0247910373559,NA 
rayol-farm2_2019-05-02_14-49-19.wav,44100,16,60,1,bioacoustic_index,512,2000,8000,1.59802891552653,NA 
rayol-farm2_2019-05-02_14-51-19.wav,44100,16,60,1,bioacoustic_index,512,2000,8000,1.56526136082413,NA 
rayol-farm2_2019-05-02_14-53-19.wav,44100,16,60,1,bioacoustic_index,512,2000,8000,1.8751335560519,NA 
rayol-farm2_2019-05-02_14-55-19.wav,44100,16,60,1,bioacoustic_index,512,2000,8000,2.24258579787008,NA 
rayol-farm2_2019-05-02_14-57-19.wav,44100,16,60,1,bioacoustic_index,512,2000,8000,1.82363568886005,NA 
rayol-farm2_2019-05-02_14-59-19.wav,44100,16,60,1,bioacoustic_index,512,2000,8000,4.34783132953204,NA 
rayol-farm2_2019-05-02_15-01-20.wav,44100,16,60,1,bioacoustic_index,512,2000,8000,1.75382083236994,NA 
rayol-farm2_2019-05-02_15-03-20.wav,44100,16,60,1,bioacoustic_index,512,2000,8000,1.74879937475652,NA 
rayol-farm2_2019-05-02_15-05-20.wav,44100,16,60,1,bioacoustic_index,512,2000,8000,3.29192398078406,NA 
rayol-farm2_2019-05-02_15-07-20.wav,44100,16,60,1,bioacoustic_index,512,2000,8000,2.17724056436722,NA 
rayol-farm2_2019-05-02_15-09-20.wav,44100,16,60,1,bioacoustic_index,512,2000,8000,2.87741843935888,NA 
rayol-farm2_2019-05-02_15-11-20.wav,44100,16,60,1,bioacoustic_index,512,2000,8000,1.6798125472421,NA 
rayol-farm2_2019-05-02_15-13-20.wav,44100,16,60,1,bioacoustic_index,512,2000,8000,2.59272035145735,NA 
rayol-farm2_2019-05-02_15-15-20.wav,44100,16,60,1,bioacoustic_index,512,2000,8000,1.91738111501319,NA 
rayol-farm2_2019-05-02_15-17-20.wav,44100,16,60,1,bioacoustic_index,512,2000,8000,1.87436189611046,NA 
rayol-farm2_2019-05-02_15-19-21.wav,44100,16,60,1,bioacoustic_index,512,2000,8000,1.57345604930513,NA 
rayol-farm2_2019-05-02_15-21-21.wav,44100,16,60,1,bioacoustic_index,512,2000,8000,1.6544463128964,NA 
rayol-farm2_2019-05-02_15-23-21.wav,44100,16,60,1,bioacoustic_index,512,2000,8000,2.24633469543995,NA 
rayol-farm2_2019-05-02_15-25-21.wav,44100,16,60,1,bioacoustic_index,512,2000,8000,3.28757434565374,NA 
rayol-farm2_2019-05-02_15-27-21.wav,44100,16,60,1,bioacoustic_index,512,2000,8000,3.54367636937417,NA 
rayol-farm2_2019-05-02_15-29-21.wav,44100,16,60,1,bioacoustic_index,512,2000,8000,3.09062192293219,NA 
rayol-farm2_2019-05-02_15-31-21.wav,44100,16,60,1,bioacoustic_index,512,2000,8000,1.57839109977286,NA 
rayol-farm2_2019-05-02_15-33-21.wav,44100,16,60,1,bioacoustic_index,512,2000,8000,1.54057158131055,NA 
rayol-farm2_2019-05-02_15-35-22.wav,44100,16,60,1,bioacoustic_index,512,2000,8000,1.67930527006955,NA 
rayol-farm2_2019-05-02_15-37-22.wav,44100,16,60,1,bioacoustic_index,512,2000,8000,2.01844674242311,NA 
rayol-farm2_2019-05-02_15-39-22.wav,44100,16,60,1,bioacoustic_index,512,2000,8000,2.34045934029298,NA 
rayol-farm2_2019-05-02_15-41-22.wav,44100,16,60,1,bioacoustic_index,512,2000,8000,2.18336580395343,NA 
rayol-farm2_2019-05-02_15-43-22.wav,44100,16,60,1,bioacoustic_index,512,2000,8000,2.78649506252882,NA 
rayol-farm2_2019-05-02_15-45-22.wav,44100,16,60,1,bioacoustic_index,512,2000,8000,1.64150062967348,NA 
rayol-farm2_2019-05-02_15-47-22.wav,44100,16,60,1,bioacoustic_index,512,2000,8000,2.16003287041261,NA 
rayol-farm2_2019-05-02_15-49-22.wav,44100,16,60,1,bioacoustic_index,512,2000,8000,2.62312586681094,NA 
rayol-farm2_2019-05-02_15-51-23.wav,44100,16,60,1,bioacoustic_index,512,2000,8000,3.48887341272819,NA 
rayol-farm2_2019-05-02_15-53-23.wav,44100,16,60,1,bioacoustic_index,512,2000,8000,2.26324888766088,NA 
rayol-farm2_2019-05-02_15-55-23.wav,44100,16,60,1,bioacoustic_index,512,2000,8000,2.07595319429507,NA 
rayol-farm2_2019-05-02_15-57-23.wav,44100,16,60,1,bioacoustic_index,512,2000,8000,1.98678274911742,NA 
rayol-farm2_2019-05-02_15-59-23.wav,44100,16,60,1,bioacoustic_index,512,2000,8000,3.09403187469888,NA 
rayol-farm2_2019-05-02_16-01-23.wav,44100,16,60,1,bioacoustic_index,512,2000,8000,2.07003486572932,NA 
rayol-farm2_2019-05-02_16-03-23.wav,44100,16,60,1,bioacoustic_index,512,2000,8000,2.15104527483236,NA 
rayol-farm2_2019-05-02_16-05-23.wav,44100,16,60,1,bioacoustic_index,512,2000,8000,3.51984856530699,NA 
rayol-farm2_2019-05-02_16-07-24.wav,44100,16,60,1,bioacoustic_index,512,2000,8000,1.70404779568573,NA 
rayol-farm2_2019-05-02_16-09-24.wav,44100,16,60,1,bioacoustic_index,512,2000,8000,1.54386910722427,NA 
rayol-farm2_2019-05-02_16-11-24.wav,44100,16,60,1,bioacoustic_index,512,2000,8000,1.51544860700232,NA 
rayol-farm2_2019-05-02_16-13-24.wav,44100,16,60,1,bioacoustic_index,512,2000,8000,1.46406633790219,NA 
rayol-farm2_2019-05-02_16-15-24.wav,44100,16,60,1,bioacoustic_index,512,2000,8000,1.88940682713695,NA 
rayol-farm2_2019-05-02_16-17-24.wav,44100,16,60,1,bioacoustic_index,512,2000,8000,3.66352462546255,NA 
rayol-farm2_2019-05-02_16-19-24.wav,44100,16,60,1,bioacoustic_index,512,2000,8000,1.92723612269895,NA 
rayol-farm2_2019-05-02_16-21-24.wav,44100,16,60,1,bioacoustic_index,512,2000,8000,2.56310770811675,NA 
rayol-farm2_2019-05-02_16-23-24.wav,44100,16,60,1,bioacoustic_index,512,2000,8000,2.43303984115686,NA 
rayol-farm2_2019-05-02_16-25-25.wav,44100,16,60,1,bioacoustic_index,512,2000,8000,1.80747100884432,NA 
rayol-farm2_2019-05-02_16-27-25.wav,44100,16,60,1,bioacoustic_index,512,2000,8000,4.07295558381121,NA 
rayol-farm2_2019-05-02_16-29-25.wav,44100,16,60,1,bioacoustic_index,512,2000,8000,1.57110880250097,NA 
rayol-farm2_2019-05-02_16-31-25.wav,44100,16,60,1,bioacoustic_index,512,2000,8000,1.46413021767436,NA 
rayol-farm2_2019-05-02_16-33-25.wav,44100,16,60,1,bioacoustic_index,512,2000,8000,2.01189606554052,NA 
rayol-farm2_2019-05-02_16-35-25.wav,44100,16,60,1,bioacoustic_index,512,2000,8000,2.52596815602224,NA 
rayol-farm2_2019-05-02_16-37-25.wav,44100,16,60,1,bioacoustic_index,512,2000,8000,2.40547096569904,NA 
rayol-farm2_2019-05-02_16-39-25.wav,44100,16,60,1,bioacoustic_index,512,2000,8000,2.89566489883598,NA 
rayol-farm2_2019-05-02_16-41-26.wav,44100,16,60,1,bioacoustic_index,512,2000,8000,2.11928273616411,NA 
rayol-farm2_2019-05-02_16-43-26.wav,44100,16,60,1,bioacoustic_index,512,2000,8000,2.49519638769973,NA 
rayol-farm2_2019-05-02_16-45-26.wav,44100,16,60,1,bioacoustic_index,512,2000,8000,2.59237035213068,NA 
rayol-farm2_2019-05-02_16-47-26.wav,44100,16,60,1,bioacoustic_index,512,2000,8000,2.86478763710154,NA 
rayol-farm2_2019-05-02_16-49-26.wav,44100,16,60,1,bioacoustic_index,512,2000,8000,2.1191752048046,NA 
rayol-farm2_2019-05-02_16-51-26.wav,44100,16,60,1,bioacoustic_index,512,2000,8000,1.52713047909871,NA 
rayol-farm2_2019-05-02_16-53-26.wav,44100,16,60,1,bioacoustic_index,512,2000,8000,1.51572677956743,NA 
rayol-farm2_2019-05-02_16-55-26.wav,44100,16,60,1,bioacoustic_index,512,2000,8000,1.57924127570576,NA 
rayol-farm2_2019-05-02_16-57-27.wav,44100,16,60,1,bioacoustic_index,512,2000,8000,2.0719193079815,NA 
rayol-farm2_2019-05-02_16-59-27.wav,44100,16,60,1,bioacoustic_index,512,2000,8000,1.79074845380322,NA 
rayol-farm2_2019-05-02_17-01-27.wav,44100,16,60,1,bioacoustic_index,512,2000,8000,1.45897482155097,NA 
rayol-farm2_2019-05-02_17-03-27.wav,44100,16,60,1,bioacoustic_index,512,2000,8000,2.09138794933371,NA 
rayol-farm2_2019-05-02_17-05-27.wav,44100,16,60,1,bioacoustic_index,512,2000,8000,1.5022989644049,NA 
rayol-farm2_2019-05-02_17-07-27.wav,44100,16,60,1,bioacoustic_index,512,2000,8000,1.83140048075597,NA 
rayol-farm2_2019-05-02_17-09-27.wav,44100,16,60,1,bioacoustic_index,512,2000,8000,1.9720420376424,NA 
rayol-farm2_2019-05-02_17-11-27.wav,44100,16,60,1,bioacoustic_index,512,2000,8000,1.9307628108618,NA 
rayol-farm2_2019-05-02_17-13-28.wav,44100,16,60,1,bioacoustic_index,512,2000,8000,1.60111855316896,NA 
rayol-farm2_2019-05-02_17-15-28.wav,44100,16,60,1,bioacoustic_index,512,2000,8000,1.6095889478992,NA 
rayol-farm2_2019-05-02_17-17-28.wav,44100,16,60,1,bioacoustic_index,512,2000,8000,1.80262926365119,NA 
rayol-farm2_2019-05-02_17-19-28.wav,44100,16,60,1,bioacoustic_index,512,2000,8000,2.33784604037195,NA 
rayol-farm2_2019-05-02_17-21-28.wav,44100,16,60,1,bioacoustic_index,512,2000,8000,2.61882362201829,NA 
rayol-farm2_2019-05-02_17-23-28.wav,44100,16,60,1,bioacoustic_index,512,2000,8000,2.02463166271245,NA 
rayol-farm2_2019-05-02_17-25-28.wav,44100,16,60,1,bioacoustic_index,512,2000,8000,1.78428870663364,NA 
rayol-farm2_2019-05-02_17-27-28.wav,44100,16,60,1,bioacoustic_index,512,2000,8000,1.44838905113598,NA 
rayol-farm2_2019-05-02_17-29-28.wav,44100,16,60,1,bioacoustic_index,512,2000,8000,1.43173608500894,NA 
rayol-farm2_2019-05-02_17-31-29.wav,44100,16,60,1,bioacoustic_index,512,2000,8000,1.49117533494932,NA 
rayol-farm2_2019-05-02_17-33-29.wav,44100,16,60,1,bioacoustic_index,512,2000,8000,1.56644877673134,NA 
rayol-farm2_2019-05-02_17-35-29.wav,44100,16,60,1,bioacoustic_index,512,2000,8000,1.39379850916194,NA 
rayol-farm2_2019-05-02_17-37-29.wav,44100,16,60,1,bioacoustic_index,512,2000,8000,1.54278054625983,NA 
rayol-farm2_2019-05-02_17-39-29.wav,44100,16,60,1,bioacoustic_index,512,2000,8000,1.37472556898423,NA 
rayol-farm2_2019-05-02_17-41-29.wav,44100,16,60,1,bioacoustic_index,512,2000,8000,1.4643865773353,NA 
rayol-farm2_2019-05-02_17-43-29.wav,44100,16,60,1,bioacoustic_index,512,2000,8000,1.40003000847461,NA 
rayol-farm2_2019-05-02_17-45-29.wav,44100,16,60,1,bioacoustic_index,512,2000,8000,1.43098479323979,NA 
rayol-farm2_2019-05-02_17-47-30.wav,44100,16,60,1,bioacoustic_index,512,2000,8000,1.40175675715438,NA 
rayol-farm2_2019-05-02_17-49-30.wav,44100,16,60,1,bioacoustic_index,512,2000,8000,1.46867457663821,NA 
rayol-farm2_2019-05-02_17-51-30.wav,44100,16,60,1,bioacoustic_index,512,2000,8000,1.63702448624334,NA 
rayol-farm2_2019-05-02_17-53-30.wav,44100,16,60,1,bioacoustic_index,512,2000,8000,2.11647395971008,NA 
rayol-farm2_2019-05-02_17-55-30.wav,44100,16,60,1,bioacoustic_index,512,2000,8000,3.30384922323527,NA 
rayol-farm2_2019-05-02_17-57-30.wav,44100,16,60,1,bioacoustic_index,512,2000,8000,1.67698114050619,NA 
rayol-farm2_2019-05-02_17-59-30.wav,44100,16,60,1,bioacoustic_index,512,2000,8000,1.4403275359989,NA 
rayol-farm2_2019-05-02_18-01-30.wav,44100,16,60,1,bioacoustic_index,512,2000,8000,1.39113606305835,NA 
rayol-farm2_2019-05-02_18-03-31.wav,44100,16,60,1,bioacoustic_index,512,2000,8000,1.427941267343,NA 
rayol-farm2_2019-05-02_18-05-31.wav,44100,16,60,1,bioacoustic_index,512,2000,8000,1.5829074972304,NA 
rayol-farm2_2019-05-02_18-07-31.wav,44100,16,60,1,bioacoustic_index,512,2000,8000,1.85458802573956,NA 
rayol-farm2_2019-05-02_18-09-31.wav,44100,16,60,1,bioacoustic_index,512,2000,8000,1.74400139692465,NA 
rayol-farm2_2019-05-02_18-11-31.wav,44100,16,60,1,bioacoustic_index,512,2000,8000,2.50564381011508,NA 
rayol-farm2_2019-05-02_18-13-31.wav,44100,16,60,1,bioacoustic_index,512,2000,8000,2.33939245448187,NA 
rayol-farm2_2019-05-02_18-15-31.wav,44100,16,60,1,bioacoustic_index,512,2000,8000,1.51240712887034,NA 
rayol-farm2_2019-05-02_18-17-31.wav,44100,16,60,1,bioacoustic_index,512,2000,8000,2.5177184593192,NA 
rayol-farm2_2019-05-02_18-19-32.wav,44100,16,60,1,bioacoustic_index,512,2000,8000,1.66807141108395,NA 
rayol-farm2_2019-05-02_18-21-32.wav,44100,16,60,1,bioacoustic_index,512,2000,8000,1.4665013516697,NA 
rayol-farm2_2019-05-02_18-23-32.wav,44100,16,60,1,bioacoustic_index,512,2000,8000,1.45690319028105,NA 
rayol-farm2_2019-05-02_18-25-32.wav,44100,16,60,1,bioacoustic_index,512,2000,8000,1.72244852698002,NA 
rayol-farm2_2019-05-02_18-27-32.wav,44100,16,60,1,bioacoustic_index,512,2000,8000,1.43782303599261,NA 
rayol-farm2_2019-05-02_18-29-32.wav,44100,16,60,1,bioacoustic_index,512,2000,8000,1.39007466223105,NA 
rayol-farm2_2019-05-02_18-31-32.wav,44100,16,60,1,bioacoustic_index,512,2000,8000,1.52075436488085,NA 
rayol-farm2_2019-05-02_18-33-32.wav,44100,16,60,1,bioacoustic_index,512,2000,8000,1.4212019469002,NA 
rayol-farm2_2019-05-02_18-35-33.wav,44100,16,60,1,bioacoustic_index,512,2000,8000,2.02204472585082,NA 
rayol-farm2_2019-05-02_18-37-33.wav,44100,16,60,1,bioacoustic_index,512,2000,8000,1.46791454601348,NA 
rayol-farm2_2019-05-02_18-39-33.wav,44100,16,60,1,bioacoustic_index,512,2000,8000,1.38125467880258,NA 
rayol-farm2_2019-05-02_18-41-33.wav,44100,16,60,1,bioacoustic_index,512,2000,8000,1.52368518472637,NA 
rayol-farm2_2019-05-02_18-43-33.wav,44100,16,60,1,bioacoustic_index,512,2000,8000,1.60700125886672,NA 
rayol-farm2_2019-05-02_18-45-33.wav,44100,16,60,1,bioacoustic_index,512,2000,8000,1.86890932427576,NA 
rayol-farm2_2019-05-02_18-47-33.wav,44100,16,60,1,bioacoustic_index,512,2000,8000,1.6169152819516,NA 
rayol-farm2_2019-05-02_18-49-33.wav,44100,16,60,1,bioacoustic_index,512,2000,8000,1.53495822865056,NA 
rayol-farm2_2019-05-02_18-51-33.wav,44100,16,60,1,bioacoustic_index,512,2000,8000,1.68388933379585,NA 
rayol-farm2_2019-05-02_18-53-34.wav,44100,16,60,1,bioacoustic_index,512,2000,8000,1.3551837600443,NA 
rayol-farm2_2019-05-02_18-55-34.wav,44100,16,60,1,bioacoustic_index,512,2000,8000,2.32256131955549,NA 
rayol-farm2_2019-05-02_18-57-34.wav,44100,16,60,1,bioacoustic_index,512,2000,8000,1.67988894648454,NA 
rayol-farm2_2019-05-02_18-59-34.wav,44100,16,60,1,bioacoustic_index,512,2000,8000,1.4735765097483,NA 
rayol-farm2_2019-05-02_19-01-34.wav,44100,16,60,1,bioacoustic_index,512,2000,8000,1.58001426306639,NA 
rayol-farm2_2019-05-02_19-03-34.wav,44100,16,60,1,bioacoustic_index,512,2000,8000,1.56956616465075,NA 
rayol-farm2_2019-05-02_19-05-34.wav,44100,16,60,1,bioacoustic_index,512,2000,8000,1.51088074152897,NA 
rayol-farm2_2019-05-02_19-07-34.wav,44100,16,60,1,bioacoustic_index,512,2000,8000,2.00907449455607,NA 
rayol-farm2_2019-05-02_19-09-35.wav,44100,16,60,1,bioacoustic_index,512,2000,8000,2.20491554480006,NA 
rayol-farm2_2019-05-02_19-11-35.wav,44100,16,60,1,bioacoustic_index,512,2000,8000,1.8596760731598,NA 
rayol-farm2_2019-05-02_19-13-35.wav,44100,16,60,1,bioacoustic_index,512,2000,8000,1.61751181440291,NA 
rayol-farm2_2019-05-02_19-15-35.wav,44100,16,60,1,bioacoustic_index,512,2000,8000,1.745395869431,NA 
rayol-farm2_2019-05-02_19-17-35.wav,44100,16,60,1,bioacoustic_index,512,2000,8000,1.60429826842518,NA 
rayol-farm2_2019-05-02_19-19-35.wav,44100,16,60,1,bioacoustic_index,512,2000,8000,1.91956828751008,NA 
rayol-farm2_2019-05-02_19-21-35.wav,44100,16,60,1,bioacoustic_index,512,2000,8000,2.0957805825359,NA 
rayol-farm2_2019-05-02_19-23-35.wav,44100,16,60,1,bioacoustic_index,512,2000,8000,1.43812610377653,NA 
rayol-farm2_2019-05-02_19-25-36.wav,44100,16,60,1,bioacoustic_index,512,2000,8000,1.61315206537716,NA 
rayol-farm2_2019-05-02_19-27-36.wav,44100,16,60,1,bioacoustic_index,512,2000,8000,2.28106470803721,NA 
rayol-farm2_2019-05-02_19-29-36.wav,44100,16,60,1,bioacoustic_index,512,2000,8000,2.2704911432005,NA 
rayol-farm2_2019-05-02_19-31-36.wav,44100,16,60,1,bioacoustic_index,512,2000,8000,2.61837917712632,NA 
rayol-farm2_2019-05-02_19-33-36.wav,44100,16,60,1,bioacoustic_index,512,2000,8000,2.17228272189549,NA 
rayol-farm2_2019-05-02_19-35-36.wav,44100,16,60,1,bioacoustic_index,512,2000,8000,1.68085128379254,NA 
rayol-farm2_2019-05-02_19-37-36.wav,44100,16,60,1,bioacoustic_index,512,2000,8000,1.20424657378477,NA 
rayol-farm2_2019-05-02_19-39-36.wav,44100,16,60,1,bioacoustic_index,512,2000,8000,1.51777669706571,NA 
rayol-farm2_2019-05-02_19-41-37.wav,44100,16,60,1,bioacoustic_index,512,2000,8000,1.57253128166224,NA 
rayol-farm2_2019-05-02_19-43-37.wav,44100,16,60,1,bioacoustic_index,512,2000,8000,2.44713160662087,NA 
rayol-farm2_2019-05-02_19-45-37.wav,44100,16,60,1,bioacoustic_index,512,2000,8000,2.30675800451066,NA 
rayol-farm2_2019-05-02_19-47-37.wav,44100,16,60,1,bioacoustic_index,512,2000,8000,2.55548598652873,NA 
rayol-farm2_2019-05-02_19-49-37.wav,44100,16,60,1,bioacoustic_index,512,2000,8000,2.19454198971287,NA 
rayol-farm2_2019-05-02_19-51-37.wav,44100,16,60,1,bioacoustic_index,512,2000,8000,1.64030491652815,NA 
rayol-farm2_2019-05-02_19-53-37.wav,44100,16,60,1,bioacoustic_index,512,2000,8000,1.21444430013766,NA 
rayol-farm2_2019-05-02_19-55-37.wav,44100,16,60,1,bioacoustic_index,512,2000,8000,1.26643620949294,NA 
rayol-farm2_2019-05-02_19-57-37.wav,44100,16,60,1,bioacoustic_index,512,2000,8000,1.28515656295197,NA 
rayol-farm2_2019-05-02_19-59-38.wav,44100,16,60,1,bioacoustic_index,512,2000,8000,1.30275645299774,NA 
rayol-farm2_2019-05-02_20-01-38.wav,44100,16,60,1,bioacoustic_index,512,2000,8000,1.45511007732544,NA 
rayol-farm2_2019-05-02_20-03-38.wav,44100,16,60,1,bioacoustic_index,512,2000,8000,1.39761810266116,NA 
rayol-farm2_2019-05-02_20-05-38.wav,44100,16,60,1,bioacoustic_index,512,2000,8000,1.58296815298527,NA 
rayol-farm2_2019-05-02_20-07-38.wav,44100,16,60,1,bioacoustic_index,512,2000,8000,1.81951021848803,NA 
rayol-farm2_2019-05-02_20-09-38.wav,44100,16,60,1,bioacoustic_index,512,2000,8000,1.55741174269907,NA 
rayol-farm2_2019-05-02_20-11-38.wav,44100,16,60,1,bioacoustic_index,512,2000,8000,2.07637927151749,NA 
rayol-farm2_2019-05-02_20-13-38.wav,44100,16,60,1,bioacoustic_index,512,2000,8000,1.49064802966219,NA 
rayol-farm2_2019-05-02_20-15-39.wav,44100,16,60,1,bioacoustic_index,512,2000,8000,1.43050385041301,NA 
rayol-farm2_2019-05-02_20-17-39.wav,44100,16,60,1,bioacoustic_index,512,2000,8000,1.3026782543722,NA 
rayol-farm2_2019-05-02_20-19-39.wav,44100,16,60,1,bioacoustic_index,512,2000,8000,1.27923582447607,NA 
rayol-farm2_2019-05-02_20-21-39.wav,44100,16,60,1,bioacoustic_index,512,2000,8000,1.53736094156783,NA 
rayol-farm2_2019-05-02_20-23-39.wav,44100,16,60,1,bioacoustic_index,512,2000,8000,1.41740193879529,NA 
rayol-farm2_2019-05-02_20-25-39.wav,44100,16,60,1,bioacoustic_index,512,2000,8000,1.43792642369571,NA 
rayol-farm2_2019-05-02_20-27-39.wav,44100,16,60,1,bioacoustic_index,512,2000,8000,1.50370361038776,NA 
rayol-farm2_2019-05-02_20-29-39.wav,44100,16,60,1,bioacoustic_index,512,2000,8000,1.68978328746757,NA 
rayol-farm2_2019-05-02_20-31-40.wav,44100,16,60,1,bioacoustic_index,512,2000,8000,1.89502922209328,NA 
rayol-farm2_2019-05-02_20-33-40.wav,44100,16,60,1,bioacoustic_index,512,2000,8000,2.34327120048002,NA 
rayol-farm2_2019-05-02_20-35-40.wav,44100,16,60,1,bioacoustic_index,512,2000,8000,2.11665630390279,NA 
rayol-farm2_2019-05-02_20-37-40.wav,44100,16,60,1,bioacoustic_index,512,2000,8000,2.26367024795741,NA 
rayol-farm2_2019-05-02_20-39-40.wav,44100,16,60,1,bioacoustic_index,512,2000,8000,1.85691437211117,NA 
rayol-farm2_2019-05-02_20-41-40.wav,44100,16,60,1,bioacoustic_index,512,2000,8000,1.83213265126546,NA 
rayol-farm2_2019-05-02_20-43-40.wav,44100,16,60,1,bioacoustic_index,512,2000,8000,1.73011325386712,NA 
rayol-farm2_2019-05-02_20-45-40.wav,44100,16,60,1,bioacoustic_index,512,2000,8000,2.1517438336384,NA 
rayol-farm2_2019-05-02_20-47-41.wav,44100,16,60,1,bioacoustic_index,512,2000,8000,1.61648070803967,NA 
rayol-farm2_2019-05-02_20-49-41.wav,44100,16,60,1,bioacoustic_index,512,2000,8000,2.11385125105175,NA 
rayol-farm2_2019-05-02_20-51-41.wav,44100,16,60,1,bioacoustic_index,512,2000,8000,1.64249698049668,NA 
rayol-farm2_2019-05-02_20-53-41.wav,44100,16,60,1,bioacoustic_index,512,2000,8000,2.31120314950978,NA 
rayol-farm2_2019-05-02_20-55-41.wav,44100,16,60,1,bioacoustic_index,512,2000,8000,2.07985214250594,NA 
rayol-farm2_2019-05-02_20-57-41.wav,44100,16,60,1,bioacoustic_index,512,2000,8000,1.99029399335546,NA 
rayol-farm2_2019-05-02_20-59-41.wav,44100,16,60,1,bioacoustic_index,512,2000,8000,2.12652867050761,NA 
rayol-farm2_2019-05-02_21-01-41.wav,44100,16,60,1,bioacoustic_index,512,2000,8000,1.4641387098873,NA 
rayol-farm2_2019-05-02_21-03-42.wav,44100,16,60,1,bioacoustic_index,512,2000,8000,2.01854277595687,NA 
rayol-farm2_2019-05-02_21-05-42.wav,44100,16,60,1,bioacoustic_index,512,2000,8000,1.8453883137129,NA 
rayol-farm2_2019-05-02_21-07-42.wav,44100,16,60,1,bioacoustic_index,512,2000,8000,1.46350565386728,NA 
rayol-farm2_2019-05-02_21-09-42.wav,44100,16,60,1,bioacoustic_index,512,2000,8000,1.90106609455524,NA 
rayol-farm2_2019-05-02_21-11-42.wav,44100,16,60,1,bioacoustic_index,512,2000,8000,1.80378175671865,NA 
rayol-farm2_2019-05-02_21-13-42.wav,44100,16,60,1,bioacoustic_index,512,2000,8000,1.31477162832384,NA 
rayol-farm2_2019-05-02_21-15-42.wav,44100,16,60,1,bioacoustic_index,512,2000,8000,1.36396159290164,NA 
rayol-farm2_2019-05-02_21-17-42.wav,44100,16,60,1,bioacoustic_index,512,2000,8000,1.33984289235214,NA 
rayol-farm2_2019-05-02_21-19-42.wav,44100,16,60,1,bioacoustic_index,512,2000,8000,1.33864587457499,NA 
rayol-farm2_2019-05-02_21-21-43.wav,44100,16,60,1,bioacoustic_index,512,2000,8000,1.29544579839336,NA 
rayol-farm2_2019-05-02_21-23-43.wav,44100,16,60,1,bioacoustic_index,512,2000,8000,1.36350687213018,NA 
rayol-farm2_2019-05-02_21-25-43.wav,44100,16,60,1,bioacoustic_index,512,2000,8000,1.26088340159179,NA 
rayol-farm2_2019-05-02_21-27-43.wav,44100,16,60,1,bioacoustic_index,512,2000,8000,1.37308709821946,NA 
rayol-farm2_2019-05-02_21-29-43.wav,44100,16,60,1,bioacoustic_index,512,2000,8000,1.29579561218383,NA 
rayol-farm2_2019-05-02_21-31-43.wav,44100,16,60,1,bioacoustic_index,512,2000,8000,1.29931722046231,NA 
rayol-farm2_2019-05-02_21-33-43.wav,44100,16,60,1,bioacoustic_index,512,2000,8000,1.22458082701209,NA 
rayol-farm2_2019-05-02_21-35-43.wav,44100,16,60,1,bioacoustic_index,512,2000,8000,1.28968454040687,NA 
rayol-farm2_2019-05-02_21-37-44.wav,44100,16,60,1,bioacoustic_index,512,2000,8000,1.29624341083413,NA 
rayol-farm2_2019-05-02_21-39-44.wav,44100,16,60,1,bioacoustic_index,512,2000,8000,1.34359516879465,NA 
rayol-farm2_2019-05-02_21-41-44.wav,44100,16,60,1,bioacoustic_index,512,2000,8000,1.34122385056622,NA 
rayol-farm2_2019-05-02_21-43-44.wav,44100,16,60,1,bioacoustic_index,512,2000,8000,1.32340412692874,NA 
rayol-farm2_2019-05-02_21-45-44.wav,44100,16,60,1,bioacoustic_index,512,2000,8000,1.32664522940383,NA 
rayol-farm2_2019-05-02_21-47-44.wav,44100,16,60,1,bioacoustic_index,512,2000,8000,1.33377444010105,NA 
rayol-farm2_2019-05-02_21-49-44.wav,44100,16,60,1,bioacoustic_index,512,2000,8000,1.32998658844541,NA 
rayol-farm2_2019-05-02_21-51-44.wav,44100,16,60,1,bioacoustic_index,512,2000,8000,1.42360742805394,NA 
rayol-farm2_2019-05-02_21-53-45.wav,44100,16,60,1,bioacoustic_index,512,2000,8000,1.29261029012663,NA 
rayol-farm2_2019-05-02_21-55-45.wav,44100,16,60,1,bioacoustic_index,512,2000,8000,1.32813335990976,NA 
rayol-farm2_2019-05-02_21-57-45.wav,44100,16,60,1,bioacoustic_index,512,2000,8000,1.32377513083773,NA 
rayol-farm2_2019-05-02_21-59-45.wav,44100,16,60,1,bioacoustic_index,512,2000,8000,1.35163502983629,NA 
rayol-farm2_2019-05-02_22-01-45.wav,44100,16,60,1,bioacoustic_index,512,2000,8000,1.30527433887003,NA 
rayol-farm2_2019-05-02_22-03-45.wav,44100,16,60,1,bioacoustic_index,512,2000,8000,1.37395319160025,NA 
rayol-farm2_2019-05-02_22-05-45.wav,44100,16,60,1,bioacoustic_index,512,2000,8000,1.29601389054172,NA 
rayol-farm2_2019-05-02_22-07-45.wav,44100,16,60,1,bioacoustic_index,512,2000,8000,1.2865833933124,NA 
rayol-farm2_2019-05-02_22-09-46.wav,44100,16,60,1,bioacoustic_index,512,2000,8000,1.31252637504832,NA 
rayol-farm2_2019-05-02_22-11-46.wav,44100,16,60,1,bioacoustic_index,512,2000,8000,1.36754261201997,NA 
rayol-farm2_2019-05-02_22-13-46.wav,44100,16,60,1,bioacoustic_index,512,2000,8000,1.30504770904144,NA 
rayol-farm2_2019-05-02_22-15-46.wav,44100,16,60,1,bioacoustic_index,512,2000,8000,1.32583923140898,NA 
rayol-farm2_2019-05-02_22-17-46.wav,44100,16,60,1,bioacoustic_index,512,2000,8000,1.38551976804338,NA 
rayol-farm2_2019-05-02_22-19-46.wav,44100,16,60,1,bioacoustic_index,512,2000,8000,1.32410180480997,NA 
rayol-farm2_2019-05-02_22-21-46.wav,44100,16,60,1,bioacoustic_index,512,2000,8000,1.24308170529322,NA 
rayol-farm2_2019-05-02_22-23-46.wav,44100,16,60,1,bioacoustic_index,512,2000,8000,1.30955572894993,NA 
rayol-farm2_2019-05-02_22-25-47.wav,44100,16,60,1,bioacoustic_index,512,2000,8000,1.31186334547918,NA 
rayol-farm2_2019-05-02_22-27-47.wav,44100,16,60,1,bioacoustic_index,512,2000,8000,1.30745546442119,NA 
rayol-farm2_2019-05-02_22-29-47.wav,44100,16,60,1,bioacoustic_index,512,2000,8000,1.30377036877242,NA 
rayol-farm2_2019-05-02_22-31-47.wav,44100,16,60,1,bioacoustic_index,512,2000,8000,1.31987775264587,NA 
rayol-farm2_2019-05-02_22-33-47.wav,44100,16,60,1,bioacoustic_index,512,2000,8000,1.34323444697313,NA 
rayol-farm2_2019-05-02_22-35-47.wav,44100,16,60,1,bioacoustic_index,512,2000,8000,1.42075642684401,NA 
rayol-farm2_2019-05-02_22-37-47.wav,44100,16,60,1,bioacoustic_index,512,2000,8000,1.30592342414751,NA 
rayol-farm2_2019-05-02_22-39-47.wav,44100,16,60,1,bioacoustic_index,512,2000,8000,1.31877101223581,NA 
rayol-farm2_2019-05-02_22-41-47.wav,44100,16,60,1,bioacoustic_index,512,2000,8000,1.22896692294083,NA 
rayol-farm2_2019-05-02_22-43-48.wav,44100,16,60,1,bioacoustic_index,512,2000,8000,1.36980844903094,NA 
rayol-farm2_2019-05-02_22-45-48.wav,44100,16,60,1,bioacoustic_index,512,2000,8000,1.37763125620716,NA 
rayol-farm2_2019-05-02_22-47-48.wav,44100,16,60,1,bioacoustic_index,512,2000,8000,1.3327952473825,NA 
rayol-farm2_2019-05-02_22-49-48.wav,44100,16,60,1,bioacoustic_index,512,2000,8000,1.37915225038575,NA 
rayol-farm2_2019-05-02_22-51-48.wav,44100,16,60,1,bioacoustic_index,512,2000,8000,1.34727378570232,NA 
rayol-farm2_2019-05-02_22-53-48.wav,44100,16,60,1,bioacoustic_index,512,2000,8000,1.29667423418201,NA 
rayol-farm2_2019-05-02_22-55-48.wav,44100,16,60,1,bioacoustic_index,512,2000,8000,1.35745224236458,NA 
rayol-farm2_2019-05-02_22-57-48.wav,44100,16,60,1,bioacoustic_index,512,2000,8000,1.3084131718355,NA 
rayol-farm2_2019-05-02_22-59-49.wav,44100,16,60,1,bioacoustic_index,512,2000,8000,1.31654361101307,NA 
rayol-farm2_2019-05-02_23-01-49.wav,44100,16,60,1,bioacoustic_index,512,2000,8000,1.38506833613431,NA 
rayol-farm2_2019-05-02_23-03-49.wav,44100,16,60,1,bioacoustic_index,512,2000,8000,1.32004153084003,NA 
rayol-farm2_2019-05-02_23-05-49.wav,44100,16,60,1,bioacoustic_index,512,2000,8000,1.33130918578589,NA 
rayol-farm2_2019-05-02_23-07-49.wav,44100,16,60,1,bioacoustic_index,512,2000,8000,1.29019085689556,NA 
rayol-farm2_2019-05-02_23-09-49.wav,44100,16,60,1,bioacoustic_index,512,2000,8000,1.47638779381663,NA 
rayol-farm2_2019-05-02_23-11-49.wav,44100,16,60,1,bioacoustic_index,512,2000,8000,1.34266440378555,NA 
rayol-farm2_2019-05-02_23-13-49.wav,44100,16,60,1,bioacoustic_index,512,2000,8000,1.37339515218097,NA 
rayol-farm2_2019-05-02_23-15-50.wav,44100,16,60,1,bioacoustic_index,512,2000,8000,1.31390538961556,NA 
rayol-farm2_2019-05-02_23-17-50.wav,44100,16,60,1,bioacoustic_index,512,2000,8000,1.34049627926129,NA 
rayol-farm2_2019-05-02_23-19-50.wav,44100,16,60,1,bioacoustic_index,512,2000,8000,1.32357170210552,NA 
rayol-farm2_2019-05-02_23-21-50.wav,44100,16,60,1,bioacoustic_index,512,2000,8000,1.4415853458233,NA 
rayol-farm2_2019-05-02_23-23-50.wav,44100,16,60,1,bioacoustic_index,512,2000,8000,1.40236987568551,NA 
rayol-farm2_2019-05-02_23-25-50.wav,44100,16,60,1,bioacoustic_index,512,2000,8000,1.32100066199201,NA 
rayol-farm2_2019-05-02_23-27-50.wav,44100,16,60,1,bioacoustic_index,512,2000,8000,1.38479225686875,NA 
rayol-farm2_2019-05-02_23-29-50.wav,44100,16,60,1,bioacoustic_index,512,2000,8000,1.46289875249163,NA 
rayol-farm2_2019-05-02_23-31-51.wav,44100,16,60,1,bioacoustic_index,512,2000,8000,1.46645611966022,NA 
rayol-farm2_2019-05-02_23-33-51.wav,44100,16,60,1,bioacoustic_index,512,2000,8000,1.43689110929731,NA 
rayol-farm2_2019-05-02_23-35-51.wav,44100,16,60,1,bioacoustic_index,512,2000,8000,1.37785658055171,NA 
rayol-farm2_2019-05-02_23-37-51.wav,44100,16,60,1,bioacoustic_index,512,2000,8000,1.44356903160601,NA 
rayol-farm2_2019-05-02_23-39-51.wav,44100,16,60,1,bioacoustic_index,512,2000,8000,1.4094240960373,NA 
rayol-farm2_2019-05-02_23-41-51.wav,44100,16,60,1,bioacoustic_index,512,2000,8000,1.3991845989427,NA 
rayol-farm2_2019-05-02_23-43-51.wav,44100,16,60,1,bioacoustic_index,512,2000,8000,1.40060346720538,NA 
rayol-farm2_2019-05-02_23-45-51.wav,44100,16,60,1,bioacoustic_index,512,2000,8000,1.4037318819416,NA 
rayol-farm2_2019-05-02_23-47-51.wav,44100,16,60,1,bioacoustic_index,512,2000,8000,1.36653107109726,NA 
rayol-farm2_2019-05-02_23-49-52.wav,44100,16,60,1,bioacoustic_index,512,2000,8000,1.37233555051042,NA 
rayol-farm2_2019-05-02_23-51-52.wav,44100,16,60,1,bioacoustic_index,512,2000,8000,1.41170436911753,NA 
rayol-farm2_2019-05-02_23-53-52.wav,44100,16,60,1,bioacoustic_index,512,2000,8000,1.33124294568892,NA 
rayol-farm2_2019-05-02_23-55-52.wav,44100,16,60,1,bioacoustic_index,512,2000,8000,1.29045882169693,NA 
rayol-farm2_2019-05-02_23-57-52.wav,44100,16,60,1,bioacoustic_index,512,2000,8000,1.35055780074228,NA 
rayol-farm2_2019-05-02_23-59-52.wav,44100,16,60,1,bioacoustic_index,512,2000,8000,1.29010210934849,NA
