FILENAME,SAMPLINGRATE,BIT,DURATION,CHANNELS,INDEX,FFT_W,MIN_FREQ,MAX_FREQ,LEFT_CHANNEL,RIGHT_CHANNEL
rayol-farm2_2019-05-08_00-01-07.wav,44100,16,60,1,bioacoustic_index,512,2000,8000,1.31300200242781,NA 
rayol-farm2_2019-05-08_00-03-08.wav,44100,16,60,1,bioacoustic_index,512,2000,8000,1.30367462577142,NA 
rayol-farm2_2019-05-08_00-05-08.wav,44100,16,60,1,bioacoustic_index,512,2000,8000,1.34165516193678,NA 
rayol-farm2_2019-05-08_00-07-08.wav,44100,16,60,1,bioacoustic_index,512,2000,8000,1.31270936214012,NA 
rayol-farm2_2019-05-08_00-09-08.wav,44100,16,60,1,bioacoustic_index,512,2000,8000,1.32166274708151,NA 
rayol-farm2_2019-05-08_00-11-08.wav,44100,16,60,1,bioacoustic_index,512,2000,8000,1.23186486170077,NA 
rayol-farm2_2019-05-08_00-13-08.wav,44100,16,60,1,bioacoustic_index,512,2000,8000,1.3495373266567,NA 
rayol-farm2_2019-05-08_00-15-08.wav,44100,16,60,1,bioacoustic_index,512,2000,8000,1.33509399557056,NA 
rayol-farm2_2019-05-08_00-17-08.wav,44100,16,60,1,bioacoustic_index,512,2000,8000,1.27580606613323,NA 
rayol-farm2_2019-05-08_00-19-09.wav,44100,16,60,1,bioacoustic_index,512,2000,8000,1.26692882380208,NA 
rayol-farm2_2019-05-08_00-21-09.wav,44100,16,60,1,bioacoustic_index,512,2000,8000,1.27621136442113,NA 
rayol-farm2_2019-05-08_00-23-09.wav,44100,16,60,1,bioacoustic_index,512,2000,8000,1.52145678505435,NA 
rayol-farm2_2019-05-08_00-25-09.wav,44100,16,60,1,bioacoustic_index,512,2000,8000,1.30412068781119,NA 
rayol-farm2_2019-05-08_00-27-09.wav,44100,16,60,1,bioacoustic_index,512,2000,8000,1.24919929970324,NA 
rayol-farm2_2019-05-08_00-29-09.wav,44100,16,60,1,bioacoustic_index,512,2000,8000,1.39868418326614,NA 
rayol-farm2_2019-05-08_00-31-09.wav,44100,16,60,1,bioacoustic_index,512,2000,8000,1.31883489810023,NA 
rayol-farm2_2019-05-08_00-33-09.wav,44100,16,60,1,bioacoustic_index,512,2000,8000,1.26163820884609,NA 
rayol-farm2_2019-05-08_00-35-10.wav,44100,16,60,1,bioacoustic_index,512,2000,8000,1.24378356841882,NA 
rayol-farm2_2019-05-08_00-37-10.wav,44100,16,60,1,bioacoustic_index,512,2000,8000,1.2991127400611,NA 
rayol-farm2_2019-05-08_00-39-10.wav,44100,16,60,1,bioacoustic_index,512,2000,8000,1.28314503694985,NA 
rayol-farm2_2019-05-08_00-41-10.wav,44100,16,60,1,bioacoustic_index,512,2000,8000,1.30119786145807,NA 
rayol-farm2_2019-05-08_00-43-10.wav,44100,16,60,1,bioacoustic_index,512,2000,8000,1.30886936819157,NA 
rayol-farm2_2019-05-08_00-45-10.wav,44100,16,60,1,bioacoustic_index,512,2000,8000,1.2552620292419,NA 
rayol-farm2_2019-05-08_00-47-10.wav,44100,16,60,1,bioacoustic_index,512,2000,8000,1.26691193049681,NA 
rayol-farm2_2019-05-08_00-49-10.wav,44100,16,60,1,bioacoustic_index,512,2000,8000,1.30755136327356,NA 
rayol-farm2_2019-05-08_00-51-10.wav,44100,16,60,1,bioacoustic_index,512,2000,8000,1.31444694287311,NA 
rayol-farm2_2019-05-08_00-53-11.wav,44100,16,60,1,bioacoustic_index,512,2000,8000,1.3023891954883,NA 
rayol-farm2_2019-05-08_00-55-11.wav,44100,16,60,1,bioacoustic_index,512,2000,8000,1.29047753757415,NA 
rayol-farm2_2019-05-08_00-57-11.wav,44100,16,60,1,bioacoustic_index,512,2000,8000,1.28193291246412,NA 
rayol-farm2_2019-05-08_00-59-11.wav,44100,16,60,1,bioacoustic_index,512,2000,8000,1.32966690102597,NA 
rayol-farm2_2019-05-08_01-01-11.wav,44100,16,60,1,bioacoustic_index,512,2000,8000,1.29775091519617,NA 
rayol-farm2_2019-05-08_01-03-11.wav,44100,16,60,1,bioacoustic_index,512,2000,8000,1.33363218359766,NA 
rayol-farm2_2019-05-08_01-05-11.wav,44100,16,60,1,bioacoustic_index,512,2000,8000,1.32950583823422,NA 
rayol-farm2_2019-05-08_01-07-11.wav,44100,16,60,1,bioacoustic_index,512,2000,8000,1.32182548506639,NA 
rayol-farm2_2019-05-08_01-09-12.wav,44100,16,60,1,bioacoustic_index,512,2000,8000,1.38402288575833,NA 
rayol-farm2_2019-05-08_01-11-12.wav,44100,16,60,1,bioacoustic_index,512,2000,8000,1.70240241076792,NA 
rayol-farm2_2019-05-08_01-13-12.wav,44100,16,60,1,bioacoustic_index,512,2000,8000,1.32895328255264,NA 
rayol-farm2_2019-05-08_01-15-12.wav,44100,16,60,1,bioacoustic_index,512,2000,8000,1.23763954873046,NA 
rayol-farm2_2019-05-08_01-17-12.wav,44100,16,60,1,bioacoustic_index,512,2000,8000,1.29528016239712,NA 
rayol-farm2_2019-05-08_01-19-12.wav,44100,16,60,1,bioacoustic_index,512,2000,8000,1.32729623302636,NA 
rayol-farm2_2019-05-08_01-21-12.wav,44100,16,60,1,bioacoustic_index,512,2000,8000,1.31653158479547,NA 
rayol-farm2_2019-05-08_01-23-12.wav,44100,16,60,1,bioacoustic_index,512,2000,8000,1.32672909690822,NA 
rayol-farm2_2019-05-08_01-25-13.wav,44100,16,60,1,bioacoustic_index,512,2000,8000,1.33037764131357,NA 
rayol-farm2_2019-05-08_01-27-13.wav,44100,16,60,1,bioacoustic_index,512,2000,8000,1.32356020932058,NA 
rayol-farm2_2019-05-08_01-29-13.wav,44100,16,60,1,bioacoustic_index,512,2000,8000,1.26631274628106,NA 
rayol-farm2_2019-05-08_01-31-13.wav,44100,16,60,1,bioacoustic_index,512,2000,8000,1.29315718996058,NA 
rayol-farm2_2019-05-08_01-33-13.wav,44100,16,60,1,bioacoustic_index,512,2000,8000,1.32575358394948,NA 
rayol-farm2_2019-05-08_01-35-13.wav,44100,16,60,1,bioacoustic_index,512,2000,8000,1.27945922336463,NA 
rayol-farm2_2019-05-08_01-37-13.wav,44100,16,60,1,bioacoustic_index,512,2000,8000,1.29819544801837,NA 
rayol-farm2_2019-05-08_01-39-13.wav,44100,16,60,1,bioacoustic_index,512,2000,8000,1.31267935899327,NA 
rayol-farm2_2019-05-08_01-41-14.wav,44100,16,60,1,bioacoustic_index,512,2000,8000,1.22900913658211,NA 
rayol-farm2_2019-05-08_01-43-14.wav,44100,16,60,1,bioacoustic_index,512,2000,8000,1.33807885143728,NA 
rayol-farm2_2019-05-08_01-45-14.wav,44100,16,60,1,bioacoustic_index,512,2000,8000,1.23384803580815,NA 
rayol-farm2_2019-05-08_01-47-14.wav,44100,16,60,1,bioacoustic_index,512,2000,8000,1.30087293631801,NA 
rayol-farm2_2019-05-08_01-49-14.wav,44100,16,60,1,bioacoustic_index,512,2000,8000,1.34541286695511,NA 
rayol-farm2_2019-05-08_01-51-14.wav,44100,16,60,1,bioacoustic_index,512,2000,8000,1.29726541953907,NA 
rayol-farm2_2019-05-08_01-53-14.wav,44100,16,60,1,bioacoustic_index,512,2000,8000,1.2928021286941,NA 
rayol-farm2_2019-05-08_01-55-14.wav,44100,16,60,1,bioacoustic_index,512,2000,8000,1.45577395499886,NA 
rayol-farm2_2019-05-08_01-57-14.wav,44100,16,60,1,bioacoustic_index,512,2000,8000,1.37637189781026,NA 
rayol-farm2_2019-05-08_01-59-15.wav,44100,16,60,1,bioacoustic_index,512,2000,8000,1.39760278416586,NA 
rayol-farm2_2019-05-08_02-01-15.wav,44100,16,60,1,bioacoustic_index,512,2000,8000,1.41243329500293,NA 
rayol-farm2_2019-05-08_02-03-15.wav,44100,16,60,1,bioacoustic_index,512,2000,8000,1.46946528810919,NA 
rayol-farm2_2019-05-08_02-05-15.wav,44100,16,60,1,bioacoustic_index,512,2000,8000,1.40083151886429,NA 
rayol-farm2_2019-05-08_02-07-15.wav,44100,16,60,1,bioacoustic_index,512,2000,8000,1.4547010860118,NA 
rayol-farm2_2019-05-08_02-09-15.wav,44100,16,60,1,bioacoustic_index,512,2000,8000,1.44347832076864,NA 
rayol-farm2_2019-05-08_02-11-15.wav,44100,16,60,1,bioacoustic_index,512,2000,8000,1.40858232428795,NA 
rayol-farm2_2019-05-08_02-13-15.wav,44100,16,60,1,bioacoustic_index,512,2000,8000,1.69553208438027,NA 
rayol-farm2_2019-05-08_02-15-16.wav,44100,16,60,1,bioacoustic_index,512,2000,8000,1.69190038772979,NA 
rayol-farm2_2019-05-08_02-17-16.wav,44100,16,60,1,bioacoustic_index,512,2000,8000,1.3209430124983,NA 
rayol-farm2_2019-05-08_02-19-16.wav,44100,16,60,1,bioacoustic_index,512,2000,8000,1.36411155468116,NA 
rayol-farm2_2019-05-08_02-21-16.wav,44100,16,60,1,bioacoustic_index,512,2000,8000,1.46228284795012,NA 
rayol-farm2_2019-05-08_02-23-16.wav,44100,16,60,1,bioacoustic_index,512,2000,8000,1.38125446058886,NA 
rayol-farm2_2019-05-08_02-25-16.wav,44100,16,60,1,bioacoustic_index,512,2000,8000,1.42996687310861,NA 
rayol-farm2_2019-05-08_02-27-16.wav,44100,16,60,1,bioacoustic_index,512,2000,8000,1.3699912300794,NA 
rayol-farm2_2019-05-08_02-29-16.wav,44100,16,60,1,bioacoustic_index,512,2000,8000,1.35897585443846,NA 
rayol-farm2_2019-05-08_02-31-17.wav,44100,16,60,1,bioacoustic_index,512,2000,8000,1.3566506856616,NA 
rayol-farm2_2019-05-08_02-33-17.wav,44100,16,60,1,bioacoustic_index,512,2000,8000,1.36448123261091,NA 
rayol-farm2_2019-05-08_02-35-17.wav,44100,16,60,1,bioacoustic_index,512,2000,8000,1.4377331692067,NA 
rayol-farm2_2019-05-08_02-37-17.wav,44100,16,60,1,bioacoustic_index,512,2000,8000,1.38730042924926,NA 
rayol-farm2_2019-05-08_02-39-17.wav,44100,16,60,1,bioacoustic_index,512,2000,8000,1.35893247370762,NA 
rayol-farm2_2019-05-08_02-41-17.wav,44100,16,60,1,bioacoustic_index,512,2000,8000,1.31188108963113,NA 
rayol-farm2_2019-05-08_02-43-17.wav,44100,16,60,1,bioacoustic_index,512,2000,8000,1.29744793313995,NA 
rayol-farm2_2019-05-08_02-45-17.wav,44100,16,60,1,bioacoustic_index,512,2000,8000,1.43105713482818,NA 
rayol-farm2_2019-05-08_02-47-18.wav,44100,16,60,1,bioacoustic_index,512,2000,8000,1.23234819607127,NA 
rayol-farm2_2019-05-08_02-49-18.wav,44100,16,60,1,bioacoustic_index,512,2000,8000,1.34539635181643,NA 
rayol-farm2_2019-05-08_02-51-18.wav,44100,16,60,1,bioacoustic_index,512,2000,8000,1.38698853012279,NA 
rayol-farm2_2019-05-08_02-53-18.wav,44100,16,60,1,bioacoustic_index,512,2000,8000,1.24525797768138,NA 
rayol-farm2_2019-05-08_02-55-18.wav,44100,16,60,1,bioacoustic_index,512,2000,8000,1.23827632662668,NA 
rayol-farm2_2019-05-08_02-57-18.wav,44100,16,60,1,bioacoustic_index,512,2000,8000,1.51602818092649,NA 
rayol-farm2_2019-05-08_02-59-18.wav,44100,16,60,1,bioacoustic_index,512,2000,8000,1.30333121752191,NA 
rayol-farm2_2019-05-08_03-01-18.wav,44100,16,60,1,bioacoustic_index,512,2000,8000,1.30850478668368,NA 
rayol-farm2_2019-05-08_03-03-19.wav,44100,16,60,1,bioacoustic_index,512,2000,8000,1.2923038628798,NA 
rayol-farm2_2019-05-08_03-05-19.wav,44100,16,60,1,bioacoustic_index,512,2000,8000,1.30681416109954,NA 
rayol-farm2_2019-05-08_03-07-19.wav,44100,16,60,1,bioacoustic_index,512,2000,8000,1.3649400669309,NA 
rayol-farm2_2019-05-08_03-09-19.wav,44100,16,60,1,bioacoustic_index,512,2000,8000,1.28494431302247,NA 
rayol-farm2_2019-05-08_03-11-19.wav,44100,16,60,1,bioacoustic_index,512,2000,8000,1.33495994386102,NA 
rayol-farm2_2019-05-08_03-13-19.wav,44100,16,60,1,bioacoustic_index,512,2000,8000,1.2599844037326,NA 
rayol-farm2_2019-05-08_03-15-19.wav,44100,16,60,1,bioacoustic_index,512,2000,8000,1.24189198002575,NA 
rayol-farm2_2019-05-08_03-17-19.wav,44100,16,60,1,bioacoustic_index,512,2000,8000,1.27538835483259,NA 
rayol-farm2_2019-05-08_03-19-20.wav,44100,16,60,1,bioacoustic_index,512,2000,8000,1.2523186981537,NA 
rayol-farm2_2019-05-08_03-21-20.wav,44100,16,60,1,bioacoustic_index,512,2000,8000,1.31002269598432,NA 
rayol-farm2_2019-05-08_03-23-20.wav,44100,16,60,1,bioacoustic_index,512,2000,8000,1.35000458030662,NA 
rayol-farm2_2019-05-08_03-25-20.wav,44100,16,60,1,bioacoustic_index,512,2000,8000,1.27147161983284,NA 
rayol-farm2_2019-05-08_03-27-20.wav,44100,16,60,1,bioacoustic_index,512,2000,8000,1.39176318741225,NA 
rayol-farm2_2019-05-08_03-29-20.wav,44100,16,60,1,bioacoustic_index,512,2000,8000,1.27195716339703,NA 
rayol-farm2_2019-05-08_03-31-20.wav,44100,16,60,1,bioacoustic_index,512,2000,8000,1.24539184234886,NA 
rayol-farm2_2019-05-08_03-33-20.wav,44100,16,60,1,bioacoustic_index,512,2000,8000,1.31131609559343,NA 
rayol-farm2_2019-05-08_03-35-20.wav,44100,16,60,1,bioacoustic_index,512,2000,8000,1.35853468552193,NA 
rayol-farm2_2019-05-08_03-37-21.wav,44100,16,60,1,bioacoustic_index,512,2000,8000,1.30295467991688,NA 
rayol-farm2_2019-05-08_03-39-21.wav,44100,16,60,1,bioacoustic_index,512,2000,8000,1.26388394274538,NA 
rayol-farm2_2019-05-08_03-41-21.wav,44100,16,60,1,bioacoustic_index,512,2000,8000,1.33188267890138,NA 
rayol-farm2_2019-05-08_03-43-21.wav,44100,16,60,1,bioacoustic_index,512,2000,8000,1.44321485017618,NA 
rayol-farm2_2019-05-08_03-45-21.wav,44100,16,60,1,bioacoustic_index,512,2000,8000,1.26848973887809,NA 
rayol-farm2_2019-05-08_03-47-21.wav,44100,16,60,1,bioacoustic_index,512,2000,8000,1.30748904837992,NA 
rayol-farm2_2019-05-08_03-49-21.wav,44100,16,60,1,bioacoustic_index,512,2000,8000,1.32698223093954,NA 
rayol-farm2_2019-05-08_03-51-21.wav,44100,16,60,1,bioacoustic_index,512,2000,8000,1.31621759093209,NA 
rayol-farm2_2019-05-08_03-53-22.wav,44100,16,60,1,bioacoustic_index,512,2000,8000,1.26780713378693,NA 
rayol-farm2_2019-05-08_03-55-22.wav,44100,16,60,1,bioacoustic_index,512,2000,8000,1.56354125987072,NA 
rayol-farm2_2019-05-08_03-57-22.wav,44100,16,60,1,bioacoustic_index,512,2000,8000,1.42891599884317,NA 
rayol-farm2_2019-05-08_03-59-22.wav,44100,16,60,1,bioacoustic_index,512,2000,8000,1.38935478603035,NA 
rayol-farm2_2019-05-08_04-01-22.wav,44100,16,60,1,bioacoustic_index,512,2000,8000,1.31433145274896,NA 
rayol-farm2_2019-05-08_04-03-22.wav,44100,16,60,1,bioacoustic_index,512,2000,8000,1.28298772163564,NA 
rayol-farm2_2019-05-08_04-05-22.wav,44100,16,60,1,bioacoustic_index,512,2000,8000,1.34693676568266,NA 
rayol-farm2_2019-05-08_04-07-22.wav,44100,16,60,1,bioacoustic_index,512,2000,8000,1.39113940233614,NA 
rayol-farm2_2019-05-08_04-09-23.wav,44100,16,60,1,bioacoustic_index,512,2000,8000,1.40370898710498,NA 
rayol-farm2_2019-05-08_04-11-23.wav,44100,16,60,1,bioacoustic_index,512,2000,8000,1.34281041659646,NA 
rayol-farm2_2019-05-08_04-13-23.wav,44100,16,60,1,bioacoustic_index,512,2000,8000,1.32965891697421,NA 
rayol-farm2_2019-05-08_04-15-23.wav,44100,16,60,1,bioacoustic_index,512,2000,8000,1.29098000726938,NA 
rayol-farm2_2019-05-08_04-17-23.wav,44100,16,60,1,bioacoustic_index,512,2000,8000,1.26502537585209,NA 
rayol-farm2_2019-05-08_04-19-23.wav,44100,16,60,1,bioacoustic_index,512,2000,8000,1.29473458306574,NA 
rayol-farm2_2019-05-08_04-21-23.wav,44100,16,60,1,bioacoustic_index,512,2000,8000,1.31758873157001,NA 
rayol-farm2_2019-05-08_04-23-23.wav,44100,16,60,1,bioacoustic_index,512,2000,8000,1.35334636940461,NA 
rayol-farm2_2019-05-08_04-25-24.wav,44100,16,60,1,bioacoustic_index,512,2000,8000,1.52916512797125,NA 
rayol-farm2_2019-05-08_04-27-24.wav,44100,16,60,1,bioacoustic_index,512,2000,8000,2.97671945090219,NA 
rayol-farm2_2019-05-08_04-29-24.wav,44100,16,60,1,bioacoustic_index,512,2000,8000,2.04653685683429,NA 
rayol-farm2_2019-05-08_04-31-24.wav,44100,16,60,1,bioacoustic_index,512,2000,8000,1.23057445885529,NA 
rayol-farm2_2019-05-08_04-33-24.wav,44100,16,60,1,bioacoustic_index,512,2000,8000,1.28113171700786,NA 
rayol-farm2_2019-05-08_04-35-24.wav,44100,16,60,1,bioacoustic_index,512,2000,8000,1.27744353248249,NA 
rayol-farm2_2019-05-08_04-37-24.wav,44100,16,60,1,bioacoustic_index,512,2000,8000,1.49399329050248,NA 
rayol-farm2_2019-05-08_04-39-24.wav,44100,16,60,1,bioacoustic_index,512,2000,8000,1.32659468095224,NA 
rayol-farm2_2019-05-08_04-41-25.wav,44100,16,60,1,bioacoustic_index,512,2000,8000,1.60651583737,NA 
rayol-farm2_2019-05-08_04-43-25.wav,44100,16,60,1,bioacoustic_index,512,2000,8000,1.26323378815606,NA 
rayol-farm2_2019-05-08_04-45-25.wav,44100,16,60,1,bioacoustic_index,512,2000,8000,1.45534980691404,NA 
rayol-farm2_2019-05-08_04-47-25.wav,44100,16,60,1,bioacoustic_index,512,2000,8000,1.45264414208093,NA 
rayol-farm2_2019-05-08_04-49-25.wav,44100,16,60,1,bioacoustic_index,512,2000,8000,1.29338883724065,NA 
rayol-farm2_2019-05-08_04-51-25.wav,44100,16,60,1,bioacoustic_index,512,2000,8000,1.26774550242949,NA 
rayol-farm2_2019-05-08_04-53-25.wav,44100,16,60,1,bioacoustic_index,512,2000,8000,1.21270055795457,NA 
rayol-farm2_2019-05-08_04-55-25.wav,44100,16,60,1,bioacoustic_index,512,2000,8000,1.27755272718461,NA 
rayol-farm2_2019-05-08_04-57-26.wav,44100,16,60,1,bioacoustic_index,512,2000,8000,1.35148991237979,NA 
rayol-farm2_2019-05-08_04-59-26.wav,44100,16,60,1,bioacoustic_index,512,2000,8000,1.65462090252532,NA 
rayol-farm2_2019-05-08_05-01-26.wav,44100,16,60,1,bioacoustic_index,512,2000,8000,1.98009327221427,NA 
rayol-farm2_2019-05-08_05-03-26.wav,44100,16,60,1,bioacoustic_index,512,2000,8000,1.90816367386098,NA 
rayol-farm2_2019-05-08_05-05-26.wav,44100,16,60,1,bioacoustic_index,512,2000,8000,1.70192454479769,NA 
rayol-farm2_2019-05-08_05-07-26.wav,44100,16,60,1,bioacoustic_index,512,2000,8000,2.25298655382317,NA 
rayol-farm2_2019-05-08_05-09-26.wav,44100,16,60,1,bioacoustic_index,512,2000,8000,2.48561180845738,NA 
rayol-farm2_2019-05-08_05-11-26.wav,44100,16,60,1,bioacoustic_index,512,2000,8000,1.95909449701563,NA 
rayol-farm2_2019-05-08_05-13-26.wav,44100,16,60,1,bioacoustic_index,512,2000,8000,2.23960764123518,NA 
rayol-farm2_2019-05-08_05-15-27.wav,44100,16,60,1,bioacoustic_index,512,2000,8000,2.48316728813866,NA 
rayol-farm2_2019-05-08_05-17-27.wav,44100,16,60,1,bioacoustic_index,512,2000,8000,2.29357715000188,NA 
rayol-farm2_2019-05-08_05-19-27.wav,44100,16,60,1,bioacoustic_index,512,2000,8000,1.96236571528904,NA 
rayol-farm2_2019-05-08_05-21-27.wav,44100,16,60,1,bioacoustic_index,512,2000,8000,1.99296756319375,NA 
rayol-farm2_2019-05-08_05-23-27.wav,44100,16,60,1,bioacoustic_index,512,2000,8000,3.2197083255535,NA 
rayol-farm2_2019-05-08_05-25-27.wav,44100,16,60,1,bioacoustic_index,512,2000,8000,2.59269188400064,NA 
rayol-farm2_2019-05-08_05-27-27.wav,44100,16,60,1,bioacoustic_index,512,2000,8000,2.65272291898705,NA 
rayol-farm2_2019-05-08_05-29-27.wav,44100,16,60,1,bioacoustic_index,512,2000,8000,2.57873331592729,NA 
rayol-farm2_2019-05-08_05-31-28.wav,44100,16,60,1,bioacoustic_index,512,2000,8000,2.49681202731498,NA 
rayol-farm2_2019-05-08_05-33-28.wav,44100,16,60,1,bioacoustic_index,512,2000,8000,2.75904682390113,NA 
rayol-farm2_2019-05-08_05-35-28.wav,44100,16,60,1,bioacoustic_index,512,2000,8000,2.67072913552497,NA 
rayol-farm2_2019-05-08_05-37-28.wav,44100,16,60,1,bioacoustic_index,512,2000,8000,3.11256519273278,NA 
rayol-farm2_2019-05-08_05-39-28.wav,44100,16,60,1,bioacoustic_index,512,2000,8000,2.56297197814839,NA 
rayol-farm2_2019-05-08_05-41-28.wav,44100,16,60,1,bioacoustic_index,512,2000,8000,3.88283794262577,NA 
rayol-farm2_2019-05-08_05-43-28.wav,44100,16,60,1,bioacoustic_index,512,2000,8000,4.91117883262163,NA 
rayol-farm2_2019-05-08_05-45-28.wav,44100,16,60,1,bioacoustic_index,512,2000,8000,3.85663138183954,NA 
rayol-farm2_2019-05-08_05-47-29.wav,44100,16,60,1,bioacoustic_index,512,2000,8000,3.76160766043379,NA 
rayol-farm2_2019-05-08_05-49-29.wav,44100,16,60,1,bioacoustic_index,512,2000,8000,4.50120781901496,NA 
rayol-farm2_2019-05-08_05-51-29.wav,44100,16,60,1,bioacoustic_index,512,2000,8000,4.43606475507028,NA 
rayol-farm2_2019-05-08_05-53-29.wav,44100,16,60,1,bioacoustic_index,512,2000,8000,3.30103799760037,NA 
rayol-farm2_2019-05-08_05-55-29.wav,44100,16,60,1,bioacoustic_index,512,2000,8000,3.24661914468874,NA 
rayol-farm2_2019-05-08_05-57-29.wav,44100,16,60,1,bioacoustic_index,512,2000,8000,3.43506191958105,NA 
rayol-farm2_2019-05-08_05-59-29.wav,44100,16,60,1,bioacoustic_index,512,2000,8000,3.44217130725698,NA 
rayol-farm2_2019-05-08_06-01-29.wav,44100,16,60,1,bioacoustic_index,512,2000,8000,2.96323631622028,NA 
rayol-farm2_2019-05-08_06-03-30.wav,44100,16,60,1,bioacoustic_index,512,2000,8000,3.4595237039046,NA 
rayol-farm2_2019-05-08_06-05-30.wav,44100,16,60,1,bioacoustic_index,512,2000,8000,2.89824303116751,NA 
rayol-farm2_2019-05-08_06-07-30.wav,44100,16,60,1,bioacoustic_index,512,2000,8000,2.58535594363874,NA 
rayol-farm2_2019-05-08_06-09-30.wav,44100,16,60,1,bioacoustic_index,512,2000,8000,3.62525781893276,NA 
rayol-farm2_2019-05-08_06-11-30.wav,44100,16,60,1,bioacoustic_index,512,2000,8000,2.10239989607933,NA 
rayol-farm2_2019-05-08_06-13-30.wav,44100,16,60,1,bioacoustic_index,512,2000,8000,2.69004940639467,NA 
rayol-farm2_2019-05-08_06-15-30.wav,44100,16,60,1,bioacoustic_index,512,2000,8000,2.31792671280045,NA 
rayol-farm2_2019-05-08_06-17-30.wav,44100,16,60,1,bioacoustic_index,512,2000,8000,2.52184399827637,NA 
rayol-farm2_2019-05-08_06-19-30.wav,44100,16,60,1,bioacoustic_index,512,2000,8000,2.43704311494572,NA 
rayol-farm2_2019-05-08_06-21-31.wav,44100,16,60,1,bioacoustic_index,512,2000,8000,2.07745789490222,NA 
rayol-farm2_2019-05-08_06-23-31.wav,44100,16,60,1,bioacoustic_index,512,2000,8000,2.42569151775739,NA 
rayol-farm2_2019-05-08_06-25-31.wav,44100,16,60,1,bioacoustic_index,512,2000,8000,1.99634843917022,NA 
rayol-farm2_2019-05-08_06-27-31.wav,44100,16,60,1,bioacoustic_index,512,2000,8000,2.29482467241642,NA 
rayol-farm2_2019-05-08_06-29-31.wav,44100,16,60,1,bioacoustic_index,512,2000,8000,2.10342489740555,NA 
rayol-farm2_2019-05-08_06-31-31.wav,44100,16,60,1,bioacoustic_index,512,2000,8000,2.149767412084,NA 
rayol-farm2_2019-05-08_06-33-31.wav,44100,16,60,1,bioacoustic_index,512,2000,8000,2.05575008900921,NA 
rayol-farm2_2019-05-08_06-35-31.wav,44100,16,60,1,bioacoustic_index,512,2000,8000,1.69389999863832,NA 
rayol-farm2_2019-05-08_06-37-32.wav,44100,16,60,1,bioacoustic_index,512,2000,8000,3.99350380035386,NA 
rayol-farm2_2019-05-08_06-39-32.wav,44100,16,60,1,bioacoustic_index,512,2000,8000,4.39142402765419,NA 
rayol-farm2_2019-05-08_06-41-32.wav,44100,16,60,1,bioacoustic_index,512,2000,8000,3.45243414794963,NA 
rayol-farm2_2019-05-08_06-43-32.wav,44100,16,60,1,bioacoustic_index,512,2000,8000,1.97388610818175,NA 
rayol-farm2_2019-05-08_06-45-32.wav,44100,16,60,1,bioacoustic_index,512,2000,8000,1.85592501358169,NA 
rayol-farm2_2019-05-08_06-47-32.wav,44100,16,60,1,bioacoustic_index,512,2000,8000,1.7737653619545,NA 
rayol-farm2_2019-05-08_06-49-32.wav,44100,16,60,1,bioacoustic_index,512,2000,8000,1.55797421944537,NA 
rayol-farm2_2019-05-08_06-51-32.wav,44100,16,60,1,bioacoustic_index,512,2000,8000,2.01305705714673,NA 
rayol-farm2_2019-05-08_06-53-33.wav,44100,16,60,1,bioacoustic_index,512,2000,8000,1.66945250962924,NA 
rayol-farm2_2019-05-08_06-55-33.wav,44100,16,60,1,bioacoustic_index,512,2000,8000,1.90986588448343,NA 
rayol-farm2_2019-05-08_06-57-33.wav,44100,16,60,1,bioacoustic_index,512,2000,8000,1.93015827215979,NA 
rayol-farm2_2019-05-08_06-59-33.wav,44100,16,60,1,bioacoustic_index,512,2000,8000,1.88067591550921,NA 
rayol-farm2_2019-05-08_07-01-33.wav,44100,16,60,1,bioacoustic_index,512,2000,8000,1.61015655112626,NA 
rayol-farm2_2019-05-08_07-03-33.wav,44100,16,60,1,bioacoustic_index,512,2000,8000,1.34876078463592,NA 
rayol-farm2_2019-05-08_07-05-33.wav,44100,16,60,1,bioacoustic_index,512,2000,8000,1.62428879371914,NA 
rayol-farm2_2019-05-08_07-07-33.wav,44100,16,60,1,bioacoustic_index,512,2000,8000,1.51747027117568,NA 
rayol-farm2_2019-05-08_07-09-34.wav,44100,16,60,1,bioacoustic_index,512,2000,8000,2.2194642168949,NA 
rayol-farm2_2019-05-08_07-11-34.wav,44100,16,60,1,bioacoustic_index,512,2000,8000,1.81032079714801,NA 
rayol-farm2_2019-05-08_07-13-34.wav,44100,16,60,1,bioacoustic_index,512,2000,8000,1.93962986818931,NA 
rayol-farm2_2019-05-08_07-15-34.wav,44100,16,60,1,bioacoustic_index,512,2000,8000,1.78932780023223,NA 
rayol-farm2_2019-05-08_07-17-34.wav,44100,16,60,1,bioacoustic_index,512,2000,8000,1.45086060950126,NA 
rayol-farm2_2019-05-08_07-19-34.wav,44100,16,60,1,bioacoustic_index,512,2000,8000,1.67980757062567,NA 
rayol-farm2_2019-05-08_07-21-34.wav,44100,16,60,1,bioacoustic_index,512,2000,8000,5.58477393614949,NA 
rayol-farm2_2019-05-08_07-23-34.wav,44100,16,60,1,bioacoustic_index,512,2000,8000,6.07476702713907,NA 
rayol-farm2_2019-05-08_07-25-35.wav,44100,16,60,1,bioacoustic_index,512,2000,8000,2.01897467560366,NA 
rayol-farm2_2019-05-08_07-27-35.wav,44100,16,60,1,bioacoustic_index,512,2000,8000,1.75134409218853,NA 
rayol-farm2_2019-05-08_07-29-35.wav,44100,16,60,1,bioacoustic_index,512,2000,8000,1.97944500964989,NA 
rayol-farm2_2019-05-08_07-31-35.wav,44100,16,60,1,bioacoustic_index,512,2000,8000,1.49607064544901,NA 
rayol-farm2_2019-05-08_07-33-35.wav,44100,16,60,1,bioacoustic_index,512,2000,8000,1.72220009632629,NA 
rayol-farm2_2019-05-08_07-35-35.wav,44100,16,60,1,bioacoustic_index,512,2000,8000,1.35406115897164,NA 
rayol-farm2_2019-05-08_07-37-35.wav,44100,16,60,1,bioacoustic_index,512,2000,8000,2.57533614246987,NA 
rayol-farm2_2019-05-08_07-39-35.wav,44100,16,60,1,bioacoustic_index,512,2000,8000,1.53347101745259,NA 
rayol-farm2_2019-05-08_07-41-35.wav,44100,16,60,1,bioacoustic_index,512,2000,8000,1.42322664584549,NA 
rayol-farm2_2019-05-08_07-43-36.wav,44100,16,60,1,bioacoustic_index,512,2000,8000,1.58486663769605,NA 
rayol-farm2_2019-05-08_07-45-36.wav,44100,16,60,1,bioacoustic_index,512,2000,8000,2.34261291956291,NA 
rayol-farm2_2019-05-08_07-47-36.wav,44100,16,60,1,bioacoustic_index,512,2000,8000,2.31700293510328,NA 
rayol-farm2_2019-05-08_07-49-36.wav,44100,16,60,1,bioacoustic_index,512,2000,8000,2.13576685638141,NA 
rayol-farm2_2019-05-08_07-51-36.wav,44100,16,60,1,bioacoustic_index,512,2000,8000,2.09930828189406,NA 
rayol-farm2_2019-05-08_07-53-36.wav,44100,16,60,1,bioacoustic_index,512,2000,8000,2.04184270965034,NA 
rayol-farm2_2019-05-08_07-55-36.wav,44100,16,60,1,bioacoustic_index,512,2000,8000,3.57086507612064,NA 
rayol-farm2_2019-05-08_07-57-36.wav,44100,16,60,1,bioacoustic_index,512,2000,8000,1.87014695663324,NA 
rayol-farm2_2019-05-08_07-59-37.wav,44100,16,60,1,bioacoustic_index,512,2000,8000,1.79798543782188,NA 
rayol-farm2_2019-05-08_08-01-37.wav,44100,16,60,1,bioacoustic_index,512,2000,8000,1.66531507676805,NA 
rayol-farm2_2019-05-08_08-03-37.wav,44100,16,60,1,bioacoustic_index,512,2000,8000,1.83959853459424,NA 
rayol-farm2_2019-05-08_08-05-37.wav,44100,16,60,1,bioacoustic_index,512,2000,8000,3.64119747171358,NA 
rayol-farm2_2019-05-08_08-07-37.wav,44100,16,60,1,bioacoustic_index,512,2000,8000,1.75944607377263,NA 
rayol-farm2_2019-05-08_08-09-37.wav,44100,16,60,1,bioacoustic_index,512,2000,8000,2.36855811052475,NA 
rayol-farm2_2019-05-08_08-11-37.wav,44100,16,60,1,bioacoustic_index,512,2000,8000,1.85281904539484,NA 
rayol-farm2_2019-05-08_08-13-37.wav,44100,16,60,1,bioacoustic_index,512,2000,8000,1.84717906458016,NA 
rayol-farm2_2019-05-08_08-15-38.wav,44100,16,60,1,bioacoustic_index,512,2000,8000,2.71380911388057,NA 
rayol-farm2_2019-05-08_08-17-38.wav,44100,16,60,1,bioacoustic_index,512,2000,8000,1.70662889633023,NA 
rayol-farm2_2019-05-08_08-19-38.wav,44100,16,60,1,bioacoustic_index,512,2000,8000,1.46973157319611,NA 
rayol-farm2_2019-05-08_08-21-38.wav,44100,16,60,1,bioacoustic_index,512,2000,8000,1.78958124633859,NA 
rayol-farm2_2019-05-08_08-23-38.wav,44100,16,60,1,bioacoustic_index,512,2000,8000,1.96488406332599,NA 
rayol-farm2_2019-05-08_08-25-38.wav,44100,16,60,1,bioacoustic_index,512,2000,8000,1.76369402848336,NA 
rayol-farm2_2019-05-08_08-27-38.wav,44100,16,60,1,bioacoustic_index,512,2000,8000,1.51751215573999,NA 
rayol-farm2_2019-05-08_08-29-38.wav,44100,16,60,1,bioacoustic_index,512,2000,8000,2.62834035906469,NA 
rayol-farm2_2019-05-08_08-31-38.wav,44100,16,60,1,bioacoustic_index,512,2000,8000,1.88439846599615,NA 
rayol-farm2_2019-05-08_08-33-39.wav,44100,16,60,1,bioacoustic_index,512,2000,8000,2.0640258544751,NA 
rayol-farm2_2019-05-08_08-35-39.wav,44100,16,60,1,bioacoustic_index,512,2000,8000,1.61988430915452,NA 
rayol-farm2_2019-05-08_08-37-39.wav,44100,16,60,1,bioacoustic_index,512,2000,8000,1.63244640458961,NA 
rayol-farm2_2019-05-08_08-39-39.wav,44100,16,60,1,bioacoustic_index,512,2000,8000,1.88658526702239,NA 
rayol-farm2_2019-05-08_08-41-39.wav,44100,16,60,1,bioacoustic_index,512,2000,8000,1.6584232680301,NA 
rayol-farm2_2019-05-08_08-43-39.wav,44100,16,60,1,bioacoustic_index,512,2000,8000,1.46500752289595,NA 
rayol-farm2_2019-05-08_08-45-39.wav,44100,16,60,1,bioacoustic_index,512,2000,8000,1.60735210782309,NA 
rayol-farm2_2019-05-08_08-47-39.wav,44100,16,60,1,bioacoustic_index,512,2000,8000,1.44291857657131,NA 
rayol-farm2_2019-05-08_08-49-40.wav,44100,16,60,1,bioacoustic_index,512,2000,8000,1.28109904834428,NA 
rayol-farm2_2019-05-08_08-51-40.wav,44100,16,60,1,bioacoustic_index,512,2000,8000,1.31508094959328,NA 
rayol-farm2_2019-05-08_08-53-40.wav,44100,16,60,1,bioacoustic_index,512,2000,8000,1.38048151244832,NA 
rayol-farm2_2019-05-08_08-55-40.wav,44100,16,60,1,bioacoustic_index,512,2000,8000,2.6461218879852,NA 
rayol-farm2_2019-05-08_08-57-40.wav,44100,16,60,1,bioacoustic_index,512,2000,8000,3.09611601919359,NA 
rayol-farm2_2019-05-08_08-59-40.wav,44100,16,60,1,bioacoustic_index,512,2000,8000,2.24019702502928,NA 
rayol-farm2_2019-05-08_09-01-40.wav,44100,16,60,1,bioacoustic_index,512,2000,8000,1.91880560406483,NA 
rayol-farm2_2019-05-08_09-03-40.wav,44100,16,60,1,bioacoustic_index,512,2000,8000,1.9128349059554,NA 
rayol-farm2_2019-05-08_09-05-41.wav,44100,16,60,1,bioacoustic_index,512,2000,8000,1.98336638611098,NA 
rayol-farm2_2019-05-08_09-07-41.wav,44100,16,60,1,bioacoustic_index,512,2000,8000,1.97531005603342,NA 
rayol-farm2_2019-05-08_09-09-41.wav,44100,16,60,1,bioacoustic_index,512,2000,8000,2.11493042171438,NA 
rayol-farm2_2019-05-08_09-11-41.wav,44100,16,60,1,bioacoustic_index,512,2000,8000,1.76987517902723,NA 
rayol-farm2_2019-05-08_09-13-41.wav,44100,16,60,1,bioacoustic_index,512,2000,8000,1.68494004123473,NA 
rayol-farm2_2019-05-08_09-15-41.wav,44100,16,60,1,bioacoustic_index,512,2000,8000,1.61831076634181,NA 
rayol-farm2_2019-05-08_09-17-41.wav,44100,16,60,1,bioacoustic_index,512,2000,8000,1.79524033934624,NA 
rayol-farm2_2019-05-08_09-19-41.wav,44100,16,60,1,bioacoustic_index,512,2000,8000,1.69467671106747,NA 
rayol-farm2_2019-05-08_09-21-41.wav,44100,16,60,1,bioacoustic_index,512,2000,8000,1.74033453499241,NA 
rayol-farm2_2019-05-08_09-23-42.wav,44100,16,60,1,bioacoustic_index,512,2000,8000,1.97192210528569,NA 
rayol-farm2_2019-05-08_09-25-42.wav,44100,16,60,1,bioacoustic_index,512,2000,8000,2.29133695679238,NA 
rayol-farm2_2019-05-08_09-27-42.wav,44100,16,60,1,bioacoustic_index,512,2000,8000,1.98361195705212,NA 
rayol-farm2_2019-05-08_09-29-42.wav,44100,16,60,1,bioacoustic_index,512,2000,8000,1.7037544962087,NA 
rayol-farm2_2019-05-08_09-31-42.wav,44100,16,60,1,bioacoustic_index,512,2000,8000,1.34252967336642,NA 
rayol-farm2_2019-05-08_09-33-42.wav,44100,16,60,1,bioacoustic_index,512,2000,8000,1.70891076363049,NA 
rayol-farm2_2019-05-08_09-35-42.wav,44100,16,60,1,bioacoustic_index,512,2000,8000,1.58137085504363,NA 
rayol-farm2_2019-05-08_09-37-42.wav,44100,16,60,1,bioacoustic_index,512,2000,8000,1.83589334539459,NA 
rayol-farm2_2019-05-08_09-39-43.wav,44100,16,60,1,bioacoustic_index,512,2000,8000,1.48424324031214,NA 
rayol-farm2_2019-05-08_09-41-43.wav,44100,16,60,1,bioacoustic_index,512,2000,8000,2.23523013777115,NA 
rayol-farm2_2019-05-08_09-43-43.wav,44100,16,60,1,bioacoustic_index,512,2000,8000,2.02676568171146,NA 
rayol-farm2_2019-05-08_09-45-43.wav,44100,16,60,1,bioacoustic_index,512,2000,8000,2.43321094361243,NA 
rayol-farm2_2019-05-08_09-47-43.wav,44100,16,60,1,bioacoustic_index,512,2000,8000,2.54348014411889,NA 
rayol-farm2_2019-05-08_09-49-43.wav,44100,16,60,1,bioacoustic_index,512,2000,8000,2.66082553288337,NA 
rayol-farm2_2019-05-08_09-51-43.wav,44100,16,60,1,bioacoustic_index,512,2000,8000,2.29839134194587,NA 
rayol-farm2_2019-05-08_09-53-43.wav,44100,16,60,1,bioacoustic_index,512,2000,8000,2.00757785654875,NA 
rayol-farm2_2019-05-08_09-55-44.wav,44100,16,60,1,bioacoustic_index,512,2000,8000,2.02473260396345,NA 
rayol-farm2_2019-05-08_09-57-44.wav,44100,16,60,1,bioacoustic_index,512,2000,8000,2.10926368333273,NA 
rayol-farm2_2019-05-08_09-59-44.wav,44100,16,60,1,bioacoustic_index,512,2000,8000,2.82134016875547,NA 
rayol-farm2_2019-05-08_10-01-44.wav,44100,16,60,1,bioacoustic_index,512,2000,8000,2.13238369483624,NA 
rayol-farm2_2019-05-08_10-03-44.wav,44100,16,60,1,bioacoustic_index,512,2000,8000,1.83879316675621,NA 
rayol-farm2_2019-05-08_10-05-44.wav,44100,16,60,1,bioacoustic_index,512,2000,8000,2.03557968441568,NA 
rayol-farm2_2019-05-08_10-07-44.wav,44100,16,60,1,bioacoustic_index,512,2000,8000,2.15361956642031,NA 
rayol-farm2_2019-05-08_10-09-44.wav,44100,16,60,1,bioacoustic_index,512,2000,8000,1.77240900631226,NA 
rayol-farm2_2019-05-08_10-11-44.wav,44100,16,60,1,bioacoustic_index,512,2000,8000,2.22161834736393,NA 
rayol-farm2_2019-05-08_10-13-45.wav,44100,16,60,1,bioacoustic_index,512,2000,8000,1.87912742154828,NA 
rayol-farm2_2019-05-08_10-15-45.wav,44100,16,60,1,bioacoustic_index,512,2000,8000,1.70992491061839,NA 
rayol-farm2_2019-05-08_10-17-45.wav,44100,16,60,1,bioacoustic_index,512,2000,8000,2.02734549289396,NA 
rayol-farm2_2019-05-08_10-19-45.wav,44100,16,60,1,bioacoustic_index,512,2000,8000,1.95537937858371,NA 
rayol-farm2_2019-05-08_10-21-45.wav,44100,16,60,1,bioacoustic_index,512,2000,8000,2.14029289832051,NA 
rayol-farm2_2019-05-08_10-23-45.wav,44100,16,60,1,bioacoustic_index,512,2000,8000,1.88032290062022,NA 
rayol-farm2_2019-05-08_10-25-45.wav,44100,16,60,1,bioacoustic_index,512,2000,8000,3.82265492355473,NA 
rayol-farm2_2019-05-08_10-27-45.wav,44100,16,60,1,bioacoustic_index,512,2000,8000,4.22511883952051,NA 
rayol-farm2_2019-05-08_10-29-46.wav,44100,16,60,1,bioacoustic_index,512,2000,8000,4.34448504638741,NA 
rayol-farm2_2019-05-08_10-31-46.wav,44100,16,60,1,bioacoustic_index,512,2000,8000,2.24757485075711,NA 
rayol-farm2_2019-05-08_10-33-46.wav,44100,16,60,1,bioacoustic_index,512,2000,8000,1.98203323847478,NA 
rayol-farm2_2019-05-08_10-35-46.wav,44100,16,60,1,bioacoustic_index,512,2000,8000,2.33553932708193,NA 
rayol-farm2_2019-05-08_10-37-46.wav,44100,16,60,1,bioacoustic_index,512,2000,8000,1.63375248661398,NA 
rayol-farm2_2019-05-08_10-39-46.wav,44100,16,60,1,bioacoustic_index,512,2000,8000,1.36430282371712,NA 
rayol-farm2_2019-05-08_10-41-46.wav,44100,16,60,1,bioacoustic_index,512,2000,8000,1.43919611861508,NA 
rayol-farm2_2019-05-08_10-43-46.wav,44100,16,60,1,bioacoustic_index,512,2000,8000,1.85236940261107,NA 
rayol-farm2_2019-05-08_10-45-47.wav,44100,16,60,1,bioacoustic_index,512,2000,8000,2.12108574716361,NA 
rayol-farm2_2019-05-08_10-47-47.wav,44100,16,60,1,bioacoustic_index,512,2000,8000,1.82949023170524,NA 
rayol-farm2_2019-05-08_10-49-47.wav,44100,16,60,1,bioacoustic_index,512,2000,8000,1.92539666580142,NA 
rayol-farm2_2019-05-08_10-51-47.wav,44100,16,60,1,bioacoustic_index,512,2000,8000,2.32858785110067,NA 
rayol-farm2_2019-05-08_10-53-47.wav,44100,16,60,1,bioacoustic_index,512,2000,8000,1.95802960856625,NA 
rayol-farm2_2019-05-08_10-55-47.wav,44100,16,60,1,bioacoustic_index,512,2000,8000,1.99947602993993,NA 
rayol-farm2_2019-05-08_10-57-47.wav,44100,16,60,1,bioacoustic_index,512,2000,8000,1.93814535370926,NA 
rayol-farm2_2019-05-08_10-59-47.wav,44100,16,60,1,bioacoustic_index,512,2000,8000,2.11640292800801,NA 
rayol-farm2_2019-05-08_11-01-47.wav,44100,16,60,1,bioacoustic_index,512,2000,8000,3.57334608789672,NA 
rayol-farm2_2019-05-08_11-03-48.wav,44100,16,60,1,bioacoustic_index,512,2000,8000,1.75505594709938,NA 
rayol-farm2_2019-05-08_11-05-48.wav,44100,16,60,1,bioacoustic_index,512,2000,8000,1.88673422089389,NA 
rayol-farm2_2019-05-08_11-07-48.wav,44100,16,60,1,bioacoustic_index,512,2000,8000,1.88725406160087,NA 
rayol-farm2_2019-05-08_11-09-48.wav,44100,16,60,1,bioacoustic_index,512,2000,8000,2.08290215252019,NA 
rayol-farm2_2019-05-08_11-11-48.wav,44100,16,60,1,bioacoustic_index,512,2000,8000,2.11501052357855,NA 
rayol-farm2_2019-05-08_11-13-48.wav,44100,16,60,1,bioacoustic_index,512,2000,8000,2.13932737562214,NA 
rayol-farm2_2019-05-08_11-15-48.wav,44100,16,60,1,bioacoustic_index,512,2000,8000,2.09663263613686,NA 
rayol-farm2_2019-05-08_11-17-48.wav,44100,16,60,1,bioacoustic_index,512,2000,8000,2.40543635993515,NA 
rayol-farm2_2019-05-08_11-19-49.wav,44100,16,60,1,bioacoustic_index,512,2000,8000,3.05467512507919,NA 
rayol-farm2_2019-05-08_11-21-49.wav,44100,16,60,1,bioacoustic_index,512,2000,8000,1.98838858730693,NA 
rayol-farm2_2019-05-08_11-23-49.wav,44100,16,60,1,bioacoustic_index,512,2000,8000,2.21038787525258,NA 
rayol-farm2_2019-05-08_11-25-49.wav,44100,16,60,1,bioacoustic_index,512,2000,8000,2.18519406842201,NA 
rayol-farm2_2019-05-08_11-27-49.wav,44100,16,60,1,bioacoustic_index,512,2000,8000,2.0242533942326,NA 
rayol-farm2_2019-05-08_11-29-49.wav,44100,16,60,1,bioacoustic_index,512,2000,8000,1.8543046535346,NA 
rayol-farm2_2019-05-08_11-31-49.wav,44100,16,60,1,bioacoustic_index,512,2000,8000,1.42158863095143,NA 
rayol-farm2_2019-05-08_11-33-49.wav,44100,16,60,1,bioacoustic_index,512,2000,8000,1.44072495328926,NA 
rayol-farm2_2019-05-08_11-35-50.wav,44100,16,60,1,bioacoustic_index,512,2000,8000,1.68433472265025,NA 
rayol-farm2_2019-05-08_11-37-50.wav,44100,16,60,1,bioacoustic_index,512,2000,8000,1.91763221779537,NA 
rayol-farm2_2019-05-08_11-39-50.wav,44100,16,60,1,bioacoustic_index,512,2000,8000,1.8176927165313,NA 
rayol-farm2_2019-05-08_11-41-50.wav,44100,16,60,1,bioacoustic_index,512,2000,8000,1.72854824935014,NA 
rayol-farm2_2019-05-08_11-43-50.wav,44100,16,60,1,bioacoustic_index,512,2000,8000,1.38656119589081,NA 
rayol-farm2_2019-05-08_11-45-50.wav,44100,16,60,1,bioacoustic_index,512,2000,8000,1.4644899127876,NA 
rayol-farm2_2019-05-08_11-47-50.wav,44100,16,60,1,bioacoustic_index,512,2000,8000,1.30523051589841,NA 
rayol-farm2_2019-05-08_11-49-50.wav,44100,16,60,1,bioacoustic_index,512,2000,8000,1.55761662699247,NA 
rayol-farm2_2019-05-08_11-51-50.wav,44100,16,60,1,bioacoustic_index,512,2000,8000,1.35156510026595,NA 
rayol-farm2_2019-05-08_11-53-51.wav,44100,16,60,1,bioacoustic_index,512,2000,8000,1.7161509833309,NA 
rayol-farm2_2019-05-08_11-55-51.wav,44100,16,60,1,bioacoustic_index,512,2000,8000,1.77967682264567,NA 
rayol-farm2_2019-05-08_11-57-51.wav,44100,16,60,1,bioacoustic_index,512,2000,8000,3.08408154573167,NA 
rayol-farm2_2019-05-08_11-59-51.wav,44100,16,60,1,bioacoustic_index,512,2000,8000,1.93400817720865,NA 
rayol-farm2_2019-05-08_12-01-51.wav,44100,16,60,1,bioacoustic_index,512,2000,8000,1.78240646176936,NA 
rayol-farm2_2019-05-08_12-03-51.wav,44100,16,60,1,bioacoustic_index,512,2000,8000,1.96141670110313,NA 
rayol-farm2_2019-05-08_12-05-51.wav,44100,16,60,1,bioacoustic_index,512,2000,8000,2.14148491989757,NA 
rayol-farm2_2019-05-08_12-07-51.wav,44100,16,60,1,bioacoustic_index,512,2000,8000,1.93225642342345,NA 
rayol-farm2_2019-05-08_12-09-52.wav,44100,16,60,1,bioacoustic_index,512,2000,8000,2.29179564966364,NA 
rayol-farm2_2019-05-08_12-11-52.wav,44100,16,60,1,bioacoustic_index,512,2000,8000,1.8094911259361,NA 
rayol-farm2_2019-05-08_12-13-52.wav,44100,16,60,1,bioacoustic_index,512,2000,8000,1.81682338209216,NA 
rayol-farm2_2019-05-08_12-15-52.wav,44100,16,60,1,bioacoustic_index,512,2000,8000,1.68400577058869,NA 
rayol-farm2_2019-05-08_12-17-52.wav,44100,16,60,1,bioacoustic_index,512,2000,8000,1.59056888964006,NA 
rayol-farm2_2019-05-08_12-19-52.wav,44100,16,60,1,bioacoustic_index,512,2000,8000,1.49530891828571,NA 
rayol-farm2_2019-05-08_12-21-52.wav,44100,16,60,1,bioacoustic_index,512,2000,8000,2.30684441883805,NA 
rayol-farm2_2019-05-08_12-23-52.wav,44100,16,60,1,bioacoustic_index,512,2000,8000,1.87913119328026,NA 
rayol-farm2_2019-05-08_12-25-53.wav,44100,16,60,1,bioacoustic_index,512,2000,8000,1.98570982940151,NA 
rayol-farm2_2019-05-08_12-27-53.wav,44100,16,60,1,bioacoustic_index,512,2000,8000,1.64487628020873,NA 
rayol-farm2_2019-05-08_12-29-53.wav,44100,16,60,1,bioacoustic_index,512,2000,8000,1.41349455478507,NA 
rayol-farm2_2019-05-08_12-31-53.wav,44100,16,60,1,bioacoustic_index,512,2000,8000,2.16531020478579,NA 
rayol-farm2_2019-05-08_12-33-53.wav,44100,16,60,1,bioacoustic_index,512,2000,8000,1.95473680038795,NA 
rayol-farm2_2019-05-08_12-35-53.wav,44100,16,60,1,bioacoustic_index,512,2000,8000,1.91510258117603,NA 
rayol-farm2_2019-05-08_12-37-53.wav,44100,16,60,1,bioacoustic_index,512,2000,8000,1.43688287648842,NA 
rayol-farm2_2019-05-08_12-39-53.wav,44100,16,60,1,bioacoustic_index,512,2000,8000,1.72037356254417,NA 
rayol-farm2_2019-05-08_12-41-53.wav,44100,16,60,1,bioacoustic_index,512,2000,8000,1.55561696196796,NA 
rayol-farm2_2019-05-08_12-43-54.wav,44100,16,60,1,bioacoustic_index,512,2000,8000,2.0528770145198,NA 
rayol-farm2_2019-05-08_12-45-54.wav,44100,16,60,1,bioacoustic_index,512,2000,8000,1.84540003652231,NA 
rayol-farm2_2019-05-08_12-47-54.wav,44100,16,60,1,bioacoustic_index,512,2000,8000,1.71174980555762,NA 
rayol-farm2_2019-05-08_12-49-54.wav,44100,16,60,1,bioacoustic_index,512,2000,8000,1.82068783272938,NA 
rayol-farm2_2019-05-08_12-51-54.wav,44100,16,60,1,bioacoustic_index,512,2000,8000,2.08330787560026,NA 
rayol-farm2_2019-05-08_12-53-54.wav,44100,16,60,1,bioacoustic_index,512,2000,8000,2.41825875185664,NA 
rayol-farm2_2019-05-08_12-55-54.wav,44100,16,60,1,bioacoustic_index,512,2000,8000,1.92968644837583,NA 
rayol-farm2_2019-05-08_12-57-54.wav,44100,16,60,1,bioacoustic_index,512,2000,8000,2.12604168866312,NA 
rayol-farm2_2019-05-08_12-59-55.wav,44100,16,60,1,bioacoustic_index,512,2000,8000,1.922853491845,NA 
rayol-farm2_2019-05-08_13-01-55.wav,44100,16,60,1,bioacoustic_index,512,2000,8000,1.53748330674261,NA 
rayol-farm2_2019-05-08_13-03-55.wav,44100,16,60,1,bioacoustic_index,512,2000,8000,2.24887097275501,NA 
rayol-farm2_2019-05-08_13-05-55.wav,44100,16,60,1,bioacoustic_index,512,2000,8000,1.94055375705951,NA 
rayol-farm2_2019-05-08_13-07-55.wav,44100,16,60,1,bioacoustic_index,512,2000,8000,1.60117119190651,NA 
rayol-farm2_2019-05-08_13-09-55.wav,44100,16,60,1,bioacoustic_index,512,2000,8000,1.99228737972183,NA 
rayol-farm2_2019-05-08_13-11-55.wav,44100,16,60,1,bioacoustic_index,512,2000,8000,1.85564568824884,NA 
rayol-farm2_2019-05-08_13-13-55.wav,44100,16,60,1,bioacoustic_index,512,2000,8000,2.52855560511319,NA 
rayol-farm2_2019-05-08_13-15-56.wav,44100,16,60,1,bioacoustic_index,512,2000,8000,2.80000444538198,NA 
rayol-farm2_2019-05-08_13-17-56.wav,44100,16,60,1,bioacoustic_index,512,2000,8000,2.11812532536923,NA 
rayol-farm2_2019-05-08_13-19-56.wav,44100,16,60,1,bioacoustic_index,512,2000,8000,2.12400759706259,NA 
rayol-farm2_2019-05-08_13-21-56.wav,44100,16,60,1,bioacoustic_index,512,2000,8000,2.56859408576248,NA 
rayol-farm2_2019-05-08_13-23-56.wav,44100,16,60,1,bioacoustic_index,512,2000,8000,1.69908803188749,NA 
rayol-farm2_2019-05-08_13-25-56.wav,44100,16,60,1,bioacoustic_index,512,2000,8000,2.03555124036513,NA 
rayol-farm2_2019-05-08_13-27-56.wav,44100,16,60,1,bioacoustic_index,512,2000,8000,1.74103771289329,NA 
rayol-farm2_2019-05-08_13-29-56.wav,44100,16,60,1,bioacoustic_index,512,2000,8000,2.7837142278773,NA 
rayol-farm2_2019-05-08_13-31-56.wav,44100,16,60,1,bioacoustic_index,512,2000,8000,2.05853576211288,NA 
rayol-farm2_2019-05-08_13-33-57.wav,44100,16,60,1,bioacoustic_index,512,2000,8000,2.22241549935138,NA 
rayol-farm2_2019-05-08_13-35-57.wav,44100,16,60,1,bioacoustic_index,512,2000,8000,1.73505419450076,NA 
rayol-farm2_2019-05-08_13-37-57.wav,44100,16,60,1,bioacoustic_index,512,2000,8000,1.83568239152242,NA 
rayol-farm2_2019-05-08_13-39-57.wav,44100,16,60,1,bioacoustic_index,512,2000,8000,1.801786196925,NA 
rayol-farm2_2019-05-08_13-41-57.wav,44100,16,60,1,bioacoustic_index,512,2000,8000,1.86736888891243,NA 
rayol-farm2_2019-05-08_13-43-57.wav,44100,16,60,1,bioacoustic_index,512,2000,8000,1.6495618766787,NA 
rayol-farm2_2019-05-08_13-45-57.wav,44100,16,60,1,bioacoustic_index,512,2000,8000,1.94399527553725,NA 
rayol-farm2_2019-05-08_13-47-57.wav,44100,16,60,1,bioacoustic_index,512,2000,8000,1.96221693531336,NA 
rayol-farm2_2019-05-08_13-49-58.wav,44100,16,60,1,bioacoustic_index,512,2000,8000,2.2866588789964,NA 
rayol-farm2_2019-05-08_13-51-58.wav,44100,16,60,1,bioacoustic_index,512,2000,8000,2.10415924554445,NA 
rayol-farm2_2019-05-08_13-53-58.wav,44100,16,60,1,bioacoustic_index,512,2000,8000,2.12979692784926,NA 
rayol-farm2_2019-05-08_13-55-58.wav,44100,16,60,1,bioacoustic_index,512,2000,8000,2.00772727032577,NA 
rayol-farm2_2019-05-08_13-57-58.wav,44100,16,60,1,bioacoustic_index,512,2000,8000,1.49170763514474,NA 
rayol-farm2_2019-05-08_13-59-58.wav,44100,16,60,1,bioacoustic_index,512,2000,8000,1.42709594720483,NA 
rayol-farm2_2019-05-08_14-01-58.wav,44100,16,60,1,bioacoustic_index,512,2000,8000,1.92580930948693,NA 
rayol-farm2_2019-05-08_14-03-58.wav,44100,16,60,1,bioacoustic_index,512,2000,8000,1.59720806017143,NA 
rayol-farm2_2019-05-08_14-05-59.wav,44100,16,60,1,bioacoustic_index,512,2000,8000,2.26375595522202,NA 
rayol-farm2_2019-05-08_14-07-59.wav,44100,16,60,1,bioacoustic_index,512,2000,8000,1.56794881597636,NA 
rayol-farm2_2019-05-08_14-09-59.wav,44100,16,60,1,bioacoustic_index,512,2000,8000,1.48623577965553,NA 
rayol-farm2_2019-05-08_14-11-59.wav,44100,16,60,1,bioacoustic_index,512,2000,8000,1.88894712510616,NA 
rayol-farm2_2019-05-08_14-13-59.wav,44100,16,60,1,bioacoustic_index,512,2000,8000,1.54184554050806,NA 
rayol-farm2_2019-05-08_14-15-59.wav,44100,16,60,1,bioacoustic_index,512,2000,8000,1.91699531558618,NA 
rayol-farm2_2019-05-08_14-17-59.wav,44100,16,60,1,bioacoustic_index,512,2000,8000,1.63479839698943,NA 
rayol-farm2_2019-05-08_14-19-59.wav,44100,16,60,1,bioacoustic_index,512,2000,8000,1.50133891692404,NA 
rayol-farm2_2019-05-08_14-22-00.wav,44100,16,60,1,bioacoustic_index,512,2000,8000,1.49580881572164,NA 
rayol-farm2_2019-05-08_14-24-00.wav,44100,16,60,1,bioacoustic_index,512,2000,8000,1.64806524979901,NA 
rayol-farm2_2019-05-08_14-26-00.wav,44100,16,60,1,bioacoustic_index,512,2000,8000,1.57361372200014,NA 
rayol-farm2_2019-05-08_14-28-00.wav,44100,16,60,1,bioacoustic_index,512,2000,8000,1.62442851992138,NA 
rayol-farm2_2019-05-08_14-30-00.wav,44100,16,60,1,bioacoustic_index,512,2000,8000,1.55748047471339,NA 
rayol-farm2_2019-05-08_14-32-00.wav,44100,16,60,1,bioacoustic_index,512,2000,8000,1.51401497006987,NA 
rayol-farm2_2019-05-08_14-34-00.wav,44100,16,60,1,bioacoustic_index,512,2000,8000,1.62369769808831,NA 
rayol-farm2_2019-05-08_14-36-00.wav,44100,16,60,1,bioacoustic_index,512,2000,8000,3.55220420926161,NA 
rayol-farm2_2019-05-08_14-38-00.wav,44100,16,60,1,bioacoustic_index,512,2000,8000,1.77226021298921,NA 
rayol-farm2_2019-05-08_14-40-01.wav,44100,16,60,1,bioacoustic_index,512,2000,8000,1.78456582829531,NA 
rayol-farm2_2019-05-08_14-42-01.wav,44100,16,60,1,bioacoustic_index,512,2000,8000,1.69197958232194,NA 
rayol-farm2_2019-05-08_14-44-01.wav,44100,16,60,1,bioacoustic_index,512,2000,8000,1.47139551465096,NA 
rayol-farm2_2019-05-08_14-46-01.wav,44100,16,60,1,bioacoustic_index,512,2000,8000,1.43862386489694,NA 
rayol-farm2_2019-05-08_14-48-01.wav,44100,16,60,1,bioacoustic_index,512,2000,8000,1.4099630443149,NA 
rayol-farm2_2019-05-08_14-50-01.wav,44100,16,60,1,bioacoustic_index,512,2000,8000,1.99932936022864,NA 
rayol-farm2_2019-05-08_14-52-01.wav,44100,16,60,1,bioacoustic_index,512,2000,8000,2.73295155380847,NA 
rayol-farm2_2019-05-08_14-54-01.wav,44100,16,60,1,bioacoustic_index,512,2000,8000,1.79946026695075,NA 
rayol-farm2_2019-05-08_14-56-02.wav,44100,16,60,1,bioacoustic_index,512,2000,8000,1.69947767577557,NA 
rayol-farm2_2019-05-08_14-58-02.wav,44100,16,60,1,bioacoustic_index,512,2000,8000,2.34520522732959,NA 
rayol-farm2_2019-05-08_15-00-02.wav,44100,16,60,1,bioacoustic_index,512,2000,8000,1.89069099192081,NA 
rayol-farm2_2019-05-08_15-02-02.wav,44100,16,60,1,bioacoustic_index,512,2000,8000,1.80121287937284,NA 
rayol-farm2_2019-05-08_15-04-02.wav,44100,16,60,1,bioacoustic_index,512,2000,8000,1.76963291161732,NA 
rayol-farm2_2019-05-08_15-06-02.wav,44100,16,60,1,bioacoustic_index,512,2000,8000,2.27140040317227,NA 
rayol-farm2_2019-05-08_15-08-02.wav,44100,16,60,1,bioacoustic_index,512,2000,8000,2.58557849894112,NA 
rayol-farm2_2019-05-08_15-10-02.wav,44100,16,60,1,bioacoustic_index,512,2000,8000,1.8684937594023,NA 
rayol-farm2_2019-05-08_15-12-03.wav,44100,16,60,1,bioacoustic_index,512,2000,8000,1.92025212495475,NA 
rayol-farm2_2019-05-08_15-14-03.wav,44100,16,60,1,bioacoustic_index,512,2000,8000,1.78320432431555,NA 
rayol-farm2_2019-05-08_15-16-03.wav,44100,16,60,1,bioacoustic_index,512,2000,8000,1.82258747603003,NA 
rayol-farm2_2019-05-08_15-18-03.wav,44100,16,60,1,bioacoustic_index,512,2000,8000,3.33786850836584,NA 
rayol-farm2_2019-05-08_15-20-03.wav,44100,16,60,1,bioacoustic_index,512,2000,8000,1.66380769644083,NA 
rayol-farm2_2019-05-08_15-22-03.wav,44100,16,60,1,bioacoustic_index,512,2000,8000,1.81457911684391,NA 
rayol-farm2_2019-05-08_15-24-03.wav,44100,16,60,1,bioacoustic_index,512,2000,8000,1.64721120391974,NA 
rayol-farm2_2019-05-08_15-26-03.wav,44100,16,60,1,bioacoustic_index,512,2000,8000,1.45697738965352,NA 
rayol-farm2_2019-05-08_15-28-04.wav,44100,16,60,1,bioacoustic_index,512,2000,8000,1.62414080998931,NA 
rayol-farm2_2019-05-08_15-30-04.wav,44100,16,60,1,bioacoustic_index,512,2000,8000,2.13847942879665,NA 
rayol-farm2_2019-05-08_15-32-04.wav,44100,16,60,1,bioacoustic_index,512,2000,8000,1.41529852874109,NA 
rayol-farm2_2019-05-08_15-34-04.wav,44100,16,60,1,bioacoustic_index,512,2000,8000,2.8269666786014,NA 
rayol-farm2_2019-05-08_15-36-04.wav,44100,16,60,1,bioacoustic_index,512,2000,8000,1.43691612016619,NA 
rayol-farm2_2019-05-08_15-38-04.wav,44100,16,60,1,bioacoustic_index,512,2000,8000,3.91743695175067,NA 
rayol-farm2_2019-05-08_15-40-04.wav,44100,16,60,1,bioacoustic_index,512,2000,8000,1.83375534909059,NA 
rayol-farm2_2019-05-08_15-42-04.wav,44100,16,60,1,bioacoustic_index,512,2000,8000,1.8224719060717,NA 
rayol-farm2_2019-05-08_15-44-04.wav,44100,16,60,1,bioacoustic_index,512,2000,8000,1.80506558776945,NA 
rayol-farm2_2019-05-08_15-46-05.wav,44100,16,60,1,bioacoustic_index,512,2000,8000,1.51683023673609,NA 
rayol-farm2_2019-05-08_15-48-05.wav,44100,16,60,1,bioacoustic_index,512,2000,8000,1.88277583847422,NA 
rayol-farm2_2019-05-08_15-50-05.wav,44100,16,60,1,bioacoustic_index,512,2000,8000,2.49205607725646,NA 
rayol-farm2_2019-05-08_15-52-05.wav,44100,16,60,1,bioacoustic_index,512,2000,8000,4.02483992573205,NA 
rayol-farm2_2019-05-08_15-54-05.wav,44100,16,60,1,bioacoustic_index,512,2000,8000,3.07838289571234,NA 
rayol-farm2_2019-05-08_15-56-05.wav,44100,16,60,1,bioacoustic_index,512,2000,8000,2.6455078295333,NA 
rayol-farm2_2019-05-08_15-58-05.wav,44100,16,60,1,bioacoustic_index,512,2000,8000,2.58872121740116,NA 
rayol-farm2_2019-05-08_16-00-05.wav,44100,16,60,1,bioacoustic_index,512,2000,8000,2.86410854456827,NA 
rayol-farm2_2019-05-08_16-02-06.wav,44100,16,60,1,bioacoustic_index,512,2000,8000,3.13582022639775,NA 
rayol-farm2_2019-05-08_16-04-06.wav,44100,16,60,1,bioacoustic_index,512,2000,8000,2.29775926102467,NA 
rayol-farm2_2019-05-08_16-06-06.wav,44100,16,60,1,bioacoustic_index,512,2000,8000,3.12940409419657,NA 
rayol-farm2_2019-05-08_16-08-06.wav,44100,16,60,1,bioacoustic_index,512,2000,8000,1.56905946508231,NA 
rayol-farm2_2019-05-08_16-10-06.wav,44100,16,60,1,bioacoustic_index,512,2000,8000,1.72649385063325,NA 
rayol-farm2_2019-05-08_16-12-06.wav,44100,16,60,1,bioacoustic_index,512,2000,8000,2.40832317614715,NA 
rayol-farm2_2019-05-08_16-14-06.wav,44100,16,60,1,bioacoustic_index,512,2000,8000,1.76779222582811,NA 
rayol-farm2_2019-05-08_16-16-06.wav,44100,16,60,1,bioacoustic_index,512,2000,8000,1.90576587083489,NA 
rayol-farm2_2019-05-08_16-18-07.wav,44100,16,60,1,bioacoustic_index,512,2000,8000,2.06143656319474,NA 
rayol-farm2_2019-05-08_16-20-07.wav,44100,16,60,1,bioacoustic_index,512,2000,8000,2.24476958894735,NA 
rayol-farm2_2019-05-08_16-22-07.wav,44100,16,60,1,bioacoustic_index,512,2000,8000,1.6063985592412,NA 
rayol-farm2_2019-05-08_16-24-07.wav,44100,16,60,1,bioacoustic_index,512,2000,8000,3.37391685185281,NA 
rayol-farm2_2019-05-08_16-26-07.wav,44100,16,60,1,bioacoustic_index,512,2000,8000,1.5344555057945,NA 
rayol-farm2_2019-05-08_16-28-07.wav,44100,16,60,1,bioacoustic_index,512,2000,8000,1.55048938122351,NA 
rayol-farm2_2019-05-08_16-30-07.wav,44100,16,60,1,bioacoustic_index,512,2000,8000,3.28653161840396,NA 
rayol-farm2_2019-05-08_16-32-07.wav,44100,16,60,1,bioacoustic_index,512,2000,8000,1.83226913294138,NA 
rayol-farm2_2019-05-08_16-34-08.wav,44100,16,60,1,bioacoustic_index,512,2000,8000,1.69198989009463,NA 
rayol-farm2_2019-05-08_16-36-08.wav,44100,16,60,1,bioacoustic_index,512,2000,8000,1.77800922566461,NA 
rayol-farm2_2019-05-08_16-38-08.wav,44100,16,60,1,bioacoustic_index,512,2000,8000,1.95059906113292,NA 
rayol-farm2_2019-05-08_16-40-08.wav,44100,16,60,1,bioacoustic_index,512,2000,8000,1.62583431379282,NA 
rayol-farm2_2019-05-08_16-42-08.wav,44100,16,60,1,bioacoustic_index,512,2000,8000,1.72205993589617,NA 
rayol-farm2_2019-05-08_16-44-08.wav,44100,16,60,1,bioacoustic_index,512,2000,8000,1.74737407591067,NA 
rayol-farm2_2019-05-08_16-46-08.wav,44100,16,60,1,bioacoustic_index,512,2000,8000,1.72184067476885,NA 
rayol-farm2_2019-05-08_16-48-08.wav,44100,16,60,1,bioacoustic_index,512,2000,8000,2.03499615576168,NA 
rayol-farm2_2019-05-08_16-50-08.wav,44100,16,60,1,bioacoustic_index,512,2000,8000,1.85137055923706,NA 
rayol-farm2_2019-05-08_16-52-09.wav,44100,16,60,1,bioacoustic_index,512,2000,8000,2.53597938686611,NA 
rayol-farm2_2019-05-08_16-54-09.wav,44100,16,60,1,bioacoustic_index,512,2000,8000,1.85476839940842,NA 
rayol-farm2_2019-05-08_16-56-09.wav,44100,16,60,1,bioacoustic_index,512,2000,8000,2.92069787681927,NA 
rayol-farm2_2019-05-08_16-58-09.wav,44100,16,60,1,bioacoustic_index,512,2000,8000,1.76416173082799,NA 
rayol-farm2_2019-05-08_17-00-09.wav,44100,16,60,1,bioacoustic_index,512,2000,8000,2.04372146708659,NA 
rayol-farm2_2019-05-08_17-02-09.wav,44100,16,60,1,bioacoustic_index,512,2000,8000,2.35175050141178,NA 
rayol-farm2_2019-05-08_17-04-09.wav,44100,16,60,1,bioacoustic_index,512,2000,8000,2.43985417888711,NA 
rayol-farm2_2019-05-08_17-06-09.wav,44100,16,60,1,bioacoustic_index,512,2000,8000,2.92640788056102,NA 
rayol-farm2_2019-05-08_17-08-10.wav,44100,16,60,1,bioacoustic_index,512,2000,8000,1.75273472527159,NA 
rayol-farm2_2019-05-08_17-10-10.wav,44100,16,60,1,bioacoustic_index,512,2000,8000,1.57865169374015,NA 
rayol-farm2_2019-05-08_17-12-10.wav,44100,16,60,1,bioacoustic_index,512,2000,8000,1.61795035582879,NA 
rayol-farm2_2019-05-08_17-14-10.wav,44100,16,60,1,bioacoustic_index,512,2000,8000,2.31295567932803,NA 
rayol-farm2_2019-05-08_17-16-10.wav,44100,16,60,1,bioacoustic_index,512,2000,8000,1.87067950389344,NA 
rayol-farm2_2019-05-08_17-18-10.wav,44100,16,60,1,bioacoustic_index,512,2000,8000,1.9771758161146,NA 
rayol-farm2_2019-05-08_17-20-10.wav,44100,16,60,1,bioacoustic_index,512,2000,8000,1.64442002122012,NA 
rayol-farm2_2019-05-08_17-22-10.wav,44100,16,60,1,bioacoustic_index,512,2000,8000,1.66426580582848,NA 
rayol-farm2_2019-05-08_17-24-11.wav,44100,16,60,1,bioacoustic_index,512,2000,8000,1.79607008726995,NA 
rayol-farm2_2019-05-08_17-26-11.wav,44100,16,60,1,bioacoustic_index,512,2000,8000,1.67858846256485,NA 
rayol-farm2_2019-05-08_17-28-11.wav,44100,16,60,1,bioacoustic_index,512,2000,8000,2.38100202252421,NA 
rayol-farm2_2019-05-08_17-30-11.wav,44100,16,60,1,bioacoustic_index,512,2000,8000,1.70747404849452,NA 
rayol-farm2_2019-05-08_17-32-11.wav,44100,16,60,1,bioacoustic_index,512,2000,8000,2.21332610744385,NA 
rayol-farm2_2019-05-08_17-34-11.wav,44100,16,60,1,bioacoustic_index,512,2000,8000,2.64312538976023,NA 
rayol-farm2_2019-05-08_17-36-11.wav,44100,16,60,1,bioacoustic_index,512,2000,8000,2.40989483962197,NA 
rayol-farm2_2019-05-08_17-38-11.wav,44100,16,60,1,bioacoustic_index,512,2000,8000,2.37081883677302,NA 
rayol-farm2_2019-05-08_17-40-12.wav,44100,16,60,1,bioacoustic_index,512,2000,8000,1.75527734205275,NA 
rayol-farm2_2019-05-08_17-42-12.wav,44100,16,60,1,bioacoustic_index,512,2000,8000,1.75495992467124,NA 
rayol-farm2_2019-05-08_17-44-12.wav,44100,16,60,1,bioacoustic_index,512,2000,8000,1.92680810884989,NA 
rayol-farm2_2019-05-08_17-46-12.wav,44100,16,60,1,bioacoustic_index,512,2000,8000,3.51415860679524,NA 
rayol-farm2_2019-05-08_17-48-12.wav,44100,16,60,1,bioacoustic_index,512,2000,8000,4.82374575797371,NA 
rayol-farm2_2019-05-08_17-50-12.wav,44100,16,60,1,bioacoustic_index,512,2000,8000,3.9418629567492,NA 
rayol-farm2_2019-05-08_17-52-12.wav,44100,16,60,1,bioacoustic_index,512,2000,8000,1.76551680149657,NA 
rayol-farm2_2019-05-08_17-54-12.wav,44100,16,60,1,bioacoustic_index,512,2000,8000,1.75970488953378,NA 
rayol-farm2_2019-05-08_17-56-13.wav,44100,16,60,1,bioacoustic_index,512,2000,8000,1.86527724291645,NA 
rayol-farm2_2019-05-08_17-58-13.wav,44100,16,60,1,bioacoustic_index,512,2000,8000,1.69585706696171,NA 
rayol-farm2_2019-05-08_18-00-13.wav,44100,16,60,1,bioacoustic_index,512,2000,8000,1.78798594916095,NA 
rayol-farm2_2019-05-08_18-02-13.wav,44100,16,60,1,bioacoustic_index,512,2000,8000,1.79651035212832,NA 
rayol-farm2_2019-05-08_18-04-13.wav,44100,16,60,1,bioacoustic_index,512,2000,8000,1.83193124650835,NA 
rayol-farm2_2019-05-08_18-06-13.wav,44100,16,60,1,bioacoustic_index,512,2000,8000,1.61211850898032,NA 
rayol-farm2_2019-05-08_18-08-13.wav,44100,16,60,1,bioacoustic_index,512,2000,8000,1.64298845590611,NA 
rayol-farm2_2019-05-08_18-10-13.wav,44100,16,60,1,bioacoustic_index,512,2000,8000,1.98331208937799,NA 
rayol-farm2_2019-05-08_18-12-13.wav,44100,16,60,1,bioacoustic_index,512,2000,8000,1.74451568038578,NA 
rayol-farm2_2019-05-08_18-14-14.wav,44100,16,60,1,bioacoustic_index,512,2000,8000,1.31516778007401,NA 
rayol-farm2_2019-05-08_18-16-14.wav,44100,16,60,1,bioacoustic_index,512,2000,8000,1.42288899909556,NA 
rayol-farm2_2019-05-08_18-18-14.wav,44100,16,60,1,bioacoustic_index,512,2000,8000,1.54832544410495,NA 
rayol-farm2_2019-05-08_18-20-14.wav,44100,16,60,1,bioacoustic_index,512,2000,8000,1.61710119106853,NA 
rayol-farm2_2019-05-08_18-22-14.wav,44100,16,60,1,bioacoustic_index,512,2000,8000,1.50807066037408,NA 
rayol-farm2_2019-05-08_18-24-14.wav,44100,16,60,1,bioacoustic_index,512,2000,8000,1.40013997413687,NA 
rayol-farm2_2019-05-08_18-26-14.wav,44100,16,60,1,bioacoustic_index,512,2000,8000,1.68926445162622,NA 
rayol-farm2_2019-05-08_18-28-14.wav,44100,16,60,1,bioacoustic_index,512,2000,8000,1.78057778870466,NA 
rayol-farm2_2019-05-08_18-30-15.wav,44100,16,60,1,bioacoustic_index,512,2000,8000,2.91360387009624,NA 
rayol-farm2_2019-05-08_18-32-15.wav,44100,16,60,1,bioacoustic_index,512,2000,8000,2.75188793348585,NA 
rayol-farm2_2019-05-08_18-34-15.wav,44100,16,60,1,bioacoustic_index,512,2000,8000,1.69489265751025,NA 
rayol-farm2_2019-05-08_18-36-15.wav,44100,16,60,1,bioacoustic_index,512,2000,8000,1.44399125712801,NA 
rayol-farm2_2019-05-08_18-38-15.wav,44100,16,60,1,bioacoustic_index,512,2000,8000,1.45329187797947,NA 
rayol-farm2_2019-05-08_18-40-15.wav,44100,16,60,1,bioacoustic_index,512,2000,8000,1.38703694497376,NA 
rayol-farm2_2019-05-08_18-42-15.wav,44100,16,60,1,bioacoustic_index,512,2000,8000,1.5531116515861,NA 
rayol-farm2_2019-05-08_18-44-15.wav,44100,16,60,1,bioacoustic_index,512,2000,8000,1.67419985980881,NA 
rayol-farm2_2019-05-08_18-46-16.wav,44100,16,60,1,bioacoustic_index,512,2000,8000,3.40410982702162,NA 
rayol-farm2_2019-05-08_18-48-16.wav,44100,16,60,1,bioacoustic_index,512,2000,8000,1.46827467035297,NA 
rayol-farm2_2019-05-08_18-50-16.wav,44100,16,60,1,bioacoustic_index,512,2000,8000,1.53447546184412,NA 
rayol-farm2_2019-05-08_18-52-16.wav,44100,16,60,1,bioacoustic_index,512,2000,8000,1.52997236264045,NA 
rayol-farm2_2019-05-08_18-54-16.wav,44100,16,60,1,bioacoustic_index,512,2000,8000,1.43299719344384,NA 
rayol-farm2_2019-05-08_18-56-16.wav,44100,16,60,1,bioacoustic_index,512,2000,8000,1.5630654561733,NA 
rayol-farm2_2019-05-08_18-58-16.wav,44100,16,60,1,bioacoustic_index,512,2000,8000,1.94441421362081,NA 
rayol-farm2_2019-05-08_19-00-16.wav,44100,16,60,1,bioacoustic_index,512,2000,8000,1.70216812131463,NA 
rayol-farm2_2019-05-08_19-02-17.wav,44100,16,60,1,bioacoustic_index,512,2000,8000,1.77129755328052,NA 
rayol-farm2_2019-05-08_19-04-17.wav,44100,16,60,1,bioacoustic_index,512,2000,8000,1.74156674756574,NA 
rayol-farm2_2019-05-08_19-06-17.wav,44100,16,60,1,bioacoustic_index,512,2000,8000,1.66255317611699,NA 
rayol-farm2_2019-05-08_19-08-17.wav,44100,16,60,1,bioacoustic_index,512,2000,8000,1.81228528223324,NA 
rayol-farm2_2019-05-08_19-10-17.wav,44100,16,60,1,bioacoustic_index,512,2000,8000,1.83647404761426,NA 
rayol-farm2_2019-05-08_19-12-17.wav,44100,16,60,1,bioacoustic_index,512,2000,8000,1.65193253916478,NA 
rayol-farm2_2019-05-08_19-14-17.wav,44100,16,60,1,bioacoustic_index,512,2000,8000,1.91414649210585,NA 
rayol-farm2_2019-05-08_19-16-17.wav,44100,16,60,1,bioacoustic_index,512,2000,8000,1.89658485798261,NA 
rayol-farm2_2019-05-08_19-18-17.wav,44100,16,60,1,bioacoustic_index,512,2000,8000,2.19260966405289,NA 
rayol-farm2_2019-05-08_19-20-18.wav,44100,16,60,1,bioacoustic_index,512,2000,8000,1.96417562028999,NA 
rayol-farm2_2019-05-08_19-22-18.wav,44100,16,60,1,bioacoustic_index,512,2000,8000,2.18269505374919,NA 
rayol-farm2_2019-05-08_19-24-18.wav,44100,16,60,1,bioacoustic_index,512,2000,8000,2.37350410972623,NA 
rayol-farm2_2019-05-08_19-26-18.wav,44100,16,60,1,bioacoustic_index,512,2000,8000,2.06224740406334,NA 
rayol-farm2_2019-05-08_19-28-18.wav,44100,16,60,1,bioacoustic_index,512,2000,8000,1.77877741064397,NA 
rayol-farm2_2019-05-08_19-30-18.wav,44100,16,60,1,bioacoustic_index,512,2000,8000,1.55441383039548,NA 
rayol-farm2_2019-05-08_19-32-18.wav,44100,16,60,1,bioacoustic_index,512,2000,8000,2.13187679709679,NA 
rayol-farm2_2019-05-08_19-34-18.wav,44100,16,60,1,bioacoustic_index,512,2000,8000,1.41715967565451,NA 
rayol-farm2_2019-05-08_19-36-19.wav,44100,16,60,1,bioacoustic_index,512,2000,8000,1.45023627584594,NA 
rayol-farm2_2019-05-08_19-38-19.wav,44100,16,60,1,bioacoustic_index,512,2000,8000,1.70282024105228,NA 
rayol-farm2_2019-05-08_19-40-19.wav,44100,16,60,1,bioacoustic_index,512,2000,8000,1.53325115212025,NA 
rayol-farm2_2019-05-08_19-42-19.wav,44100,16,60,1,bioacoustic_index,512,2000,8000,1.79571226852377,NA 
rayol-farm2_2019-05-08_19-44-19.wav,44100,16,60,1,bioacoustic_index,512,2000,8000,2.09960520782389,NA 
rayol-farm2_2019-05-08_19-46-19.wav,44100,16,60,1,bioacoustic_index,512,2000,8000,1.42966522313456,NA 
rayol-farm2_2019-05-08_19-48-19.wav,44100,16,60,1,bioacoustic_index,512,2000,8000,1.37139582387833,NA 
rayol-farm2_2019-05-08_19-50-19.wav,44100,16,60,1,bioacoustic_index,512,2000,8000,1.53466858370142,NA 
rayol-farm2_2019-05-08_19-52-20.wav,44100,16,60,1,bioacoustic_index,512,2000,8000,1.46960606771345,NA 
rayol-farm2_2019-05-08_19-54-20.wav,44100,16,60,1,bioacoustic_index,512,2000,8000,1.75304586057044,NA 
rayol-farm2_2019-05-08_19-56-20.wav,44100,16,60,1,bioacoustic_index,512,2000,8000,1.73617230218658,NA 
rayol-farm2_2019-05-08_19-58-20.wav,44100,16,60,1,bioacoustic_index,512,2000,8000,1.66470262186159,NA 
rayol-farm2_2019-05-08_20-00-20.wav,44100,16,60,1,bioacoustic_index,512,2000,8000,1.42187319384229,NA 
rayol-farm2_2019-05-08_20-02-20.wav,44100,16,60,1,bioacoustic_index,512,2000,8000,1.60205519289029,NA 
rayol-farm2_2019-05-08_20-04-20.wav,44100,16,60,1,bioacoustic_index,512,2000,8000,1.5266529189216,NA 
rayol-farm2_2019-05-08_20-06-20.wav,44100,16,60,1,bioacoustic_index,512,2000,8000,1.50089142263826,NA 
rayol-farm2_2019-05-08_20-08-21.wav,44100,16,60,1,bioacoustic_index,512,2000,8000,1.680053248095,NA 
rayol-farm2_2019-05-08_20-10-21.wav,44100,16,60,1,bioacoustic_index,512,2000,8000,1.97298446381339,NA 
rayol-farm2_2019-05-08_20-12-21.wav,44100,16,60,1,bioacoustic_index,512,2000,8000,1.5446803461259,NA 
rayol-farm2_2019-05-08_20-14-21.wav,44100,16,60,1,bioacoustic_index,512,2000,8000,1.53480149305782,NA 
rayol-farm2_2019-05-08_20-16-21.wav,44100,16,60,1,bioacoustic_index,512,2000,8000,1.49705682900873,NA 
rayol-farm2_2019-05-08_20-18-21.wav,44100,16,60,1,bioacoustic_index,512,2000,8000,1.53475715666702,NA 
rayol-farm2_2019-05-08_20-20-21.wav,44100,16,60,1,bioacoustic_index,512,2000,8000,2.53943037373587,NA 
rayol-farm2_2019-05-08_20-22-21.wav,44100,16,60,1,bioacoustic_index,512,2000,8000,2.08621601929134,NA 
rayol-farm2_2019-05-08_20-24-21.wav,44100,16,60,1,bioacoustic_index,512,2000,8000,2.70117045327318,NA 
rayol-farm2_2019-05-08_20-26-22.wav,44100,16,60,1,bioacoustic_index,512,2000,8000,2.18249647826737,NA 
rayol-farm2_2019-05-08_20-28-22.wav,44100,16,60,1,bioacoustic_index,512,2000,8000,2.01806335788896,NA 
rayol-farm2_2019-05-08_20-30-22.wav,44100,16,60,1,bioacoustic_index,512,2000,8000,1.97009452717395,NA 
rayol-farm2_2019-05-08_20-32-22.wav,44100,16,60,1,bioacoustic_index,512,2000,8000,1.90245163124481,NA 
rayol-farm2_2019-05-08_20-34-22.wav,44100,16,60,1,bioacoustic_index,512,2000,8000,1.89944387660113,NA 
rayol-farm2_2019-05-08_20-36-22.wav,44100,16,60,1,bioacoustic_index,512,2000,8000,1.55231368496598,NA 
rayol-farm2_2019-05-08_20-38-22.wav,44100,16,60,1,bioacoustic_index,512,2000,8000,1.73626000604075,NA 
rayol-farm2_2019-05-08_20-40-22.wav,44100,16,60,1,bioacoustic_index,512,2000,8000,1.81802466065384,NA 
rayol-farm2_2019-05-08_20-42-23.wav,44100,16,60,1,bioacoustic_index,512,2000,8000,2.01817450055182,NA 
rayol-farm2_2019-05-08_20-44-23.wav,44100,16,60,1,bioacoustic_index,512,2000,8000,1.95949160806389,NA 
rayol-farm2_2019-05-08_20-46-23.wav,44100,16,60,1,bioacoustic_index,512,2000,8000,1.85862306303583,NA 
rayol-farm2_2019-05-08_20-48-23.wav,44100,16,60,1,bioacoustic_index,512,2000,8000,2.28309926845483,NA 
rayol-farm2_2019-05-08_20-50-23.wav,44100,16,60,1,bioacoustic_index,512,2000,8000,2.0993386357138,NA 
rayol-farm2_2019-05-08_20-52-23.wav,44100,16,60,1,bioacoustic_index,512,2000,8000,2.12126488887615,NA 
rayol-farm2_2019-05-08_20-54-23.wav,44100,16,60,1,bioacoustic_index,512,2000,8000,1.88106196144125,NA 
rayol-farm2_2019-05-08_20-56-23.wav,44100,16,60,1,bioacoustic_index,512,2000,8000,2.13009964050669,NA 
rayol-farm2_2019-05-08_20-58-24.wav,44100,16,60,1,bioacoustic_index,512,2000,8000,1.83733850705829,NA 
rayol-farm2_2019-05-08_21-00-24.wav,44100,16,60,1,bioacoustic_index,512,2000,8000,1.49445483600362,NA 
rayol-farm2_2019-05-08_21-02-24.wav,44100,16,60,1,bioacoustic_index,512,2000,8000,1.52272911667776,NA 
rayol-farm2_2019-05-08_21-04-24.wav,44100,16,60,1,bioacoustic_index,512,2000,8000,1.37412403903124,NA 
rayol-farm2_2019-05-08_21-06-24.wav,44100,16,60,1,bioacoustic_index,512,2000,8000,1.39861964110774,NA 
rayol-farm2_2019-05-08_21-08-24.wav,44100,16,60,1,bioacoustic_index,512,2000,8000,1.41005045225948,NA 
rayol-farm2_2019-05-08_21-10-24.wav,44100,16,60,1,bioacoustic_index,512,2000,8000,1.41896128012032,NA 
rayol-farm2_2019-05-08_21-12-24.wav,44100,16,60,1,bioacoustic_index,512,2000,8000,1.47793754571607,NA 
rayol-farm2_2019-05-08_21-14-25.wav,44100,16,60,1,bioacoustic_index,512,2000,8000,1.40186528975386,NA 
rayol-farm2_2019-05-08_21-16-25.wav,44100,16,60,1,bioacoustic_index,512,2000,8000,1.47204023930858,NA 
rayol-farm2_2019-05-08_21-18-25.wav,44100,16,60,1,bioacoustic_index,512,2000,8000,1.51014939154644,NA 
rayol-farm2_2019-05-08_21-20-25.wav,44100,16,60,1,bioacoustic_index,512,2000,8000,1.44662909812061,NA 
rayol-farm2_2019-05-08_21-22-25.wav,44100,16,60,1,bioacoustic_index,512,2000,8000,1.38484855831586,NA 
rayol-farm2_2019-05-08_21-24-25.wav,44100,16,60,1,bioacoustic_index,512,2000,8000,1.39021352542767,NA 
rayol-farm2_2019-05-08_21-26-25.wav,44100,16,60,1,bioacoustic_index,512,2000,8000,1.50969452450359,NA 
rayol-farm2_2019-05-08_21-28-25.wav,44100,16,60,1,bioacoustic_index,512,2000,8000,1.53698523895809,NA 
rayol-farm2_2019-05-08_21-30-25.wav,44100,16,60,1,bioacoustic_index,512,2000,8000,1.49651805363173,NA 
rayol-farm2_2019-05-08_21-32-26.wav,44100,16,60,1,bioacoustic_index,512,2000,8000,1.46338814963714,NA 
rayol-farm2_2019-05-08_21-34-26.wav,44100,16,60,1,bioacoustic_index,512,2000,8000,1.68990626775755,NA 
rayol-farm2_2019-05-08_21-36-26.wav,44100,16,60,1,bioacoustic_index,512,2000,8000,1.54024519938284,NA 
rayol-farm2_2019-05-08_21-38-26.wav,44100,16,60,1,bioacoustic_index,512,2000,8000,1.56438423422781,NA 
rayol-farm2_2019-05-08_21-40-26.wav,44100,16,60,1,bioacoustic_index,512,2000,8000,1.43071121741069,NA 
rayol-farm2_2019-05-08_21-42-26.wav,44100,16,60,1,bioacoustic_index,512,2000,8000,1.47442628356811,NA 
rayol-farm2_2019-05-08_21-44-26.wav,44100,16,60,1,bioacoustic_index,512,2000,8000,1.41589702540605,NA 
rayol-farm2_2019-05-08_21-46-26.wav,44100,16,60,1,bioacoustic_index,512,2000,8000,1.48666661432973,NA 
rayol-farm2_2019-05-08_21-48-27.wav,44100,16,60,1,bioacoustic_index,512,2000,8000,1.63126897044969,NA 
rayol-farm2_2019-05-08_21-50-27.wav,44100,16,60,1,bioacoustic_index,512,2000,8000,1.40507767775228,NA 
rayol-farm2_2019-05-08_21-52-27.wav,44100,16,60,1,bioacoustic_index,512,2000,8000,1.44299096393101,NA 
rayol-farm2_2019-05-08_21-54-27.wav,44100,16,60,1,bioacoustic_index,512,2000,8000,1.50291145237076,NA 
rayol-farm2_2019-05-08_21-56-27.wav,44100,16,60,1,bioacoustic_index,512,2000,8000,1.48551308173099,NA 
rayol-farm2_2019-05-08_21-58-27.wav,44100,16,60,1,bioacoustic_index,512,2000,8000,1.38978925975837,NA 
rayol-farm2_2019-05-08_22-00-27.wav,44100,16,60,1,bioacoustic_index,512,2000,8000,1.43232521307634,NA 
rayol-farm2_2019-05-08_22-02-27.wav,44100,16,60,1,bioacoustic_index,512,2000,8000,1.52149613125927,NA 
rayol-farm2_2019-05-08_22-04-28.wav,44100,16,60,1,bioacoustic_index,512,2000,8000,1.57939807617597,NA 
rayol-farm2_2019-05-08_22-06-28.wav,44100,16,60,1,bioacoustic_index,512,2000,8000,1.42414944474704,NA 
rayol-farm2_2019-05-08_22-08-28.wav,44100,16,60,1,bioacoustic_index,512,2000,8000,1.51170711622833,NA 
rayol-farm2_2019-05-08_22-10-28.wav,44100,16,60,1,bioacoustic_index,512,2000,8000,1.44895643726877,NA 
rayol-farm2_2019-05-08_22-12-28.wav,44100,16,60,1,bioacoustic_index,512,2000,8000,1.6960023243937,NA 
rayol-farm2_2019-05-08_22-14-28.wav,44100,16,60,1,bioacoustic_index,512,2000,8000,1.55306197989577,NA 
rayol-farm2_2019-05-08_22-16-28.wav,44100,16,60,1,bioacoustic_index,512,2000,8000,1.58626219065831,NA 
rayol-farm2_2019-05-08_22-18-28.wav,44100,16,60,1,bioacoustic_index,512,2000,8000,1.78910389132927,NA 
rayol-farm2_2019-05-08_22-20-29.wav,44100,16,60,1,bioacoustic_index,512,2000,8000,1.53123709164462,NA 
rayol-farm2_2019-05-08_22-22-29.wav,44100,16,60,1,bioacoustic_index,512,2000,8000,1.57320812162362,NA 
rayol-farm2_2019-05-08_22-24-29.wav,44100,16,60,1,bioacoustic_index,512,2000,8000,1.7819784013472,NA 
rayol-farm2_2019-05-08_22-26-29.wav,44100,16,60,1,bioacoustic_index,512,2000,8000,1.51436735355517,NA 
rayol-farm2_2019-05-08_22-28-29.wav,44100,16,60,1,bioacoustic_index,512,2000,8000,1.45599792166354,NA 
rayol-farm2_2019-05-08_22-30-29.wav,44100,16,60,1,bioacoustic_index,512,2000,8000,1.46794584788525,NA 
rayol-farm2_2019-05-08_22-32-29.wav,44100,16,60,1,bioacoustic_index,512,2000,8000,1.57232866718226,NA 
rayol-farm2_2019-05-08_22-34-29.wav,44100,16,60,1,bioacoustic_index,512,2000,8000,2.22789148576292,NA 
rayol-farm2_2019-05-08_22-36-30.wav,44100,16,60,1,bioacoustic_index,512,2000,8000,1.55733190329734,NA 
rayol-farm2_2019-05-08_22-38-30.wav,44100,16,60,1,bioacoustic_index,512,2000,8000,1.42615218930204,NA 
rayol-farm2_2019-05-08_22-40-30.wav,44100,16,60,1,bioacoustic_index,512,2000,8000,1.38029280823589,NA 
rayol-farm2_2019-05-08_22-42-30.wav,44100,16,60,1,bioacoustic_index,512,2000,8000,1.39930497605761,NA 
rayol-farm2_2019-05-08_22-44-30.wav,44100,16,60,1,bioacoustic_index,512,2000,8000,1.35949356098677,NA 
rayol-farm2_2019-05-08_22-46-30.wav,44100,16,60,1,bioacoustic_index,512,2000,8000,1.36019597907702,NA 
rayol-farm2_2019-05-08_22-48-30.wav,44100,16,60,1,bioacoustic_index,512,2000,8000,1.41714025970287,NA 
rayol-farm2_2019-05-08_22-50-30.wav,44100,16,60,1,bioacoustic_index,512,2000,8000,1.37112540886377,NA 
rayol-farm2_2019-05-08_22-52-31.wav,44100,16,60,1,bioacoustic_index,512,2000,8000,1.37273874530643,NA 
rayol-farm2_2019-05-08_22-54-31.wav,44100,16,60,1,bioacoustic_index,512,2000,8000,1.4283970569921,NA 
rayol-farm2_2019-05-08_22-56-31.wav,44100,16,60,1,bioacoustic_index,512,2000,8000,1.3899333689898,NA 
rayol-farm2_2019-05-08_22-58-31.wav,44100,16,60,1,bioacoustic_index,512,2000,8000,1.43649297451114,NA 
rayol-farm2_2019-05-08_23-00-31.wav,44100,16,60,1,bioacoustic_index,512,2000,8000,1.46546978062471,NA 
rayol-farm2_2019-05-08_23-02-31.wav,44100,16,60,1,bioacoustic_index,512,2000,8000,1.37832027559269,NA 
rayol-farm2_2019-05-08_23-04-31.wav,44100,16,60,1,bioacoustic_index,512,2000,8000,1.97151323322036,NA 
rayol-farm2_2019-05-08_23-06-31.wav,44100,16,60,1,bioacoustic_index,512,2000,8000,1.73496299172998,NA 
rayol-farm2_2019-05-08_23-08-31.wav,44100,16,60,1,bioacoustic_index,512,2000,8000,1.5072220551042,NA 
rayol-farm2_2019-05-08_23-10-32.wav,44100,16,60,1,bioacoustic_index,512,2000,8000,1.76018337080974,NA 
rayol-farm2_2019-05-08_23-12-32.wav,44100,16,60,1,bioacoustic_index,512,2000,8000,1.46984331264816,NA 
rayol-farm2_2019-05-08_23-14-32.wav,44100,16,60,1,bioacoustic_index,512,2000,8000,1.35311157355674,NA 
rayol-farm2_2019-05-08_23-16-32.wav,44100,16,60,1,bioacoustic_index,512,2000,8000,1.40466319523119,NA 
rayol-farm2_2019-05-08_23-18-32.wav,44100,16,60,1,bioacoustic_index,512,2000,8000,1.84522643429023,NA 
rayol-farm2_2019-05-08_23-20-32.wav,44100,16,60,1,bioacoustic_index,512,2000,8000,1.82169181142274,NA 
rayol-farm2_2019-05-08_23-22-32.wav,44100,16,60,1,bioacoustic_index,512,2000,8000,1.26116234602924,NA 
rayol-farm2_2019-05-08_23-24-32.wav,44100,16,60,1,bioacoustic_index,512,2000,8000,1.23713690007196,NA 
rayol-farm2_2019-05-08_23-26-33.wav,44100,16,60,1,bioacoustic_index,512,2000,8000,1.24191378481806,NA 
rayol-farm2_2019-05-08_23-28-33.wav,44100,16,60,1,bioacoustic_index,512,2000,8000,1.35076461956743,NA 
rayol-farm2_2019-05-08_23-30-33.wav,44100,16,60,1,bioacoustic_index,512,2000,8000,1.42550657326691,NA 
rayol-farm2_2019-05-08_23-32-33.wav,44100,16,60,1,bioacoustic_index,512,2000,8000,1.61204931717126,NA 
rayol-farm2_2019-05-08_23-34-33.wav,44100,16,60,1,bioacoustic_index,512,2000,8000,1.54207268144626,NA 
rayol-farm2_2019-05-08_23-36-33.wav,44100,16,59.88,1,bioacoustic_index,512,2000,8000,2.10681760661965,NA 
rayol-farm2_2019-05-08_23-38-33.wav,44100,16,60,1,bioacoustic_index,512,2000,8000,1.58747792682851,NA 
rayol-farm2_2019-05-08_23-40-33.wav,44100,16,60,1,bioacoustic_index,512,2000,8000,1.34495666794544,NA 
rayol-farm2_2019-05-08_23-42-34.wav,44100,16,60,1,bioacoustic_index,512,2000,8000,1.24504425947156,NA 
rayol-farm2_2019-05-08_23-44-34.wav,44100,16,60,1,bioacoustic_index,512,2000,8000,1.30258767011693,NA 
rayol-farm2_2019-05-08_23-46-34.wav,44100,16,60,1,bioacoustic_index,512,2000,8000,1.28909591152005,NA 
rayol-farm2_2019-05-08_23-48-34.wav,44100,16,60,1,bioacoustic_index,512,2000,8000,1.21181465606577,NA 
rayol-farm2_2019-05-08_23-50-34.wav,44100,16,60,1,bioacoustic_index,512,2000,8000,1.29307239942107,NA 
rayol-farm2_2019-05-08_23-52-34.wav,44100,16,60,1,bioacoustic_index,512,2000,8000,1.30100454404932,NA 
rayol-farm2_2019-05-08_23-54-34.wav,44100,16,60,1,bioacoustic_index,512,2000,8000,1.2882057363661,NA 
rayol-farm2_2019-05-08_23-56-34.wav,44100,16,60,1,bioacoustic_index,512,2000,8000,1.30132884924994,NA 
rayol-farm2_2019-05-08_23-58-35.wav,44100,16,60,1,bioacoustic_index,512,2000,8000,1.33838178831788,NA
