FILENAME,SAMPLINGRATE,BIT,DURATION,CHANNELS,INDEX,FFT_W,MIN_FREQ,MAX_FREQ,J,LEFT_CHANNEL,RIGHT_CHANNEL
rayol-farm2_2019-03-22_00-01-42.wav,44100,16,60,1,acoustic_complexity,512,1,NA,5,1840.47872991144,NA 
rayol-farm2_2019-03-22_00-03-42.wav,44100,16,60,1,acoustic_complexity,512,1,NA,5,1818.6173081339,NA 
rayol-farm2_2019-03-22_00-05-42.wav,44100,16,60,1,acoustic_complexity,512,1,NA,5,1818.1514592913,NA 
rayol-farm2_2019-03-22_00-07-42.wav,44100,16,60,1,acoustic_complexity,512,1,NA,5,1818.75586570683,NA 
rayol-farm2_2019-03-22_00-09-42.wav,44100,16,60,1,acoustic_complexity,512,1,NA,5,1816.25565683373,NA 
rayol-farm2_2019-03-22_00-11-42.wav,44100,16,60,1,acoustic_complexity,512,1,NA,5,1809.4925707677,NA 
rayol-farm2_2019-03-22_00-13-43.wav,44100,16,60,1,acoustic_complexity,512,1,NA,5,1822.66466909798,NA 
rayol-farm2_2019-03-22_00-15-43.wav,44100,16,60,1,acoustic_complexity,512,1,NA,5,1848.99564726592,NA 
rayol-farm2_2019-03-22_00-17-43.wav,44100,16,60,1,acoustic_complexity,512,1,NA,5,1846.10290886955,NA 
rayol-farm2_2019-03-22_00-19-43.wav,44100,16,60,1,acoustic_complexity,512,1,NA,5,1812.76048061286,NA 
rayol-farm2_2019-03-22_00-21-43.wav,44100,16,60,1,acoustic_complexity,512,1,NA,5,1818.54783432458,NA 
rayol-farm2_2019-03-22_00-23-43.wav,44100,16,60,1,acoustic_complexity,512,1,NA,5,1813.41408820729,NA 
rayol-farm2_2019-03-22_00-25-43.wav,44100,16,60,1,acoustic_complexity,512,1,NA,5,1811.53595670749,NA 
rayol-farm2_2019-03-22_00-27-43.wav,44100,16,60,1,acoustic_complexity,512,1,NA,5,1816.34871870475,NA 
rayol-farm2_2019-03-22_00-29-44.wav,44100,16,60,1,acoustic_complexity,512,1,NA,5,1819.82800754754,NA 
rayol-farm2_2019-03-22_00-31-44.wav,44100,16,60,1,acoustic_complexity,512,1,NA,5,1835.29917618622,NA 
rayol-farm2_2019-03-22_00-33-44.wav,44100,16,60,1,acoustic_complexity,512,1,NA,5,1843.85417746878,NA 
rayol-farm2_2019-03-22_00-35-44.wav,44100,16,60,1,acoustic_complexity,512,1,NA,5,1803.10696888362,NA 
rayol-farm2_2019-03-22_00-37-44.wav,44100,16,60,1,acoustic_complexity,512,1,NA,5,1812.12459433395,NA 
rayol-farm2_2019-03-22_00-39-44.wav,44100,16,60,1,acoustic_complexity,512,1,NA,5,1810.45280519508,NA 
rayol-farm2_2019-03-22_00-41-44.wav,44100,16,60,1,acoustic_complexity,512,1,NA,5,1822.56971318972,NA 
rayol-farm2_2019-03-22_00-43-44.wav,44100,16,60,1,acoustic_complexity,512,1,NA,5,1816.61821392471,NA 
rayol-farm2_2019-03-22_00-45-44.wav,44100,16,60,1,acoustic_complexity,512,1,NA,5,1808.60073275509,NA 
rayol-farm2_2019-03-22_00-47-45.wav,44100,16,60,1,acoustic_complexity,512,1,NA,5,1811.16699699108,NA 
rayol-farm2_2019-03-22_00-49-45.wav,44100,16,60,1,acoustic_complexity,512,1,NA,5,1842.81725460573,NA 
rayol-farm2_2019-03-22_00-51-45.wav,44100,16,60,1,acoustic_complexity,512,1,NA,5,1821.69140560421,NA 
rayol-farm2_2019-03-22_00-53-45.wav,44100,16,60,1,acoustic_complexity,512,1,NA,5,1821.0495803482,NA 
rayol-farm2_2019-03-22_00-55-45.wav,44100,16,60,1,acoustic_complexity,512,1,NA,5,1822.02049146509,NA 
rayol-farm2_2019-03-22_00-57-45.wav,44100,16,60,1,acoustic_complexity,512,1,NA,5,1822.43522923736,NA 
rayol-farm2_2019-03-22_00-59-45.wav,44100,16,60,1,acoustic_complexity,512,1,NA,5,1816.91626102429,NA 
rayol-farm2_2019-03-22_01-01-45.wav,44100,16,60,1,acoustic_complexity,512,1,NA,5,1825.76251564023,NA 
rayol-farm2_2019-03-22_01-03-46.wav,44100,16,60,1,acoustic_complexity,512,1,NA,5,1814.61788465406,NA 
rayol-farm2_2019-03-22_01-05-46.wav,44100,16,60,1,acoustic_complexity,512,1,NA,5,1844.70380784444,NA 
rayol-farm2_2019-03-22_01-07-46.wav,44100,16,60,1,acoustic_complexity,512,1,NA,5,1839.94566108569,NA 
rayol-farm2_2019-03-22_01-09-46.wav,44100,16,60,1,acoustic_complexity,512,1,NA,5,1813.73557890984,NA 
rayol-farm2_2019-03-22_01-11-46.wav,44100,16,60,1,acoustic_complexity,512,1,NA,5,1806.25228132467,NA 
rayol-farm2_2019-03-22_01-13-46.wav,44100,16,60,1,acoustic_complexity,512,1,NA,5,1816.96634859383,NA 
rayol-farm2_2019-03-22_01-15-46.wav,44100,16,60,1,acoustic_complexity,512,1,NA,5,1827.40647209523,NA 
rayol-farm2_2019-03-22_01-17-46.wav,44100,16,60,1,acoustic_complexity,512,1,NA,5,1814.93422492141,NA 
rayol-farm2_2019-03-22_01-19-47.wav,44100,16,60,1,acoustic_complexity,512,1,NA,5,1825.58955367317,NA 
rayol-farm2_2019-03-22_01-21-47.wav,44100,16,60,1,acoustic_complexity,512,1,NA,5,1828.35940524929,NA 
rayol-farm2_2019-03-22_01-23-47.wav,44100,16,60,1,acoustic_complexity,512,1,NA,5,1853.36752720685,NA 
rayol-farm2_2019-03-22_01-25-47.wav,44100,16,60,1,acoustic_complexity,512,1,NA,5,1814.16400622314,NA 
rayol-farm2_2019-03-22_01-27-47.wav,44100,16,60,1,acoustic_complexity,512,1,NA,5,1818.26131987569,NA 
rayol-farm2_2019-03-22_01-29-47.wav,44100,16,60,1,acoustic_complexity,512,1,NA,5,1814.62623645229,NA 
rayol-farm2_2019-03-22_01-31-47.wav,44100,16,60,1,acoustic_complexity,512,1,NA,5,1823.95032023343,NA 
rayol-farm2_2019-03-22_01-33-47.wav,44100,16,60,1,acoustic_complexity,512,1,NA,5,1817.63579693326,NA 
rayol-farm2_2019-03-22_01-35-48.wav,44100,16,60,1,acoustic_complexity,512,1,NA,5,1809.07714026902,NA 
rayol-farm2_2019-03-22_01-37-48.wav,44100,16,60,1,acoustic_complexity,512,1,NA,5,1826.70114048863,NA 
rayol-farm2_2019-03-22_01-39-48.wav,44100,16,60,1,acoustic_complexity,512,1,NA,5,1848.18776641605,NA 
rayol-farm2_2019-03-22_01-41-48.wav,44100,16,60,1,acoustic_complexity,512,1,NA,5,1815.58956324542,NA 
rayol-farm2_2019-03-22_01-43-48.wav,44100,16,60,1,acoustic_complexity,512,1,NA,5,1819.23950060108,NA 
rayol-farm2_2019-03-22_01-45-48.wav,44100,16,60,1,acoustic_complexity,512,1,NA,5,1807.24340028649,NA 
rayol-farm2_2019-03-22_01-47-48.wav,44100,16,60,1,acoustic_complexity,512,1,NA,5,1817.71689941192,NA 
rayol-farm2_2019-03-22_01-49-48.wav,44100,16,60,1,acoustic_complexity,512,1,NA,5,1813.89133312896,NA 
rayol-farm2_2019-03-22_01-51-48.wav,44100,16,60,1,acoustic_complexity,512,1,NA,5,1824.64654264238,NA 
rayol-farm2_2019-03-22_01-53-49.wav,44100,16,60,1,acoustic_complexity,512,1,NA,5,1812.03505613677,NA 
rayol-farm2_2019-03-22_01-55-49.wav,44100,16,60,1,acoustic_complexity,512,1,NA,5,1840.89213283113,NA 
rayol-farm2_2019-03-22_01-57-49.wav,44100,16,60,1,acoustic_complexity,512,1,NA,5,1826.73385241252,NA 
rayol-farm2_2019-03-22_01-59-49.wav,44100,16,60,1,acoustic_complexity,512,1,NA,5,1818.32050553113,NA 
rayol-farm2_2019-03-22_02-01-49.wav,44100,16,60,1,acoustic_complexity,512,1,NA,5,1814.59711066492,NA 
rayol-farm2_2019-03-22_02-03-49.wav,44100,16,60,1,acoustic_complexity,512,1,NA,5,1810.42392277571,NA 
rayol-farm2_2019-03-22_02-05-49.wav,44100,16,60,1,acoustic_complexity,512,1,NA,5,1825.46050104361,NA 
rayol-farm2_2019-03-22_02-07-49.wav,44100,16,60,1,acoustic_complexity,512,1,NA,5,1821.51511247596,NA 
rayol-farm2_2019-03-22_02-09-50.wav,44100,16,60,1,acoustic_complexity,512,1,NA,5,1833.17795802129,NA 
rayol-farm2_2019-03-22_02-11-50.wav,44100,16,60,1,acoustic_complexity,512,1,NA,5,1846.6961827031,NA 
rayol-farm2_2019-03-22_02-13-50.wav,44100,16,60,1,acoustic_complexity,512,1,NA,5,1842.262126806,NA 
rayol-farm2_2019-03-22_02-15-50.wav,44100,16,60,1,acoustic_complexity,512,1,NA,5,1817.82211971461,NA 
rayol-farm2_2019-03-22_02-17-50.wav,44100,16,60,1,acoustic_complexity,512,1,NA,5,1812.59821028756,NA 
rayol-farm2_2019-03-22_02-19-50.wav,44100,16,60,1,acoustic_complexity,512,1,NA,5,1809.4093145472,NA 
rayol-farm2_2019-03-22_02-21-50.wav,44100,16,60,1,acoustic_complexity,512,1,NA,5,1834.41666376727,NA 
rayol-farm2_2019-03-22_02-23-50.wav,44100,16,60,1,acoustic_complexity,512,1,NA,5,1814.45460616715,NA 
rayol-farm2_2019-03-22_02-25-51.wav,44100,16,60,1,acoustic_complexity,512,1,NA,5,1816.94426479266,NA 
rayol-farm2_2019-03-22_02-27-51.wav,44100,16,60,1,acoustic_complexity,512,1,NA,5,1812.16455704596,NA 
rayol-farm2_2019-03-22_02-29-51.wav,44100,16,60,1,acoustic_complexity,512,1,NA,5,1835.00752592058,NA 
rayol-farm2_2019-03-22_02-31-51.wav,44100,16,60,1,acoustic_complexity,512,1,NA,5,1837.70598561238,NA 
rayol-farm2_2019-03-22_02-33-51.wav,44100,16,60,1,acoustic_complexity,512,1,NA,5,1821.53766516334,NA 
rayol-farm2_2019-03-22_02-35-51.wav,44100,16,60,1,acoustic_complexity,512,1,NA,5,1809.11619922081,NA 
rayol-farm2_2019-03-22_02-37-51.wav,44100,16,60,1,acoustic_complexity,512,1,NA,5,1815.7940518334,NA 
rayol-farm2_2019-03-22_02-39-51.wav,44100,16,60,1,acoustic_complexity,512,1,NA,5,1819.97515769407,NA 
rayol-farm2_2019-03-22_02-41-51.wav,44100,16,60,1,acoustic_complexity,512,1,NA,5,1814.72190729656,NA 
rayol-farm2_2019-03-22_02-43-52.wav,44100,16,60,1,acoustic_complexity,512,1,NA,5,1826.24342616842,NA 
rayol-farm2_2019-03-22_02-45-52.wav,44100,16,60,1,acoustic_complexity,512,1,NA,5,1842.20882943161,NA 
rayol-farm2_2019-03-22_02-47-52.wav,44100,16,60,1,acoustic_complexity,512,1,NA,5,1832.26198988714,NA 
rayol-farm2_2019-03-22_02-49-52.wav,44100,16,60,1,acoustic_complexity,512,1,NA,5,1807.09275963826,NA 
rayol-farm2_2019-03-22_02-51-52.wav,44100,16,60,1,acoustic_complexity,512,1,NA,5,1814.92013646916,NA 
rayol-farm2_2019-03-22_02-53-52.wav,44100,16,60,1,acoustic_complexity,512,1,NA,5,1812.96040103257,NA 
rayol-farm2_2019-03-22_02-55-52.wav,44100,16,60,1,acoustic_complexity,512,1,NA,5,1815.54688641761,NA 
rayol-farm2_2019-03-22_02-57-52.wav,44100,16,60,1,acoustic_complexity,512,1,NA,5,1823.68865810179,NA 
rayol-farm2_2019-03-22_02-59-53.wav,44100,16,60,1,acoustic_complexity,512,1,NA,5,1817.79969985925,NA 
rayol-farm2_2019-03-22_03-01-53.wav,44100,16,60,1,acoustic_complexity,512,1,NA,5,1829.31516199643,NA 
rayol-farm2_2019-03-22_03-03-53.wav,44100,16,60,1,acoustic_complexity,512,1,NA,5,1836.87009364541,NA 
rayol-farm2_2019-03-22_03-05-53.wav,44100,16,60,1,acoustic_complexity,512,1,NA,5,1837.74902611275,NA 
rayol-farm2_2019-03-22_03-07-53.wav,44100,16,60,1,acoustic_complexity,512,1,NA,5,1816.50574686712,NA 
rayol-farm2_2019-03-22_03-09-53.wav,44100,16,60,1,acoustic_complexity,512,1,NA,5,1811.87465646919,NA 
rayol-farm2_2019-03-22_03-11-53.wav,44100,16,60,1,acoustic_complexity,512,1,NA,5,1816.08570904794,NA 
rayol-farm2_2019-03-22_03-13-53.wav,44100,16,60,1,acoustic_complexity,512,1,NA,5,1823.62114358483,NA 
rayol-farm2_2019-03-22_03-15-54.wav,44100,16,60,1,acoustic_complexity,512,1,NA,5,1830.83107914978,NA 
rayol-farm2_2019-03-22_03-17-54.wav,44100,16,60,1,acoustic_complexity,512,1,NA,5,1816.16380072851,NA 
rayol-farm2_2019-03-22_03-19-54.wav,44100,16,60,1,acoustic_complexity,512,1,NA,5,1831.24928777077,NA 
rayol-farm2_2019-03-22_03-21-54.wav,44100,16,60,1,acoustic_complexity,512,1,NA,5,1841.13682170345,NA 
rayol-farm2_2019-03-22_03-23-54.wav,44100,16,60,1,acoustic_complexity,512,1,NA,5,1803.65928791976,NA 
rayol-farm2_2019-03-22_03-25-54.wav,44100,16,60,1,acoustic_complexity,512,1,NA,5,1818.60188093925,NA 
rayol-farm2_2019-03-22_03-27-54.wav,44100,16,60,1,acoustic_complexity,512,1,NA,5,1807.43877942711,NA 
rayol-farm2_2019-03-22_03-29-54.wav,44100,16,60,1,acoustic_complexity,512,1,NA,5,1809.91566629462,NA 
rayol-farm2_2019-03-22_03-31-55.wav,44100,16,60,1,acoustic_complexity,512,1,NA,5,1817.4669588896,NA 
rayol-farm2_2019-03-22_03-33-55.wav,44100,16,60,1,acoustic_complexity,512,1,NA,5,1808.67692962584,NA 
rayol-farm2_2019-03-22_03-35-55.wav,44100,16,60,1,acoustic_complexity,512,1,NA,5,1813.19741254954,NA 
rayol-farm2_2019-03-22_03-37-55.wav,44100,16,60,1,acoustic_complexity,512,1,NA,5,1839.26915244738,NA 
rayol-farm2_2019-03-22_03-39-55.wav,44100,16,60,1,acoustic_complexity,512,1,NA,5,1833.35794159079,NA 
rayol-farm2_2019-03-22_03-41-55.wav,44100,16,60,1,acoustic_complexity,512,1,NA,5,1809.57184799085,NA 
rayol-farm2_2019-03-22_03-43-55.wav,44100,16,60,1,acoustic_complexity,512,1,NA,5,1816.81874284588,NA 
rayol-farm2_2019-03-22_03-45-55.wav,44100,16,60,1,acoustic_complexity,512,1,NA,5,1814.28070835458,NA 
rayol-farm2_2019-03-22_03-47-56.wav,44100,16,60,1,acoustic_complexity,512,1,NA,5,1828.29348804045,NA 
rayol-farm2_2019-03-22_03-49-56.wav,44100,16,60,1,acoustic_complexity,512,1,NA,5,1815.89842335027,NA 
rayol-farm2_2019-03-22_03-51-56.wav,44100,16,60,1,acoustic_complexity,512,1,NA,5,1822.54368367965,NA 
rayol-farm2_2019-03-22_03-53-56.wav,44100,16,60,1,acoustic_complexity,512,1,NA,5,1836.38449961169,NA 
rayol-farm2_2019-03-22_03-55-56.wav,44100,16,60,1,acoustic_complexity,512,1,NA,5,1840.9981805353,NA 
rayol-farm2_2019-03-22_03-57-56.wav,44100,16,60,1,acoustic_complexity,512,1,NA,5,1823.09730882845,NA 
rayol-farm2_2019-03-22_03-59-56.wav,44100,16,60,1,acoustic_complexity,512,1,NA,5,1809.50038587316,NA 
rayol-farm2_2019-03-22_04-01-56.wav,44100,16,60,1,acoustic_complexity,512,1,NA,5,1822.41390060668,NA 
rayol-farm2_2019-03-22_04-03-57.wav,44100,16,60,1,acoustic_complexity,512,1,NA,5,1815.51646208381,NA 
rayol-farm2_2019-03-22_04-05-57.wav,44100,16,60,1,acoustic_complexity,512,1,NA,5,1825.23452762901,NA 
rayol-farm2_2019-03-22_04-07-57.wav,44100,16,60,1,acoustic_complexity,512,1,NA,5,1817.91220749003,NA 
rayol-farm2_2019-03-22_04-09-57.wav,44100,16,60,1,acoustic_complexity,512,1,NA,5,1816.44983629291,NA 
rayol-farm2_2019-03-22_04-11-57.wav,44100,16,60,1,acoustic_complexity,512,1,NA,5,1843.30031224294,NA 
rayol-farm2_2019-03-22_04-13-57.wav,44100,16,60,1,acoustic_complexity,512,1,NA,5,1839.79112072202,NA 
rayol-farm2_2019-03-22_04-15-57.wav,44100,16,60,1,acoustic_complexity,512,1,NA,5,1809.65126570482,NA 
rayol-farm2_2019-03-22_04-17-57.wav,44100,16,60,1,acoustic_complexity,512,1,NA,5,1816.46074729439,NA 
rayol-farm2_2019-03-22_04-19-57.wav,44100,16,60,1,acoustic_complexity,512,1,NA,5,1818.28179295492,NA 
rayol-farm2_2019-03-22_04-21-58.wav,44100,16,60,1,acoustic_complexity,512,1,NA,5,1807.50879265803,NA 
rayol-farm2_2019-03-22_04-23-58.wav,44100,16,60,1,acoustic_complexity,512,1,NA,5,1816.05105876002,NA 
rayol-farm2_2019-03-22_04-25-58.wav,44100,16,60,1,acoustic_complexity,512,1,NA,5,1821.48625356326,NA 
rayol-farm2_2019-03-22_04-27-58.wav,44100,16,60,1,acoustic_complexity,512,1,NA,5,1820.92059761297,NA 
rayol-farm2_2019-03-22_04-29-58.wav,44100,16,60,1,acoustic_complexity,512,1,NA,5,1840.95547173705,NA 
rayol-farm2_2019-03-22_04-31-58.wav,44100,16,60,1,acoustic_complexity,512,1,NA,5,1834.28513689041,NA 
rayol-farm2_2019-03-22_04-33-58.wav,44100,16,60,1,acoustic_complexity,512,1,NA,5,1829.58099481323,NA 
rayol-farm2_2019-03-22_04-35-58.wav,44100,16,60,1,acoustic_complexity,512,1,NA,5,1822.19014129514,NA 
rayol-farm2_2019-03-22_04-37-59.wav,44100,16,60,1,acoustic_complexity,512,1,NA,5,1806.85649161208,NA 
rayol-farm2_2019-03-22_04-39-59.wav,44100,16,60,1,acoustic_complexity,512,1,NA,5,1822.81843709319,NA 
rayol-farm2_2019-03-22_04-41-59.wav,44100,16,60,1,acoustic_complexity,512,1,NA,5,1812.64223377645,NA 
rayol-farm2_2019-03-22_04-43-59.wav,44100,16,60,1,acoustic_complexity,512,1,NA,5,1813.92303468993,NA 
rayol-farm2_2019-03-22_04-45-59.wav,44100,16,60,1,acoustic_complexity,512,1,NA,5,1821.16983621057,NA 
rayol-farm2_2019-03-22_04-47-59.wav,44100,16,60,1,acoustic_complexity,512,1,NA,5,1832.80189394593,NA 
rayol-farm2_2019-03-22_04-49-59.wav,44100,16,60,1,acoustic_complexity,512,1,NA,5,1817.87416265592,NA 
rayol-farm2_2019-03-22_04-51-59.wav,44100,16,60,1,acoustic_complexity,512,1,NA,5,1823.00663056081,NA 
rayol-farm2_2019-03-22_04-54-00.wav,44100,16,60,1,acoustic_complexity,512,1,NA,5,1811.20330172607,NA 
rayol-farm2_2019-03-22_04-56-00.wav,44100,16,60,1,acoustic_complexity,512,1,NA,5,1819.33936822911,NA 
rayol-farm2_2019-03-22_04-58-00.wav,44100,16,60,1,acoustic_complexity,512,1,NA,5,1810.73958297467,NA 
rayol-farm2_2019-03-22_05-00-00.wav,44100,16,60,1,acoustic_complexity,512,1,NA,5,1823.68936300923,NA 
rayol-farm2_2019-03-22_05-02-00.wav,44100,16,60,1,acoustic_complexity,512,1,NA,5,1816.61604416768,NA 
rayol-farm2_2019-03-22_05-04-00.wav,44100,16,60,1,acoustic_complexity,512,1,NA,5,1833.92182442079,NA 
rayol-farm2_2019-03-22_05-06-00.wav,44100,16,60,1,acoustic_complexity,512,1,NA,5,1830.47374113054,NA 
rayol-farm2_2019-03-22_05-08-00.wav,44100,16,60,1,acoustic_complexity,512,1,NA,5,1811.28362624974,NA 
rayol-farm2_2019-03-22_05-10-00.wav,44100,16,60,1,acoustic_complexity,512,1,NA,5,1824.11863331541,NA 
rayol-farm2_2019-03-22_05-12-01.wav,44100,16,60,1,acoustic_complexity,512,1,NA,5,1805.65756436832,NA 
rayol-farm2_2019-03-22_05-14-01.wav,44100,16,60,1,acoustic_complexity,512,1,NA,5,1816.15542050779,NA 
rayol-farm2_2019-03-22_05-16-01.wav,44100,16,60,1,acoustic_complexity,512,1,NA,5,1811.959457513,NA 
rayol-farm2_2019-03-22_05-18-01.wav,44100,16,60,1,acoustic_complexity,512,1,NA,5,1829.10195666055,NA 
rayol-farm2_2019-03-22_05-20-01.wav,44100,16,60,1,acoustic_complexity,512,1,NA,5,1815.67832385353,NA 
rayol-farm2_2019-03-22_05-22-01.wav,44100,16,60,1,acoustic_complexity,512,1,NA,5,1839.50779064833,NA 
rayol-farm2_2019-03-22_05-24-01.wav,44100,16,60,1,acoustic_complexity,512,1,NA,5,1839.79107036607,NA 
rayol-farm2_2019-03-22_05-26-01.wav,44100,16,60,1,acoustic_complexity,512,1,NA,5,1813.38475562398,NA 
rayol-farm2_2019-03-22_05-28-02.wav,44100,16,60,1,acoustic_complexity,512,1,NA,5,1806.82075583727,NA 
rayol-farm2_2019-03-22_05-30-02.wav,44100,16,60,1,acoustic_complexity,512,1,NA,5,1814.12514851736,NA 
rayol-farm2_2019-03-22_05-32-02.wav,44100,16,60,1,acoustic_complexity,512,1,NA,5,1815.43762924062,NA 
rayol-farm2_2019-03-22_05-34-02.wav,44100,16,60,1,acoustic_complexity,512,1,NA,5,1812.82721400932,NA 
rayol-farm2_2019-03-22_05-36-02.wav,44100,16,60,1,acoustic_complexity,512,1,NA,5,1820.32526429433,NA 
rayol-farm2_2019-03-22_05-38-02.wav,44100,16,60,1,acoustic_complexity,512,1,NA,5,1818.26027255097,NA 
rayol-farm2_2019-03-22_05-40-02.wav,44100,16,60,1,acoustic_complexity,512,1,NA,5,1847.83322064134,NA 
rayol-farm2_2019-03-22_05-42-02.wav,44100,16,60,1,acoustic_complexity,512,1,NA,5,1836.17025946498,NA 
rayol-farm2_2019-03-22_05-44-03.wav,44100,16,60,1,acoustic_complexity,512,1,NA,5,1807.88843556217,NA 
rayol-farm2_2019-03-22_05-46-03.wav,44100,16,60,1,acoustic_complexity,512,1,NA,5,1836.88057501222,NA 
rayol-farm2_2019-03-22_05-48-03.wav,44100,16,60,1,acoustic_complexity,512,1,NA,5,1833.42372943359,NA 
rayol-farm2_2019-03-22_05-50-03.wav,44100,16,60,1,acoustic_complexity,512,1,NA,5,1824.8822669519,NA 
rayol-farm2_2019-03-22_05-52-03.wav,44100,16,60,1,acoustic_complexity,512,1,NA,5,1830.13459105595,NA 
rayol-farm2_2019-03-22_05-54-03.wav,44100,16,60,1,acoustic_complexity,512,1,NA,5,1834.92415402577,NA 
rayol-farm2_2019-03-22_05-56-03.wav,44100,16,60,1,acoustic_complexity,512,1,NA,5,1818.6544613449,NA 
rayol-farm2_2019-03-22_05-58-03.wav,44100,16,60,1,acoustic_complexity,512,1,NA,5,1838.86247069511,NA 
rayol-farm2_2019-03-22_06-00-04.wav,44100,16,60,1,acoustic_complexity,512,1,NA,5,1839.9958706622,NA 
rayol-farm2_2019-03-22_06-02-04.wav,44100,16,60,1,acoustic_complexity,512,1,NA,5,1813.8119568565,NA 
rayol-farm2_2019-03-22_06-04-04.wav,44100,16,60,1,acoustic_complexity,512,1,NA,5,1843.61971379362,NA 
rayol-farm2_2019-03-22_06-06-04.wav,44100,16,60,1,acoustic_complexity,512,1,NA,5,1819.69388709644,NA 
rayol-farm2_2019-03-22_06-08-04.wav,44100,16,60,1,acoustic_complexity,512,1,NA,5,1838.56620835186,NA 
rayol-farm2_2019-03-22_06-10-04.wav,44100,16,60,1,acoustic_complexity,512,1,NA,5,1829.81572202153,NA 
rayol-farm2_2019-03-22_06-12-04.wav,44100,16,60,1,acoustic_complexity,512,1,NA,5,1822.21044947396,NA 
rayol-farm2_2019-03-22_06-14-04.wav,44100,16,60,1,acoustic_complexity,512,1,NA,5,1812.13828383263,NA 
rayol-farm2_2019-03-22_06-16-04.wav,44100,16,60,1,acoustic_complexity,512,1,NA,5,1842.20692301143,NA 
rayol-farm2_2019-03-22_06-18-05.wav,44100,16,60,1,acoustic_complexity,512,1,NA,5,1842.68165313244,NA 
rayol-farm2_2019-03-22_06-20-05.wav,44100,16,60,1,acoustic_complexity,512,1,NA,5,1814.07388591721,NA 
rayol-farm2_2019-03-22_06-22-05.wav,44100,16,60,1,acoustic_complexity,512,1,NA,5,1830.70162757684,NA 
rayol-farm2_2019-03-22_06-24-05.wav,44100,16,60,1,acoustic_complexity,512,1,NA,5,1867.65162263826,NA 
rayol-farm2_2019-03-22_06-26-05.wav,44100,16,60,1,acoustic_complexity,512,1,NA,5,1819.76425446657,NA 
rayol-farm2_2019-03-22_06-28-05.wav,44100,16,60,1,acoustic_complexity,512,1,NA,5,1817.56049491999,NA 
rayol-farm2_2019-03-22_06-30-05.wav,44100,16,60,1,acoustic_complexity,512,1,NA,5,1808.1880666375,NA 
rayol-farm2_2019-03-22_06-32-05.wav,44100,16,60,1,acoustic_complexity,512,1,NA,5,1823.10995856173,NA 
rayol-farm2_2019-03-22_06-34-06.wav,44100,16,60,1,acoustic_complexity,512,1,NA,5,1833.84714551765,NA 
rayol-farm2_2019-03-22_06-36-06.wav,44100,16,60,1,acoustic_complexity,512,1,NA,5,1875.84087482646,NA 
rayol-farm2_2019-03-22_06-38-06.wav,44100,16,60,1,acoustic_complexity,512,1,NA,5,1818.80000183495,NA 
rayol-farm2_2019-03-22_06-40-06.wav,44100,16,60,1,acoustic_complexity,512,1,NA,5,1811.42853641372,NA 
rayol-farm2_2019-03-22_06-42-06.wav,44100,16,60,1,acoustic_complexity,512,1,NA,5,1819.04487418925,NA 
rayol-farm2_2019-03-22_06-44-06.wav,44100,16,60,1,acoustic_complexity,512,1,NA,5,1827.20449956807,NA 
rayol-farm2_2019-03-22_06-46-06.wav,44100,16,60,1,acoustic_complexity,512,1,NA,5,1827.72139547118,NA 
rayol-farm2_2019-03-22_06-48-06.wav,44100,16,60,1,acoustic_complexity,512,1,NA,5,1822.76009037867,NA 
rayol-farm2_2019-03-22_06-50-07.wav,44100,16,60,1,acoustic_complexity,512,1,NA,5,1808.01071472629,NA 
rayol-farm2_2019-03-22_06-52-07.wav,44100,16,60,1,acoustic_complexity,512,1,NA,5,1827.13764268848,NA 
rayol-farm2_2019-03-22_06-54-07.wav,44100,16,60,1,acoustic_complexity,512,1,NA,5,1823.10982592233,NA 
rayol-farm2_2019-03-22_06-56-07.wav,44100,16,60,1,acoustic_complexity,512,1,NA,5,1826.63273984209,NA 
rayol-farm2_2019-03-22_06-58-07.wav,44100,16,60,1,acoustic_complexity,512,1,NA,5,1809.97622006809,NA 
rayol-farm2_2019-03-22_07-00-07.wav,44100,16,60,1,acoustic_complexity,512,1,NA,5,1811.09295697578,NA 
rayol-farm2_2019-03-22_07-02-07.wav,44100,16,60,1,acoustic_complexity,512,1,NA,5,1819.67632279371,NA 
rayol-farm2_2019-03-22_07-04-07.wav,44100,16,60,1,acoustic_complexity,512,1,NA,5,1822.54356027806,NA 
rayol-farm2_2019-03-22_07-06-07.wav,44100,16,60,1,acoustic_complexity,512,1,NA,5,1820.64824636991,NA 
rayol-farm2_2019-03-22_07-08-08.wav,44100,16,60,1,acoustic_complexity,512,1,NA,5,1818.2156697853,NA 
rayol-farm2_2019-03-22_07-10-08.wav,44100,16,60,1,acoustic_complexity,512,1,NA,5,1847.08885329984,NA 
rayol-farm2_2019-03-22_07-12-08.wav,44100,16,60,1,acoustic_complexity,512,1,NA,5,1840.77377692303,NA 
rayol-farm2_2019-03-22_07-14-08.wav,44100,16,60,1,acoustic_complexity,512,1,NA,5,1809.48799512949,NA 
rayol-farm2_2019-03-22_07-16-08.wav,44100,16,60,1,acoustic_complexity,512,1,NA,5,1832.86964050537,NA 
rayol-farm2_2019-03-22_07-18-08.wav,44100,16,60,1,acoustic_complexity,512,1,NA,5,1825.76974153232,NA 
rayol-farm2_2019-03-22_07-20-08.wav,44100,16,60,1,acoustic_complexity,512,1,NA,5,1816.76137278218,NA 
rayol-farm2_2019-03-22_07-22-08.wav,44100,16,60,1,acoustic_complexity,512,1,NA,5,1814.81046887233,NA 
rayol-farm2_2019-03-22_07-24-09.wav,44100,16,60,1,acoustic_complexity,512,1,NA,5,1821.32353761629,NA 
rayol-farm2_2019-03-22_07-26-09.wav,44100,16,60,1,acoustic_complexity,512,1,NA,5,1738.28674884252,NA 
rayol-farm2_2019-03-22_07-28-09.wav,44100,16,60,1,acoustic_complexity,512,1,NA,5,1844.67555985213,NA 
rayol-farm2_2019-03-22_07-30-09.wav,44100,16,60,1,acoustic_complexity,512,1,NA,5,1833.59932914751,NA 
rayol-farm2_2019-03-22_07-32-09.wav,44100,16,60,1,acoustic_complexity,512,1,NA,5,1820.80585646366,NA 
rayol-farm2_2019-03-22_07-34-09.wav,44100,16,60,1,acoustic_complexity,512,1,NA,5,1816.94950700037,NA 
rayol-farm2_2019-03-22_07-36-09.wav,44100,16,60,1,acoustic_complexity,512,1,NA,5,1812.99384272701,NA 
rayol-farm2_2019-03-22_07-38-09.wav,44100,16,60,1,acoustic_complexity,512,1,NA,5,1822.27722463192,NA 
rayol-farm2_2019-03-22_07-40-10.wav,44100,16,60,1,acoustic_complexity,512,1,NA,5,1801.59282860273,NA 
rayol-farm2_2019-03-22_07-42-10.wav,44100,16,60,1,acoustic_complexity,512,1,NA,5,1810.64880574919,NA 
rayol-farm2_2019-03-22_07-44-10.wav,44100,16,60,1,acoustic_complexity,512,1,NA,5,1818.20129364796,NA 
rayol-farm2_2019-03-22_07-46-10.wav,44100,16,60,1,acoustic_complexity,512,1,NA,5,1827.61945558583,NA 
rayol-farm2_2019-03-22_07-48-10.wav,44100,16,60,1,acoustic_complexity,512,1,NA,5,1833.47297097852,NA 
rayol-farm2_2019-03-22_07-50-10.wav,44100,16,60,1,acoustic_complexity,512,1,NA,5,1773.59781849494,NA 
rayol-farm2_2019-03-22_07-52-10.wav,44100,16,60,1,acoustic_complexity,512,1,NA,5,1799.57690068874,NA 
rayol-farm2_2019-03-22_07-54-10.wav,44100,16,60,1,acoustic_complexity,512,1,NA,5,1810.51375462688,NA 
rayol-farm2_2019-03-22_07-56-10.wav,44100,16,60,1,acoustic_complexity,512,1,NA,5,1810.74117220793,NA 
rayol-farm2_2019-03-22_07-58-11.wav,44100,16,60,1,acoustic_complexity,512,1,NA,5,1804.8086577605,NA 
rayol-farm2_2019-03-22_08-00-11.wav,44100,16,60,1,acoustic_complexity,512,1,NA,5,1825.10581483117,NA 
rayol-farm2_2019-03-22_08-02-11.wav,44100,16,60,1,acoustic_complexity,512,1,NA,5,1844.23838112758,NA 
rayol-farm2_2019-03-22_08-04-11.wav,44100,16,60,1,acoustic_complexity,512,1,NA,5,1802.74572874258,NA 
rayol-farm2_2019-03-22_08-06-11.wav,44100,16,60,1,acoustic_complexity,512,1,NA,5,1813.67975318812,NA 
rayol-farm2_2019-03-22_08-08-11.wav,44100,16,60,1,acoustic_complexity,512,1,NA,5,1824.74526355176,NA 
rayol-farm2_2019-03-22_08-10-11.wav,44100,16,60,1,acoustic_complexity,512,1,NA,5,1822.76336707598,NA 
rayol-farm2_2019-03-22_08-12-11.wav,44100,16,60,1,acoustic_complexity,512,1,NA,5,1844.65053941791,NA 
rayol-farm2_2019-03-22_08-14-12.wav,44100,16,60,1,acoustic_complexity,512,1,NA,5,1829.65083697003,NA 
rayol-farm2_2019-03-22_08-16-12.wav,44100,16,60,1,acoustic_complexity,512,1,NA,5,1807.21756535155,NA 
rayol-farm2_2019-03-22_08-18-12.wav,44100,16,60,1,acoustic_complexity,512,1,NA,5,1822.59669920109,NA 
rayol-farm2_2019-03-22_08-20-12.wav,44100,16,60,1,acoustic_complexity,512,1,NA,5,1820.35336756282,NA 
rayol-farm2_2019-03-22_08-22-12.wav,44100,16,60,1,acoustic_complexity,512,1,NA,5,1830.08724666653,NA 
rayol-farm2_2019-03-22_08-24-12.wav,44100,16,60,1,acoustic_complexity,512,1,NA,5,1809.3049414235,NA 
rayol-farm2_2019-03-22_08-26-12.wav,44100,16,60,1,acoustic_complexity,512,1,NA,5,1829.27257136646,NA 
rayol-farm2_2019-03-22_08-28-12.wav,44100,16,60,1,acoustic_complexity,512,1,NA,5,1811.86051771471,NA 
rayol-farm2_2019-03-22_08-30-13.wav,44100,16,60,1,acoustic_complexity,512,1,NA,5,1815.10374800863,NA 
rayol-farm2_2019-03-22_08-32-13.wav,44100,16,60,1,acoustic_complexity,512,1,NA,5,1833.74879632367,NA 
rayol-farm2_2019-03-22_08-34-13.wav,44100,16,60,1,acoustic_complexity,512,1,NA,5,1837.32723897471,NA 
rayol-farm2_2019-03-22_08-36-13.wav,44100,16,60,1,acoustic_complexity,512,1,NA,5,1837.27633807648,NA 
rayol-farm2_2019-03-22_08-38-13.wav,44100,16,60,1,acoustic_complexity,512,1,NA,5,1827.1465668543,NA 
rayol-farm2_2019-03-22_08-40-13.wav,44100,16,60,1,acoustic_complexity,512,1,NA,5,1818.05260697543,NA 
rayol-farm2_2019-03-22_08-42-13.wav,44100,16,60,1,acoustic_complexity,512,1,NA,5,1817.03385086572,NA 
rayol-farm2_2019-03-22_08-44-13.wav,44100,16,60,1,acoustic_complexity,512,1,NA,5,1835.40002922376,NA 
rayol-farm2_2019-03-22_08-46-14.wav,44100,16,60,1,acoustic_complexity,512,1,NA,5,1816.7944836585,NA 
rayol-farm2_2019-03-22_08-48-14.wav,44100,16,60,1,acoustic_complexity,512,1,NA,5,1817.59296468277,NA 
rayol-farm2_2019-03-22_08-50-14.wav,44100,16,60,1,acoustic_complexity,512,1,NA,5,1827.44947851205,NA 
rayol-farm2_2019-03-22_08-52-14.wav,44100,16,60,1,acoustic_complexity,512,1,NA,5,1839.46494781863,NA 
rayol-farm2_2019-03-22_08-54-14.wav,44100,16,60,1,acoustic_complexity,512,1,NA,5,1836.53629684894,NA 
rayol-farm2_2019-03-22_08-56-14.wav,44100,16,60,1,acoustic_complexity,512,1,NA,5,1818.80274297235,NA 
rayol-farm2_2019-03-22_08-58-14.wav,44100,16,60,1,acoustic_complexity,512,1,NA,5,1823.63256779949,NA 
rayol-farm2_2019-03-22_09-00-14.wav,44100,16,60,1,acoustic_complexity,512,1,NA,5,1814.81002304596,NA 
rayol-farm2_2019-03-22_09-02-14.wav,44100,16,60,1,acoustic_complexity,512,1,NA,5,1825.54277996052,NA 
rayol-farm2_2019-03-22_09-04-15.wav,44100,16,60,1,acoustic_complexity,512,1,NA,5,1818.43025783752,NA 
rayol-farm2_2019-03-22_09-06-15.wav,44100,16,60,1,acoustic_complexity,512,1,NA,5,1868.81599735747,NA 
rayol-farm2_2019-03-22_09-08-15.wav,44100,16,60,1,acoustic_complexity,512,1,NA,5,1858.26689053086,NA 
rayol-farm2_2019-03-22_09-10-15.wav,44100,16,60,1,acoustic_complexity,512,1,NA,5,1858.03001862786,NA 
rayol-farm2_2019-03-22_09-12-15.wav,44100,16,60,1,acoustic_complexity,512,1,NA,5,1884.67684495576,NA 
rayol-farm2_2019-03-22_09-14-15.wav,44100,16,60,1,acoustic_complexity,512,1,NA,5,1847.5364601781,NA 
rayol-farm2_2019-03-22_09-16-15.wav,44100,16,60,1,acoustic_complexity,512,1,NA,5,1845.35802501871,NA 
rayol-farm2_2019-03-22_09-18-15.wav,44100,16,60,1,acoustic_complexity,512,1,NA,5,1821.42822244745,NA 
rayol-farm2_2019-03-22_09-20-16.wav,44100,16,60,1,acoustic_complexity,512,1,NA,5,1832.95870527234,NA 
rayol-farm2_2019-03-22_09-22-16.wav,44100,16,60,1,acoustic_complexity,512,1,NA,5,1835.13874106574,NA 
rayol-farm2_2019-03-22_09-24-16.wav,44100,16,60,1,acoustic_complexity,512,1,NA,5,1819.00375194762,NA 
rayol-farm2_2019-03-22_09-26-16.wav,44100,16,60,1,acoustic_complexity,512,1,NA,5,1877.03798517784,NA 
rayol-farm2_2019-03-22_09-28-16.wav,44100,16,60,1,acoustic_complexity,512,1,NA,5,1895.1211248639,NA 
rayol-farm2_2019-03-22_09-30-16.wav,44100,16,60,1,acoustic_complexity,512,1,NA,5,1872.97203560247,NA 
rayol-farm2_2019-03-22_09-32-16.wav,44100,16,60,1,acoustic_complexity,512,1,NA,5,1874.02270525789,NA 
rayol-farm2_2019-03-22_09-34-16.wav,44100,16,60,1,acoustic_complexity,512,1,NA,5,1874.00527298993,NA 
rayol-farm2_2019-03-22_09-36-17.wav,44100,16,60,1,acoustic_complexity,512,1,NA,5,1846.4526159062,NA 
rayol-farm2_2019-03-22_09-38-17.wav,44100,16,60,1,acoustic_complexity,512,1,NA,5,1868.54910656423,NA 
rayol-farm2_2019-03-22_09-40-17.wav,44100,16,60,1,acoustic_complexity,512,1,NA,5,1847.5052921524,NA 
rayol-farm2_2019-03-22_09-42-17.wav,44100,16,60,1,acoustic_complexity,512,1,NA,5,1849.90678723997,NA 
rayol-farm2_2019-03-22_09-44-17.wav,44100,16,60,1,acoustic_complexity,512,1,NA,5,1877.93416293376,NA 
rayol-farm2_2019-03-22_09-46-17.wav,44100,16,60,1,acoustic_complexity,512,1,NA,5,1841.74160907093,NA 
rayol-farm2_2019-03-22_09-48-17.wav,44100,16,60,1,acoustic_complexity,512,1,NA,5,1807.30950106686,NA 
rayol-farm2_2019-03-22_09-50-17.wav,44100,16,60,1,acoustic_complexity,512,1,NA,5,1818.45247492253,NA 
rayol-farm2_2019-03-22_09-52-18.wav,44100,16,60,1,acoustic_complexity,512,1,NA,5,1833.45781616758,NA 
rayol-farm2_2019-03-22_09-54-18.wav,44100,16,60,1,acoustic_complexity,512,1,NA,5,1837.31206461802,NA 
rayol-farm2_2019-03-22_09-56-18.wav,44100,16,60,1,acoustic_complexity,512,1,NA,5,1847.02034892149,NA 
rayol-farm2_2019-03-22_09-58-18.wav,44100,16,60,1,acoustic_complexity,512,1,NA,5,1829.07737761398,NA 
rayol-farm2_2019-03-22_10-00-18.wav,44100,16,60,1,acoustic_complexity,512,1,NA,5,1832.20681379199,NA 
rayol-farm2_2019-03-22_10-02-18.wav,44100,16,60,1,acoustic_complexity,512,1,NA,5,1861.31017155536,NA 
rayol-farm2_2019-03-22_10-04-18.wav,44100,16,60,1,acoustic_complexity,512,1,NA,5,1817.63296701244,NA 
rayol-farm2_2019-03-22_10-06-18.wav,44100,16,60,1,acoustic_complexity,512,1,NA,5,1841.94333206778,NA 
rayol-farm2_2019-03-22_10-08-18.wav,44100,16,60,1,acoustic_complexity,512,1,NA,5,1846.62082290994,NA 
rayol-farm2_2019-03-22_10-10-19.wav,44100,16,60,1,acoustic_complexity,512,1,NA,5,1842.07214292662,NA 
rayol-farm2_2019-03-22_10-12-19.wav,44100,16,60,1,acoustic_complexity,512,1,NA,5,1847.66518506224,NA 
rayol-farm2_2019-03-22_10-14-19.wav,44100,16,60,1,acoustic_complexity,512,1,NA,5,1848.35537742261,NA 
rayol-farm2_2019-03-22_10-16-19.wav,44100,16,60,1,acoustic_complexity,512,1,NA,5,1834.38211487072,NA 
rayol-farm2_2019-03-22_10-18-19.wav,44100,16,60,1,acoustic_complexity,512,1,NA,5,1839.79117728962,NA 
rayol-farm2_2019-03-22_10-20-19.wav,44100,16,60,1,acoustic_complexity,512,1,NA,5,1838.61823525902,NA 
rayol-farm2_2019-03-22_10-22-19.wav,44100,16,60,1,acoustic_complexity,512,1,NA,5,1816.44302163457,NA 
rayol-farm2_2019-03-22_10-24-19.wav,44100,16,60,1,acoustic_complexity,512,1,NA,5,1824.12477388039,NA 
rayol-farm2_2019-03-22_10-26-20.wav,44100,16,60,1,acoustic_complexity,512,1,NA,5,1839.15556132261,NA 
rayol-farm2_2019-03-22_10-28-20.wav,44100,16,60,1,acoustic_complexity,512,1,NA,5,1830.1021013013,NA 
rayol-farm2_2019-03-22_10-30-20.wav,44100,16,60,1,acoustic_complexity,512,1,NA,5,1912.40578131391,NA 
rayol-farm2_2019-03-22_10-32-20.wav,44100,16,60,1,acoustic_complexity,512,1,NA,5,1990.6837132738,NA 
rayol-farm2_2019-03-22_10-34-20.wav,44100,16,60,1,acoustic_complexity,512,1,NA,5,1859.7255403467,NA 
rayol-farm2_2019-03-22_10-36-20.wav,44100,16,60,1,acoustic_complexity,512,1,NA,5,1852.19836043326,NA 
rayol-farm2_2019-03-22_10-38-20.wav,44100,16,60,1,acoustic_complexity,512,1,NA,5,1852.02195410886,NA 
rayol-farm2_2019-03-22_10-40-20.wav,44100,16,60,1,acoustic_complexity,512,1,NA,5,1860.25084952029,NA 
rayol-farm2_2019-03-22_10-42-21.wav,44100,16,60,1,acoustic_complexity,512,1,NA,5,1899.59941022578,NA 
rayol-farm2_2019-03-22_10-44-21.wav,44100,16,60,1,acoustic_complexity,512,1,NA,5,1842.61513397,NA 
rayol-farm2_2019-03-22_10-46-21.wav,44100,16,60,1,acoustic_complexity,512,1,NA,5,1844.70844242907,NA 
rayol-farm2_2019-03-22_10-48-21.wav,44100,16,60,1,acoustic_complexity,512,1,NA,5,1833.41792522593,NA 
rayol-farm2_2019-03-22_10-50-21.wav,44100,16,60,1,acoustic_complexity,512,1,NA,5,1840.21362896344,NA 
rayol-farm2_2019-03-22_10-52-21.wav,44100,16,60,1,acoustic_complexity,512,1,NA,5,1839.66099373911,NA 
rayol-farm2_2019-03-22_10-54-21.wav,44100,16,60,1,acoustic_complexity,512,1,NA,5,1815.63167700483,NA 
rayol-farm2_2019-03-22_10-56-21.wav,44100,16,60,1,acoustic_complexity,512,1,NA,5,1864.3318569772,NA 
rayol-farm2_2019-03-22_10-58-22.wav,44100,16,60,1,acoustic_complexity,512,1,NA,5,1995.62588126492,NA 
rayol-farm2_2019-03-22_11-00-22.wav,44100,16,60,1,acoustic_complexity,512,1,NA,5,1862.82010389126,NA 
rayol-farm2_2019-03-22_11-02-22.wav,44100,16,60,1,acoustic_complexity,512,1,NA,5,1857.49947872562,NA 
rayol-farm2_2019-03-22_11-04-22.wav,44100,16,60,1,acoustic_complexity,512,1,NA,5,1841.73836113072,NA 
rayol-farm2_2019-03-22_11-06-22.wav,44100,16,60,1,acoustic_complexity,512,1,NA,5,1842.96869033476,NA 
rayol-farm2_2019-03-22_11-08-22.wav,44100,16,60,1,acoustic_complexity,512,1,NA,5,1832.35742621794,NA 
rayol-farm2_2019-03-22_11-10-22.wav,44100,16,60,1,acoustic_complexity,512,1,NA,5,1843.12107003614,NA 
rayol-farm2_2019-03-22_11-12-22.wav,44100,16,60,1,acoustic_complexity,512,1,NA,5,1823.52687297495,NA 
rayol-farm2_2019-03-22_11-14-23.wav,44100,16,60,1,acoustic_complexity,512,1,NA,5,1814.35906179572,NA 
rayol-farm2_2019-03-22_11-16-23.wav,44100,16,60,1,acoustic_complexity,512,1,NA,5,1866.5999553862,NA 
rayol-farm2_2019-03-22_11-18-23.wav,44100,16,60,1,acoustic_complexity,512,1,NA,5,1870.52693687648,NA 
rayol-farm2_2019-03-22_11-20-23.wav,44100,16,60,1,acoustic_complexity,512,1,NA,5,1871.41691571233,NA 
rayol-farm2_2019-03-22_11-22-23.wav,44100,16,60,1,acoustic_complexity,512,1,NA,5,1861.39815639843,NA 
rayol-farm2_2019-03-22_11-24-23.wav,44100,16,60,1,acoustic_complexity,512,1,NA,5,1852.33763772418,NA 
rayol-farm2_2019-03-22_11-26-23.wav,44100,16,60,1,acoustic_complexity,512,1,NA,5,1843.72484164905,NA 
rayol-farm2_2019-03-22_11-28-23.wav,44100,16,60,1,acoustic_complexity,512,1,NA,5,1856.94149853694,NA 
rayol-farm2_2019-03-22_11-30-23.wav,44100,16,60,1,acoustic_complexity,512,1,NA,5,1894.30324028115,NA 
rayol-farm2_2019-03-22_11-32-24.wav,44100,16,60,1,acoustic_complexity,512,1,NA,5,1832.22523922621,NA 
rayol-farm2_2019-03-22_11-34-24.wav,44100,16,60,1,acoustic_complexity,512,1,NA,5,1844.03251912947,NA 
rayol-farm2_2019-03-22_11-36-24.wav,44100,16,60,1,acoustic_complexity,512,1,NA,5,1875.55898969965,NA 
rayol-farm2_2019-03-22_11-38-24.wav,44100,16,60,1,acoustic_complexity,512,1,NA,5,1874.56034507216,NA 
rayol-farm2_2019-03-22_11-40-24.wav,44100,16,60,1,acoustic_complexity,512,1,NA,5,1883.60015710958,NA 
rayol-farm2_2019-03-22_11-42-24.wav,44100,16,60,1,acoustic_complexity,512,1,NA,5,1858.51576747625,NA 
rayol-farm2_2019-03-22_11-44-24.wav,44100,16,60,1,acoustic_complexity,512,1,NA,5,1829.13932548745,NA 
rayol-farm2_2019-03-22_11-46-24.wav,44100,16,60,1,acoustic_complexity,512,1,NA,5,1830.11269956592,NA 
rayol-farm2_2019-03-22_11-48-25.wav,44100,16,60,1,acoustic_complexity,512,1,NA,5,1835.261512888,NA 
rayol-farm2_2019-03-22_11-50-25.wav,44100,16,60,1,acoustic_complexity,512,1,NA,5,1855.3740461868,NA 
rayol-farm2_2019-03-22_11-52-25.wav,44100,16,60,1,acoustic_complexity,512,1,NA,5,1827.97875733651,NA 
rayol-farm2_2019-03-22_11-54-25.wav,44100,16,60,1,acoustic_complexity,512,1,NA,5,1854.64370324293,NA 
rayol-farm2_2019-03-22_11-56-25.wav,44100,16,60,1,acoustic_complexity,512,1,NA,5,1871.3618809181,NA 
rayol-farm2_2019-03-22_11-58-25.wav,44100,16,60,1,acoustic_complexity,512,1,NA,5,1925.96729591182,NA 
rayol-farm2_2019-03-22_12-00-25.wav,44100,16,60,1,acoustic_complexity,512,1,NA,5,1860.59272144096,NA 
rayol-farm2_2019-03-22_12-02-25.wav,44100,16,60,1,acoustic_complexity,512,1,NA,5,1836.53122383359,NA 
rayol-farm2_2019-03-22_12-04-26.wav,44100,16,60,1,acoustic_complexity,512,1,NA,5,1844.63465138074,NA 
rayol-farm2_2019-03-22_12-06-26.wav,44100,16,60,1,acoustic_complexity,512,1,NA,5,1831.5057471093,NA 
rayol-farm2_2019-03-22_12-08-26.wav,44100,16,60,1,acoustic_complexity,512,1,NA,5,1835.15521844069,NA 
rayol-farm2_2019-03-22_12-10-26.wav,44100,16,60,1,acoustic_complexity,512,1,NA,5,1824.32827490004,NA 
rayol-farm2_2019-03-22_12-12-26.wav,44100,16,60,1,acoustic_complexity,512,1,NA,5,1830.88554388924,NA 
rayol-farm2_2019-03-22_12-14-26.wav,44100,16,60,1,acoustic_complexity,512,1,NA,5,1852.57341298605,NA 
rayol-farm2_2019-03-22_12-16-26.wav,44100,16,60,1,acoustic_complexity,512,1,NA,5,1851.60407789319,NA 
rayol-farm2_2019-03-22_12-18-26.wav,44100,16,60,1,acoustic_complexity,512,1,NA,5,1831.61284006281,NA 
rayol-farm2_2019-03-22_12-20-26.wav,44100,16,60,1,acoustic_complexity,512,1,NA,5,1841.47600730347,NA 
rayol-farm2_2019-03-22_12-22-27.wav,44100,16,60,1,acoustic_complexity,512,1,NA,5,1832.22251889604,NA 
rayol-farm2_2019-03-22_12-24-27.wav,44100,16,60,1,acoustic_complexity,512,1,NA,5,1845.29375759898,NA 
rayol-farm2_2019-03-22_12-26-27.wav,44100,16,60,1,acoustic_complexity,512,1,NA,5,1839.33911705492,NA 
rayol-farm2_2019-03-22_12-28-27.wav,44100,16,60,1,acoustic_complexity,512,1,NA,5,1853.36555044468,NA 
rayol-farm2_2019-03-22_12-30-27.wav,44100,16,60,1,acoustic_complexity,512,1,NA,5,1855.62661871489,NA 
rayol-farm2_2019-03-22_12-32-27.wav,44100,16,60,1,acoustic_complexity,512,1,NA,5,1865.13649156419,NA 
rayol-farm2_2019-03-22_12-34-27.wav,44100,16,60,1,acoustic_complexity,512,1,NA,5,1825.66823190762,NA 
rayol-farm2_2019-03-22_12-36-27.wav,44100,16,60,1,acoustic_complexity,512,1,NA,5,1834.23883751858,NA 
rayol-farm2_2019-03-22_12-38-28.wav,44100,16,60,1,acoustic_complexity,512,1,NA,5,1826.65788644305,NA 
rayol-farm2_2019-03-22_12-40-28.wav,44100,16,60,1,acoustic_complexity,512,1,NA,5,1823.86885273824,NA 
rayol-farm2_2019-03-22_12-42-28.wav,44100,16,60,1,acoustic_complexity,512,1,NA,5,1849.45985440702,NA 
rayol-farm2_2019-03-22_12-44-28.wav,44100,16,60,1,acoustic_complexity,512,1,NA,5,1908.25206805191,NA 
rayol-farm2_2019-03-22_12-46-28.wav,44100,16,60,1,acoustic_complexity,512,1,NA,5,1834.14417122957,NA 
rayol-farm2_2019-03-22_12-48-28.wav,44100,16,60,1,acoustic_complexity,512,1,NA,5,1859.1961803164,NA 
rayol-farm2_2019-03-22_12-50-28.wav,44100,16,60,1,acoustic_complexity,512,1,NA,5,1842.7621231195,NA 
rayol-farm2_2019-03-22_12-52-28.wav,44100,16,60,1,acoustic_complexity,512,1,NA,5,1833.21904112885,NA 
rayol-farm2_2019-03-22_12-54-29.wav,44100,16,60,1,acoustic_complexity,512,1,NA,5,1822.55554345646,NA 
rayol-farm2_2019-03-22_12-56-29.wav,44100,16,60,1,acoustic_complexity,512,1,NA,5,1828.98625637847,NA 
rayol-farm2_2019-03-22_12-58-29.wav,44100,16,60,1,acoustic_complexity,512,1,NA,5,1824.83006595601,NA 
rayol-farm2_2019-03-22_13-00-29.wav,44100,16,60,1,acoustic_complexity,512,1,NA,5,1849.94356830486,NA 
rayol-farm2_2019-03-22_13-02-29.wav,44100,16,60,1,acoustic_complexity,512,1,NA,5,1850.81939449858,NA 
rayol-farm2_2019-03-22_13-04-29.wav,44100,16,60,1,acoustic_complexity,512,1,NA,5,1851.49236968529,NA 
rayol-farm2_2019-03-22_13-06-29.wav,44100,16,60,1,acoustic_complexity,512,1,NA,5,1851.70163761738,NA 
rayol-farm2_2019-03-22_13-08-29.wav,44100,16,60,1,acoustic_complexity,512,1,NA,5,1851.27259671156,NA 
rayol-farm2_2019-03-22_13-10-30.wav,44100,16,60,1,acoustic_complexity,512,1,NA,5,1832.05692549359,NA 
rayol-farm2_2019-03-22_13-12-30.wav,44100,16,60,1,acoustic_complexity,512,1,NA,5,1816.5528914201,NA 
rayol-farm2_2019-03-22_13-14-30.wav,44100,16,60,1,acoustic_complexity,512,1,NA,5,1839.33605906839,NA 
rayol-farm2_2019-03-22_13-16-30.wav,44100,16,60,1,acoustic_complexity,512,1,NA,5,1841.13675827708,NA 
rayol-farm2_2019-03-22_13-18-30.wav,44100,16,60,1,acoustic_complexity,512,1,NA,5,1866.91941226165,NA 
rayol-farm2_2019-03-22_13-20-30.wav,44100,16,60,1,acoustic_complexity,512,1,NA,5,1864.84640224495,NA 
rayol-farm2_2019-03-22_13-22-30.wav,44100,16,60,1,acoustic_complexity,512,1,NA,5,1846.11887656165,NA 
rayol-farm2_2019-03-22_13-24-30.wav,44100,16,60,1,acoustic_complexity,512,1,NA,5,1834.7949648693,NA 
rayol-farm2_2019-03-22_13-26-30.wav,44100,16,60,1,acoustic_complexity,512,1,NA,5,1836.11887080887,NA 
rayol-farm2_2019-03-22_13-28-31.wav,44100,16,60,1,acoustic_complexity,512,1,NA,5,1857.40084315194,NA 
rayol-farm2_2019-03-22_13-30-31.wav,44100,16,60,1,acoustic_complexity,512,1,NA,5,1840.07496937796,NA 
rayol-farm2_2019-03-22_13-32-31.wav,44100,16,60,1,acoustic_complexity,512,1,NA,5,1860.63960729831,NA 
rayol-farm2_2019-03-22_13-34-31.wav,44100,16,60,1,acoustic_complexity,512,1,NA,5,1846.13139774578,NA 
rayol-farm2_2019-03-22_13-36-31.wav,44100,16,60,1,acoustic_complexity,512,1,NA,5,1860.86293253928,NA 
rayol-farm2_2019-03-22_13-38-31.wav,44100,16,60,1,acoustic_complexity,512,1,NA,5,1845.43016225262,NA 
rayol-farm2_2019-03-22_13-40-31.wav,44100,16,60,1,acoustic_complexity,512,1,NA,5,1853.13861154727,NA 
rayol-farm2_2019-03-22_13-42-31.wav,44100,16,60,1,acoustic_complexity,512,1,NA,5,1868.33034489584,NA 
rayol-farm2_2019-03-22_13-44-32.wav,44100,16,60,1,acoustic_complexity,512,1,NA,5,1876.40872137732,NA 
rayol-farm2_2019-03-22_13-46-32.wav,44100,16,60,1,acoustic_complexity,512,1,NA,5,1841.08038156984,NA 
rayol-farm2_2019-03-22_13-48-32.wav,44100,16,60,1,acoustic_complexity,512,1,NA,5,1830.62549557738,NA 
rayol-farm2_2019-03-22_13-50-32.wav,44100,16,60,1,acoustic_complexity,512,1,NA,5,1877.44691094233,NA 
rayol-farm2_2019-03-22_13-52-32.wav,44100,16,60,1,acoustic_complexity,512,1,NA,5,1864.9049490106,NA 
rayol-farm2_2019-03-22_13-54-32.wav,44100,16,60,1,acoustic_complexity,512,1,NA,5,1875.83657688648,NA 
rayol-farm2_2019-03-22_13-56-32.wav,44100,16,60,1,acoustic_complexity,512,1,NA,5,1868.30306265831,NA 
rayol-farm2_2019-03-22_13-58-32.wav,44100,16,60,1,acoustic_complexity,512,1,NA,5,1830.91936168955,NA 
rayol-farm2_2019-03-22_14-00-33.wav,44100,16,60,1,acoustic_complexity,512,1,NA,5,1878.01201568572,NA 
rayol-farm2_2019-03-22_14-02-33.wav,44100,16,60,1,acoustic_complexity,512,1,NA,5,1831.48927134402,NA 
rayol-farm2_2019-03-22_14-04-33.wav,44100,16,60,1,acoustic_complexity,512,1,NA,5,1834.80625706964,NA 
rayol-farm2_2019-03-22_14-06-33.wav,44100,16,60,1,acoustic_complexity,512,1,NA,5,1865.60606034136,NA 
rayol-farm2_2019-03-22_14-08-33.wav,44100,16,60,1,acoustic_complexity,512,1,NA,5,1839.14965998844,NA 
rayol-farm2_2019-03-22_14-10-33.wav,44100,16,60,1,acoustic_complexity,512,1,NA,5,1869.25745867043,NA 
rayol-farm2_2019-03-22_14-12-33.wav,44100,16,60,1,acoustic_complexity,512,1,NA,5,1852.81006392802,NA 
rayol-farm2_2019-03-22_14-14-33.wav,44100,16,60,1,acoustic_complexity,512,1,NA,5,1876.55360794854,NA 
rayol-farm2_2019-03-22_14-16-34.wav,44100,16,60,1,acoustic_complexity,512,1,NA,5,1858.43635079614,NA 
rayol-farm2_2019-03-22_14-18-34.wav,44100,16,60,1,acoustic_complexity,512,1,NA,5,1869.35161418686,NA 
rayol-farm2_2019-03-22_14-20-34.wav,44100,16,60,1,acoustic_complexity,512,1,NA,5,2161.84784221542,NA 
rayol-farm2_2019-03-22_14-22-34.wav,44100,16,60,1,acoustic_complexity,512,1,NA,5,1867.47153377011,NA 
rayol-farm2_2019-03-22_14-24-34.wav,44100,16,60,1,acoustic_complexity,512,1,NA,5,1883.34262997123,NA 
rayol-farm2_2019-03-22_14-26-34.wav,44100,16,60,1,acoustic_complexity,512,1,NA,5,1908.40895567148,NA 
rayol-farm2_2019-03-22_14-28-34.wav,44100,16,60,1,acoustic_complexity,512,1,NA,5,1891.75485248544,NA 
rayol-farm2_2019-03-22_14-30-34.wav,44100,16,60,1,acoustic_complexity,512,1,NA,5,1888.39102352893,NA 
rayol-farm2_2019-03-22_14-32-34.wav,44100,16,60,1,acoustic_complexity,512,1,NA,5,1921.95922570658,NA 
rayol-farm2_2019-03-22_14-34-35.wav,44100,16,60,1,acoustic_complexity,512,1,NA,5,1871.82167519925,NA 
rayol-farm2_2019-03-22_14-36-35.wav,44100,16,60,1,acoustic_complexity,512,1,NA,5,1858.6917823271,NA 
rayol-farm2_2019-03-22_14-38-35.wav,44100,16,60,1,acoustic_complexity,512,1,NA,5,1926.01623408059,NA 
rayol-farm2_2019-03-22_14-40-35.wav,44100,16,60,1,acoustic_complexity,512,1,NA,5,1888.92274049323,NA 
rayol-farm2_2019-03-22_14-42-35.wav,44100,16,60,1,acoustic_complexity,512,1,NA,5,1842.24904221571,NA 
rayol-farm2_2019-03-22_14-44-35.wav,44100,16,60,1,acoustic_complexity,512,1,NA,5,1860.42436719154,NA 
rayol-farm2_2019-03-22_14-46-35.wav,44100,16,60,1,acoustic_complexity,512,1,NA,5,1868.13020368724,NA 
rayol-farm2_2019-03-22_14-48-35.wav,44100,16,60,1,acoustic_complexity,512,1,NA,5,1856.76113264202,NA 
rayol-farm2_2019-03-22_14-50-36.wav,44100,16,60,1,acoustic_complexity,512,1,NA,5,1850.76894989677,NA 
rayol-farm2_2019-03-22_14-52-36.wav,44100,16,60,1,acoustic_complexity,512,1,NA,5,1853.62653279253,NA 
rayol-farm2_2019-03-22_14-54-36.wav,44100,16,60,1,acoustic_complexity,512,1,NA,5,1866.80231955608,NA 
rayol-farm2_2019-03-22_14-56-36.wav,44100,16,60,1,acoustic_complexity,512,1,NA,5,1872.44805997021,NA 
rayol-farm2_2019-03-22_14-58-36.wav,44100,16,60,1,acoustic_complexity,512,1,NA,5,1855.18254681883,NA 
rayol-farm2_2019-03-22_15-00-36.wav,44100,16,60,1,acoustic_complexity,512,1,NA,5,1880.50263361922,NA 
rayol-farm2_2019-03-22_15-02-36.wav,44100,16,60,1,acoustic_complexity,512,1,NA,5,1869.67919800597,NA 
rayol-farm2_2019-03-22_15-04-36.wav,44100,16,60,1,acoustic_complexity,512,1,NA,5,1859.25155102089,NA 
rayol-farm2_2019-03-22_15-06-37.wav,44100,16,60,1,acoustic_complexity,512,1,NA,5,1848.20173420353,NA 
rayol-farm2_2019-03-22_15-08-37.wav,44100,16,60,1,acoustic_complexity,512,1,NA,5,1859.73857303834,NA 
rayol-farm2_2019-03-22_15-10-37.wav,44100,16,60,1,acoustic_complexity,512,1,NA,5,1841.58183067225,NA 
rayol-farm2_2019-03-22_15-12-37.wav,44100,16,60,1,acoustic_complexity,512,1,NA,5,1859.89826068799,NA 
rayol-farm2_2019-03-22_15-14-37.wav,44100,16,60,1,acoustic_complexity,512,1,NA,5,1882.22138090861,NA 
rayol-farm2_2019-03-22_15-16-37.wav,44100,16,60,1,acoustic_complexity,512,1,NA,5,1858.2686151282,NA 
rayol-farm2_2019-03-22_15-18-37.wav,44100,16,60,1,acoustic_complexity,512,1,NA,5,1843.91332146407,NA 
rayol-farm2_2019-03-22_15-20-37.wav,44100,16,60,1,acoustic_complexity,512,1,NA,5,1863.95848144418,NA 
rayol-farm2_2019-03-22_15-22-38.wav,44100,16,60,1,acoustic_complexity,512,1,NA,5,1846.05845402154,NA 
rayol-farm2_2019-03-22_15-24-38.wav,44100,16,60,1,acoustic_complexity,512,1,NA,5,1841.48157603295,NA 
rayol-farm2_2019-03-22_15-26-38.wav,44100,16,60,1,acoustic_complexity,512,1,NA,5,1867.65089193426,NA 
rayol-farm2_2019-03-22_15-28-38.wav,44100,16,60,1,acoustic_complexity,512,1,NA,5,1862.18652465224,NA 
rayol-farm2_2019-03-22_15-30-38.wav,44100,16,60,1,acoustic_complexity,512,1,NA,5,1847.55006135727,NA 
rayol-farm2_2019-03-22_15-32-38.wav,44100,16,60,1,acoustic_complexity,512,1,NA,5,1849.47859350238,NA 
rayol-farm2_2019-03-22_15-34-38.wav,44100,16,60,1,acoustic_complexity,512,1,NA,5,1833.8966961569,NA 
rayol-farm2_2019-03-22_15-36-38.wav,44100,16,60,1,acoustic_complexity,512,1,NA,5,1849.26328831296,NA 
rayol-farm2_2019-03-22_15-38-38.wav,44100,16,60,1,acoustic_complexity,512,1,NA,5,1843.32206255154,NA 
rayol-farm2_2019-03-22_15-40-39.wav,44100,16,60,1,acoustic_complexity,512,1,NA,5,1860.61804687397,NA 
rayol-farm2_2019-03-22_15-42-39.wav,44100,16,60,1,acoustic_complexity,512,1,NA,5,1829.40871126868,NA 
rayol-farm2_2019-03-22_15-44-39.wav,44100,16,60,1,acoustic_complexity,512,1,NA,5,1845.19966218878,NA 
rayol-farm2_2019-03-22_15-46-39.wav,44100,16,60,1,acoustic_complexity,512,1,NA,5,1852.47409870474,NA 
rayol-farm2_2019-03-22_15-48-39.wav,44100,16,60,1,acoustic_complexity,512,1,NA,5,1854.28844916092,NA 
rayol-farm2_2019-03-22_15-50-39.wav,44100,16,60,1,acoustic_complexity,512,1,NA,5,1865.16984909,NA 
rayol-farm2_2019-03-22_15-52-39.wav,44100,16,60,1,acoustic_complexity,512,1,NA,5,1843.60717381782,NA 
rayol-farm2_2019-03-22_15-54-39.wav,44100,16,60,1,acoustic_complexity,512,1,NA,5,1856.87778790289,NA 
rayol-farm2_2019-03-22_15-56-40.wav,44100,16,60,1,acoustic_complexity,512,1,NA,5,1843.55222250495,NA 
rayol-farm2_2019-03-22_15-58-40.wav,44100,16,60,1,acoustic_complexity,512,1,NA,5,1817.12263423503,NA 
rayol-farm2_2019-03-22_16-00-40.wav,44100,16,60,1,acoustic_complexity,512,1,NA,5,1843.21112463004,NA 
rayol-farm2_2019-03-22_16-02-40.wav,44100,16,60,1,acoustic_complexity,512,1,NA,5,1848.87714951506,NA 
rayol-farm2_2019-03-22_16-04-40.wav,44100,16,60,1,acoustic_complexity,512,1,NA,5,1853.96967435908,NA 
rayol-farm2_2019-03-22_16-06-40.wav,44100,16,60,1,acoustic_complexity,512,1,NA,5,1859.10180072395,NA 
rayol-farm2_2019-03-22_16-08-40.wav,44100,16,60,1,acoustic_complexity,512,1,NA,5,1841.76797087755,NA 
rayol-farm2_2019-03-22_16-10-40.wav,44100,16,60,1,acoustic_complexity,512,1,NA,5,1847.96094891154,NA 
rayol-farm2_2019-03-22_16-12-41.wav,44100,16,60,1,acoustic_complexity,512,1,NA,5,1838.96852647656,NA 
rayol-farm2_2019-03-22_16-14-41.wav,44100,16,60,1,acoustic_complexity,512,1,NA,5,1820.57653116912,NA 
rayol-farm2_2019-03-22_16-16-41.wav,44100,16,60,1,acoustic_complexity,512,1,NA,5,1830.85494926897,NA 
rayol-farm2_2019-03-22_16-18-41.wav,44100,16,60,1,acoustic_complexity,512,1,NA,5,1843.5614533031,NA 
rayol-farm2_2019-03-22_16-20-41.wav,44100,16,60,1,acoustic_complexity,512,1,NA,5,1897.31664199576,NA 
rayol-farm2_2019-03-22_16-22-41.wav,44100,16,60,1,acoustic_complexity,512,1,NA,5,1852.93155052297,NA 
rayol-farm2_2019-03-22_16-24-41.wav,44100,16,60,1,acoustic_complexity,512,1,NA,5,1851.52194521744,NA 
rayol-farm2_2019-03-22_16-26-41.wav,44100,16,60,1,acoustic_complexity,512,1,NA,5,1833.83881350555,NA 
rayol-farm2_2019-03-22_16-28-42.wav,44100,16,60,1,acoustic_complexity,512,1,NA,5,1844.1713350804,NA 
rayol-farm2_2019-03-22_16-30-42.wav,44100,16,60,1,acoustic_complexity,512,1,NA,5,1829.31826893442,NA 
rayol-farm2_2019-03-22_16-32-42.wav,44100,16,60,1,acoustic_complexity,512,1,NA,5,1827.18613924326,NA 
rayol-farm2_2019-03-22_16-34-42.wav,44100,16,60,1,acoustic_complexity,512,1,NA,5,1839.51470660189,NA 
rayol-farm2_2019-03-22_16-36-42.wav,44100,16,60,1,acoustic_complexity,512,1,NA,5,1842.31818871886,NA 
rayol-farm2_2019-03-22_16-38-42.wav,44100,16,60,1,acoustic_complexity,512,1,NA,5,1859.09290893316,NA 
rayol-farm2_2019-03-22_16-40-42.wav,44100,16,60,1,acoustic_complexity,512,1,NA,5,1855.13916514374,NA 
rayol-farm2_2019-03-22_16-42-42.wav,44100,16,60,1,acoustic_complexity,512,1,NA,5,1848.72893561749,NA 
rayol-farm2_2019-03-22_16-44-42.wav,44100,16,60,1,acoustic_complexity,512,1,NA,5,1841.33489142155,NA 
rayol-farm2_2019-03-22_16-46-43.wav,44100,16,60,1,acoustic_complexity,512,1,NA,5,1862.09200444123,NA 
rayol-farm2_2019-03-22_16-48-43.wav,44100,16,60,1,acoustic_complexity,512,1,NA,5,1834.97520065714,NA 
rayol-farm2_2019-03-22_16-50-43.wav,44100,16,60,1,acoustic_complexity,512,1,NA,5,1845.62995103026,NA 
rayol-farm2_2019-03-22_16-52-43.wav,44100,16,60,1,acoustic_complexity,512,1,NA,5,1828.89183310758,NA 
rayol-farm2_2019-03-22_16-54-43.wav,44100,16,60,1,acoustic_complexity,512,1,NA,5,1848.1439894456,NA 
rayol-farm2_2019-03-22_16-56-43.wav,44100,16,60,1,acoustic_complexity,512,1,NA,5,1856.82806197753,NA 
rayol-farm2_2019-03-22_16-58-43.wav,44100,16,60,1,acoustic_complexity,512,1,NA,5,1848.47623095408,NA 
rayol-farm2_2019-03-22_17-00-43.wav,44100,16,60,1,acoustic_complexity,512,1,NA,5,1838.46304680296,NA 
rayol-farm2_2019-03-22_17-02-44.wav,44100,16,60,1,acoustic_complexity,512,1,NA,5,1845.30557888226,NA 
rayol-farm2_2019-03-22_17-04-44.wav,44100,16,60,1,acoustic_complexity,512,1,NA,5,1845.85405813634,NA 
rayol-farm2_2019-03-22_17-06-44.wav,44100,16,60,1,acoustic_complexity,512,1,NA,5,1826.86352979776,NA 
rayol-farm2_2019-03-22_17-08-44.wav,44100,16,60,1,acoustic_complexity,512,1,NA,5,1839.93264507044,NA 
rayol-farm2_2019-03-22_17-10-44.wav,44100,16,60,1,acoustic_complexity,512,1,NA,5,1843.90974369067,NA 
rayol-farm2_2019-03-22_17-12-44.wav,44100,16,60,1,acoustic_complexity,512,1,NA,5,1866.75922281936,NA 
rayol-farm2_2019-03-22_17-14-44.wav,44100,16,60,1,acoustic_complexity,512,1,NA,5,1884.10563439029,NA 
rayol-farm2_2019-03-22_17-16-44.wav,44100,16,60,1,acoustic_complexity,512,1,NA,5,1861.43678061437,NA 
rayol-farm2_2019-03-22_17-18-45.wav,44100,16,60,1,acoustic_complexity,512,1,NA,5,1843.20533519028,NA 
rayol-farm2_2019-03-22_17-20-45.wav,44100,16,60,1,acoustic_complexity,512,1,NA,5,1854.63369404875,NA 
rayol-farm2_2019-03-22_17-22-45.wav,44100,16,60,1,acoustic_complexity,512,1,NA,5,1821.05283190907,NA 
rayol-farm2_2019-03-22_17-24-45.wav,44100,16,60,1,acoustic_complexity,512,1,NA,5,1837.06384223609,NA 
rayol-farm2_2019-03-22_17-26-45.wav,44100,16,60,1,acoustic_complexity,512,1,NA,5,1833.36772105163,NA 
rayol-farm2_2019-03-22_17-28-45.wav,44100,16,60,1,acoustic_complexity,512,1,NA,5,1832.70651026878,NA 
rayol-farm2_2019-03-22_17-30-45.wav,44100,16,60,1,acoustic_complexity,512,1,NA,5,1849.31664885361,NA 
rayol-farm2_2019-03-22_17-32-45.wav,44100,16,60,1,acoustic_complexity,512,1,NA,5,1845.87974925608,NA 
rayol-farm2_2019-03-22_17-34-46.wav,44100,16,60,1,acoustic_complexity,512,1,NA,5,1842.98761547979,NA 
rayol-farm2_2019-03-22_17-36-46.wav,44100,16,60,1,acoustic_complexity,512,1,NA,5,1815.57803205641,NA 
rayol-farm2_2019-03-22_17-38-46.wav,44100,16,60,1,acoustic_complexity,512,1,NA,5,1829.19010488727,NA 
rayol-farm2_2019-03-22_17-40-46.wav,44100,16,60,1,acoustic_complexity,512,1,NA,5,1804.08375860062,NA 
rayol-farm2_2019-03-22_17-42-46.wav,44100,16,60,1,acoustic_complexity,512,1,NA,5,1833.86485338821,NA 
rayol-farm2_2019-03-22_17-44-46.wav,44100,16,60,1,acoustic_complexity,512,1,NA,5,1843.10847566073,NA 
rayol-farm2_2019-03-22_17-46-46.wav,44100,16,60,1,acoustic_complexity,512,1,NA,5,1832.58483513282,NA 
rayol-farm2_2019-03-22_17-48-46.wav,44100,16,60,1,acoustic_complexity,512,1,NA,5,1851.77663524757,NA 
rayol-farm2_2019-03-22_17-50-46.wav,44100,16,60,1,acoustic_complexity,512,1,NA,5,1840.47706202363,NA 
rayol-farm2_2019-03-22_17-52-47.wav,44100,16,60,1,acoustic_complexity,512,1,NA,5,1845.31798308051,NA 
rayol-farm2_2019-03-22_17-54-47.wav,44100,16,60,1,acoustic_complexity,512,1,NA,5,1840.02058733771,NA 
rayol-farm2_2019-03-22_17-56-47.wav,44100,16,60,1,acoustic_complexity,512,1,NA,5,1823.7775797021,NA 
rayol-farm2_2019-03-22_17-58-47.wav,44100,16,60,1,acoustic_complexity,512,1,NA,5,1822.49235420937,NA 
rayol-farm2_2019-03-22_18-00-47.wav,44100,16,60,1,acoustic_complexity,512,1,NA,5,1846.64119015643,NA 
rayol-farm2_2019-03-22_18-02-47.wav,44100,16,60,1,acoustic_complexity,512,1,NA,5,1820.54676216425,NA 
rayol-farm2_2019-03-22_18-04-47.wav,44100,16,60,1,acoustic_complexity,512,1,NA,5,1835.53469963147,NA 
rayol-farm2_2019-03-22_18-06-47.wav,44100,16,60,1,acoustic_complexity,512,1,NA,5,1855.272628463,NA 
rayol-farm2_2019-03-22_18-08-48.wav,44100,16,60,1,acoustic_complexity,512,1,NA,5,1850.15344034851,NA 
rayol-farm2_2019-03-22_18-10-48.wav,44100,16,60,1,acoustic_complexity,512,1,NA,5,1854.85646873146,NA 
rayol-farm2_2019-03-22_18-12-48.wav,44100,16,60,1,acoustic_complexity,512,1,NA,5,1845.42618875428,NA 
rayol-farm2_2019-03-22_18-14-48.wav,44100,16,60,1,acoustic_complexity,512,1,NA,5,1844.63928441888,NA 
rayol-farm2_2019-03-22_18-16-48.wav,44100,16,60,1,acoustic_complexity,512,1,NA,5,1832.20730904302,NA 
rayol-farm2_2019-03-22_18-18-48.wav,44100,16,60,1,acoustic_complexity,512,1,NA,5,1829.94593215434,NA 
rayol-farm2_2019-03-22_18-20-48.wav,44100,16,60,1,acoustic_complexity,512,1,NA,5,1823.9031154406,NA 
rayol-farm2_2019-03-22_18-22-48.wav,44100,16,60,1,acoustic_complexity,512,1,NA,5,1832.74919212925,NA 
rayol-farm2_2019-03-22_18-24-49.wav,44100,16,60,1,acoustic_complexity,512,1,NA,5,1843.92391845202,NA 
rayol-farm2_2019-03-22_18-26-49.wav,44100,16,60,1,acoustic_complexity,512,1,NA,5,1874.87945309622,NA 
rayol-farm2_2019-03-22_18-28-49.wav,44100,16,60,1,acoustic_complexity,512,1,NA,5,1849.28585729208,NA 
rayol-farm2_2019-03-22_18-30-49.wav,44100,16,60,1,acoustic_complexity,512,1,NA,5,1829.34911661389,NA 
rayol-farm2_2019-03-22_18-32-49.wav,44100,16,60,1,acoustic_complexity,512,1,NA,5,1820.99017786608,NA 
rayol-farm2_2019-03-22_18-34-49.wav,44100,16,60,1,acoustic_complexity,512,1,NA,5,1841.43374437146,NA 
rayol-farm2_2019-03-22_18-36-49.wav,44100,16,60,1,acoustic_complexity,512,1,NA,5,1826.22073857063,NA 
rayol-farm2_2019-03-22_18-38-49.wav,44100,16,60,1,acoustic_complexity,512,1,NA,5,1827.85566714811,NA 
rayol-farm2_2019-03-22_18-40-50.wav,44100,16,60,1,acoustic_complexity,512,1,NA,5,1830.08647758077,NA 
rayol-farm2_2019-03-22_18-42-50.wav,44100,16,60,1,acoustic_complexity,512,1,NA,5,1849.79398859952,NA 
rayol-farm2_2019-03-22_18-44-50.wav,44100,16,60,1,acoustic_complexity,512,1,NA,5,1869.13906143305,NA 
rayol-farm2_2019-03-22_18-46-50.wav,44100,16,60,1,acoustic_complexity,512,1,NA,5,1835.47907562212,NA 
rayol-farm2_2019-03-22_18-48-50.wav,44100,16,60,1,acoustic_complexity,512,1,NA,5,1809.26696976221,NA 
rayol-farm2_2019-03-22_18-50-50.wav,44100,16,60,1,acoustic_complexity,512,1,NA,5,1833.68884941745,NA 
rayol-farm2_2019-03-22_18-52-50.wav,44100,16,60,1,acoustic_complexity,512,1,NA,5,1820.32867964705,NA 
rayol-farm2_2019-03-22_18-54-50.wav,44100,16,60,1,acoustic_complexity,512,1,NA,5,1824.65458145338,NA 
rayol-farm2_2019-03-22_18-56-50.wav,44100,16,60,1,acoustic_complexity,512,1,NA,5,1830.60908715818,NA 
rayol-farm2_2019-03-22_18-58-51.wav,44100,16,60,1,acoustic_complexity,512,1,NA,5,1842.21921187201,NA 
rayol-farm2_2019-03-22_19-00-51.wav,44100,16,60,1,acoustic_complexity,512,1,NA,5,1848.36607098117,NA 
rayol-farm2_2019-03-22_19-02-51.wav,44100,16,60,1,acoustic_complexity,512,1,NA,5,1843.55714366208,NA 
rayol-farm2_2019-03-22_19-04-51.wav,44100,16,60,1,acoustic_complexity,512,1,NA,5,1833.84402753747,NA 
rayol-farm2_2019-03-22_19-06-51.wav,44100,16,60,1,acoustic_complexity,512,1,NA,5,1821.41879532314,NA 
rayol-farm2_2019-03-22_19-08-51.wav,44100,16,60,1,acoustic_complexity,512,1,NA,5,1833.10071024213,NA 
rayol-farm2_2019-03-22_19-10-51.wav,44100,16,60,1,acoustic_complexity,512,1,NA,5,1828.33267648936,NA 
rayol-farm2_2019-03-22_19-12-51.wav,44100,16,60,1,acoustic_complexity,512,1,NA,5,1820.53393189519,NA 
rayol-farm2_2019-03-22_19-14-52.wav,44100,16,60,1,acoustic_complexity,512,1,NA,5,1825.7812822466,NA 
rayol-farm2_2019-03-22_19-16-52.wav,44100,16,60,1,acoustic_complexity,512,1,NA,5,1835.96200828768,NA 
rayol-farm2_2019-03-22_19-18-52.wav,44100,16,60,1,acoustic_complexity,512,1,NA,5,1838.29089182112,NA 
rayol-farm2_2019-03-22_19-20-52.wav,44100,16,60,1,acoustic_complexity,512,1,NA,5,1845.30471480508,NA 
rayol-farm2_2019-03-22_19-22-52.wav,44100,16,60,1,acoustic_complexity,512,1,NA,5,1821.44740862271,NA 
rayol-farm2_2019-03-22_19-24-52.wav,44100,16,60,1,acoustic_complexity,512,1,NA,5,1833.93217496859,NA 
rayol-farm2_2019-03-22_19-26-52.wav,44100,16,60,1,acoustic_complexity,512,1,NA,5,1833.99625503664,NA 
rayol-farm2_2019-03-22_19-28-52.wav,44100,16,60,1,acoustic_complexity,512,1,NA,5,1821.81790347391,NA 
rayol-farm2_2019-03-22_19-30-53.wav,44100,16,60,1,acoustic_complexity,512,1,NA,5,1823.70205499845,NA 
rayol-farm2_2019-03-22_19-32-53.wav,44100,16,60,1,acoustic_complexity,512,1,NA,5,1812.31110343503,NA 
rayol-farm2_2019-03-22_19-34-53.wav,44100,16,60,1,acoustic_complexity,512,1,NA,5,1832.32850971525,NA 
rayol-farm2_2019-03-22_19-36-53.wav,44100,16,60,1,acoustic_complexity,512,1,NA,5,1838.66548185577,NA 
rayol-farm2_2019-03-22_19-38-53.wav,44100,16,60,1,acoustic_complexity,512,1,NA,5,1862.50597757514,NA 
rayol-farm2_2019-03-22_19-40-53.wav,44100,16,60,1,acoustic_complexity,512,1,NA,5,1824.4658833316,NA 
rayol-farm2_2019-03-22_19-42-53.wav,44100,16,60,1,acoustic_complexity,512,1,NA,5,1820.38732042783,NA 
rayol-farm2_2019-03-22_19-44-53.wav,44100,16,60,1,acoustic_complexity,512,1,NA,5,1817.94362277437,NA 
rayol-farm2_2019-03-22_19-46-54.wav,44100,16,60,1,acoustic_complexity,512,1,NA,5,1810.91610623607,NA 
rayol-farm2_2019-03-22_19-48-54.wav,44100,16,60,1,acoustic_complexity,512,1,NA,5,1813.76479374122,NA 
rayol-farm2_2019-03-22_19-50-54.wav,44100,16,60,1,acoustic_complexity,512,1,NA,5,1804.47825558339,NA 
rayol-farm2_2019-03-22_19-52-54.wav,44100,16,60,1,acoustic_complexity,512,1,NA,5,1811.71855306627,NA 
rayol-farm2_2019-03-22_19-54-54.wav,44100,16,60,1,acoustic_complexity,512,1,NA,5,1838.4910557199,NA 
rayol-farm2_2019-03-22_19-56-54.wav,44100,16,60,1,acoustic_complexity,512,1,NA,5,1842.72413413668,NA 
rayol-farm2_2019-03-22_19-58-54.wav,44100,16,60,1,acoustic_complexity,512,1,NA,5,1830.15173869147,NA 
rayol-farm2_2019-03-22_20-00-54.wav,44100,16,60,1,acoustic_complexity,512,1,NA,5,1817.32364461526,NA 
rayol-farm2_2019-03-22_20-02-55.wav,44100,16,60,1,acoustic_complexity,512,1,NA,5,1824.23626511863,NA 
rayol-farm2_2019-03-22_20-04-55.wav,44100,16,60,1,acoustic_complexity,512,1,NA,5,1821.54733586035,NA 
rayol-farm2_2019-03-22_20-06-55.wav,44100,16,60,1,acoustic_complexity,512,1,NA,5,1820.20606278305,NA 
rayol-farm2_2019-03-22_20-08-55.wav,44100,16,60,1,acoustic_complexity,512,1,NA,5,1821.50152475352,NA 
rayol-farm2_2019-03-22_20-10-55.wav,44100,16,60,1,acoustic_complexity,512,1,NA,5,1828.01664390462,NA 
rayol-farm2_2019-03-22_20-12-55.wav,44100,16,60,1,acoustic_complexity,512,1,NA,5,1845.7413866899,NA 
rayol-farm2_2019-03-22_20-14-55.wav,44100,16,60,1,acoustic_complexity,512,1,NA,5,1834.47657976785,NA 
rayol-farm2_2019-03-22_20-16-55.wav,44100,16,60,1,acoustic_complexity,512,1,NA,5,1827.83681193273,NA 
rayol-farm2_2019-03-22_20-18-55.wav,44100,16,60,1,acoustic_complexity,512,1,NA,5,1815.74875769811,NA 
rayol-farm2_2019-03-22_20-20-56.wav,44100,16,60,1,acoustic_complexity,512,1,NA,5,1810.55158531888,NA 
rayol-farm2_2019-03-22_20-22-56.wav,44100,16,60,1,acoustic_complexity,512,1,NA,5,1821.45875838163,NA 
rayol-farm2_2019-03-22_20-24-56.wav,44100,16,60,1,acoustic_complexity,512,1,NA,5,1820.52672272971,NA 
rayol-farm2_2019-03-22_20-26-56.wav,44100,16,60,1,acoustic_complexity,512,1,NA,5,1841.84743649604,NA 
rayol-farm2_2019-03-22_20-28-56.wav,44100,16,60,1,acoustic_complexity,512,1,NA,5,1844.34388356307,NA 
rayol-farm2_2019-03-22_20-30-56.wav,44100,16,60,1,acoustic_complexity,512,1,NA,5,1847.89302200473,NA 
rayol-farm2_2019-03-22_20-32-56.wav,44100,16,60,1,acoustic_complexity,512,1,NA,5,1826.19862686952,NA 
rayol-farm2_2019-03-22_20-34-56.wav,44100,16,60,1,acoustic_complexity,512,1,NA,5,1843.82224324926,NA 
rayol-farm2_2019-03-22_20-36-57.wav,44100,16,60,1,acoustic_complexity,512,1,NA,5,1807.88889308316,NA 
rayol-farm2_2019-03-22_20-38-57.wav,44100,16,60,1,acoustic_complexity,512,1,NA,5,1806.7361579306,NA 
rayol-farm2_2019-03-22_20-40-57.wav,44100,16,60,1,acoustic_complexity,512,1,NA,5,1835.49908624345,NA 
rayol-farm2_2019-03-22_20-42-57.wav,44100,16,60,1,acoustic_complexity,512,1,NA,5,1822.01783665662,NA 
rayol-farm2_2019-03-22_20-44-57.wav,44100,16,60,1,acoustic_complexity,512,1,NA,5,1820.71186422069,NA 
rayol-farm2_2019-03-22_20-46-57.wav,44100,16,60,1,acoustic_complexity,512,1,NA,5,1846.57567768163,NA 
rayol-farm2_2019-03-22_20-48-57.wav,44100,16,60,1,acoustic_complexity,512,1,NA,5,1853.93265987723,NA 
rayol-farm2_2019-03-22_20-50-57.wav,44100,16,60,1,acoustic_complexity,512,1,NA,5,1833.87053375299,NA 
rayol-farm2_2019-03-22_20-52-58.wav,44100,16,60,1,acoustic_complexity,512,1,NA,5,1810.23609873431,NA 
rayol-farm2_2019-03-22_20-54-58.wav,44100,16,60,1,acoustic_complexity,512,1,NA,5,1814.45455328363,NA 
rayol-farm2_2019-03-22_20-56-58.wav,44100,16,60,1,acoustic_complexity,512,1,NA,5,1813.61014313339,NA 
rayol-farm2_2019-03-22_20-58-58.wav,44100,16,60,1,acoustic_complexity,512,1,NA,5,1813.83766746338,NA 
rayol-farm2_2019-03-22_21-00-58.wav,44100,16,60,1,acoustic_complexity,512,1,NA,5,1815.68368252552,NA 
rayol-farm2_2019-03-22_21-02-58.wav,44100,16,60,1,acoustic_complexity,512,1,NA,5,1822.9652477139,NA 
rayol-farm2_2019-03-22_21-04-58.wav,44100,16,60,1,acoustic_complexity,512,1,NA,5,1842.06198026569,NA 
rayol-farm2_2019-03-22_21-06-58.wav,44100,16,60,1,acoustic_complexity,512,1,NA,5,1849.51081901971,NA 
rayol-farm2_2019-03-22_21-08-59.wav,44100,16,60,1,acoustic_complexity,512,1,NA,5,1833.69808467746,NA 
rayol-farm2_2019-03-22_21-10-59.wav,44100,16,60,1,acoustic_complexity,512,1,NA,5,1814.58585854563,NA 
rayol-farm2_2019-03-22_21-12-59.wav,44100,16,60,1,acoustic_complexity,512,1,NA,5,1830.89513804908,NA 
rayol-farm2_2019-03-22_21-14-59.wav,44100,16,60,1,acoustic_complexity,512,1,NA,5,1810.72075529084,NA 
rayol-farm2_2019-03-22_21-16-59.wav,44100,16,60,1,acoustic_complexity,512,1,NA,5,1821.58939292906,NA 
rayol-farm2_2019-03-22_21-18-59.wav,44100,16,60,1,acoustic_complexity,512,1,NA,5,1822.53411015758,NA 
rayol-farm2_2019-03-22_21-20-59.wav,44100,16,60,1,acoustic_complexity,512,1,NA,5,1831.09955765875,NA 
rayol-farm2_2019-03-22_21-22-59.wav,44100,16,60,1,acoustic_complexity,512,1,NA,5,1823.17277612898,NA 
rayol-farm2_2019-03-22_21-24-59.wav,44100,16,60,1,acoustic_complexity,512,1,NA,5,1839.04448288116,NA 
rayol-farm2_2019-03-22_21-27-00.wav,44100,16,60,1,acoustic_complexity,512,1,NA,5,1836.16131045245,NA 
rayol-farm2_2019-03-22_21-29-00.wav,44100,16,60,1,acoustic_complexity,512,1,NA,5,1807.55246486638,NA 
rayol-farm2_2019-03-22_21-31-00.wav,44100,16,60,1,acoustic_complexity,512,1,NA,5,1815.71227970379,NA 
rayol-farm2_2019-03-22_21-33-00.wav,44100,16,60,1,acoustic_complexity,512,1,NA,5,1830.21831561366,NA 
rayol-farm2_2019-03-22_21-35-00.wav,44100,16,60,1,acoustic_complexity,512,1,NA,5,1824.14806415308,NA 
rayol-farm2_2019-03-22_21-37-00.wav,44100,16,60,1,acoustic_complexity,512,1,NA,5,1820.50872219808,NA 
rayol-farm2_2019-03-22_21-39-00.wav,44100,16,60,1,acoustic_complexity,512,1,NA,5,1831.80453610758,NA 
rayol-farm2_2019-03-22_21-41-00.wav,44100,16,60,1,acoustic_complexity,512,1,NA,5,1828.03428159753,NA 
rayol-farm2_2019-03-22_21-43-01.wav,44100,16,60,1,acoustic_complexity,512,1,NA,5,1835.46533359806,NA 
rayol-farm2_2019-03-22_21-45-01.wav,44100,16,60,1,acoustic_complexity,512,1,NA,5,1831.08320184777,NA 
rayol-farm2_2019-03-22_21-47-01.wav,44100,16,60,1,acoustic_complexity,512,1,NA,5,1834.82606648033,NA 
rayol-farm2_2019-03-22_21-49-01.wav,44100,16,60,1,acoustic_complexity,512,1,NA,5,1819.52069405146,NA 
rayol-farm2_2019-03-22_21-51-01.wav,44100,16,60,1,acoustic_complexity,512,1,NA,5,1850.32462652925,NA 
rayol-farm2_2019-03-22_21-53-01.wav,44100,16,60,1,acoustic_complexity,512,1,NA,5,1833.84588473734,NA 
rayol-farm2_2019-03-22_21-55-01.wav,44100,16,60,1,acoustic_complexity,512,1,NA,5,1814.79083403831,NA 
rayol-farm2_2019-03-22_21-57-01.wav,44100,16,60,1,acoustic_complexity,512,1,NA,5,1826.69765293055,NA 
rayol-farm2_2019-03-22_21-59-02.wav,44100,16,60,1,acoustic_complexity,512,1,NA,5,1822.58421123194,NA 
rayol-farm2_2019-03-22_22-01-02.wav,44100,16,60,1,acoustic_complexity,512,1,NA,5,1815.3759110055,NA 
rayol-farm2_2019-03-22_22-03-02.wav,44100,16,60,1,acoustic_complexity,512,1,NA,5,1850.47770967113,NA 
rayol-farm2_2019-03-22_22-05-02.wav,44100,16,60,1,acoustic_complexity,512,1,NA,5,1844.41404032383,NA 
rayol-farm2_2019-03-22_22-07-02.wav,44100,16,60,1,acoustic_complexity,512,1,NA,5,1818.15164397998,NA 
rayol-farm2_2019-03-22_22-09-02.wav,44100,16,60,1,acoustic_complexity,512,1,NA,5,1813.54769212045,NA 
rayol-farm2_2019-03-22_22-11-02.wav,44100,16,60,1,acoustic_complexity,512,1,NA,5,1830.86314808011,NA 
rayol-farm2_2019-03-22_22-13-02.wav,44100,16,60,1,acoustic_complexity,512,1,NA,5,1816.53725779763,NA 
rayol-farm2_2019-03-22_22-15-03.wav,44100,16,60,1,acoustic_complexity,512,1,NA,5,1823.47004361024,NA 
rayol-farm2_2019-03-22_22-17-03.wav,44100,16,60,1,acoustic_complexity,512,1,NA,5,1815.42188617134,NA 
rayol-farm2_2019-03-22_22-19-03.wav,44100,16,60,1,acoustic_complexity,512,1,NA,5,1824.54203563172,NA 
rayol-farm2_2019-03-22_22-21-03.wav,44100,16,60,1,acoustic_complexity,512,1,NA,5,1839.35539882534,NA 
rayol-farm2_2019-03-22_22-23-03.wav,44100,16,60,1,acoustic_complexity,512,1,NA,5,1846.62422101897,NA 
rayol-farm2_2019-03-22_22-25-03.wav,44100,16,60,1,acoustic_complexity,512,1,NA,5,1846.46069738929,NA 
rayol-farm2_2019-03-22_22-27-03.wav,44100,16,60,1,acoustic_complexity,512,1,NA,5,1821.10664063617,NA 
rayol-farm2_2019-03-22_22-29-03.wav,44100,16,60,1,acoustic_complexity,512,1,NA,5,1831.66881680639,NA 
rayol-farm2_2019-03-22_22-31-03.wav,44100,16,60,1,acoustic_complexity,512,1,NA,5,1823.81632156061,NA 
rayol-farm2_2019-03-22_22-33-04.wav,44100,16,60,1,acoustic_complexity,512,1,NA,5,1813.09923149044,NA 
rayol-farm2_2019-03-22_22-35-04.wav,44100,16,60,1,acoustic_complexity,512,1,NA,5,1809.53651294744,NA 
rayol-farm2_2019-03-22_22-37-04.wav,44100,16,60,1,acoustic_complexity,512,1,NA,5,1821.78493213276,NA 
rayol-farm2_2019-03-22_22-39-04.wav,44100,16,60,1,acoustic_complexity,512,1,NA,5,1817.74209530251,NA 
rayol-farm2_2019-03-22_22-41-04.wav,44100,16,60,1,acoustic_complexity,512,1,NA,5,1842.7015835768,NA 
rayol-farm2_2019-03-22_22-43-04.wav,44100,16,60,1,acoustic_complexity,512,1,NA,5,1841.98499066097,NA 
rayol-farm2_2019-03-22_22-45-04.wav,44100,16,60,1,acoustic_complexity,512,1,NA,5,1851.99155940264,NA 
rayol-farm2_2019-03-22_22-47-04.wav,44100,16,60,1,acoustic_complexity,512,1,NA,5,1822.91716135486,NA 
rayol-farm2_2019-03-22_22-49-05.wav,44100,16,60,1,acoustic_complexity,512,1,NA,5,1810.91092381913,NA 
rayol-farm2_2019-03-22_22-51-05.wav,44100,16,60,1,acoustic_complexity,512,1,NA,5,1828.21729076196,NA 
rayol-farm2_2019-03-22_22-53-05.wav,44100,16,60,1,acoustic_complexity,512,1,NA,5,1819.55521826481,NA 
rayol-farm2_2019-03-22_22-55-05.wav,44100,16,60,1,acoustic_complexity,512,1,NA,5,1815.02593827516,NA 
rayol-farm2_2019-03-22_22-57-05.wav,44100,16,60,1,acoustic_complexity,512,1,NA,5,1803.24653382111,NA 
rayol-farm2_2019-03-22_22-59-05.wav,44100,16,60,1,acoustic_complexity,512,1,NA,5,1820.28728921734,NA 
rayol-farm2_2019-03-22_23-01-05.wav,44100,16,60,1,acoustic_complexity,512,1,NA,5,1836.44296278988,NA 
rayol-farm2_2019-03-22_23-03-05.wav,44100,16,60,1,acoustic_complexity,512,1,NA,5,1845.29690608704,NA 
rayol-farm2_2019-03-22_23-05-06.wav,44100,16,60,1,acoustic_complexity,512,1,NA,5,1827.08551713534,NA 
rayol-farm2_2019-03-22_23-07-06.wav,44100,16,60,1,acoustic_complexity,512,1,NA,5,1809.56423797404,NA 
rayol-farm2_2019-03-22_23-09-06.wav,44100,16,60,1,acoustic_complexity,512,1,NA,5,1806.50818146736,NA 
rayol-farm2_2019-03-22_23-11-06.wav,44100,16,60,1,acoustic_complexity,512,1,NA,5,1809.98080113598,NA 
rayol-farm2_2019-03-22_23-13-06.wav,44100,16,60,1,acoustic_complexity,512,1,NA,5,1808.25924011406,NA 
rayol-farm2_2019-03-22_23-15-06.wav,44100,16,60,1,acoustic_complexity,512,1,NA,5,1810.68218870591,NA 
rayol-farm2_2019-03-22_23-17-06.wav,44100,16,60,1,acoustic_complexity,512,1,NA,5,1827.4788647676,NA 
rayol-farm2_2019-03-22_23-19-06.wav,44100,16,60,1,acoustic_complexity,512,1,NA,5,1837.69914367555,NA 
rayol-farm2_2019-03-22_23-21-07.wav,44100,16,60,1,acoustic_complexity,512,1,NA,5,1863.07206254641,NA 
rayol-farm2_2019-03-22_23-23-07.wav,44100,16,60,1,acoustic_complexity,512,1,NA,5,1852.27039362522,NA 
rayol-farm2_2019-03-22_23-25-07.wav,44100,16,60,1,acoustic_complexity,512,1,NA,5,1854.94973976345,NA 
rayol-farm2_2019-03-22_23-27-07.wav,44100,16,60,1,acoustic_complexity,512,1,NA,5,1828.98150851105,NA 
rayol-farm2_2019-03-22_23-29-07.wav,44100,16,60,1,acoustic_complexity,512,1,NA,5,1846.57175523542,NA 
rayol-farm2_2019-03-22_23-31-07.wav,44100,16,60,1,acoustic_complexity,512,1,NA,5,1833.02542400257,NA 
rayol-farm2_2019-03-22_23-33-07.wav,44100,16,60,1,acoustic_complexity,512,1,NA,5,1851.59850152135,NA 
rayol-farm2_2019-03-22_23-35-07.wav,44100,16,60,1,acoustic_complexity,512,1,NA,5,1847.50740690096,NA 
rayol-farm2_2019-03-22_23-37-08.wav,44100,16,60,1,acoustic_complexity,512,1,NA,5,1842.75962383886,NA 
rayol-farm2_2019-03-22_23-39-08.wav,44100,16,60,1,acoustic_complexity,512,1,NA,5,1827.4729682292,NA 
rayol-farm2_2019-03-22_23-41-08.wav,44100,16,60,1,acoustic_complexity,512,1,NA,5,1850.54103101313,NA 
rayol-farm2_2019-03-22_23-43-08.wav,44100,16,60,1,acoustic_complexity,512,1,NA,5,1848.54557253148,NA 
rayol-farm2_2019-03-22_23-45-08.wav,44100,16,60,1,acoustic_complexity,512,1,NA,5,1820.11213620597,NA 
rayol-farm2_2019-03-22_23-47-08.wav,44100,16,60,1,acoustic_complexity,512,1,NA,5,1826.81417432502,NA 
rayol-farm2_2019-03-22_23-49-08.wav,44100,16,60,1,acoustic_complexity,512,1,NA,5,1819.19847493956,NA 
rayol-farm2_2019-03-22_23-51-08.wav,44100,16,60,1,acoustic_complexity,512,1,NA,5,1803.70085847836,NA 
rayol-farm2_2019-03-22_23-53-08.wav,44100,16,60,1,acoustic_complexity,512,1,NA,5,1830.16342881897,NA 
rayol-farm2_2019-03-22_23-55-09.wav,44100,16,60,1,acoustic_complexity,512,1,NA,5,1830.89196307776,NA 
rayol-farm2_2019-03-22_23-57-09.wav,44100,16,60,1,acoustic_complexity,512,1,NA,5,1834.11579228553,NA 
rayol-farm2_2019-03-22_23-59-09.wav,44100,16,60,1,acoustic_complexity,512,1,NA,5,1817.55761970809,NA
