FILENAME,SAMPLINGRATE,BIT,DURATION,CHANNELS,INDEX,FFT_W,MIN_FREQ,MAX_FREQ,J,LEFT_CHANNEL,RIGHT_CHANNEL
rayol-farm1_2019-04-03_00-00-33.wav,44100,16,60,1,acoustic_complexity,512,1,NA,5,1773.51023072402,NA 
rayol-farm1_2019-04-03_00-01-33.wav,44100,16,60,1,acoustic_complexity,512,1,NA,5,1772.92934019405,NA 
rayol-farm1_2019-04-03_00-02-33.wav,44100,16,60,1,acoustic_complexity,512,1,NA,5,1771.4562623657,NA 
rayol-farm1_2019-04-03_00-03-33.wav,44100,16,60,1,acoustic_complexity,512,1,NA,5,1766.45188368976,NA 
rayol-farm1_2019-04-03_00-04-33.wav,44100,16,60,1,acoustic_complexity,512,1,NA,5,1775.85081384395,NA 
rayol-farm1_2019-04-03_00-05-33.wav,44100,16,60,1,acoustic_complexity,512,1,NA,5,1775.15625287657,NA 
rayol-farm1_2019-04-03_00-06-33.wav,44100,16,60,1,acoustic_complexity,512,1,NA,5,1775.50023405682,NA 
rayol-farm1_2019-04-03_00-07-33.wav,44100,16,60,1,acoustic_complexity,512,1,NA,5,1778.13160578535,NA 
rayol-farm1_2019-04-03_00-08-33.wav,44100,16,60,1,acoustic_complexity,512,1,NA,5,1776.53351729427,NA 
rayol-farm1_2019-04-03_00-09-33.wav,44100,16,60,1,acoustic_complexity,512,1,NA,5,1776.1176799542,NA 
rayol-farm1_2019-04-03_00-10-33.wav,44100,16,60,1,acoustic_complexity,512,1,NA,5,1773.18336284961,NA 
rayol-farm1_2019-04-03_00-11-33.wav,44100,16,60,1,acoustic_complexity,512,1,NA,5,1770.91274620124,NA 
rayol-farm1_2019-04-03_00-12-33.wav,44100,16,60,1,acoustic_complexity,512,1,NA,5,1780.01637285683,NA 
rayol-farm1_2019-04-03_00-13-33.wav,44100,16,60,1,acoustic_complexity,512,1,NA,5,1776.37485983756,NA 
rayol-farm1_2019-04-03_00-14-33.wav,44100,16,60,1,acoustic_complexity,512,1,NA,5,1774.78341151545,NA 
rayol-farm1_2019-04-03_00-15-33.wav,44100,16,60,1,acoustic_complexity,512,1,NA,5,1771.77878343599,NA 
rayol-farm1_2019-04-03_00-16-33.wav,44100,16,60,1,acoustic_complexity,512,1,NA,5,1771.75699674963,NA 
rayol-farm1_2019-04-03_00-17-33.wav,44100,16,60,1,acoustic_complexity,512,1,NA,5,1779.68747406058,NA 
rayol-farm1_2019-04-03_00-18-33.wav,44100,16,60,1,acoustic_complexity,512,1,NA,5,1774.22471691461,NA 
rayol-farm1_2019-04-03_00-19-33.wav,44100,16,60,1,acoustic_complexity,512,1,NA,5,1778.04625310787,NA 
rayol-farm1_2019-04-03_00-20-33.wav,44100,16,60,1,acoustic_complexity,512,1,NA,5,1775.3638314585,NA 
rayol-farm1_2019-04-03_00-21-33.wav,44100,16,60,1,acoustic_complexity,512,1,NA,5,1780.78485856258,NA 
rayol-farm1_2019-04-03_00-22-33.wav,44100,16,60,1,acoustic_complexity,512,1,NA,5,1776.74787437952,NA 
rayol-farm1_2019-04-03_00-23-33.wav,44100,16,60,1,acoustic_complexity,512,1,NA,5,1775.81256861137,NA 
rayol-farm1_2019-04-03_00-24-33.wav,44100,16,60,1,acoustic_complexity,512,1,NA,5,1773.81450522033,NA 
rayol-farm1_2019-04-03_00-25-33.wav,44100,16,60,1,acoustic_complexity,512,1,NA,5,1779.56344662929,NA 
rayol-farm1_2019-04-03_00-26-33.wav,44100,16,60,1,acoustic_complexity,512,1,NA,5,1775.73844505677,NA 
rayol-farm1_2019-04-03_00-27-33.wav,44100,16,60,1,acoustic_complexity,512,1,NA,5,1774.40518944439,NA 
rayol-farm1_2019-04-03_00-28-33.wav,44100,16,60,1,acoustic_complexity,512,1,NA,5,1776.74227463664,NA 
rayol-farm1_2019-04-03_00-29-33.wav,44100,16,60,1,acoustic_complexity,512,1,NA,5,1773.05260245666,NA 
rayol-farm1_2019-04-03_00-30-33.wav,44100,16,60,1,acoustic_complexity,512,1,NA,5,1778.97171154451,NA 
rayol-farm1_2019-04-03_00-31-33.wav,44100,16,60,1,acoustic_complexity,512,1,NA,5,1776.84339030397,NA 
rayol-farm1_2019-04-03_00-32-33.wav,44100,16,60,1,acoustic_complexity,512,1,NA,5,1778.14808515179,NA 
rayol-farm1_2019-04-03_00-33-33.wav,44100,16,60,1,acoustic_complexity,512,1,NA,5,1766.24851659804,NA 
rayol-farm1_2019-04-03_00-34-33.wav,44100,16,60,1,acoustic_complexity,512,1,NA,5,1767.9444972219,NA 
rayol-farm1_2019-04-03_00-35-33.wav,44100,16,60,1,acoustic_complexity,512,1,NA,5,1766.57230042942,NA 
rayol-farm1_2019-04-03_00-36-33.wav,44100,16,60,1,acoustic_complexity,512,1,NA,5,1771.25736342582,NA 
rayol-farm1_2019-04-03_00-37-33.wav,44100,16,60,1,acoustic_complexity,512,1,NA,5,1767.03044949607,NA 
rayol-farm1_2019-04-03_00-38-33.wav,44100,16,60,1,acoustic_complexity,512,1,NA,5,1776.30663588415,NA 
rayol-farm1_2019-04-03_00-39-33.wav,44100,16,60,1,acoustic_complexity,512,1,NA,5,1804.24447876703,NA 
rayol-farm1_2019-04-03_00-40-33.wav,44100,16,60,1,acoustic_complexity,512,1,NA,5,1826.34311750427,NA 
rayol-farm1_2019-04-03_00-41-33.wav,44100,16,60,1,acoustic_complexity,512,1,NA,5,1828.59801012686,NA 
rayol-farm1_2019-04-03_00-42-33.wav,44100,16,60,1,acoustic_complexity,512,1,NA,5,1807.06452544043,NA 
rayol-farm1_2019-04-03_00-43-33.wav,44100,16,60,1,acoustic_complexity,512,1,NA,5,1803.02696888806,NA 
rayol-farm1_2019-04-03_00-44-33.wav,44100,16,60,1,acoustic_complexity,512,1,NA,5,1788.95218913892,NA 
rayol-farm1_2019-04-03_00-45-33.wav,44100,16,60,1,acoustic_complexity,512,1,NA,5,1775.7942399946,NA 
rayol-farm1_2019-04-03_00-46-33.wav,44100,16,60,1,acoustic_complexity,512,1,NA,5,1765.99117164075,NA 
rayol-farm1_2019-04-03_00-47-33.wav,44100,16,60,1,acoustic_complexity,512,1,NA,5,1766.39620679677,NA 
rayol-farm1_2019-04-03_00-48-33.wav,44100,16,60,1,acoustic_complexity,512,1,NA,5,1762.17048626006,NA 
rayol-farm1_2019-04-03_00-49-33.wav,44100,16,60,1,acoustic_complexity,512,1,NA,5,1754.22882349347,NA 
rayol-farm1_2019-04-03_00-50-33.wav,44100,16,60,1,acoustic_complexity,512,1,NA,5,1764.1333356301,NA 
rayol-farm1_2019-04-03_00-51-33.wav,44100,16,60,1,acoustic_complexity,512,1,NA,5,1756.12654147302,NA 
rayol-farm1_2019-04-03_00-52-33.wav,44100,16,60,1,acoustic_complexity,512,1,NA,5,1750.97727852179,NA 
rayol-farm1_2019-04-03_00-53-33.wav,44100,16,60,1,acoustic_complexity,512,1,NA,5,1752.58787414801,NA 
rayol-farm1_2019-04-03_00-54-33.wav,44100,16,60,1,acoustic_complexity,512,1,NA,5,1754.3764334516,NA 
rayol-farm1_2019-04-03_00-55-33.wav,44100,16,60,1,acoustic_complexity,512,1,NA,5,1752.91777422687,NA 
rayol-farm1_2019-04-03_00-56-33.wav,44100,16,60,1,acoustic_complexity,512,1,NA,5,1750.19321542549,NA 
rayol-farm1_2019-04-03_00-57-33.wav,44100,16,60,1,acoustic_complexity,512,1,NA,5,1749.96828455316,NA 
rayol-farm1_2019-04-03_00-58-33.wav,44100,16,60,1,acoustic_complexity,512,1,NA,5,1753.59624950851,NA 
rayol-farm1_2019-04-03_00-59-33.wav,44100,16,60,1,acoustic_complexity,512,1,NA,5,1749.16489087166,NA 
rayol-farm1_2019-04-03_01-00-33.wav,44100,16,60,1,acoustic_complexity,512,1,NA,5,1751.04384406756,NA 
rayol-farm1_2019-04-03_01-01-33.wav,44100,16,60,1,acoustic_complexity,512,1,NA,5,1748.9508684317,NA 
rayol-farm1_2019-04-03_01-02-33.wav,44100,16,60,1,acoustic_complexity,512,1,NA,5,1754.5767641658,NA 
rayol-farm1_2019-04-03_01-03-33.wav,44100,16,60,1,acoustic_complexity,512,1,NA,5,1754.75770983806,NA 
rayol-farm1_2019-04-03_01-04-33.wav,44100,16,60,1,acoustic_complexity,512,1,NA,5,1757.25808784404,NA 
rayol-farm1_2019-04-03_01-05-33.wav,44100,16,60,1,acoustic_complexity,512,1,NA,5,1750.21338362375,NA 
rayol-farm1_2019-04-03_01-06-33.wav,44100,16,60,1,acoustic_complexity,512,1,NA,5,1750.49548663727,NA 
rayol-farm1_2019-04-03_01-07-33.wav,44100,16,60,1,acoustic_complexity,512,1,NA,5,1748.33151985652,NA 
rayol-farm1_2019-04-03_01-08-33.wav,44100,16,60,1,acoustic_complexity,512,1,NA,5,1755.06647004836,NA 
rayol-farm1_2019-04-03_01-09-33.wav,44100,16,60,1,acoustic_complexity,512,1,NA,5,1756.65983107219,NA 
rayol-farm1_2019-04-03_01-10-33.wav,44100,16,60,1,acoustic_complexity,512,1,NA,5,1753.65078038779,NA 
rayol-farm1_2019-04-03_01-11-33.wav,44100,16,60,1,acoustic_complexity,512,1,NA,5,1750.61845752296,NA 
rayol-farm1_2019-04-03_01-12-33.wav,44100,16,60,1,acoustic_complexity,512,1,NA,5,1756.95737204021,NA 
rayol-farm1_2019-04-03_01-13-33.wav,44100,16,60,1,acoustic_complexity,512,1,NA,5,1757.21652837326,NA 
rayol-farm1_2019-04-03_01-14-33.wav,44100,16,60,1,acoustic_complexity,512,1,NA,5,1756.81140048855,NA 
rayol-farm1_2019-04-03_01-15-33.wav,44100,16,60,1,acoustic_complexity,512,1,NA,5,1754.75009975584,NA 
rayol-farm1_2019-04-03_01-16-33.wav,44100,16,60,1,acoustic_complexity,512,1,NA,5,1750.19987597631,NA 
rayol-farm1_2019-04-03_01-17-33.wav,44100,16,60,1,acoustic_complexity,512,1,NA,5,1758.46122950809,NA 
rayol-farm1_2019-04-03_01-18-33.wav,44100,16,60,1,acoustic_complexity,512,1,NA,5,1755.24668317689,NA 
rayol-farm1_2019-04-03_01-19-33.wav,44100,16,60,1,acoustic_complexity,512,1,NA,5,1759.05892350898,NA 
rayol-farm1_2019-04-03_01-20-33.wav,44100,16,60,1,acoustic_complexity,512,1,NA,5,1756.9253032893,NA 
rayol-farm1_2019-04-03_01-21-33.wav,44100,16,60,1,acoustic_complexity,512,1,NA,5,1757.57839088586,NA 
rayol-farm1_2019-04-03_01-22-33.wav,44100,16,60,1,acoustic_complexity,512,1,NA,5,1755.6855846308,NA 
rayol-farm1_2019-04-03_01-23-33.wav,44100,16,60,1,acoustic_complexity,512,1,NA,5,1761.95145141291,NA 
rayol-farm1_2019-04-03_01-24-33.wav,44100,16,60,1,acoustic_complexity,512,1,NA,5,1761.82527127743,NA 
rayol-farm1_2019-04-03_01-25-33.wav,44100,16,60,1,acoustic_complexity,512,1,NA,5,1748.55510861432,NA 
rayol-farm1_2019-04-03_01-26-33.wav,44100,16,60,1,acoustic_complexity,512,1,NA,5,1753.00830763199,NA 
rayol-farm1_2019-04-03_01-27-33.wav,44100,16,60,1,acoustic_complexity,512,1,NA,5,1756.81839195479,NA 
rayol-farm1_2019-04-03_01-28-33.wav,44100,16,60,1,acoustic_complexity,512,1,NA,5,1753.38010822037,NA 
rayol-farm1_2019-04-03_01-29-33.wav,44100,16,60,1,acoustic_complexity,512,1,NA,5,1752.3842471041,NA 
rayol-farm1_2019-04-03_01-30-33.wav,44100,16,60,1,acoustic_complexity,512,1,NA,5,1750.31444498216,NA 
rayol-farm1_2019-04-03_01-31-33.wav,44100,16,60,1,acoustic_complexity,512,1,NA,5,1760.84643146027,NA 
rayol-farm1_2019-04-03_01-32-33.wav,44100,16,60,1,acoustic_complexity,512,1,NA,5,1751.01441493625,NA 
rayol-farm1_2019-04-03_01-33-33.wav,44100,16,60,1,acoustic_complexity,512,1,NA,5,1747.32911037209,NA 
rayol-farm1_2019-04-03_01-34-33.wav,44100,16,60,1,acoustic_complexity,512,1,NA,5,1755.84650235821,NA 
rayol-farm1_2019-04-03_01-35-33.wav,44100,16,60,1,acoustic_complexity,512,1,NA,5,1750.92127030124,NA 
rayol-farm1_2019-04-03_01-36-33.wav,44100,16,60,1,acoustic_complexity,512,1,NA,5,1758.54425282003,NA 
rayol-farm1_2019-04-03_01-37-33.wav,44100,16,60,1,acoustic_complexity,512,1,NA,5,1751.30957837486,NA 
rayol-farm1_2019-04-03_01-38-33.wav,44100,16,60,1,acoustic_complexity,512,1,NA,5,1751.3345833637,NA 
rayol-farm1_2019-04-03_01-39-33.wav,44100,16,60,1,acoustic_complexity,512,1,NA,5,1748.87245963924,NA 
rayol-farm1_2019-04-03_01-40-33.wav,44100,16,60,1,acoustic_complexity,512,1,NA,5,1755.50561168674,NA 
rayol-farm1_2019-04-03_01-41-33.wav,44100,16,60,1,acoustic_complexity,512,1,NA,5,1756.6537177498,NA 
rayol-farm1_2019-04-03_01-42-33.wav,44100,16,60,1,acoustic_complexity,512,1,NA,5,1753.2526282468,NA 
rayol-farm1_2019-04-03_01-43-33.wav,44100,16,60,1,acoustic_complexity,512,1,NA,5,1755.86796734407,NA 
rayol-farm1_2019-04-03_01-44-33.wav,44100,16,60,1,acoustic_complexity,512,1,NA,5,1755.17811543957,NA 
rayol-farm1_2019-04-03_01-45-33.wav,44100,16,60,1,acoustic_complexity,512,1,NA,5,1753.76825330011,NA 
rayol-farm1_2019-04-03_01-46-33.wav,44100,16,60,1,acoustic_complexity,512,1,NA,5,1756.75769286823,NA 
rayol-farm1_2019-04-03_01-47-33.wav,44100,16,60,1,acoustic_complexity,512,1,NA,5,1767.61745543288,NA 
rayol-farm1_2019-04-03_01-48-33.wav,44100,16,60,1,acoustic_complexity,512,1,NA,5,1768.41825787802,NA 
rayol-farm1_2019-04-03_01-49-33.wav,44100,16,60,1,acoustic_complexity,512,1,NA,5,1767.95267426699,NA 
rayol-farm1_2019-04-03_01-50-33.wav,44100,16,60,1,acoustic_complexity,512,1,NA,5,1764.22486681998,NA 
rayol-farm1_2019-04-03_01-51-33.wav,44100,16,60,1,acoustic_complexity,512,1,NA,5,1768.12751425977,NA 
rayol-farm1_2019-04-03_01-52-33.wav,44100,16,60,1,acoustic_complexity,512,1,NA,5,1765.66266140966,NA 
rayol-farm1_2019-04-03_01-53-33.wav,44100,16,60,1,acoustic_complexity,512,1,NA,5,1768.20813985773,NA 
rayol-farm1_2019-04-03_01-54-33.wav,44100,16,60,1,acoustic_complexity,512,1,NA,5,1755.90005047317,NA 
rayol-farm1_2019-04-03_01-55-33.wav,44100,16,60,1,acoustic_complexity,512,1,NA,5,1763.496976631,NA 
rayol-farm1_2019-04-03_01-56-33.wav,44100,16,60,1,acoustic_complexity,512,1,NA,5,1761.66012773038,NA 
rayol-farm1_2019-04-03_01-57-33.wav,44100,16,60,1,acoustic_complexity,512,1,NA,5,1764.80795433749,NA 
rayol-farm1_2019-04-03_01-58-33.wav,44100,16,60,1,acoustic_complexity,512,1,NA,5,1763.72345300201,NA 
rayol-farm1_2019-04-03_01-59-33.wav,44100,16,60,1,acoustic_complexity,512,1,NA,5,1767.48963896999,NA 
rayol-farm1_2019-04-03_02-00-33.wav,44100,16,60,1,acoustic_complexity,512,1,NA,5,1759.54596220457,NA 
rayol-farm1_2019-04-03_02-01-33.wav,44100,16,60,1,acoustic_complexity,512,1,NA,5,1758.83714642781,NA 
rayol-farm1_2019-04-03_02-02-33.wav,44100,16,60,1,acoustic_complexity,512,1,NA,5,1759.92462572594,NA 
rayol-farm1_2019-04-03_02-03-33.wav,44100,16,60,1,acoustic_complexity,512,1,NA,5,1751.28096400342,NA 
rayol-farm1_2019-04-03_02-04-33.wav,44100,16,60,1,acoustic_complexity,512,1,NA,5,1754.68525115685,NA 
rayol-farm1_2019-04-03_02-05-33.wav,44100,16,60,1,acoustic_complexity,512,1,NA,5,1762.23002950364,NA 
rayol-farm1_2019-04-03_02-06-33.wav,44100,16,60,1,acoustic_complexity,512,1,NA,5,1756.34718013978,NA 
rayol-farm1_2019-04-03_02-07-33.wav,44100,16,60,1,acoustic_complexity,512,1,NA,5,1772.30115385641,NA 
rayol-farm1_2019-04-03_02-08-33.wav,44100,16,60,1,acoustic_complexity,512,1,NA,5,1756.43936675922,NA 
rayol-farm1_2019-04-03_02-09-33.wav,44100,16,60,1,acoustic_complexity,512,1,NA,5,1754.4503288997,NA 
rayol-farm1_2019-04-03_02-10-33.wav,44100,16,60,1,acoustic_complexity,512,1,NA,5,1758.23676171889,NA 
rayol-farm1_2019-04-03_02-11-33.wav,44100,16,60,1,acoustic_complexity,512,1,NA,5,1752.09403927628,NA 
rayol-farm1_2019-04-03_02-12-33.wav,44100,16,60,1,acoustic_complexity,512,1,NA,5,1753.91040287036,NA 
rayol-farm1_2019-04-03_02-13-33.wav,44100,16,60,1,acoustic_complexity,512,1,NA,5,1756.85150486425,NA 
rayol-farm1_2019-04-03_02-14-33.wav,44100,16,60,1,acoustic_complexity,512,1,NA,5,1756.61483532174,NA 
rayol-farm1_2019-04-03_02-15-33.wav,44100,16,60,1,acoustic_complexity,512,1,NA,5,1757.92386294052,NA 
rayol-farm1_2019-04-03_02-16-33.wav,44100,16,60,1,acoustic_complexity,512,1,NA,5,1757.62267679627,NA 
rayol-farm1_2019-04-03_02-17-33.wav,44100,16,60,1,acoustic_complexity,512,1,NA,5,1757.48682420627,NA 
rayol-farm1_2019-04-03_02-18-33.wav,44100,16,60,1,acoustic_complexity,512,1,NA,5,1761.08194984137,NA 
rayol-farm1_2019-04-03_02-19-33.wav,44100,16,60,1,acoustic_complexity,512,1,NA,5,1763.23177489229,NA 
rayol-farm1_2019-04-03_02-20-33.wav,44100,16,60,1,acoustic_complexity,512,1,NA,5,1761.82890598407,NA 
rayol-farm1_2019-04-03_02-21-33.wav,44100,16,60,1,acoustic_complexity,512,1,NA,5,1768.37125297843,NA 
rayol-farm1_2019-04-03_02-22-33.wav,44100,16,60,1,acoustic_complexity,512,1,NA,5,1768.33333013347,NA 
rayol-farm1_2019-04-03_02-23-33.wav,44100,16,60,1,acoustic_complexity,512,1,NA,5,1770.04643882372,NA 
rayol-farm1_2019-04-03_02-24-33.wav,44100,16,60,1,acoustic_complexity,512,1,NA,5,1758.03851949274,NA 
rayol-farm1_2019-04-03_02-25-33.wav,44100,16,60,1,acoustic_complexity,512,1,NA,5,1757.25037169444,NA 
rayol-farm1_2019-04-03_02-26-33.wav,44100,16,60,1,acoustic_complexity,512,1,NA,5,1763.23312459219,NA 
rayol-farm1_2019-04-03_02-27-33.wav,44100,16,60,1,acoustic_complexity,512,1,NA,5,1761.78783084594,NA 
rayol-farm1_2019-04-03_02-28-33.wav,44100,16,60,1,acoustic_complexity,512,1,NA,5,1765.2349574055,NA 
rayol-farm1_2019-04-03_02-29-33.wav,44100,16,60,1,acoustic_complexity,512,1,NA,5,1756.38132734535,NA 
rayol-farm1_2019-04-03_02-30-33.wav,44100,16,60,1,acoustic_complexity,512,1,NA,5,1762.9834665442,NA 
rayol-farm1_2019-04-03_02-31-33.wav,44100,16,60,1,acoustic_complexity,512,1,NA,5,1759.83056617184,NA 
rayol-farm1_2019-04-03_02-32-33.wav,44100,16,60,1,acoustic_complexity,512,1,NA,5,1757.65915741621,NA 
rayol-farm1_2019-04-03_02-33-33.wav,44100,16,60,1,acoustic_complexity,512,1,NA,5,1761.7659888912,NA 
rayol-farm1_2019-04-03_02-34-33.wav,44100,16,60,1,acoustic_complexity,512,1,NA,5,1759.34172531362,NA 
rayol-farm1_2019-04-03_02-35-33.wav,44100,16,60,1,acoustic_complexity,512,1,NA,5,1758.10275072793,NA 
rayol-farm1_2019-04-03_02-36-33.wav,44100,16,60,1,acoustic_complexity,512,1,NA,5,1756.45733197382,NA 
rayol-farm1_2019-04-03_02-37-33.wav,44100,16,60,1,acoustic_complexity,512,1,NA,5,1760.73949187568,NA 
rayol-farm1_2019-04-03_02-38-33.wav,44100,16,60,1,acoustic_complexity,512,1,NA,5,1761.0443823931,NA 
rayol-farm1_2019-04-03_02-39-33.wav,44100,16,60,1,acoustic_complexity,512,1,NA,5,1760.45121125862,NA 
rayol-farm1_2019-04-03_02-40-33.wav,44100,16,60,1,acoustic_complexity,512,1,NA,5,1754.41051268927,NA 
rayol-farm1_2019-04-03_02-41-33.wav,44100,16,60,1,acoustic_complexity,512,1,NA,5,1755.13989038969,NA 
rayol-farm1_2019-04-03_02-42-33.wav,44100,16,60,1,acoustic_complexity,512,1,NA,5,1758.02289359316,NA 
rayol-farm1_2019-04-03_02-43-33.wav,44100,16,60,1,acoustic_complexity,512,1,NA,5,1755.38390937686,NA 
rayol-farm1_2019-04-03_02-44-33.wav,44100,16,60,1,acoustic_complexity,512,1,NA,5,1759.20009604059,NA 
rayol-farm1_2019-04-03_02-45-33.wav,44100,16,60,1,acoustic_complexity,512,1,NA,5,1761.04134366182,NA 
rayol-farm1_2019-04-03_02-46-33.wav,44100,16,60,1,acoustic_complexity,512,1,NA,5,1751.28160976851,NA 
rayol-farm1_2019-04-03_02-47-33.wav,44100,16,60,1,acoustic_complexity,512,1,NA,5,1755.92781533102,NA 
rayol-farm1_2019-04-03_02-48-33.wav,44100,16,60,1,acoustic_complexity,512,1,NA,5,1759.58341893072,NA 
rayol-farm1_2019-04-03_02-49-33.wav,44100,16,60,1,acoustic_complexity,512,1,NA,5,1752.95561417503,NA 
rayol-farm1_2019-04-03_02-50-33.wav,44100,16,60,1,acoustic_complexity,512,1,NA,5,1761.67709927772,NA 
rayol-farm1_2019-04-03_02-51-33.wav,44100,16,60,1,acoustic_complexity,512,1,NA,5,1770.608225798,NA 
rayol-farm1_2019-04-03_02-52-33.wav,44100,16,60,1,acoustic_complexity,512,1,NA,5,1775.50390655546,NA 
rayol-farm1_2019-04-03_02-53-33.wav,44100,16,60,1,acoustic_complexity,512,1,NA,5,1767.67212985462,NA 
rayol-farm1_2019-04-03_02-54-33.wav,44100,16,60,1,acoustic_complexity,512,1,NA,5,1761.51549846156,NA 
rayol-farm1_2019-04-03_02-55-33.wav,44100,16,60,1,acoustic_complexity,512,1,NA,5,1765.44219543107,NA 
rayol-farm1_2019-04-03_02-56-33.wav,44100,16,60,1,acoustic_complexity,512,1,NA,5,1774.10986266764,NA 
rayol-farm1_2019-04-03_02-57-33.wav,44100,16,60,1,acoustic_complexity,512,1,NA,5,1763.1509753547,NA 
rayol-farm1_2019-04-03_02-58-33.wav,44100,16,60,1,acoustic_complexity,512,1,NA,5,1762.30052560076,NA 
rayol-farm1_2019-04-03_02-59-33.wav,44100,16,60,1,acoustic_complexity,512,1,NA,5,1763.59356813582,NA 
rayol-farm1_2019-04-03_03-00-33.wav,44100,16,60,1,acoustic_complexity,512,1,NA,5,1757.60627984126,NA 
rayol-farm1_2019-04-03_03-01-33.wav,44100,16,60,1,acoustic_complexity,512,1,NA,5,1762.15870571496,NA 
rayol-farm1_2019-04-03_03-02-33.wav,44100,16,60,1,acoustic_complexity,512,1,NA,5,1760.43913093679,NA 
rayol-farm1_2019-04-03_03-03-33.wav,44100,16,60,1,acoustic_complexity,512,1,NA,5,1749.3748047846,NA 
rayol-farm1_2019-04-03_03-04-33.wav,44100,16,60,1,acoustic_complexity,512,1,NA,5,1753.27432344128,NA 
rayol-farm1_2019-04-03_03-05-33.wav,44100,16,60,1,acoustic_complexity,512,1,NA,5,1762.16949081221,NA 
rayol-farm1_2019-04-03_03-06-33.wav,44100,16,60,1,acoustic_complexity,512,1,NA,5,1760.91067368163,NA 
rayol-farm1_2019-04-03_03-07-33.wav,44100,16,60,1,acoustic_complexity,512,1,NA,5,1758.79319561623,NA 
rayol-farm1_2019-04-03_03-08-33.wav,44100,16,60,1,acoustic_complexity,512,1,NA,5,1756.79423612913,NA 
rayol-farm1_2019-04-03_03-09-33.wav,44100,16,60,1,acoustic_complexity,512,1,NA,5,1750.72803242935,NA 
rayol-farm1_2019-04-03_03-10-33.wav,44100,16,60,1,acoustic_complexity,512,1,NA,5,1763.50328044209,NA 
rayol-farm1_2019-04-03_03-11-33.wav,44100,16,60,1,acoustic_complexity,512,1,NA,5,1756.68291058286,NA 
rayol-farm1_2019-04-03_03-12-33.wav,44100,16,60,1,acoustic_complexity,512,1,NA,5,1759.0815979388,NA 
rayol-farm1_2019-04-03_03-13-33.wav,44100,16,60,1,acoustic_complexity,512,1,NA,5,1768.41233256451,NA 
rayol-farm1_2019-04-03_03-14-33.wav,44100,16,60,1,acoustic_complexity,512,1,NA,5,1753.56152964953,NA 
rayol-farm1_2019-04-03_03-15-33.wav,44100,16,60,1,acoustic_complexity,512,1,NA,5,1748.44759407928,NA 
rayol-farm1_2019-04-03_03-16-33.wav,44100,16,60,1,acoustic_complexity,512,1,NA,5,1760.78285729635,NA 
rayol-farm1_2019-04-03_03-17-33.wav,44100,16,60,1,acoustic_complexity,512,1,NA,5,1760.79780524241,NA 
rayol-farm1_2019-04-03_03-18-33.wav,44100,16,60,1,acoustic_complexity,512,1,NA,5,1760.08395199767,NA 
rayol-farm1_2019-04-03_03-19-33.wav,44100,16,60,1,acoustic_complexity,512,1,NA,5,1758.58263274852,NA 
rayol-farm1_2019-04-03_03-20-33.wav,44100,16,60,1,acoustic_complexity,512,1,NA,5,1757.03893519602,NA 
rayol-farm1_2019-04-03_03-21-33.wav,44100,16,60,1,acoustic_complexity,512,1,NA,5,1762.10365542682,NA 
rayol-farm1_2019-04-03_03-22-33.wav,44100,16,60,1,acoustic_complexity,512,1,NA,5,1753.69071042287,NA 
rayol-farm1_2019-04-03_03-23-33.wav,44100,16,60,1,acoustic_complexity,512,1,NA,5,1758.6594904242,NA 
rayol-farm1_2019-04-03_03-24-33.wav,44100,16,60,1,acoustic_complexity,512,1,NA,5,1752.25812424773,NA 
rayol-farm1_2019-04-03_03-25-33.wav,44100,16,60,1,acoustic_complexity,512,1,NA,5,1752.16145888828,NA 
rayol-farm1_2019-04-03_03-26-33.wav,44100,16,60,1,acoustic_complexity,512,1,NA,5,1760.71449256662,NA 
rayol-farm1_2019-04-03_03-27-33.wav,44100,16,60,1,acoustic_complexity,512,1,NA,5,1754.27948507807,NA 
rayol-farm1_2019-04-03_03-28-33.wav,44100,16,60,1,acoustic_complexity,512,1,NA,5,1755.41388647375,NA 
rayol-farm1_2019-04-03_03-29-33.wav,44100,16,60,1,acoustic_complexity,512,1,NA,5,1759.63503217576,NA 
rayol-farm1_2019-04-03_03-30-33.wav,44100,16,60,1,acoustic_complexity,512,1,NA,5,1760.58435014732,NA 
rayol-farm1_2019-04-03_03-31-33.wav,44100,16,60,1,acoustic_complexity,512,1,NA,5,1756.29657607439,NA 
rayol-farm1_2019-04-03_03-32-33.wav,44100,16,60,1,acoustic_complexity,512,1,NA,5,1757.06797370267,NA 
rayol-farm1_2019-04-03_03-33-33.wav,44100,16,60,1,acoustic_complexity,512,1,NA,5,1751.25708124567,NA 
rayol-farm1_2019-04-03_03-34-33.wav,44100,16,60,1,acoustic_complexity,512,1,NA,5,1759.82458830955,NA 
rayol-farm1_2019-04-03_03-35-33.wav,44100,16,60,1,acoustic_complexity,512,1,NA,5,1760.57065324239,NA 
rayol-farm1_2019-04-03_03-36-33.wav,44100,16,60,1,acoustic_complexity,512,1,NA,5,1751.95965551565,NA 
rayol-farm1_2019-04-03_03-37-33.wav,44100,16,60,1,acoustic_complexity,512,1,NA,5,1759.85811418537,NA 
rayol-farm1_2019-04-03_03-38-33.wav,44100,16,60,1,acoustic_complexity,512,1,NA,5,1760.45900295825,NA 
rayol-farm1_2019-04-03_03-39-33.wav,44100,16,60,1,acoustic_complexity,512,1,NA,5,1754.99624651879,NA 
rayol-farm1_2019-04-03_03-40-33.wav,44100,16,60,1,acoustic_complexity,512,1,NA,5,1758.63813209755,NA 
rayol-farm1_2019-04-03_03-41-33.wav,44100,16,60,1,acoustic_complexity,512,1,NA,5,1757.22005064696,NA 
rayol-farm1_2019-04-03_03-42-33.wav,44100,16,60,1,acoustic_complexity,512,1,NA,5,1757.95449258013,NA 
rayol-farm1_2019-04-03_03-43-33.wav,44100,16,60,1,acoustic_complexity,512,1,NA,5,1759.30816181295,NA 
rayol-farm1_2019-04-03_03-44-33.wav,44100,16,60,1,acoustic_complexity,512,1,NA,5,1764.4467194262,NA 
rayol-farm1_2019-04-03_03-45-33.wav,44100,16,60,1,acoustic_complexity,512,1,NA,5,1766.33192574525,NA 
rayol-farm1_2019-04-03_03-46-33.wav,44100,16,60,1,acoustic_complexity,512,1,NA,5,1771.69909713119,NA 
rayol-farm1_2019-04-03_03-47-33.wav,44100,16,60,1,acoustic_complexity,512,1,NA,5,1783.07908076853,NA 
rayol-farm1_2019-04-03_03-48-33.wav,44100,16,60,1,acoustic_complexity,512,1,NA,5,1761.02324307752,NA 
rayol-farm1_2019-04-03_03-49-33.wav,44100,16,60,1,acoustic_complexity,512,1,NA,5,1770.63241584464,NA 
rayol-farm1_2019-04-03_03-50-33.wav,44100,16,60,1,acoustic_complexity,512,1,NA,5,1767.2584287773,NA 
rayol-farm1_2019-04-03_03-51-33.wav,44100,16,60,1,acoustic_complexity,512,1,NA,5,1768.53416690281,NA 
rayol-farm1_2019-04-03_03-52-33.wav,44100,16,60,1,acoustic_complexity,512,1,NA,5,1766.73260791309,NA 
rayol-farm1_2019-04-03_03-53-33.wav,44100,16,60,1,acoustic_complexity,512,1,NA,5,1770.89293150392,NA 
rayol-farm1_2019-04-03_03-54-33.wav,44100,16,60,1,acoustic_complexity,512,1,NA,5,1764.50956903279,NA 
rayol-farm1_2019-04-03_03-55-33.wav,44100,16,60,1,acoustic_complexity,512,1,NA,5,1758.97174434763,NA 
rayol-farm1_2019-04-03_03-56-33.wav,44100,16,60,1,acoustic_complexity,512,1,NA,5,1757.95215531284,NA 
rayol-farm1_2019-04-03_03-57-33.wav,44100,16,60,1,acoustic_complexity,512,1,NA,5,1750.96648002627,NA 
rayol-farm1_2019-04-03_03-58-33.wav,44100,16,60,1,acoustic_complexity,512,1,NA,5,1747.5383506792,NA 
rayol-farm1_2019-04-03_03-59-33.wav,44100,16,60,1,acoustic_complexity,512,1,NA,5,1755.92993015272,NA 
rayol-farm1_2019-04-03_04-00-33.wav,44100,16,60,1,acoustic_complexity,512,1,NA,5,1762.1230125597,NA 
rayol-farm1_2019-04-03_04-01-33.wav,44100,16,60,1,acoustic_complexity,512,1,NA,5,1755.21728256273,NA 
rayol-farm1_2019-04-03_04-02-33.wav,44100,16,60,1,acoustic_complexity,512,1,NA,5,1757.94540871007,NA 
rayol-farm1_2019-04-03_04-03-33.wav,44100,16,60,1,acoustic_complexity,512,1,NA,5,1748.64082599098,NA 
rayol-farm1_2019-04-03_04-04-33.wav,44100,16,60,1,acoustic_complexity,512,1,NA,5,1763.48313099631,NA 
rayol-farm1_2019-04-03_04-05-33.wav,44100,16,60,1,acoustic_complexity,512,1,NA,5,1755.79794253671,NA 
rayol-farm1_2019-04-03_04-06-33.wav,44100,16,60,1,acoustic_complexity,512,1,NA,5,1755.44688073858,NA 
rayol-farm1_2019-04-03_04-07-33.wav,44100,16,60,1,acoustic_complexity,512,1,NA,5,1756.61905695382,NA 
rayol-farm1_2019-04-03_04-08-33.wav,44100,16,60,1,acoustic_complexity,512,1,NA,5,1755.76309292916,NA 
rayol-farm1_2019-04-03_04-09-33.wav,44100,16,60,1,acoustic_complexity,512,1,NA,5,1751.84847131983,NA 
rayol-farm1_2019-04-03_04-10-33.wav,44100,16,60,1,acoustic_complexity,512,1,NA,5,1755.33125227843,NA 
rayol-farm1_2019-04-03_04-11-33.wav,44100,16,60,1,acoustic_complexity,512,1,NA,5,1747.78020206118,NA 
rayol-farm1_2019-04-03_04-12-33.wav,44100,16,60,1,acoustic_complexity,512,1,NA,5,1759.34228345819,NA 
rayol-farm1_2019-04-03_04-13-33.wav,44100,16,60,1,acoustic_complexity,512,1,NA,5,1761.58250813642,NA 
rayol-farm1_2019-04-03_04-14-33.wav,44100,16,60,1,acoustic_complexity,512,1,NA,5,1760.63598579502,NA 
rayol-farm1_2019-04-03_04-15-33.wav,44100,16,60,1,acoustic_complexity,512,1,NA,5,1760.54449207088,NA 
rayol-farm1_2019-04-03_04-16-33.wav,44100,16,60,1,acoustic_complexity,512,1,NA,5,1758.44984581357,NA 
rayol-farm1_2019-04-03_04-17-33.wav,44100,16,60,1,acoustic_complexity,512,1,NA,5,1768.14280880503,NA 
rayol-farm1_2019-04-03_04-18-33.wav,44100,16,60,1,acoustic_complexity,512,1,NA,5,1762.91783497613,NA 
rayol-farm1_2019-04-03_04-19-33.wav,44100,16,60,1,acoustic_complexity,512,1,NA,5,1765.36423118712,NA 
rayol-farm1_2019-04-03_04-20-33.wav,44100,16,60,1,acoustic_complexity,512,1,NA,5,1770.04289356614,NA 
rayol-farm1_2019-04-03_04-21-33.wav,44100,16,60,1,acoustic_complexity,512,1,NA,5,1764.19053205354,NA 
rayol-farm1_2019-04-03_04-22-33.wav,44100,16,60,1,acoustic_complexity,512,1,NA,5,1757.02766748153,NA 
rayol-farm1_2019-04-03_04-23-33.wav,44100,16,60,1,acoustic_complexity,512,1,NA,5,1765.88261707126,NA 
rayol-farm1_2019-04-03_04-24-33.wav,44100,16,60,1,acoustic_complexity,512,1,NA,5,1762.39464889915,NA 
rayol-farm1_2019-04-03_04-25-33.wav,44100,16,60,1,acoustic_complexity,512,1,NA,5,1757.23427868005,NA 
rayol-farm1_2019-04-03_04-26-33.wav,44100,16,60,1,acoustic_complexity,512,1,NA,5,1760.54577806599,NA 
rayol-farm1_2019-04-03_04-27-33.wav,44100,16,60,1,acoustic_complexity,512,1,NA,5,1756.51862261484,NA 
rayol-farm1_2019-04-03_04-28-33.wav,44100,16,60,1,acoustic_complexity,512,1,NA,5,1760.16021920231,NA 
rayol-farm1_2019-04-03_04-29-33.wav,44100,16,60,1,acoustic_complexity,512,1,NA,5,1756.56283285639,NA 
rayol-farm1_2019-04-03_04-30-33.wav,44100,16,60,1,acoustic_complexity,512,1,NA,5,1756.40978252002,NA 
rayol-farm1_2019-04-03_04-31-33.wav,44100,16,60,1,acoustic_complexity,512,1,NA,5,1761.14684770626,NA 
rayol-farm1_2019-04-03_04-32-33.wav,44100,16,60,1,acoustic_complexity,512,1,NA,5,1760.14400002009,NA 
rayol-farm1_2019-04-03_04-33-33.wav,44100,16,60,1,acoustic_complexity,512,1,NA,5,1751.53973867943,NA 
rayol-farm1_2019-04-03_04-34-33.wav,44100,16,60,1,acoustic_complexity,512,1,NA,5,1762.23082768954,NA 
rayol-farm1_2019-04-03_04-35-33.wav,44100,16,60,1,acoustic_complexity,512,1,NA,5,1760.24976803412,NA 
rayol-farm1_2019-04-03_04-36-33.wav,44100,16,60,1,acoustic_complexity,512,1,NA,5,1752.90250805367,NA 
rayol-farm1_2019-04-03_04-37-33.wav,44100,16,60,1,acoustic_complexity,512,1,NA,5,1749.00560684144,NA 
rayol-farm1_2019-04-03_04-38-33.wav,44100,16,60,1,acoustic_complexity,512,1,NA,5,1753.97012103238,NA 
rayol-farm1_2019-04-03_04-39-33.wav,44100,16,60,1,acoustic_complexity,512,1,NA,5,1757.71212907317,NA 
rayol-farm1_2019-04-03_04-40-33.wav,44100,16,60,1,acoustic_complexity,512,1,NA,5,1753.29484293714,NA 
rayol-farm1_2019-04-03_04-41-33.wav,44100,16,60,1,acoustic_complexity,512,1,NA,5,1752.39831124072,NA 
rayol-farm1_2019-04-03_04-42-33.wav,44100,16,60,1,acoustic_complexity,512,1,NA,5,1762.70447811356,NA 
rayol-farm1_2019-04-03_04-43-33.wav,44100,16,60,1,acoustic_complexity,512,1,NA,5,1754.80196141698,NA 
rayol-farm1_2019-04-03_04-44-33.wav,44100,16,60,1,acoustic_complexity,512,1,NA,5,1756.60203097301,NA 
rayol-farm1_2019-04-03_04-45-33.wav,44100,16,60,1,acoustic_complexity,512,1,NA,5,1756.89199400822,NA 
rayol-farm1_2019-04-03_04-46-33.wav,44100,16,60,1,acoustic_complexity,512,1,NA,5,1772.23614491508,NA 
rayol-farm1_2019-04-03_04-47-33.wav,44100,16,60,1,acoustic_complexity,512,1,NA,5,1767.11524978809,NA 
rayol-farm1_2019-04-03_04-48-33.wav,44100,16,60,1,acoustic_complexity,512,1,NA,5,1764.36153709599,NA 
rayol-farm1_2019-04-03_04-49-33.wav,44100,16,60,1,acoustic_complexity,512,1,NA,5,1763.19209428993,NA 
rayol-farm1_2019-04-03_04-50-33.wav,44100,16,60,1,acoustic_complexity,512,1,NA,5,1760.51100601877,NA 
rayol-farm1_2019-04-03_04-51-33.wav,44100,16,60,1,acoustic_complexity,512,1,NA,5,1765.14163125834,NA 
rayol-farm1_2019-04-03_04-52-33.wav,44100,16,60,1,acoustic_complexity,512,1,NA,5,1758.54172298191,NA 
rayol-farm1_2019-04-03_04-53-33.wav,44100,16,60,1,acoustic_complexity,512,1,NA,5,1759.41431577127,NA 
rayol-farm1_2019-04-03_04-54-33.wav,44100,16,60,1,acoustic_complexity,512,1,NA,5,1759.96523098514,NA 
rayol-farm1_2019-04-03_04-55-33.wav,44100,16,60,1,acoustic_complexity,512,1,NA,5,1753.8353282312,NA 
rayol-farm1_2019-04-03_04-56-33.wav,44100,16,60,1,acoustic_complexity,512,1,NA,5,1763.64567544991,NA 
rayol-farm1_2019-04-03_04-57-33.wav,44100,16,60,1,acoustic_complexity,512,1,NA,5,1762.80413550128,NA 
rayol-farm1_2019-04-03_04-58-33.wav,44100,16,60,1,acoustic_complexity,512,1,NA,5,1758.48852672437,NA 
rayol-farm1_2019-04-03_04-59-33.wav,44100,16,60,1,acoustic_complexity,512,1,NA,5,1762.57527605865,NA 
rayol-farm1_2019-04-03_05-00-33.wav,44100,16,60,1,acoustic_complexity,512,1,NA,5,1770.97573710694,NA 
rayol-farm1_2019-04-03_05-01-33.wav,44100,16,60,1,acoustic_complexity,512,1,NA,5,1763.35641276068,NA 
rayol-farm1_2019-04-03_05-02-33.wav,44100,16,60,1,acoustic_complexity,512,1,NA,5,1764.46699869871,NA 
rayol-farm1_2019-04-03_05-03-33.wav,44100,16,60,1,acoustic_complexity,512,1,NA,5,1756.58855141507,NA 
rayol-farm1_2019-04-03_05-04-33.wav,44100,16,60,1,acoustic_complexity,512,1,NA,5,1758.35709762049,NA 
rayol-farm1_2019-04-03_05-05-33.wav,44100,16,60,1,acoustic_complexity,512,1,NA,5,1758.22230821945,NA 
rayol-farm1_2019-04-03_05-06-33.wav,44100,16,60,1,acoustic_complexity,512,1,NA,5,1760.39820658155,NA 
rayol-farm1_2019-04-03_05-07-33.wav,44100,16,60,1,acoustic_complexity,512,1,NA,5,1765.90961164555,NA 
rayol-farm1_2019-04-03_05-08-33.wav,44100,16,60,1,acoustic_complexity,512,1,NA,5,1752.96422250901,NA 
rayol-farm1_2019-04-03_05-09-33.wav,44100,16,60,1,acoustic_complexity,512,1,NA,5,1760.80905542409,NA 
rayol-farm1_2019-04-03_05-10-33.wav,44100,16,60,1,acoustic_complexity,512,1,NA,5,1761.61672455449,NA 
rayol-farm1_2019-04-03_05-11-33.wav,44100,16,60,1,acoustic_complexity,512,1,NA,5,1756.92875976186,NA 
rayol-farm1_2019-04-03_05-12-33.wav,44100,16,60,1,acoustic_complexity,512,1,NA,5,1769.2656005831,NA 
rayol-farm1_2019-04-03_05-13-33.wav,44100,16,60,1,acoustic_complexity,512,1,NA,5,1761.91344196347,NA 
rayol-farm1_2019-04-03_05-14-33.wav,44100,16,60,1,acoustic_complexity,512,1,NA,5,1756.34763344459,NA 
rayol-farm1_2019-04-03_05-15-33.wav,44100,16,60,1,acoustic_complexity,512,1,NA,5,1763.09302076872,NA 
rayol-farm1_2019-04-03_05-16-33.wav,44100,16,60,1,acoustic_complexity,512,1,NA,5,1764.98743662198,NA 
rayol-farm1_2019-04-03_05-17-33.wav,44100,16,60,1,acoustic_complexity,512,1,NA,5,1761.43669779486,NA 
rayol-farm1_2019-04-03_05-18-33.wav,44100,16,60,1,acoustic_complexity,512,1,NA,5,1763.07127799631,NA 
rayol-farm1_2019-04-03_05-19-33.wav,44100,16,60,1,acoustic_complexity,512,1,NA,5,1769.41897575916,NA 
rayol-farm1_2019-04-03_05-20-33.wav,44100,16,60,1,acoustic_complexity,512,1,NA,5,1782.16812402338,NA 
rayol-farm1_2019-04-03_05-21-33.wav,44100,16,60,1,acoustic_complexity,512,1,NA,5,1772.61419518288,NA 
rayol-farm1_2019-04-03_05-22-33.wav,44100,16,60,1,acoustic_complexity,512,1,NA,5,1768.36972624295,NA 
rayol-farm1_2019-04-03_05-23-33.wav,44100,16,60,1,acoustic_complexity,512,1,NA,5,1766.25207122725,NA 
rayol-farm1_2019-04-03_05-24-33.wav,44100,16,60,1,acoustic_complexity,512,1,NA,5,1792.74909247394,NA 
rayol-farm1_2019-04-03_05-25-33.wav,44100,16,60,1,acoustic_complexity,512,1,NA,5,1816.54384662214,NA 
rayol-farm1_2019-04-03_05-26-33.wav,44100,16,60,1,acoustic_complexity,512,1,NA,5,1883.52884788036,NA 
rayol-farm1_2019-04-03_05-27-33.wav,44100,16,60,1,acoustic_complexity,512,1,NA,5,1883.86406686995,NA 
rayol-farm1_2019-04-03_05-28-33.wav,44100,16,60,1,acoustic_complexity,512,1,NA,5,1841.07858398258,NA 
rayol-farm1_2019-04-03_05-29-33.wav,44100,16,60,1,acoustic_complexity,512,1,NA,5,1888.62403813798,NA 
rayol-farm1_2019-04-03_05-30-33.wav,44100,16,60,1,acoustic_complexity,512,1,NA,5,1930.41523685711,NA 
rayol-farm1_2019-04-03_05-31-33.wav,44100,16,60,1,acoustic_complexity,512,1,NA,5,1916.79255174146,NA 
rayol-farm1_2019-04-03_05-32-33.wav,44100,16,60,1,acoustic_complexity,512,1,NA,5,1901.25179896618,NA 
rayol-farm1_2019-04-03_05-33-33.wav,44100,16,60,1,acoustic_complexity,512,1,NA,5,1900.50458159132,NA 
rayol-farm1_2019-04-03_05-34-33.wav,44100,16,60,1,acoustic_complexity,512,1,NA,5,1877.10724028156,NA 
rayol-farm1_2019-04-03_05-35-33.wav,44100,16,60,1,acoustic_complexity,512,1,NA,5,1848.04765748044,NA 
rayol-farm1_2019-04-03_05-36-33.wav,44100,16,60,1,acoustic_complexity,512,1,NA,5,1852.39956541363,NA 
rayol-farm1_2019-04-03_05-37-33.wav,44100,16,60,1,acoustic_complexity,512,1,NA,5,1820.23125073426,NA 
rayol-farm1_2019-04-03_05-38-33.wav,44100,16,60,1,acoustic_complexity,512,1,NA,5,1806.79075892935,NA 
rayol-farm1_2019-04-03_05-39-33.wav,44100,16,60,1,acoustic_complexity,512,1,NA,5,1818.30788698563,NA 
rayol-farm1_2019-04-03_05-40-33.wav,44100,16,60,1,acoustic_complexity,512,1,NA,5,1800.78765241244,NA 
rayol-farm1_2019-04-03_05-41-33.wav,44100,16,60,1,acoustic_complexity,512,1,NA,5,1793.57696471731,NA 
rayol-farm1_2019-04-03_05-42-33.wav,44100,16,60,1,acoustic_complexity,512,1,NA,5,1789.25617247247,NA 
rayol-farm1_2019-04-03_05-43-33.wav,44100,16,60,1,acoustic_complexity,512,1,NA,5,1778.82516170024,NA 
rayol-farm1_2019-04-03_05-44-33.wav,44100,16,60,1,acoustic_complexity,512,1,NA,5,1786.74485405562,NA 
rayol-farm1_2019-04-03_05-45-33.wav,44100,16,60,1,acoustic_complexity,512,1,NA,5,1791.81850044547,NA 
rayol-farm1_2019-04-03_05-46-33.wav,44100,16,60,1,acoustic_complexity,512,1,NA,5,1779.0941481856,NA 
rayol-farm1_2019-04-03_05-47-33.wav,44100,16,60,1,acoustic_complexity,512,1,NA,5,1775.79940226472,NA 
rayol-farm1_2019-04-03_05-48-33.wav,44100,16,60,1,acoustic_complexity,512,1,NA,5,1776.15788078329,NA 
rayol-farm1_2019-04-03_05-49-33.wav,44100,16,60,1,acoustic_complexity,512,1,NA,5,1758.63375529357,NA 
rayol-farm1_2019-04-03_05-50-33.wav,44100,16,60,1,acoustic_complexity,512,1,NA,5,1777.39221911516,NA 
rayol-farm1_2019-04-03_05-51-33.wav,44100,16,60,1,acoustic_complexity,512,1,NA,5,1776.90395858352,NA 
rayol-farm1_2019-04-03_05-52-33.wav,44100,16,60,1,acoustic_complexity,512,1,NA,5,1762.30782006505,NA 
rayol-farm1_2019-04-03_05-53-33.wav,44100,16,60,1,acoustic_complexity,512,1,NA,5,1769.97003367581,NA 
rayol-farm1_2019-04-03_05-54-33.wav,44100,16,60,1,acoustic_complexity,512,1,NA,5,1763.66323139265,NA 
rayol-farm1_2019-04-03_05-55-33.wav,44100,16,60,1,acoustic_complexity,512,1,NA,5,1742.33942536,NA 
rayol-farm1_2019-04-03_05-56-33.wav,44100,16,60,1,acoustic_complexity,512,1,NA,5,1746.01475040881,NA 
rayol-farm1_2019-04-03_05-57-33.wav,44100,16,60,1,acoustic_complexity,512,1,NA,5,1764.47656703995,NA 
rayol-farm1_2019-04-03_05-58-33.wav,44100,16,60,1,acoustic_complexity,512,1,NA,5,1768.75884828117,NA 
rayol-farm1_2019-04-03_05-59-33.wav,44100,16,60,1,acoustic_complexity,512,1,NA,5,1768.04708794409,NA 
rayol-farm1_2019-04-03_06-00-33.wav,44100,16,60,1,acoustic_complexity,512,1,NA,5,1771.15606542929,NA 
rayol-farm1_2019-04-03_06-01-33.wav,44100,16,60,1,acoustic_complexity,512,1,NA,5,1772.597928557,NA 
rayol-farm1_2019-04-03_06-02-33.wav,44100,16,60,1,acoustic_complexity,512,1,NA,5,1770.56543580121,NA 
rayol-farm1_2019-04-03_06-03-33.wav,44100,16,60,1,acoustic_complexity,512,1,NA,5,1772.84602521748,NA 
rayol-farm1_2019-04-03_06-04-33.wav,44100,16,60,1,acoustic_complexity,512,1,NA,5,1775.37144370548,NA 
rayol-farm1_2019-04-03_06-05-33.wav,44100,16,60,1,acoustic_complexity,512,1,NA,5,1768.79885599639,NA 
rayol-farm1_2019-04-03_06-06-33.wav,44100,16,60,1,acoustic_complexity,512,1,NA,5,1776.47081658475,NA 
rayol-farm1_2019-04-03_06-07-33.wav,44100,16,60,1,acoustic_complexity,512,1,NA,5,1770.29567219577,NA 
rayol-farm1_2019-04-03_06-08-33.wav,44100,16,60,1,acoustic_complexity,512,1,NA,5,1774.46160164804,NA 
rayol-farm1_2019-04-03_06-09-33.wav,44100,16,60,1,acoustic_complexity,512,1,NA,5,1780.97416083577,NA 
rayol-farm1_2019-04-03_06-10-33.wav,44100,16,60,1,acoustic_complexity,512,1,NA,5,1782.25595126168,NA 
rayol-farm1_2019-04-03_06-11-33.wav,44100,16,60,1,acoustic_complexity,512,1,NA,5,1777.85197780539,NA 
rayol-farm1_2019-04-03_06-12-33.wav,44100,16,60,1,acoustic_complexity,512,1,NA,5,1773.70464827566,NA 
rayol-farm1_2019-04-03_06-13-33.wav,44100,16,60,1,acoustic_complexity,512,1,NA,5,1772.88481568037,NA 
rayol-farm1_2019-04-03_06-14-33.wav,44100,16,60,1,acoustic_complexity,512,1,NA,5,1775.58436326678,NA 
rayol-farm1_2019-04-03_06-15-33.wav,44100,16,60,1,acoustic_complexity,512,1,NA,5,1773.60245243581,NA 
rayol-farm1_2019-04-03_06-16-33.wav,44100,16,60,1,acoustic_complexity,512,1,NA,5,1780.41674878672,NA 
rayol-farm1_2019-04-03_06-17-33.wav,44100,16,60,1,acoustic_complexity,512,1,NA,5,1777.05209163936,NA 
rayol-farm1_2019-04-03_06-18-33.wav,44100,16,60,1,acoustic_complexity,512,1,NA,5,1779.54875024997,NA 
rayol-farm1_2019-04-03_06-19-33.wav,44100,16,60,1,acoustic_complexity,512,1,NA,5,1781.98316339696,NA 
rayol-farm1_2019-04-03_06-20-33.wav,44100,16,60,1,acoustic_complexity,512,1,NA,5,1783.05142091215,NA 
rayol-farm1_2019-04-03_06-21-33.wav,44100,16,60,1,acoustic_complexity,512,1,NA,5,1778.93564940058,NA 
rayol-farm1_2019-04-03_06-22-33.wav,44100,16,60,1,acoustic_complexity,512,1,NA,5,1781.832542138,NA 
rayol-farm1_2019-04-03_06-23-33.wav,44100,16,60,1,acoustic_complexity,512,1,NA,5,1773.99343551851,NA 
rayol-farm1_2019-04-03_06-24-33.wav,44100,16,60,1,acoustic_complexity,512,1,NA,5,1780.04891562948,NA 
rayol-farm1_2019-04-03_06-25-33.wav,44100,16,60,1,acoustic_complexity,512,1,NA,5,1782.18414975014,NA 
rayol-farm1_2019-04-03_06-26-33.wav,44100,16,60,1,acoustic_complexity,512,1,NA,5,1786.86152448361,NA 
rayol-farm1_2019-04-03_06-27-33.wav,44100,16,60,1,acoustic_complexity,512,1,NA,5,1772.60824082374,NA 
rayol-farm1_2019-04-03_06-28-33.wav,44100,16,60,1,acoustic_complexity,512,1,NA,5,1775.41189925088,NA 
rayol-farm1_2019-04-03_06-29-33.wav,44100,16,60,1,acoustic_complexity,512,1,NA,5,1775.1753587212,NA 
rayol-farm1_2019-04-03_06-30-33.wav,44100,16,60,1,acoustic_complexity,512,1,NA,5,1773.08518094172,NA 
rayol-farm1_2019-04-03_06-31-33.wav,44100,16,60,1,acoustic_complexity,512,1,NA,5,1778.75056311984,NA 
rayol-farm1_2019-04-03_06-32-33.wav,44100,16,60,1,acoustic_complexity,512,1,NA,5,1776.79355122751,NA 
rayol-farm1_2019-04-03_06-33-33.wav,44100,16,60,1,acoustic_complexity,512,1,NA,5,1782.62785202914,NA 
rayol-farm1_2019-04-03_06-34-33.wav,44100,16,60,1,acoustic_complexity,512,1,NA,5,1772.41112424316,NA 
rayol-farm1_2019-04-03_06-35-33.wav,44100,16,60,1,acoustic_complexity,512,1,NA,5,1771.62264740399,NA 
rayol-farm1_2019-04-03_06-36-33.wav,44100,16,60,1,acoustic_complexity,512,1,NA,5,1776.06248733471,NA 
rayol-farm1_2019-04-03_06-37-33.wav,44100,16,60,1,acoustic_complexity,512,1,NA,5,1776.71322638768,NA 
rayol-farm1_2019-04-03_06-38-33.wav,44100,16,60,1,acoustic_complexity,512,1,NA,5,1777.18333532283,NA 
rayol-farm1_2019-04-03_06-39-33.wav,44100,16,60,1,acoustic_complexity,512,1,NA,5,1777.43144031175,NA 
rayol-farm1_2019-04-03_06-40-33.wav,44100,16,60,1,acoustic_complexity,512,1,NA,5,1774.97583176624,NA 
rayol-farm1_2019-04-03_06-41-33.wav,44100,16,60,1,acoustic_complexity,512,1,NA,5,1780.6719385503,NA 
rayol-farm1_2019-04-03_06-42-33.wav,44100,16,60,1,acoustic_complexity,512,1,NA,5,1773.41248901628,NA 
rayol-farm1_2019-04-03_06-43-33.wav,44100,16,60,1,acoustic_complexity,512,1,NA,5,1777.76770345029,NA 
rayol-farm1_2019-04-03_06-44-33.wav,44100,16,60,1,acoustic_complexity,512,1,NA,5,1785.03108690558,NA 
rayol-farm1_2019-04-03_06-45-33.wav,44100,16,60,1,acoustic_complexity,512,1,NA,5,1828.75027516922,NA 
rayol-farm1_2019-04-03_06-46-33.wav,44100,16,60,1,acoustic_complexity,512,1,NA,5,1852.1410918594,NA 
rayol-farm1_2019-04-03_06-47-33.wav,44100,16,60,1,acoustic_complexity,512,1,NA,5,1776.49963111986,NA 
rayol-farm1_2019-04-03_06-48-33.wav,44100,16,60,1,acoustic_complexity,512,1,NA,5,1771.97047399827,NA 
rayol-farm1_2019-04-03_06-49-33.wav,44100,16,60,1,acoustic_complexity,512,1,NA,5,1774.4330700256,NA 
rayol-farm1_2019-04-03_06-50-33.wav,44100,16,60,1,acoustic_complexity,512,1,NA,5,1772.69339538072,NA 
rayol-farm1_2019-04-03_06-51-33.wav,44100,16,60,1,acoustic_complexity,512,1,NA,5,1775.33591920222,NA 
rayol-farm1_2019-04-03_06-52-33.wav,44100,16,60,1,acoustic_complexity,512,1,NA,5,1781.51255262729,NA 
rayol-farm1_2019-04-03_06-53-33.wav,44100,16,60,1,acoustic_complexity,512,1,NA,5,1775.29069809019,NA 
rayol-farm1_2019-04-03_06-54-33.wav,44100,16,60,1,acoustic_complexity,512,1,NA,5,1768.46363359082,NA 
rayol-farm1_2019-04-03_06-55-33.wav,44100,16,60,1,acoustic_complexity,512,1,NA,5,1780.33356177554,NA 
rayol-farm1_2019-04-03_06-56-33.wav,44100,16,60,1,acoustic_complexity,512,1,NA,5,1784.02764362438,NA 
rayol-farm1_2019-04-03_06-57-33.wav,44100,16,60,1,acoustic_complexity,512,1,NA,5,1772.64086837832,NA 
rayol-farm1_2019-04-03_06-58-33.wav,44100,16,60,1,acoustic_complexity,512,1,NA,5,1786.10718991069,NA 
rayol-farm1_2019-04-03_06-59-33.wav,44100,16,60,1,acoustic_complexity,512,1,NA,5,1773.35688754996,NA 
rayol-farm1_2019-04-03_07-00-33.wav,44100,16,60,1,acoustic_complexity,512,1,NA,5,1781.60026008417,NA 
rayol-farm1_2019-04-03_07-01-33.wav,44100,16,60,1,acoustic_complexity,512,1,NA,5,1771.9928672589,NA 
rayol-farm1_2019-04-03_07-02-33.wav,44100,16,60,1,acoustic_complexity,512,1,NA,5,1791.25804193682,NA 
rayol-farm1_2019-04-03_07-03-33.wav,44100,16,60,1,acoustic_complexity,512,1,NA,5,1804.93212625403,NA 
rayol-farm1_2019-04-03_07-04-33.wav,44100,16,60,1,acoustic_complexity,512,1,NA,5,1783.03074753718,NA 
rayol-farm1_2019-04-03_07-05-33.wav,44100,16,60,1,acoustic_complexity,512,1,NA,5,1790.65752071799,NA 
rayol-farm1_2019-04-03_07-06-33.wav,44100,16,60,1,acoustic_complexity,512,1,NA,5,1789.05600879475,NA 
rayol-farm1_2019-04-03_07-07-33.wav,44100,16,60,1,acoustic_complexity,512,1,NA,5,1798.80527166014,NA 
rayol-farm1_2019-04-03_07-08-33.wav,44100,16,60,1,acoustic_complexity,512,1,NA,5,1799.90585184415,NA 
rayol-farm1_2019-04-03_07-09-33.wav,44100,16,60,1,acoustic_complexity,512,1,NA,5,1788.56772426621,NA 
rayol-farm1_2019-04-03_07-10-33.wav,44100,16,60,1,acoustic_complexity,512,1,NA,5,1805.30477665388,NA 
rayol-farm1_2019-04-03_07-11-33.wav,44100,16,60,1,acoustic_complexity,512,1,NA,5,1798.38709800529,NA 
rayol-farm1_2019-04-03_07-12-33.wav,44100,16,60,1,acoustic_complexity,512,1,NA,5,1809.88988873214,NA 
rayol-farm1_2019-04-03_07-13-33.wav,44100,16,60,1,acoustic_complexity,512,1,NA,5,1781.05815512441,NA 
rayol-farm1_2019-04-03_07-14-33.wav,44100,16,60,1,acoustic_complexity,512,1,NA,5,1786.5906003581,NA 
rayol-farm1_2019-04-03_07-15-33.wav,44100,16,60,1,acoustic_complexity,512,1,NA,5,1776.68701363343,NA 
rayol-farm1_2019-04-03_07-16-33.wav,44100,16,60,1,acoustic_complexity,512,1,NA,5,1781.5354260703,NA 
rayol-farm1_2019-04-03_07-17-33.wav,44100,16,60,1,acoustic_complexity,512,1,NA,5,1774.86072399836,NA 
rayol-farm1_2019-04-03_07-18-33.wav,44100,16,60,1,acoustic_complexity,512,1,NA,5,1787.76342853529,NA 
rayol-farm1_2019-04-03_07-19-33.wav,44100,16,60,1,acoustic_complexity,512,1,NA,5,1812.61014679028,NA 
rayol-farm1_2019-04-03_07-20-33.wav,44100,16,60,1,acoustic_complexity,512,1,NA,5,1790.13522169309,NA 
rayol-farm1_2019-04-03_07-21-33.wav,44100,16,60,1,acoustic_complexity,512,1,NA,5,1801.03939385252,NA 
rayol-farm1_2019-04-03_07-22-33.wav,44100,16,60,1,acoustic_complexity,512,1,NA,5,1778.32101732109,NA 
rayol-farm1_2019-04-03_07-23-33.wav,44100,16,60,1,acoustic_complexity,512,1,NA,5,1779.79178068874,NA 
rayol-farm1_2019-04-03_07-24-33.wav,44100,16,60,1,acoustic_complexity,512,1,NA,5,1787.35266215516,NA 
rayol-farm1_2019-04-03_07-25-33.wav,44100,16,60,1,acoustic_complexity,512,1,NA,5,1779.94420447454,NA 
rayol-farm1_2019-04-03_07-26-33.wav,44100,16,60,1,acoustic_complexity,512,1,NA,5,1776.84622912246,NA 
rayol-farm1_2019-04-03_07-27-33.wav,44100,16,60,1,acoustic_complexity,512,1,NA,5,1780.46395783959,NA 
rayol-farm1_2019-04-03_07-28-33.wav,44100,16,60,1,acoustic_complexity,512,1,NA,5,1776.02069642586,NA 
rayol-farm1_2019-04-03_07-29-33.wav,44100,16,60,1,acoustic_complexity,512,1,NA,5,1779.18375705392,NA 
rayol-farm1_2019-04-03_07-30-33.wav,44100,16,60,1,acoustic_complexity,512,1,NA,5,1778.91170104926,NA 
rayol-farm1_2019-04-03_07-31-33.wav,44100,16,60,1,acoustic_complexity,512,1,NA,5,1776.48850686255,NA 
rayol-farm1_2019-04-03_07-32-33.wav,44100,16,60,1,acoustic_complexity,512,1,NA,5,1782.0661810449,NA 
rayol-farm1_2019-04-03_07-33-33.wav,44100,16,60,1,acoustic_complexity,512,1,NA,5,1779.5442143287,NA 
rayol-farm1_2019-04-03_07-34-33.wav,44100,16,60,1,acoustic_complexity,512,1,NA,5,1774.61967250059,NA 
rayol-farm1_2019-04-03_07-35-33.wav,44100,16,60,1,acoustic_complexity,512,1,NA,5,1774.59821807115,NA 
rayol-farm1_2019-04-03_07-36-33.wav,44100,16,60,1,acoustic_complexity,512,1,NA,5,1775.74613405144,NA 
rayol-farm1_2019-04-03_07-37-33.wav,44100,16,60,1,acoustic_complexity,512,1,NA,5,1779.09087420982,NA 
rayol-farm1_2019-04-03_07-38-33.wav,44100,16,60,1,acoustic_complexity,512,1,NA,5,1775.89731618933,NA 
rayol-farm1_2019-04-03_07-39-33.wav,44100,16,60,1,acoustic_complexity,512,1,NA,5,1776.78974348845,NA 
rayol-farm1_2019-04-03_07-40-33.wav,44100,16,60,1,acoustic_complexity,512,1,NA,5,1771.70407537227,NA 
rayol-farm1_2019-04-03_07-41-33.wav,44100,16,60,1,acoustic_complexity,512,1,NA,5,1777.70145135893,NA 
rayol-farm1_2019-04-03_07-42-33.wav,44100,16,60,1,acoustic_complexity,512,1,NA,5,1771.26010948029,NA 
rayol-farm1_2019-04-03_07-43-33.wav,44100,16,60,1,acoustic_complexity,512,1,NA,5,1775.11295116726,NA 
rayol-farm1_2019-04-03_07-44-33.wav,44100,16,60,1,acoustic_complexity,512,1,NA,5,1775.13273112664,NA 
rayol-farm1_2019-04-03_07-45-33.wav,44100,16,60,1,acoustic_complexity,512,1,NA,5,1775.89160437588,NA 
rayol-farm1_2019-04-03_07-46-33.wav,44100,16,60,1,acoustic_complexity,512,1,NA,5,1768.97244601661,NA 
rayol-farm1_2019-04-03_07-47-33.wav,44100,16,60,1,acoustic_complexity,512,1,NA,5,1771.84378814155,NA 
rayol-farm1_2019-04-03_07-48-33.wav,44100,16,60,1,acoustic_complexity,512,1,NA,5,1781.17894770074,NA 
rayol-farm1_2019-04-03_07-49-33.wav,44100,16,60,1,acoustic_complexity,512,1,NA,5,1777.53201393349,NA 
rayol-farm1_2019-04-03_07-50-33.wav,44100,16,60,1,acoustic_complexity,512,1,NA,5,1778.62311007517,NA 
rayol-farm1_2019-04-03_07-51-33.wav,44100,16,60,1,acoustic_complexity,512,1,NA,5,1778.81384605675,NA 
rayol-farm1_2019-04-03_07-52-33.wav,44100,16,60,1,acoustic_complexity,512,1,NA,5,1777.32368962023,NA 
rayol-farm1_2019-04-03_07-53-33.wav,44100,16,60,1,acoustic_complexity,512,1,NA,5,1771.92046202054,NA 
rayol-farm1_2019-04-03_07-54-33.wav,44100,16,60,1,acoustic_complexity,512,1,NA,5,1771.19635863462,NA 
rayol-farm1_2019-04-03_07-55-33.wav,44100,16,60,1,acoustic_complexity,512,1,NA,5,1782.23007918917,NA 
rayol-farm1_2019-04-03_07-56-33.wav,44100,16,60,1,acoustic_complexity,512,1,NA,5,1777.61941578366,NA 
rayol-farm1_2019-04-03_07-57-33.wav,44100,16,60,1,acoustic_complexity,512,1,NA,5,1776.70670689663,NA 
rayol-farm1_2019-04-03_07-58-33.wav,44100,16,60,1,acoustic_complexity,512,1,NA,5,1768.37865528711,NA 
rayol-farm1_2019-04-03_07-59-33.wav,44100,16,60,1,acoustic_complexity,512,1,NA,5,1774.42691610659,NA 
rayol-farm1_2019-04-03_08-00-33.wav,44100,16,60,1,acoustic_complexity,512,1,NA,5,1789.86007490736,NA 
rayol-farm1_2019-04-03_08-01-33.wav,44100,16,60,1,acoustic_complexity,512,1,NA,5,1785.45844718804,NA 
rayol-farm1_2019-04-03_08-02-33.wav,44100,16,60,1,acoustic_complexity,512,1,NA,5,1774.85591929837,NA 
rayol-farm1_2019-04-03_08-03-33.wav,44100,16,60,1,acoustic_complexity,512,1,NA,5,1785.85342687845,NA 
rayol-farm1_2019-04-03_08-04-33.wav,44100,16,60,1,acoustic_complexity,512,1,NA,5,1781.73076382799,NA 
rayol-farm1_2019-04-03_08-05-33.wav,44100,16,60,1,acoustic_complexity,512,1,NA,5,1771.48660326247,NA 
rayol-farm1_2019-04-03_08-06-33.wav,44100,16,60,1,acoustic_complexity,512,1,NA,5,1780.32358963616,NA 
rayol-farm1_2019-04-03_08-07-33.wav,44100,16,60,1,acoustic_complexity,512,1,NA,5,1792.47873546875,NA 
rayol-farm1_2019-04-03_08-08-33.wav,44100,16,60,1,acoustic_complexity,512,1,NA,5,1772.29233497313,NA 
rayol-farm1_2019-04-03_08-09-33.wav,44100,16,60,1,acoustic_complexity,512,1,NA,5,1773.46808466186,NA 
rayol-farm1_2019-04-03_08-10-33.wav,44100,16,60,1,acoustic_complexity,512,1,NA,5,1771.7165922878,NA 
rayol-farm1_2019-04-03_08-11-33.wav,44100,16,60,1,acoustic_complexity,512,1,NA,5,1775.4984928389,NA 
rayol-farm1_2019-04-03_08-12-33.wav,44100,16,60,1,acoustic_complexity,512,1,NA,5,1777.31914011008,NA 
rayol-farm1_2019-04-03_08-13-33.wav,44100,16,60,1,acoustic_complexity,512,1,NA,5,1781.36553299303,NA 
rayol-farm1_2019-04-03_08-14-33.wav,44100,16,60,1,acoustic_complexity,512,1,NA,5,1772.57810806524,NA 
rayol-farm1_2019-04-03_08-15-33.wav,44100,16,60,1,acoustic_complexity,512,1,NA,5,1770.34161098685,NA 
rayol-farm1_2019-04-03_08-16-33.wav,44100,16,60,1,acoustic_complexity,512,1,NA,5,1783.01210960842,NA 
rayol-farm1_2019-04-03_08-17-33.wav,44100,16,60,1,acoustic_complexity,512,1,NA,5,1791.74523560416,NA 
rayol-farm1_2019-04-03_08-18-33.wav,44100,16,60,1,acoustic_complexity,512,1,NA,5,1789.77391079949,NA 
rayol-farm1_2019-04-03_08-19-33.wav,44100,16,60,1,acoustic_complexity,512,1,NA,5,1777.98847265424,NA 
rayol-farm1_2019-04-03_08-20-33.wav,44100,16,60,1,acoustic_complexity,512,1,NA,5,1777.48706801503,NA 
rayol-farm1_2019-04-03_08-21-33.wav,44100,16,60,1,acoustic_complexity,512,1,NA,5,1780.01721343886,NA 
rayol-farm1_2019-04-03_08-22-33.wav,44100,16,60,1,acoustic_complexity,512,1,NA,5,1776.48630959222,NA 
rayol-farm1_2019-04-03_08-23-33.wav,44100,16,60,1,acoustic_complexity,512,1,NA,5,1785.14582994479,NA 
rayol-farm1_2019-04-03_08-24-33.wav,44100,16,60,1,acoustic_complexity,512,1,NA,5,1775.73470863044,NA 
rayol-farm1_2019-04-03_08-25-33.wav,44100,16,60,1,acoustic_complexity,512,1,NA,5,1773.77508378528,NA 
rayol-farm1_2019-04-03_08-26-33.wav,44100,16,60,1,acoustic_complexity,512,1,NA,5,1776.68781778936,NA 
rayol-farm1_2019-04-03_08-27-33.wav,44100,16,60,1,acoustic_complexity,512,1,NA,5,1782.77557682677,NA 
rayol-farm1_2019-04-03_08-28-33.wav,44100,16,60,1,acoustic_complexity,512,1,NA,5,1787.27357500398,NA 
rayol-farm1_2019-04-03_08-29-33.wav,44100,16,60,1,acoustic_complexity,512,1,NA,5,1768.69410555817,NA 
rayol-farm1_2019-04-03_08-30-33.wav,44100,16,60,1,acoustic_complexity,512,1,NA,5,1773.60800629995,NA 
rayol-farm1_2019-04-03_08-31-33.wav,44100,16,60,1,acoustic_complexity,512,1,NA,5,1774.17981815597,NA 
rayol-farm1_2019-04-03_08-32-33.wav,44100,16,60,1,acoustic_complexity,512,1,NA,5,1772.95917188585,NA 
rayol-farm1_2019-04-03_08-33-33.wav,44100,16,60,1,acoustic_complexity,512,1,NA,5,1793.11825217655,NA 
rayol-farm1_2019-04-03_08-34-33.wav,44100,16,60,1,acoustic_complexity,512,1,NA,5,1778.17766150574,NA 
rayol-farm1_2019-04-03_08-35-33.wav,44100,16,60,1,acoustic_complexity,512,1,NA,5,1782.54934058505,NA 
rayol-farm1_2019-04-03_08-36-33.wav,44100,16,60,1,acoustic_complexity,512,1,NA,5,1771.44758000122,NA 
rayol-farm1_2019-04-03_08-37-33.wav,44100,16,60,1,acoustic_complexity,512,1,NA,5,1773.43902546664,NA 
rayol-farm1_2019-04-03_08-38-33.wav,44100,16,60,1,acoustic_complexity,512,1,NA,5,1786.27713214433,NA 
rayol-farm1_2019-04-03_08-39-33.wav,44100,16,60,1,acoustic_complexity,512,1,NA,5,1779.29572279053,NA 
rayol-farm1_2019-04-03_08-40-33.wav,44100,16,60,1,acoustic_complexity,512,1,NA,5,1771.29893001594,NA 
rayol-farm1_2019-04-03_08-41-33.wav,44100,16,60,1,acoustic_complexity,512,1,NA,5,1779.16132712517,NA 
rayol-farm1_2019-04-03_08-42-33.wav,44100,16,60,1,acoustic_complexity,512,1,NA,5,1772.18743694615,NA 
rayol-farm1_2019-04-03_08-43-33.wav,44100,16,60,1,acoustic_complexity,512,1,NA,5,1774.22678304937,NA 
rayol-farm1_2019-04-03_08-44-33.wav,44100,16,60,1,acoustic_complexity,512,1,NA,5,1773.55937312704,NA 
rayol-farm1_2019-04-03_08-45-33.wav,44100,16,60,1,acoustic_complexity,512,1,NA,5,1769.00868864072,NA 
rayol-farm1_2019-04-03_08-46-33.wav,44100,16,60,1,acoustic_complexity,512,1,NA,5,1775.89167703251,NA 
rayol-farm1_2019-04-03_08-47-33.wav,44100,16,60,1,acoustic_complexity,512,1,NA,5,1783.17036172424,NA 
rayol-farm1_2019-04-03_08-48-33.wav,44100,16,60,1,acoustic_complexity,512,1,NA,5,1776.28145358101,NA 
rayol-farm1_2019-04-03_08-49-33.wav,44100,16,60,1,acoustic_complexity,512,1,NA,5,1781.56894447524,NA 
rayol-farm1_2019-04-03_08-50-33.wav,44100,16,60,1,acoustic_complexity,512,1,NA,5,1798.89297335112,NA 
rayol-farm1_2019-04-03_08-51-33.wav,44100,16,60,1,acoustic_complexity,512,1,NA,5,1788.15815793199,NA 
rayol-farm1_2019-04-03_08-52-33.wav,44100,16,60,1,acoustic_complexity,512,1,NA,5,1781.77615495234,NA 
rayol-farm1_2019-04-03_08-53-33.wav,44100,16,60,1,acoustic_complexity,512,1,NA,5,1779.13341396119,NA 
rayol-farm1_2019-04-03_08-54-33.wav,44100,16,60,1,acoustic_complexity,512,1,NA,5,1773.19274371533,NA 
rayol-farm1_2019-04-03_08-55-33.wav,44100,16,60,1,acoustic_complexity,512,1,NA,5,1789.04508980369,NA 
rayol-farm1_2019-04-03_08-56-33.wav,44100,16,60,1,acoustic_complexity,512,1,NA,5,1809.10132344674,NA 
rayol-farm1_2019-04-03_08-57-33.wav,44100,16,60,1,acoustic_complexity,512,1,NA,5,1799.64970438805,NA 
rayol-farm1_2019-04-03_08-58-33.wav,44100,16,60,1,acoustic_complexity,512,1,NA,5,1802.33460947762,NA 
rayol-farm1_2019-04-03_08-59-33.wav,44100,16,60,1,acoustic_complexity,512,1,NA,5,1781.42853749613,NA 
rayol-farm1_2019-04-03_09-00-33.wav,44100,16,60,1,acoustic_complexity,512,1,NA,5,1787.27319435827,NA 
rayol-farm1_2019-04-03_09-01-33.wav,44100,16,60,1,acoustic_complexity,512,1,NA,5,1796.35230850403,NA 
rayol-farm1_2019-04-03_09-02-33.wav,44100,16,60,1,acoustic_complexity,512,1,NA,5,1799.06907470932,NA 
rayol-farm1_2019-04-03_09-03-33.wav,44100,16,60,1,acoustic_complexity,512,1,NA,5,1802.58962083321,NA 
rayol-farm1_2019-04-03_09-04-33.wav,44100,16,60,1,acoustic_complexity,512,1,NA,5,1799.71768219999,NA 
rayol-farm1_2019-04-03_09-05-33.wav,44100,16,60,1,acoustic_complexity,512,1,NA,5,1801.42311638229,NA 
rayol-farm1_2019-04-03_09-06-33.wav,44100,16,60,1,acoustic_complexity,512,1,NA,5,1796.14760327142,NA 
rayol-farm1_2019-04-03_09-07-33.wav,44100,16,60,1,acoustic_complexity,512,1,NA,5,1801.20543194178,NA 
rayol-farm1_2019-04-03_09-08-33.wav,44100,16,60,1,acoustic_complexity,512,1,NA,5,1790.71995242439,NA 
rayol-farm1_2019-04-03_09-09-33.wav,44100,16,60,1,acoustic_complexity,512,1,NA,5,1811.85003488242,NA 
rayol-farm1_2019-04-03_09-10-33.wav,44100,16,60,1,acoustic_complexity,512,1,NA,5,1808.25067406966,NA 
rayol-farm1_2019-04-03_09-11-33.wav,44100,16,60,1,acoustic_complexity,512,1,NA,5,1800.4828226769,NA 
rayol-farm1_2019-04-03_09-12-33.wav,44100,16,60,1,acoustic_complexity,512,1,NA,5,1799.5985771354,NA 
rayol-farm1_2019-04-03_09-13-33.wav,44100,16,60,1,acoustic_complexity,512,1,NA,5,1813.51673884867,NA 
rayol-farm1_2019-04-03_09-14-33.wav,44100,16,60,1,acoustic_complexity,512,1,NA,5,1824.49053975793,NA 
rayol-farm1_2019-04-03_09-15-33.wav,44100,16,60,1,acoustic_complexity,512,1,NA,5,1869.45533797604,NA 
rayol-farm1_2019-04-03_09-16-33.wav,44100,16,60,1,acoustic_complexity,512,1,NA,5,1818.99437756892,NA 
rayol-farm1_2019-04-03_09-17-33.wav,44100,16,60,1,acoustic_complexity,512,1,NA,5,1796.49369901333,NA 
rayol-farm1_2019-04-03_09-18-33.wav,44100,16,60,1,acoustic_complexity,512,1,NA,5,1805.5030680405,NA 
rayol-farm1_2019-04-03_09-19-33.wav,44100,16,60,1,acoustic_complexity,512,1,NA,5,1814.72016184404,NA 
rayol-farm1_2019-04-03_09-20-33.wav,44100,16,60,1,acoustic_complexity,512,1,NA,5,1817.86627876293,NA 
rayol-farm1_2019-04-03_09-21-33.wav,44100,16,60,1,acoustic_complexity,512,1,NA,5,1819.11873202297,NA 
rayol-farm1_2019-04-03_09-22-33.wav,44100,16,60,1,acoustic_complexity,512,1,NA,5,1809.8460055142,NA 
rayol-farm1_2019-04-03_09-23-33.wav,44100,16,60,1,acoustic_complexity,512,1,NA,5,1809.99510342102,NA 
rayol-farm1_2019-04-03_09-24-33.wav,44100,16,60,1,acoustic_complexity,512,1,NA,5,1809.5918197239,NA 
rayol-farm1_2019-04-03_09-25-33.wav,44100,16,60,1,acoustic_complexity,512,1,NA,5,1820.36521759918,NA 
rayol-farm1_2019-04-03_09-26-33.wav,44100,16,60,1,acoustic_complexity,512,1,NA,5,1810.61948502388,NA 
rayol-farm1_2019-04-03_09-27-33.wav,44100,16,60,1,acoustic_complexity,512,1,NA,5,1819.1774443557,NA 
rayol-farm1_2019-04-03_09-28-33.wav,44100,16,60,1,acoustic_complexity,512,1,NA,5,1820.58889633428,NA 
rayol-farm1_2019-04-03_09-29-33.wav,44100,16,60,1,acoustic_complexity,512,1,NA,5,1785.10610769911,NA 
rayol-farm1_2019-04-03_09-30-33.wav,44100,16,60,1,acoustic_complexity,512,1,NA,5,1860.47256769276,NA 
rayol-farm1_2019-04-03_09-31-33.wav,44100,16,60,1,acoustic_complexity,512,1,NA,5,1879.40712793832,NA 
rayol-farm1_2019-04-03_09-32-33.wav,44100,16,60,1,acoustic_complexity,512,1,NA,5,1810.40966225484,NA 
rayol-farm1_2019-04-03_09-33-33.wav,44100,16,60,1,acoustic_complexity,512,1,NA,5,1794.69459370138,NA 
rayol-farm1_2019-04-03_09-34-33.wav,44100,16,60,1,acoustic_complexity,512,1,NA,5,1809.32495940509,NA 
rayol-farm1_2019-04-03_09-35-33.wav,44100,16,60,1,acoustic_complexity,512,1,NA,5,1804.76991985473,NA 
rayol-farm1_2019-04-03_09-36-33.wav,44100,16,60,1,acoustic_complexity,512,1,NA,5,1806.02926924443,NA 
rayol-farm1_2019-04-03_09-37-33.wav,44100,16,60,1,acoustic_complexity,512,1,NA,5,1806.90150845981,NA 
rayol-farm1_2019-04-03_09-38-33.wav,44100,16,60,1,acoustic_complexity,512,1,NA,5,1815.32922817644,NA 
rayol-farm1_2019-04-03_09-39-33.wav,44100,16,60,1,acoustic_complexity,512,1,NA,5,1812.10087667636,NA 
rayol-farm1_2019-04-03_09-40-33.wav,44100,16,60,1,acoustic_complexity,512,1,NA,5,1812.70172514171,NA 
rayol-farm1_2019-04-03_09-41-33.wav,44100,16,60,1,acoustic_complexity,512,1,NA,5,1834.14522323292,NA 
rayol-farm1_2019-04-03_09-42-33.wav,44100,16,60,1,acoustic_complexity,512,1,NA,5,1828.5365060212,NA 
rayol-farm1_2019-04-03_09-43-33.wav,44100,16,60,1,acoustic_complexity,512,1,NA,5,1804.71051136446,NA 
rayol-farm1_2019-04-03_09-44-33.wav,44100,16,60,1,acoustic_complexity,512,1,NA,5,1824.91766556132,NA 
rayol-farm1_2019-04-03_09-45-33.wav,44100,16,60,1,acoustic_complexity,512,1,NA,5,1814.49230799853,NA 
rayol-farm1_2019-04-03_09-46-33.wav,44100,16,60,1,acoustic_complexity,512,1,NA,5,1813.23975378726,NA 
rayol-farm1_2019-04-03_09-47-33.wav,44100,16,60,1,acoustic_complexity,512,1,NA,5,1822.04228337615,NA 
rayol-farm1_2019-04-03_09-48-33.wav,44100,16,60,1,acoustic_complexity,512,1,NA,5,1806.78062911562,NA 
rayol-farm1_2019-04-03_09-49-33.wav,44100,16,60,1,acoustic_complexity,512,1,NA,5,1798.79369155481,NA 
rayol-farm1_2019-04-03_09-50-33.wav,44100,16,60,1,acoustic_complexity,512,1,NA,5,1781.82148470916,NA 
rayol-farm1_2019-04-03_09-51-33.wav,44100,16,60,1,acoustic_complexity,512,1,NA,5,1780.71109571132,NA 
rayol-farm1_2019-04-03_09-52-33.wav,44100,16,60,1,acoustic_complexity,512,1,NA,5,1776.6656734016,NA 
rayol-farm1_2019-04-03_09-53-33.wav,44100,16,60,1,acoustic_complexity,512,1,NA,5,1778.26961608162,NA 
rayol-farm1_2019-04-03_09-54-33.wav,44100,16,60,1,acoustic_complexity,512,1,NA,5,1779.98064413159,NA 
rayol-farm1_2019-04-03_09-55-33.wav,44100,16,60,1,acoustic_complexity,512,1,NA,5,1773.71188613907,NA 
rayol-farm1_2019-04-03_09-56-33.wav,44100,16,60,1,acoustic_complexity,512,1,NA,5,1760.44842916537,NA 
rayol-farm1_2019-04-03_09-57-33.wav,44100,16,60,1,acoustic_complexity,512,1,NA,5,1767.4944836478,NA 
rayol-farm1_2019-04-03_09-58-33.wav,44100,16,60,1,acoustic_complexity,512,1,NA,5,1775.38007568118,NA 
rayol-farm1_2019-04-03_09-59-33.wav,44100,16,60,1,acoustic_complexity,512,1,NA,5,1777.37615353497,NA 
rayol-farm1_2019-04-03_10-00-33.wav,44100,16,60,1,acoustic_complexity,512,1,NA,5,1787.91457355288,NA 
rayol-farm1_2019-04-03_10-01-33.wav,44100,16,60,1,acoustic_complexity,512,1,NA,5,1774.16782126854,NA 
rayol-farm1_2019-04-03_10-02-33.wav,44100,16,60,1,acoustic_complexity,512,1,NA,5,1770.85163981218,NA 
rayol-farm1_2019-04-03_10-03-33.wav,44100,16,60,1,acoustic_complexity,512,1,NA,5,1771.44010643304,NA 
rayol-farm1_2019-04-03_10-04-33.wav,44100,16,60,1,acoustic_complexity,512,1,NA,5,1778.48703019161,NA 
rayol-farm1_2019-04-03_10-05-33.wav,44100,16,60,1,acoustic_complexity,512,1,NA,5,1784.38715745575,NA 
rayol-farm1_2019-04-03_10-06-33.wav,44100,16,60,1,acoustic_complexity,512,1,NA,5,1786.91004284811,NA 
rayol-farm1_2019-04-03_10-07-33.wav,44100,16,60,1,acoustic_complexity,512,1,NA,5,1777.47057601555,NA 
rayol-farm1_2019-04-03_10-08-33.wav,44100,16,60,1,acoustic_complexity,512,1,NA,5,1782.75347155557,NA 
rayol-farm1_2019-04-03_10-09-33.wav,44100,16,60,1,acoustic_complexity,512,1,NA,5,1783.79476705129,NA 
rayol-farm1_2019-04-03_10-10-33.wav,44100,16,60,1,acoustic_complexity,512,1,NA,5,1775.60040513905,NA 
rayol-farm1_2019-04-03_10-11-33.wav,44100,16,60,1,acoustic_complexity,512,1,NA,5,1788.4879899995,NA 
rayol-farm1_2019-04-03_10-12-33.wav,44100,16,60,1,acoustic_complexity,512,1,NA,5,1775.78032091327,NA 
rayol-farm1_2019-04-03_10-13-33.wav,44100,16,60,1,acoustic_complexity,512,1,NA,5,1783.26170746529,NA 
rayol-farm1_2019-04-03_10-14-33.wav,44100,16,60,1,acoustic_complexity,512,1,NA,5,1800.12025905167,NA 
rayol-farm1_2019-04-03_10-15-33.wav,44100,16,60,1,acoustic_complexity,512,1,NA,5,1791.13933437743,NA 
rayol-farm1_2019-04-03_10-16-33.wav,44100,16,60,1,acoustic_complexity,512,1,NA,5,1789.91032967138,NA 
rayol-farm1_2019-04-03_10-17-33.wav,44100,16,60,1,acoustic_complexity,512,1,NA,5,1785.43038659465,NA 
rayol-farm1_2019-04-03_10-18-33.wav,44100,16,60,1,acoustic_complexity,512,1,NA,5,1784.29044728638,NA 
rayol-farm1_2019-04-03_10-19-33.wav,44100,16,60,1,acoustic_complexity,512,1,NA,5,1774.51591494813,NA 
rayol-farm1_2019-04-03_10-20-33.wav,44100,16,60,1,acoustic_complexity,512,1,NA,5,1782.62990753453,NA 
rayol-farm1_2019-04-03_10-21-33.wav,44100,16,60,1,acoustic_complexity,512,1,NA,5,1785.29591257926,NA 
rayol-farm1_2019-04-03_10-22-33.wav,44100,16,60,1,acoustic_complexity,512,1,NA,5,1786.18104890075,NA 
rayol-farm1_2019-04-03_10-23-33.wav,44100,16,60,1,acoustic_complexity,512,1,NA,5,1790.79136095322,NA 
rayol-farm1_2019-04-03_10-24-33.wav,44100,16,60,1,acoustic_complexity,512,1,NA,5,1777.06922192896,NA 
rayol-farm1_2019-04-03_10-25-33.wav,44100,16,60,1,acoustic_complexity,512,1,NA,5,1779.65857208014,NA 
rayol-farm1_2019-04-03_10-26-33.wav,44100,16,60,1,acoustic_complexity,512,1,NA,5,1771.41731706016,NA 
rayol-farm1_2019-04-03_10-27-33.wav,44100,16,60,1,acoustic_complexity,512,1,NA,5,1773.81208521417,NA 
rayol-farm1_2019-04-03_10-28-33.wav,44100,16,60,1,acoustic_complexity,512,1,NA,5,1784.69774194222,NA 
rayol-farm1_2019-04-03_10-29-33.wav,44100,16,60,1,acoustic_complexity,512,1,NA,5,1780.75488868675,NA 
rayol-farm1_2019-04-03_10-30-33.wav,44100,16,60,1,acoustic_complexity,512,1,NA,5,1785.33741189982,NA 
rayol-farm1_2019-04-03_10-31-33.wav,44100,16,60,1,acoustic_complexity,512,1,NA,5,1778.57102430917,NA 
rayol-farm1_2019-04-03_10-32-33.wav,44100,16,60,1,acoustic_complexity,512,1,NA,5,1785.48605986178,NA 
rayol-farm1_2019-04-03_10-33-33.wav,44100,16,60,1,acoustic_complexity,512,1,NA,5,1782.94814681256,NA 
rayol-farm1_2019-04-03_10-34-33.wav,44100,16,60,1,acoustic_complexity,512,1,NA,5,1781.53859610684,NA 
rayol-farm1_2019-04-03_10-35-33.wav,44100,16,60,1,acoustic_complexity,512,1,NA,5,1793.26689237426,NA 
rayol-farm1_2019-04-03_10-36-33.wav,44100,16,60,1,acoustic_complexity,512,1,NA,5,1786.39356829785,NA 
rayol-farm1_2019-04-03_10-37-33.wav,44100,16,60,1,acoustic_complexity,512,1,NA,5,1779.55518676117,NA 
rayol-farm1_2019-04-03_10-38-33.wav,44100,16,60,1,acoustic_complexity,512,1,NA,5,1785.54818874346,NA 
rayol-farm1_2019-04-03_10-39-33.wav,44100,16,60,1,acoustic_complexity,512,1,NA,5,1787.74892856959,NA 
rayol-farm1_2019-04-03_10-40-33.wav,44100,16,60,1,acoustic_complexity,512,1,NA,5,1790.41960962287,NA 
rayol-farm1_2019-04-03_10-41-33.wav,44100,16,60,1,acoustic_complexity,512,1,NA,5,1784.32733243109,NA 
rayol-farm1_2019-04-03_10-42-33.wav,44100,16,60,1,acoustic_complexity,512,1,NA,5,1804.66135388012,NA 
rayol-farm1_2019-04-03_10-43-33.wav,44100,16,60,1,acoustic_complexity,512,1,NA,5,1803.31522409884,NA 
rayol-farm1_2019-04-03_10-44-33.wav,44100,16,60,1,acoustic_complexity,512,1,NA,5,1805.8631267362,NA 
rayol-farm1_2019-04-03_10-45-33.wav,44100,16,60,1,acoustic_complexity,512,1,NA,5,1812.80092553483,NA 
rayol-farm1_2019-04-03_10-46-33.wav,44100,16,60,1,acoustic_complexity,512,1,NA,5,1799.6649035732,NA 
rayol-farm1_2019-04-03_10-47-33.wav,44100,16,60,1,acoustic_complexity,512,1,NA,5,1800.4978797782,NA 
rayol-farm1_2019-04-03_10-48-33.wav,44100,16,60,1,acoustic_complexity,512,1,NA,5,1814.32532499705,NA 
rayol-farm1_2019-04-03_10-49-33.wav,44100,16,60,1,acoustic_complexity,512,1,NA,5,1814.45743788638,NA 
rayol-farm1_2019-04-03_10-50-33.wav,44100,16,60,1,acoustic_complexity,512,1,NA,5,1793.6710094543,NA 
rayol-farm1_2019-04-03_10-51-33.wav,44100,16,60,1,acoustic_complexity,512,1,NA,5,1805.44670232764,NA 
rayol-farm1_2019-04-03_10-52-33.wav,44100,16,60,1,acoustic_complexity,512,1,NA,5,1809.03877691337,NA 
rayol-farm1_2019-04-03_10-53-33.wav,44100,16,60,1,acoustic_complexity,512,1,NA,5,1822.04663797609,NA 
rayol-farm1_2019-04-03_10-54-33.wav,44100,16,60,1,acoustic_complexity,512,1,NA,5,1806.74138143239,NA 
rayol-farm1_2019-04-03_10-55-33.wav,44100,16,60,1,acoustic_complexity,512,1,NA,5,1793.95002948392,NA 
rayol-farm1_2019-04-03_10-56-33.wav,44100,16,60,1,acoustic_complexity,512,1,NA,5,1810.88698713628,NA 
rayol-farm1_2019-04-03_10-57-33.wav,44100,16,60,1,acoustic_complexity,512,1,NA,5,1801.87794260187,NA 
rayol-farm1_2019-04-03_10-58-33.wav,44100,16,60,1,acoustic_complexity,512,1,NA,5,1811.19233179312,NA 
rayol-farm1_2019-04-03_10-59-33.wav,44100,16,60,1,acoustic_complexity,512,1,NA,5,1806.6552296132,NA 
rayol-farm1_2019-04-03_11-00-33.wav,44100,16,60,1,acoustic_complexity,512,1,NA,5,1797.33437821358,NA 
rayol-farm1_2019-04-03_11-01-33.wav,44100,16,60,1,acoustic_complexity,512,1,NA,5,1798.57341029394,NA 
rayol-farm1_2019-04-03_11-02-33.wav,44100,16,60,1,acoustic_complexity,512,1,NA,5,1820.09646848577,NA 
rayol-farm1_2019-04-03_11-03-33.wav,44100,16,60,1,acoustic_complexity,512,1,NA,5,1799.41498578816,NA 
rayol-farm1_2019-04-03_11-04-33.wav,44100,16,60,1,acoustic_complexity,512,1,NA,5,1799.21640436333,NA 
rayol-farm1_2019-04-03_11-05-33.wav,44100,16,60,1,acoustic_complexity,512,1,NA,5,1807.27864063368,NA 
rayol-farm1_2019-04-03_11-06-33.wav,44100,16,60,1,acoustic_complexity,512,1,NA,5,1834.07733688754,NA 
rayol-farm1_2019-04-03_11-07-33.wav,44100,16,60,1,acoustic_complexity,512,1,NA,5,1814.74480442349,NA 
rayol-farm1_2019-04-03_11-08-33.wav,44100,16,60,1,acoustic_complexity,512,1,NA,5,1819.20493759031,NA 
rayol-farm1_2019-04-03_11-09-33.wav,44100,16,60,1,acoustic_complexity,512,1,NA,5,1819.18055004651,NA 
rayol-farm1_2019-04-03_11-10-33.wav,44100,16,60,1,acoustic_complexity,512,1,NA,5,1813.06444282381,NA 
rayol-farm1_2019-04-03_11-11-33.wav,44100,16,60,1,acoustic_complexity,512,1,NA,5,1827.55120847962,NA 
rayol-farm1_2019-04-03_11-12-33.wav,44100,16,60,1,acoustic_complexity,512,1,NA,5,1809.55248730924,NA 
rayol-farm1_2019-04-03_11-13-33.wav,44100,16,60,1,acoustic_complexity,512,1,NA,5,1836.13763766902,NA 
rayol-farm1_2019-04-03_11-14-33.wav,44100,16,60,1,acoustic_complexity,512,1,NA,5,1833.32633226824,NA 
rayol-farm1_2019-04-03_11-15-33.wav,44100,16,60,1,acoustic_complexity,512,1,NA,5,1804.79779163935,NA 
rayol-farm1_2019-04-03_11-16-33.wav,44100,16,60,1,acoustic_complexity,512,1,NA,5,1830.4134749689,NA 
rayol-farm1_2019-04-03_11-17-33.wav,44100,16,60,1,acoustic_complexity,512,1,NA,5,1837.19514313218,NA 
rayol-farm1_2019-04-03_11-18-33.wav,44100,16,60,1,acoustic_complexity,512,1,NA,5,1808.52230187574,NA 
rayol-farm1_2019-04-03_11-19-33.wav,44100,16,60,1,acoustic_complexity,512,1,NA,5,1797.00819590101,NA 
rayol-farm1_2019-04-03_11-20-33.wav,44100,16,60,1,acoustic_complexity,512,1,NA,5,1819.89092171432,NA 
rayol-farm1_2019-04-03_11-21-33.wav,44100,16,60,1,acoustic_complexity,512,1,NA,5,1829.25091887005,NA 
rayol-farm1_2019-04-03_11-22-33.wav,44100,16,60,1,acoustic_complexity,512,1,NA,5,1817.53953601999,NA 
rayol-farm1_2019-04-03_11-23-33.wav,44100,16,60,1,acoustic_complexity,512,1,NA,5,1822.14350725669,NA 
rayol-farm1_2019-04-03_11-24-33.wav,44100,16,60,1,acoustic_complexity,512,1,NA,5,1827.04696048427,NA 
rayol-farm1_2019-04-03_11-25-33.wav,44100,16,60,1,acoustic_complexity,512,1,NA,5,1809.7464339558,NA 
rayol-farm1_2019-04-03_11-26-33.wav,44100,16,60,1,acoustic_complexity,512,1,NA,5,1811.6344691546,NA 
rayol-farm1_2019-04-03_11-27-33.wav,44100,16,60,1,acoustic_complexity,512,1,NA,5,1804.97483464022,NA 
rayol-farm1_2019-04-03_11-28-33.wav,44100,16,60,1,acoustic_complexity,512,1,NA,5,1808.9363021026,NA 
rayol-farm1_2019-04-03_11-29-33.wav,44100,16,60,1,acoustic_complexity,512,1,NA,5,1806.33741850203,NA 
rayol-farm1_2019-04-03_11-30-33.wav,44100,16,60,1,acoustic_complexity,512,1,NA,5,1807.79220388785,NA 
rayol-farm1_2019-04-03_11-31-33.wav,44100,16,60,1,acoustic_complexity,512,1,NA,5,1807.7538593387,NA 
rayol-farm1_2019-04-03_11-32-33.wav,44100,16,60,1,acoustic_complexity,512,1,NA,5,1802.72421667822,NA 
rayol-farm1_2019-04-03_11-33-33.wav,44100,16,60,1,acoustic_complexity,512,1,NA,5,1801.60612901998,NA 
rayol-farm1_2019-04-03_11-34-33.wav,44100,16,60,1,acoustic_complexity,512,1,NA,5,1802.11039915652,NA 
rayol-farm1_2019-04-03_11-35-33.wav,44100,16,60,1,acoustic_complexity,512,1,NA,5,1790.74547494395,NA 
rayol-farm1_2019-04-03_11-36-33.wav,44100,16,60,1,acoustic_complexity,512,1,NA,5,1805.67795893205,NA 
rayol-farm1_2019-04-03_11-37-33.wav,44100,16,60,1,acoustic_complexity,512,1,NA,5,1785.05070881149,NA 
rayol-farm1_2019-04-03_11-38-33.wav,44100,16,60,1,acoustic_complexity,512,1,NA,5,1773.75569780391,NA 
rayol-farm1_2019-04-03_11-39-33.wav,44100,16,60,1,acoustic_complexity,512,1,NA,5,1783.05175511749,NA 
rayol-farm1_2019-04-03_11-40-33.wav,44100,16,60,1,acoustic_complexity,512,1,NA,5,1781.61968415281,NA 
rayol-farm1_2019-04-03_11-41-33.wav,44100,16,60,1,acoustic_complexity,512,1,NA,5,1809.1026574063,NA 
rayol-farm1_2019-04-03_11-42-33.wav,44100,16,60,1,acoustic_complexity,512,1,NA,5,1813.9531424518,NA 
rayol-farm1_2019-04-03_11-43-33.wav,44100,16,60,1,acoustic_complexity,512,1,NA,5,1801.41710776463,NA 
rayol-farm1_2019-04-03_11-44-33.wav,44100,16,60,1,acoustic_complexity,512,1,NA,5,1784.60240469242,NA 
rayol-farm1_2019-04-03_11-45-33.wav,44100,16,60,1,acoustic_complexity,512,1,NA,5,1788.60011374942,NA 
rayol-farm1_2019-04-03_11-46-33.wav,44100,16,60,1,acoustic_complexity,512,1,NA,5,1806.71945069181,NA 
rayol-farm1_2019-04-03_11-47-33.wav,44100,16,60,1,acoustic_complexity,512,1,NA,5,1816.37708315145,NA 
rayol-farm1_2019-04-03_11-48-33.wav,44100,16,60,1,acoustic_complexity,512,1,NA,5,1822.46492534789,NA 
rayol-farm1_2019-04-03_11-49-33.wav,44100,16,60,1,acoustic_complexity,512,1,NA,5,1819.49941624324,NA 
rayol-farm1_2019-04-03_11-50-33.wav,44100,16,60,1,acoustic_complexity,512,1,NA,5,1802.01016433964,NA 
rayol-farm1_2019-04-03_11-51-33.wav,44100,16,60,1,acoustic_complexity,512,1,NA,5,1827.97770485818,NA 
rayol-farm1_2019-04-03_11-52-33.wav,44100,16,60,1,acoustic_complexity,512,1,NA,5,1825.93460437886,NA 
rayol-farm1_2019-04-03_11-53-33.wav,44100,16,60,1,acoustic_complexity,512,1,NA,5,1813.83476464213,NA 
rayol-farm1_2019-04-03_11-54-33.wav,44100,16,60,1,acoustic_complexity,512,1,NA,5,1795.58577267714,NA 
rayol-farm1_2019-04-03_11-55-33.wav,44100,16,60,1,acoustic_complexity,512,1,NA,5,1812.87419671119,NA 
rayol-farm1_2019-04-03_11-56-33.wav,44100,16,60,1,acoustic_complexity,512,1,NA,5,1811.32377416988,NA 
rayol-farm1_2019-04-03_11-57-33.wav,44100,16,60,1,acoustic_complexity,512,1,NA,5,1817.03939381896,NA 
rayol-farm1_2019-04-03_11-58-33.wav,44100,16,60,1,acoustic_complexity,512,1,NA,5,1802.01451376065,NA 
rayol-farm1_2019-04-03_11-59-33.wav,44100,16,60,1,acoustic_complexity,512,1,NA,5,1784.61031955946,NA 
rayol-farm1_2019-04-03_12-00-33.wav,44100,16,60,1,acoustic_complexity,512,1,NA,5,1785.87527856947,NA 
rayol-farm1_2019-04-03_12-01-33.wav,44100,16,60,1,acoustic_complexity,512,1,NA,5,1766.21963973049,NA 
rayol-farm1_2019-04-03_12-02-33.wav,44100,16,60,1,acoustic_complexity,512,1,NA,5,1771.52442418672,NA 
rayol-farm1_2019-04-03_12-03-33.wav,44100,16,60,1,acoustic_complexity,512,1,NA,5,1799.51185472409,NA 
rayol-farm1_2019-04-03_12-04-33.wav,44100,16,60,1,acoustic_complexity,512,1,NA,5,1797.24845889189,NA 
rayol-farm1_2019-04-03_12-05-33.wav,44100,16,60,1,acoustic_complexity,512,1,NA,5,1789.17546727921,NA 
rayol-farm1_2019-04-03_12-06-33.wav,44100,16,60,1,acoustic_complexity,512,1,NA,5,1784.84500726835,NA 
rayol-farm1_2019-04-03_12-07-33.wav,44100,16,60,1,acoustic_complexity,512,1,NA,5,1793.3450385927,NA 
rayol-farm1_2019-04-03_12-08-33.wav,44100,16,60,1,acoustic_complexity,512,1,NA,5,1793.5950371862,NA 
rayol-farm1_2019-04-03_12-09-33.wav,44100,16,60,1,acoustic_complexity,512,1,NA,5,1798.7287838324,NA 
rayol-farm1_2019-04-03_12-10-33.wav,44100,16,60,1,acoustic_complexity,512,1,NA,5,1797.14688551538,NA 
rayol-farm1_2019-04-03_12-11-33.wav,44100,16,60,1,acoustic_complexity,512,1,NA,5,1796.2159285719,NA 
rayol-farm1_2019-04-03_12-12-33.wav,44100,16,60,1,acoustic_complexity,512,1,NA,5,1834.40924254873,NA 
rayol-farm1_2019-04-03_12-13-33.wav,44100,16,60,1,acoustic_complexity,512,1,NA,5,1787.36874923066,NA 
rayol-farm1_2019-04-03_12-14-33.wav,44100,16,60,1,acoustic_complexity,512,1,NA,5,1781.23812887251,NA 
rayol-farm1_2019-04-03_12-15-33.wav,44100,16,60,1,acoustic_complexity,512,1,NA,5,1785.1109278505,NA 
rayol-farm1_2019-04-03_12-16-33.wav,44100,16,60,1,acoustic_complexity,512,1,NA,5,1802.3910584431,NA 
rayol-farm1_2019-04-03_12-17-33.wav,44100,16,60,1,acoustic_complexity,512,1,NA,5,1792.04699525492,NA 
rayol-farm1_2019-04-03_12-18-33.wav,44100,16,60,1,acoustic_complexity,512,1,NA,5,1802.21282016656,NA 
rayol-farm1_2019-04-03_12-19-33.wav,44100,16,60,1,acoustic_complexity,512,1,NA,5,1788.38601055957,NA 
rayol-farm1_2019-04-03_12-20-33.wav,44100,16,60,1,acoustic_complexity,512,1,NA,5,1794.92439777076,NA 
rayol-farm1_2019-04-03_12-21-33.wav,44100,16,60,1,acoustic_complexity,512,1,NA,5,1805.54162128889,NA 
rayol-farm1_2019-04-03_12-22-33.wav,44100,16,60,1,acoustic_complexity,512,1,NA,5,1799.91800067615,NA 
rayol-farm1_2019-04-03_12-23-33.wav,44100,16,60,1,acoustic_complexity,512,1,NA,5,1806.24544216737,NA 
rayol-farm1_2019-04-03_12-24-33.wav,44100,16,60,1,acoustic_complexity,512,1,NA,5,1800.52588473488,NA 
rayol-farm1_2019-04-03_12-25-33.wav,44100,16,60,1,acoustic_complexity,512,1,NA,5,1817.04372433426,NA 
rayol-farm1_2019-04-03_12-26-33.wav,44100,16,60,1,acoustic_complexity,512,1,NA,5,1802.16603483152,NA 
rayol-farm1_2019-04-03_12-27-33.wav,44100,16,60,1,acoustic_complexity,512,1,NA,5,1801.52714017477,NA 
rayol-farm1_2019-04-03_12-28-33.wav,44100,16,60,1,acoustic_complexity,512,1,NA,5,1798.36276242325,NA 
rayol-farm1_2019-04-03_12-29-33.wav,44100,16,60,1,acoustic_complexity,512,1,NA,5,1788.75747271232,NA 
rayol-farm1_2019-04-03_12-30-33.wav,44100,16,60,1,acoustic_complexity,512,1,NA,5,1793.65147574808,NA 
rayol-farm1_2019-04-03_12-31-33.wav,44100,16,60,1,acoustic_complexity,512,1,NA,5,1809.4494522014,NA 
rayol-farm1_2019-04-03_12-32-33.wav,44100,16,60,1,acoustic_complexity,512,1,NA,5,1790.18164386089,NA 
rayol-farm1_2019-04-03_12-33-33.wav,44100,16,60,1,acoustic_complexity,512,1,NA,5,1801.63806159355,NA 
rayol-farm1_2019-04-03_12-34-33.wav,44100,16,60,1,acoustic_complexity,512,1,NA,5,1780.70534888498,NA 
rayol-farm1_2019-04-03_12-35-33.wav,44100,16,60,1,acoustic_complexity,512,1,NA,5,1801.76824310615,NA 
rayol-farm1_2019-04-03_12-36-33.wav,44100,16,60,1,acoustic_complexity,512,1,NA,5,1784.10681391835,NA 
rayol-farm1_2019-04-03_12-37-33.wav,44100,16,60,1,acoustic_complexity,512,1,NA,5,1796.254575422,NA 
rayol-farm1_2019-04-03_12-38-33.wav,44100,16,60,1,acoustic_complexity,512,1,NA,5,1787.3449949987,NA 
rayol-farm1_2019-04-03_12-39-33.wav,44100,16,60,1,acoustic_complexity,512,1,NA,5,1786.4381748256,NA 
rayol-farm1_2019-04-03_12-40-33.wav,44100,16,60,1,acoustic_complexity,512,1,NA,5,1795.50235842717,NA 
rayol-farm1_2019-04-03_12-41-33.wav,44100,16,60,1,acoustic_complexity,512,1,NA,5,1787.81734307219,NA 
rayol-farm1_2019-04-03_12-42-33.wav,44100,16,60,1,acoustic_complexity,512,1,NA,5,1798.61480183222,NA 
rayol-farm1_2019-04-03_12-43-33.wav,44100,16,60,1,acoustic_complexity,512,1,NA,5,1795.66842603213,NA 
rayol-farm1_2019-04-03_12-44-33.wav,44100,16,60,1,acoustic_complexity,512,1,NA,5,1789.19334885683,NA 
rayol-farm1_2019-04-03_12-45-33.wav,44100,16,60,1,acoustic_complexity,512,1,NA,5,1807.75295026821,NA 
rayol-farm1_2019-04-03_12-46-33.wav,44100,16,60,1,acoustic_complexity,512,1,NA,5,1795.18009668398,NA 
rayol-farm1_2019-04-03_12-47-33.wav,44100,16,60,1,acoustic_complexity,512,1,NA,5,1800.92468660968,NA 
rayol-farm1_2019-04-03_12-48-33.wav,44100,16,60,1,acoustic_complexity,512,1,NA,5,1795.7149537644,NA 
rayol-farm1_2019-04-03_12-49-33.wav,44100,16,60,1,acoustic_complexity,512,1,NA,5,1780.18416447654,NA 
rayol-farm1_2019-04-03_12-50-33.wav,44100,16,60,1,acoustic_complexity,512,1,NA,5,1790.47621882368,NA 
rayol-farm1_2019-04-03_12-51-33.wav,44100,16,60,1,acoustic_complexity,512,1,NA,5,1773.18640670526,NA 
rayol-farm1_2019-04-03_12-52-33.wav,44100,16,60,1,acoustic_complexity,512,1,NA,5,1789.15937857683,NA 
rayol-farm1_2019-04-03_12-53-33.wav,44100,16,60,1,acoustic_complexity,512,1,NA,5,1784.75415819079,NA 
rayol-farm1_2019-04-03_12-54-33.wav,44100,16,60,1,acoustic_complexity,512,1,NA,5,1788.4540522402,NA 
rayol-farm1_2019-04-03_12-55-33.wav,44100,16,60,1,acoustic_complexity,512,1,NA,5,1779.97409963917,NA 
rayol-farm1_2019-04-03_12-56-33.wav,44100,16,60,1,acoustic_complexity,512,1,NA,5,1797.48484603862,NA 
rayol-farm1_2019-04-03_12-57-33.wav,44100,16,60,1,acoustic_complexity,512,1,NA,5,1782.77692584814,NA 
rayol-farm1_2019-04-03_12-58-33.wav,44100,16,60,1,acoustic_complexity,512,1,NA,5,1785.00802455961,NA 
rayol-farm1_2019-04-03_12-59-33.wav,44100,16,60,1,acoustic_complexity,512,1,NA,5,1796.90433437688,NA 
rayol-farm1_2019-04-03_13-00-33.wav,44100,16,60,1,acoustic_complexity,512,1,NA,5,1800.68120607413,NA 
rayol-farm1_2019-04-03_13-01-33.wav,44100,16,60,1,acoustic_complexity,512,1,NA,5,1788.01935736009,NA 
rayol-farm1_2019-04-03_13-02-33.wav,44100,16,60,1,acoustic_complexity,512,1,NA,5,1772.32002126337,NA 
rayol-farm1_2019-04-03_13-03-33.wav,44100,16,60,1,acoustic_complexity,512,1,NA,5,1783.06131198761,NA 
rayol-farm1_2019-04-03_13-04-33.wav,44100,16,60,1,acoustic_complexity,512,1,NA,5,1809.50897569529,NA 
rayol-farm1_2019-04-03_13-05-33.wav,44100,16,60,1,acoustic_complexity,512,1,NA,5,1785.6836873111,NA 
rayol-farm1_2019-04-03_13-06-33.wav,44100,16,60,1,acoustic_complexity,512,1,NA,5,1790.03280344934,NA 
rayol-farm1_2019-04-03_13-07-33.wav,44100,16,60,1,acoustic_complexity,512,1,NA,5,1778.06287783317,NA 
rayol-farm1_2019-04-03_13-08-33.wav,44100,16,60,1,acoustic_complexity,512,1,NA,5,1780.26631290794,NA 
rayol-farm1_2019-04-03_13-09-33.wav,44100,16,60,1,acoustic_complexity,512,1,NA,5,1790.50836840471,NA 
rayol-farm1_2019-04-03_13-10-33.wav,44100,16,60,1,acoustic_complexity,512,1,NA,5,1769.01498600381,NA 
rayol-farm1_2019-04-03_13-11-33.wav,44100,16,60,1,acoustic_complexity,512,1,NA,5,1775.02440128452,NA 
rayol-farm1_2019-04-03_13-12-33.wav,44100,16,60,1,acoustic_complexity,512,1,NA,5,1789.30520861704,NA 
rayol-farm1_2019-04-03_13-13-33.wav,44100,16,60,1,acoustic_complexity,512,1,NA,5,1800.91018733253,NA 
rayol-farm1_2019-04-03_13-14-33.wav,44100,16,60,1,acoustic_complexity,512,1,NA,5,1819.28676726218,NA 
rayol-farm1_2019-04-03_13-15-33.wav,44100,16,60,1,acoustic_complexity,512,1,NA,5,1802.60327550297,NA 
rayol-farm1_2019-04-03_13-16-33.wav,44100,16,60,1,acoustic_complexity,512,1,NA,5,1811.47622419482,NA
