FILENAME,SAMPLINGRATE,BIT,DURATION,CHANNELS,INDEX,FFT_W,MIN_FREQ,MAX_FREQ,LEFT_CHANNEL,RIGHT_CHANNEL
rayol-farm2_2019-03-22_00-01-42.wav,44100,16,60,1,bioacoustic_index,512,2000,8000,1.09489568195396,NA 
rayol-farm2_2019-03-22_00-03-42.wav,44100,16,60,1,bioacoustic_index,512,2000,8000,1.05027236620261,NA 
rayol-farm2_2019-03-22_00-05-42.wav,44100,16,60,1,bioacoustic_index,512,2000,8000,1.09749404118257,NA 
rayol-farm2_2019-03-22_00-07-42.wav,44100,16,60,1,bioacoustic_index,512,2000,8000,1.12423318681552,NA 
rayol-farm2_2019-03-22_00-09-42.wav,44100,16,60,1,bioacoustic_index,512,2000,8000,1.09038227281472,NA 
rayol-farm2_2019-03-22_00-11-42.wav,44100,16,60,1,bioacoustic_index,512,2000,8000,1.17078781196754,NA 
rayol-farm2_2019-03-22_00-13-43.wav,44100,16,60,1,bioacoustic_index,512,2000,8000,1.07979675921401,NA 
rayol-farm2_2019-03-22_00-15-43.wav,44100,16,60,1,bioacoustic_index,512,2000,8000,1.06929348029839,NA 
rayol-farm2_2019-03-22_00-17-43.wav,44100,16,60,1,bioacoustic_index,512,2000,8000,1.09228644395368,NA 
rayol-farm2_2019-03-22_00-19-43.wav,44100,16,60,1,bioacoustic_index,512,2000,8000,1.18148893375732,NA 
rayol-farm2_2019-03-22_00-21-43.wav,44100,16,60,1,bioacoustic_index,512,2000,8000,1.09945999986846,NA 
rayol-farm2_2019-03-22_00-23-43.wav,44100,16,60,1,bioacoustic_index,512,2000,8000,1.0910480075355,NA 
rayol-farm2_2019-03-22_00-25-43.wav,44100,16,60,1,bioacoustic_index,512,2000,8000,1.08049829206426,NA 
rayol-farm2_2019-03-22_00-27-43.wav,44100,16,60,1,bioacoustic_index,512,2000,8000,1.09460400765432,NA 
rayol-farm2_2019-03-22_00-29-44.wav,44100,16,60,1,bioacoustic_index,512,2000,8000,1.11322139298524,NA 
rayol-farm2_2019-03-22_00-31-44.wav,44100,16,60,1,bioacoustic_index,512,2000,8000,1.07637049792626,NA 
rayol-farm2_2019-03-22_00-33-44.wav,44100,16,60,1,bioacoustic_index,512,2000,8000,1.11028822436586,NA 
rayol-farm2_2019-03-22_00-35-44.wav,44100,16,60,1,bioacoustic_index,512,2000,8000,1.1238808618407,NA 
rayol-farm2_2019-03-22_00-37-44.wav,44100,16,60,1,bioacoustic_index,512,2000,8000,1.07523992568258,NA 
rayol-farm2_2019-03-22_00-39-44.wav,44100,16,60,1,bioacoustic_index,512,2000,8000,1.12849916593009,NA 
rayol-farm2_2019-03-22_00-41-44.wav,44100,16,60,1,bioacoustic_index,512,2000,8000,1.09999083555341,NA 
rayol-farm2_2019-03-22_00-43-44.wav,44100,16,60,1,bioacoustic_index,512,2000,8000,1.11328466907871,NA 
rayol-farm2_2019-03-22_00-45-44.wav,44100,16,60,1,bioacoustic_index,512,2000,8000,1.07612204409809,NA 
rayol-farm2_2019-03-22_00-47-45.wav,44100,16,60,1,bioacoustic_index,512,2000,8000,1.1280463504271,NA 
rayol-farm2_2019-03-22_00-49-45.wav,44100,16,60,1,bioacoustic_index,512,2000,8000,1.07905269531708,NA 
rayol-farm2_2019-03-22_00-51-45.wav,44100,16,60,1,bioacoustic_index,512,2000,8000,1.12144530844512,NA 
rayol-farm2_2019-03-22_00-53-45.wav,44100,16,60,1,bioacoustic_index,512,2000,8000,1.16359230611758,NA 
rayol-farm2_2019-03-22_00-55-45.wav,44100,16,60,1,bioacoustic_index,512,2000,8000,1.06180408982453,NA 
rayol-farm2_2019-03-22_00-57-45.wav,44100,16,60,1,bioacoustic_index,512,2000,8000,1.09476619035058,NA 
rayol-farm2_2019-03-22_00-59-45.wav,44100,16,60,1,bioacoustic_index,512,2000,8000,1.13237383541167,NA 
rayol-farm2_2019-03-22_01-01-45.wav,44100,16,60,1,bioacoustic_index,512,2000,8000,1.14025399716616,NA 
rayol-farm2_2019-03-22_01-03-46.wav,44100,16,60,1,bioacoustic_index,512,2000,8000,1.11494194851876,NA 
rayol-farm2_2019-03-22_01-05-46.wav,44100,16,60,1,bioacoustic_index,512,2000,8000,1.11470869295617,NA 
rayol-farm2_2019-03-22_01-07-46.wav,44100,16,60,1,bioacoustic_index,512,2000,8000,1.08834794053045,NA 
rayol-farm2_2019-03-22_01-09-46.wav,44100,16,60,1,bioacoustic_index,512,2000,8000,1.16742163031046,NA 
rayol-farm2_2019-03-22_01-11-46.wav,44100,16,60,1,bioacoustic_index,512,2000,8000,1.17679197812113,NA 
rayol-farm2_2019-03-22_01-13-46.wav,44100,16,60,1,bioacoustic_index,512,2000,8000,1.31954171630922,NA 
rayol-farm2_2019-03-22_01-15-46.wav,44100,16,60,1,bioacoustic_index,512,2000,8000,1.18702511891145,NA 
rayol-farm2_2019-03-22_01-17-46.wav,44100,16,60,1,bioacoustic_index,512,2000,8000,1.10611452082628,NA 
rayol-farm2_2019-03-22_01-19-47.wav,44100,16,60,1,bioacoustic_index,512,2000,8000,1.09658144556547,NA 
rayol-farm2_2019-03-22_01-21-47.wav,44100,16,60,1,bioacoustic_index,512,2000,8000,1.14580288842014,NA 
rayol-farm2_2019-03-22_01-23-47.wav,44100,16,60,1,bioacoustic_index,512,2000,8000,1.08660872414974,NA 
rayol-farm2_2019-03-22_01-25-47.wav,44100,16,60,1,bioacoustic_index,512,2000,8000,1.16932737263128,NA 
rayol-farm2_2019-03-22_01-27-47.wav,44100,16,60,1,bioacoustic_index,512,2000,8000,1.06988319201855,NA 
rayol-farm2_2019-03-22_01-29-47.wav,44100,16,60,1,bioacoustic_index,512,2000,8000,1.0993748738541,NA 
rayol-farm2_2019-03-22_01-31-47.wav,44100,16,60,1,bioacoustic_index,512,2000,8000,1.13885881216585,NA 
rayol-farm2_2019-03-22_01-33-47.wav,44100,16,60,1,bioacoustic_index,512,2000,8000,1.14677054040247,NA 
rayol-farm2_2019-03-22_01-35-48.wav,44100,16,60,1,bioacoustic_index,512,2000,8000,1.2102793779335,NA 
rayol-farm2_2019-03-22_01-37-48.wav,44100,16,60,1,bioacoustic_index,512,2000,8000,1.12306997825234,NA 
rayol-farm2_2019-03-22_01-39-48.wav,44100,16,60,1,bioacoustic_index,512,2000,8000,1.13791390823086,NA 
rayol-farm2_2019-03-22_01-41-48.wav,44100,16,60,1,bioacoustic_index,512,2000,8000,1.1488925357179,NA 
rayol-farm2_2019-03-22_01-43-48.wav,44100,16,60,1,bioacoustic_index,512,2000,8000,1.11622446101722,NA 
rayol-farm2_2019-03-22_01-45-48.wav,44100,16,60,1,bioacoustic_index,512,2000,8000,1.10000938823874,NA 
rayol-farm2_2019-03-22_01-47-48.wav,44100,16,60,1,bioacoustic_index,512,2000,8000,1.11456690843543,NA 
rayol-farm2_2019-03-22_01-49-48.wav,44100,16,60,1,bioacoustic_index,512,2000,8000,1.13264756645919,NA 
rayol-farm2_2019-03-22_01-51-48.wav,44100,16,60,1,bioacoustic_index,512,2000,8000,1.07965881273687,NA 
rayol-farm2_2019-03-22_01-53-49.wav,44100,16,60,1,bioacoustic_index,512,2000,8000,1.07443820978323,NA 
rayol-farm2_2019-03-22_01-55-49.wav,44100,16,60,1,bioacoustic_index,512,2000,8000,1.12192950789806,NA 
rayol-farm2_2019-03-22_01-57-49.wav,44100,16,60,1,bioacoustic_index,512,2000,8000,1.1179768167826,NA 
rayol-farm2_2019-03-22_01-59-49.wav,44100,16,60,1,bioacoustic_index,512,2000,8000,1.1214882788059,NA 
rayol-farm2_2019-03-22_02-01-49.wav,44100,16,60,1,bioacoustic_index,512,2000,8000,1.11356297606735,NA 
rayol-farm2_2019-03-22_02-03-49.wav,44100,16,60,1,bioacoustic_index,512,2000,8000,1.10172455043082,NA 
rayol-farm2_2019-03-22_02-05-49.wav,44100,16,60,1,bioacoustic_index,512,2000,8000,1.04528072791123,NA 
rayol-farm2_2019-03-22_02-07-49.wav,44100,16,60,1,bioacoustic_index,512,2000,8000,1.13388426727904,NA 
rayol-farm2_2019-03-22_02-09-50.wav,44100,16,60,1,bioacoustic_index,512,2000,8000,1.07824125808554,NA 
rayol-farm2_2019-03-22_02-11-50.wav,44100,16,60,1,bioacoustic_index,512,2000,8000,1.1560614294217,NA 
rayol-farm2_2019-03-22_02-13-50.wav,44100,16,60,1,bioacoustic_index,512,2000,8000,1.12296159654808,NA 
rayol-farm2_2019-03-22_02-15-50.wav,44100,16,60,1,bioacoustic_index,512,2000,8000,1.09182796972325,NA 
rayol-farm2_2019-03-22_02-17-50.wav,44100,16,60,1,bioacoustic_index,512,2000,8000,1.05366563862841,NA 
rayol-farm2_2019-03-22_02-19-50.wav,44100,16,60,1,bioacoustic_index,512,2000,8000,1.08966864771912,NA 
rayol-farm2_2019-03-22_02-21-50.wav,44100,16,60,1,bioacoustic_index,512,2000,8000,1.06969613968227,NA 
rayol-farm2_2019-03-22_02-23-50.wav,44100,16,60,1,bioacoustic_index,512,2000,8000,1.12748452598034,NA 
rayol-farm2_2019-03-22_02-25-51.wav,44100,16,60,1,bioacoustic_index,512,2000,8000,1.10954437765866,NA 
rayol-farm2_2019-03-22_02-27-51.wav,44100,16,60,1,bioacoustic_index,512,2000,8000,1.09862057223633,NA 
rayol-farm2_2019-03-22_02-29-51.wav,44100,16,60,1,bioacoustic_index,512,2000,8000,1.0938594424509,NA 
rayol-farm2_2019-03-22_02-31-51.wav,44100,16,60,1,bioacoustic_index,512,2000,8000,1.05062833532761,NA 
rayol-farm2_2019-03-22_02-33-51.wav,44100,16,60,1,bioacoustic_index,512,2000,8000,1.08677861593817,NA 
rayol-farm2_2019-03-22_02-35-51.wav,44100,16,60,1,bioacoustic_index,512,2000,8000,1.10473937001639,NA 
rayol-farm2_2019-03-22_02-37-51.wav,44100,16,60,1,bioacoustic_index,512,2000,8000,1.12442719529624,NA 
rayol-farm2_2019-03-22_02-39-51.wav,44100,16,60,1,bioacoustic_index,512,2000,8000,1.09630796212932,NA 
rayol-farm2_2019-03-22_02-41-51.wav,44100,16,60,1,bioacoustic_index,512,2000,8000,1.08333556853867,NA 
rayol-farm2_2019-03-22_02-43-52.wav,44100,16,60,1,bioacoustic_index,512,2000,8000,1.0845543093783,NA 
rayol-farm2_2019-03-22_02-45-52.wav,44100,16,60,1,bioacoustic_index,512,2000,8000,1.12015885127238,NA 
rayol-farm2_2019-03-22_02-47-52.wav,44100,16,60,1,bioacoustic_index,512,2000,8000,1.15321122641201,NA 
rayol-farm2_2019-03-22_02-49-52.wav,44100,16,60,1,bioacoustic_index,512,2000,8000,1.12054467143839,NA 
rayol-farm2_2019-03-22_02-51-52.wav,44100,16,60,1,bioacoustic_index,512,2000,8000,1.12518518903044,NA 
rayol-farm2_2019-03-22_02-53-52.wav,44100,16,60,1,bioacoustic_index,512,2000,8000,1.15192904167417,NA 
rayol-farm2_2019-03-22_02-55-52.wav,44100,16,60,1,bioacoustic_index,512,2000,8000,1.12291980919533,NA 
rayol-farm2_2019-03-22_02-57-52.wav,44100,16,60,1,bioacoustic_index,512,2000,8000,1.06386110843909,NA 
rayol-farm2_2019-03-22_02-59-53.wav,44100,16,60,1,bioacoustic_index,512,2000,8000,1.08581618625957,NA 
rayol-farm2_2019-03-22_03-01-53.wav,44100,16,60,1,bioacoustic_index,512,2000,8000,1.13869577889613,NA 
rayol-farm2_2019-03-22_03-03-53.wav,44100,16,60,1,bioacoustic_index,512,2000,8000,1.11580046981999,NA 
rayol-farm2_2019-03-22_03-05-53.wav,44100,16,60,1,bioacoustic_index,512,2000,8000,1.09819469784884,NA 
rayol-farm2_2019-03-22_03-07-53.wav,44100,16,60,1,bioacoustic_index,512,2000,8000,1.10202682658948,NA 
rayol-farm2_2019-03-22_03-09-53.wav,44100,16,60,1,bioacoustic_index,512,2000,8000,1.09497161733886,NA 
rayol-farm2_2019-03-22_03-11-53.wav,44100,16,60,1,bioacoustic_index,512,2000,8000,1.08479241449766,NA 
rayol-farm2_2019-03-22_03-13-53.wav,44100,16,60,1,bioacoustic_index,512,2000,8000,1.11458111573608,NA 
rayol-farm2_2019-03-22_03-15-54.wav,44100,16,60,1,bioacoustic_index,512,2000,8000,1.10906806732502,NA 
rayol-farm2_2019-03-22_03-17-54.wav,44100,16,60,1,bioacoustic_index,512,2000,8000,1.10566296941428,NA 
rayol-farm2_2019-03-22_03-19-54.wav,44100,16,60,1,bioacoustic_index,512,2000,8000,1.08223039129437,NA 
rayol-farm2_2019-03-22_03-21-54.wav,44100,16,60,1,bioacoustic_index,512,2000,8000,1.15258459084962,NA 
rayol-farm2_2019-03-22_03-23-54.wav,44100,16,60,1,bioacoustic_index,512,2000,8000,1.06760948327051,NA 
rayol-farm2_2019-03-22_03-25-54.wav,44100,16,60,1,bioacoustic_index,512,2000,8000,1.11856552487246,NA 
rayol-farm2_2019-03-22_03-27-54.wav,44100,16,60,1,bioacoustic_index,512,2000,8000,1.14522489392461,NA 
rayol-farm2_2019-03-22_03-29-54.wav,44100,16,60,1,bioacoustic_index,512,2000,8000,1.07346291905046,NA 
rayol-farm2_2019-03-22_03-31-55.wav,44100,16,60,1,bioacoustic_index,512,2000,8000,1.13254788082264,NA 
rayol-farm2_2019-03-22_03-33-55.wav,44100,16,60,1,bioacoustic_index,512,2000,8000,1.12784476045586,NA 
rayol-farm2_2019-03-22_03-35-55.wav,44100,16,60,1,bioacoustic_index,512,2000,8000,1.09865248170681,NA 
rayol-farm2_2019-03-22_03-37-55.wav,44100,16,60,1,bioacoustic_index,512,2000,8000,1.11708353965856,NA 
rayol-farm2_2019-03-22_03-39-55.wav,44100,16,60,1,bioacoustic_index,512,2000,8000,1.09317016188455,NA 
rayol-farm2_2019-03-22_03-41-55.wav,44100,16,60,1,bioacoustic_index,512,2000,8000,1.15717314137174,NA 
rayol-farm2_2019-03-22_03-43-55.wav,44100,16,60,1,bioacoustic_index,512,2000,8000,1.12071071507473,NA 
rayol-farm2_2019-03-22_03-45-55.wav,44100,16,60,1,bioacoustic_index,512,2000,8000,1.11499825604597,NA 
rayol-farm2_2019-03-22_03-47-56.wav,44100,16,60,1,bioacoustic_index,512,2000,8000,1.0180917038817,NA 
rayol-farm2_2019-03-22_03-49-56.wav,44100,16,60,1,bioacoustic_index,512,2000,8000,1.06190889547555,NA 
rayol-farm2_2019-03-22_03-51-56.wav,44100,16,60,1,bioacoustic_index,512,2000,8000,1.11498552314145,NA 
rayol-farm2_2019-03-22_03-53-56.wav,44100,16,60,1,bioacoustic_index,512,2000,8000,1.11751879047517,NA 
rayol-farm2_2019-03-22_03-55-56.wav,44100,16,60,1,bioacoustic_index,512,2000,8000,1.17504989482318,NA 
rayol-farm2_2019-03-22_03-57-56.wav,44100,16,60,1,bioacoustic_index,512,2000,8000,1.07668096987225,NA 
rayol-farm2_2019-03-22_03-59-56.wav,44100,16,60,1,bioacoustic_index,512,2000,8000,1.10844108381845,NA 
rayol-farm2_2019-03-22_04-01-56.wav,44100,16,60,1,bioacoustic_index,512,2000,8000,1.09662427285215,NA 
rayol-farm2_2019-03-22_04-03-57.wav,44100,16,60,1,bioacoustic_index,512,2000,8000,1.12516580333465,NA 
rayol-farm2_2019-03-22_04-05-57.wav,44100,16,60,1,bioacoustic_index,512,2000,8000,1.18321572529848,NA 
rayol-farm2_2019-03-22_04-07-57.wav,44100,16,60,1,bioacoustic_index,512,2000,8000,1.10709438458127,NA 
rayol-farm2_2019-03-22_04-09-57.wav,44100,16,60,1,bioacoustic_index,512,2000,8000,1.21111850684778,NA 
rayol-farm2_2019-03-22_04-11-57.wav,44100,16,60,1,bioacoustic_index,512,2000,8000,1.09160193441364,NA 
rayol-farm2_2019-03-22_04-13-57.wav,44100,16,60,1,bioacoustic_index,512,2000,8000,1.03987595532622,NA 
rayol-farm2_2019-03-22_04-15-57.wav,44100,16,60,1,bioacoustic_index,512,2000,8000,1.14640294482266,NA 
rayol-farm2_2019-03-22_04-17-57.wav,44100,16,60,1,bioacoustic_index,512,2000,8000,1.08812872295022,NA 
rayol-farm2_2019-03-22_04-19-57.wav,44100,16,60,1,bioacoustic_index,512,2000,8000,1.13139537598419,NA 
rayol-farm2_2019-03-22_04-21-58.wav,44100,16,60,1,bioacoustic_index,512,2000,8000,1.09790094505209,NA 
rayol-farm2_2019-03-22_04-23-58.wav,44100,16,60,1,bioacoustic_index,512,2000,8000,1.08461518494944,NA 
rayol-farm2_2019-03-22_04-25-58.wav,44100,16,60,1,bioacoustic_index,512,2000,8000,1.07048573454876,NA 
rayol-farm2_2019-03-22_04-27-58.wav,44100,16,60,1,bioacoustic_index,512,2000,8000,1.10235986593591,NA 
rayol-farm2_2019-03-22_04-29-58.wav,44100,16,60,1,bioacoustic_index,512,2000,8000,1.0848739498046,NA 
rayol-farm2_2019-03-22_04-31-58.wav,44100,16,60,1,bioacoustic_index,512,2000,8000,1.13763769054825,NA 
rayol-farm2_2019-03-22_04-33-58.wav,44100,16,60,1,bioacoustic_index,512,2000,8000,1.11626470414307,NA 
rayol-farm2_2019-03-22_04-35-58.wav,44100,16,60,1,bioacoustic_index,512,2000,8000,1.10385827511477,NA 
rayol-farm2_2019-03-22_04-37-59.wav,44100,16,60,1,bioacoustic_index,512,2000,8000,1.09835537620888,NA 
rayol-farm2_2019-03-22_04-39-59.wav,44100,16,60,1,bioacoustic_index,512,2000,8000,1.14518042440961,NA 
rayol-farm2_2019-03-22_04-41-59.wav,44100,16,60,1,bioacoustic_index,512,2000,8000,1.14052737085935,NA 
rayol-farm2_2019-03-22_04-43-59.wav,44100,16,60,1,bioacoustic_index,512,2000,8000,1.06874860229819,NA 
rayol-farm2_2019-03-22_04-45-59.wav,44100,16,60,1,bioacoustic_index,512,2000,8000,1.0944909884367,NA 
rayol-farm2_2019-03-22_04-47-59.wav,44100,16,60,1,bioacoustic_index,512,2000,8000,1.07656934686394,NA 
rayol-farm2_2019-03-22_04-49-59.wav,44100,16,60,1,bioacoustic_index,512,2000,8000,1.11920189777709,NA 
rayol-farm2_2019-03-22_04-51-59.wav,44100,16,60,1,bioacoustic_index,512,2000,8000,1.08462813584416,NA 
rayol-farm2_2019-03-22_04-54-00.wav,44100,16,60,1,bioacoustic_index,512,2000,8000,1.0873375680692,NA 
rayol-farm2_2019-03-22_04-56-00.wav,44100,16,60,1,bioacoustic_index,512,2000,8000,1.08106582838402,NA 
rayol-farm2_2019-03-22_04-58-00.wav,44100,16,60,1,bioacoustic_index,512,2000,8000,1.10243388987298,NA 
rayol-farm2_2019-03-22_05-00-00.wav,44100,16,60,1,bioacoustic_index,512,2000,8000,1.17254604339813,NA 
rayol-farm2_2019-03-22_05-02-00.wav,44100,16,60,1,bioacoustic_index,512,2000,8000,1.12389796771044,NA 
rayol-farm2_2019-03-22_05-04-00.wav,44100,16,60,1,bioacoustic_index,512,2000,8000,1.17102769768761,NA 
rayol-farm2_2019-03-22_05-06-00.wav,44100,16,60,1,bioacoustic_index,512,2000,8000,1.04649737944961,NA 
rayol-farm2_2019-03-22_05-08-00.wav,44100,16,60,1,bioacoustic_index,512,2000,8000,1.11458671575107,NA 
rayol-farm2_2019-03-22_05-10-00.wav,44100,16,60,1,bioacoustic_index,512,2000,8000,1.10779989303038,NA 
rayol-farm2_2019-03-22_05-12-01.wav,44100,16,60,1,bioacoustic_index,512,2000,8000,1.14504588466255,NA 
rayol-farm2_2019-03-22_05-14-01.wav,44100,16,60,1,bioacoustic_index,512,2000,8000,1.10117965499648,NA 
rayol-farm2_2019-03-22_05-16-01.wav,44100,16,60,1,bioacoustic_index,512,2000,8000,1.07823496793756,NA 
rayol-farm2_2019-03-22_05-18-01.wav,44100,16,60,1,bioacoustic_index,512,2000,8000,1.1671614601932,NA 
rayol-farm2_2019-03-22_05-20-01.wav,44100,16,60,1,bioacoustic_index,512,2000,8000,1.0797081930989,NA 
rayol-farm2_2019-03-22_05-22-01.wav,44100,16,60,1,bioacoustic_index,512,2000,8000,1.07072222425692,NA 
rayol-farm2_2019-03-22_05-24-01.wav,44100,16,60,1,bioacoustic_index,512,2000,8000,1.08025801248654,NA 
rayol-farm2_2019-03-22_05-26-01.wav,44100,16,60,1,bioacoustic_index,512,2000,8000,1.31104982115142,NA 
rayol-farm2_2019-03-22_05-28-02.wav,44100,16,60,1,bioacoustic_index,512,2000,8000,1.14943082648132,NA 
rayol-farm2_2019-03-22_05-30-02.wav,44100,16,60,1,bioacoustic_index,512,2000,8000,1.16419818073697,NA 
rayol-farm2_2019-03-22_05-32-02.wav,44100,16,60,1,bioacoustic_index,512,2000,8000,1.15640630224601,NA 
rayol-farm2_2019-03-22_05-34-02.wav,44100,16,60,1,bioacoustic_index,512,2000,8000,1.32332726131397,NA 
rayol-farm2_2019-03-22_05-36-02.wav,44100,16,60,1,bioacoustic_index,512,2000,8000,1.2675656775369,NA 
rayol-farm2_2019-03-22_05-38-02.wav,44100,16,60,1,bioacoustic_index,512,2000,8000,1.39259954576137,NA 
rayol-farm2_2019-03-22_05-40-02.wav,44100,16,60,1,bioacoustic_index,512,2000,8000,1.50889367342815,NA 
rayol-farm2_2019-03-22_05-42-02.wav,44100,16,60,1,bioacoustic_index,512,2000,8000,1.58479572283519,NA 
rayol-farm2_2019-03-22_05-44-03.wav,44100,16,60,1,bioacoustic_index,512,2000,8000,2.05786152796681,NA 
rayol-farm2_2019-03-22_05-46-03.wav,44100,16,60,1,bioacoustic_index,512,2000,8000,2.501289449033,NA 
rayol-farm2_2019-03-22_05-48-03.wav,44100,16,60,1,bioacoustic_index,512,2000,8000,2.42168608206966,NA 
rayol-farm2_2019-03-22_05-50-03.wav,44100,16,60,1,bioacoustic_index,512,2000,8000,3.39323121018776,NA 
rayol-farm2_2019-03-22_05-52-03.wav,44100,16,60,1,bioacoustic_index,512,2000,8000,2.71339521587512,NA 
rayol-farm2_2019-03-22_05-54-03.wav,44100,16,60,1,bioacoustic_index,512,2000,8000,3.39937682796128,NA 
rayol-farm2_2019-03-22_05-56-03.wav,44100,16,60,1,bioacoustic_index,512,2000,8000,4.25429733115747,NA 
rayol-farm2_2019-03-22_05-58-03.wav,44100,16,60,1,bioacoustic_index,512,2000,8000,2.98388754021597,NA 
rayol-farm2_2019-03-22_06-00-04.wav,44100,16,60,1,bioacoustic_index,512,2000,8000,2.4967884153803,NA 
rayol-farm2_2019-03-22_06-02-04.wav,44100,16,60,1,bioacoustic_index,512,2000,8000,3.53646340088185,NA 
rayol-farm2_2019-03-22_06-04-04.wav,44100,16,60,1,bioacoustic_index,512,2000,8000,4.04873163502983,NA 
rayol-farm2_2019-03-22_06-06-04.wav,44100,16,60,1,bioacoustic_index,512,2000,8000,4.48129228834032,NA 
rayol-farm2_2019-03-22_06-08-04.wav,44100,16,60,1,bioacoustic_index,512,2000,8000,5.34030928796989,NA 
rayol-farm2_2019-03-22_06-10-04.wav,44100,16,60,1,bioacoustic_index,512,2000,8000,5.98923763671396,NA 
rayol-farm2_2019-03-22_06-12-04.wav,44100,16,60,1,bioacoustic_index,512,2000,8000,4.6484850276993,NA 
rayol-farm2_2019-03-22_06-14-04.wav,44100,16,60,1,bioacoustic_index,512,2000,8000,3.55032872333927,NA 
rayol-farm2_2019-03-22_06-16-04.wav,44100,16,60,1,bioacoustic_index,512,2000,8000,1.7343865666294,NA 
rayol-farm2_2019-03-22_06-18-05.wav,44100,16,60,1,bioacoustic_index,512,2000,8000,1.30186007912372,NA 
rayol-farm2_2019-03-22_06-20-05.wav,44100,16,60,1,bioacoustic_index,512,2000,8000,1.72188470999486,NA 
rayol-farm2_2019-03-22_06-22-05.wav,44100,16,60,1,bioacoustic_index,512,2000,8000,1.93421774441014,NA 
rayol-farm2_2019-03-22_06-24-05.wav,44100,16,60,1,bioacoustic_index,512,2000,8000,1.6288581143723,NA 
rayol-farm2_2019-03-22_06-26-05.wav,44100,16,60,1,bioacoustic_index,512,2000,8000,1.95952182168763,NA 
rayol-farm2_2019-03-22_06-28-05.wav,44100,16,60,1,bioacoustic_index,512,2000,8000,2.46520722561669,NA 
rayol-farm2_2019-03-22_06-30-05.wav,44100,16,60,1,bioacoustic_index,512,2000,8000,1.80414504020764,NA 
rayol-farm2_2019-03-22_06-32-05.wav,44100,16,60,1,bioacoustic_index,512,2000,8000,2.39701565896523,NA 
rayol-farm2_2019-03-22_06-34-06.wav,44100,16,60,1,bioacoustic_index,512,2000,8000,1.55182292400023,NA 
rayol-farm2_2019-03-22_06-36-06.wav,44100,16,60,1,bioacoustic_index,512,2000,8000,1.97319032038071,NA 
rayol-farm2_2019-03-22_06-38-06.wav,44100,16,60,1,bioacoustic_index,512,2000,8000,1.3176925778289,NA 
rayol-farm2_2019-03-22_06-40-06.wav,44100,16,60,1,bioacoustic_index,512,2000,8000,1.12511797386003,NA 
rayol-farm2_2019-03-22_06-42-06.wav,44100,16,60,1,bioacoustic_index,512,2000,8000,2.3298218202427,NA 
rayol-farm2_2019-03-22_06-44-06.wav,44100,16,60,1,bioacoustic_index,512,2000,8000,2.56732879682502,NA 
rayol-farm2_2019-03-22_06-46-06.wav,44100,16,60,1,bioacoustic_index,512,2000,8000,1.85547140850354,NA 
rayol-farm2_2019-03-22_06-48-06.wav,44100,16,60,1,bioacoustic_index,512,2000,8000,1.27501711321296,NA 
rayol-farm2_2019-03-22_06-50-07.wav,44100,16,60,1,bioacoustic_index,512,2000,8000,3.63353521622756,NA 
rayol-farm2_2019-03-22_06-52-07.wav,44100,16,60,1,bioacoustic_index,512,2000,8000,1.25974223142835,NA 
rayol-farm2_2019-03-22_06-54-07.wav,44100,16,60,1,bioacoustic_index,512,2000,8000,1.08538373165633,NA 
rayol-farm2_2019-03-22_06-56-07.wav,44100,16,60,1,bioacoustic_index,512,2000,8000,1.67942477383972,NA 
rayol-farm2_2019-03-22_06-58-07.wav,44100,16,60,1,bioacoustic_index,512,2000,8000,1.12082692366364,NA 
rayol-farm2_2019-03-22_07-00-07.wav,44100,16,60,1,bioacoustic_index,512,2000,8000,1.22651280534292,NA 
rayol-farm2_2019-03-22_07-02-07.wav,44100,16,60,1,bioacoustic_index,512,2000,8000,1.78189638476659,NA 
rayol-farm2_2019-03-22_07-04-07.wav,44100,16,60,1,bioacoustic_index,512,2000,8000,3.95993595361621,NA 
rayol-farm2_2019-03-22_07-06-07.wav,44100,16,60,1,bioacoustic_index,512,2000,8000,1.75180161951258,NA 
rayol-farm2_2019-03-22_07-08-08.wav,44100,16,60,1,bioacoustic_index,512,2000,8000,1.48260121620603,NA 
rayol-farm2_2019-03-22_07-10-08.wav,44100,16,60,1,bioacoustic_index,512,2000,8000,1.04916152981871,NA 
rayol-farm2_2019-03-22_07-12-08.wav,44100,16,60,1,bioacoustic_index,512,2000,8000,1.18443494284236,NA 
rayol-farm2_2019-03-22_07-14-08.wav,44100,16,60,1,bioacoustic_index,512,2000,8000,1.59332566146039,NA 
rayol-farm2_2019-03-22_07-16-08.wav,44100,16,60,1,bioacoustic_index,512,2000,8000,1.50088387970946,NA 
rayol-farm2_2019-03-22_07-18-08.wav,44100,16,60,1,bioacoustic_index,512,2000,8000,1.15611385630242,NA 
rayol-farm2_2019-03-22_07-20-08.wav,44100,16,60,1,bioacoustic_index,512,2000,8000,1.35067379667631,NA 
rayol-farm2_2019-03-22_07-22-08.wav,44100,16,60,1,bioacoustic_index,512,2000,8000,1.14192739310717,NA 
rayol-farm2_2019-03-22_07-24-09.wav,44100,16,60,1,bioacoustic_index,512,2000,8000,1.10914448473585,NA 
rayol-farm2_2019-03-22_07-26-09.wav,44100,16,60,1,bioacoustic_index,512,2000,8000,1.25038218928917,NA 
rayol-farm2_2019-03-22_07-28-09.wav,44100,16,60,1,bioacoustic_index,512,2000,8000,3.58624487643973,NA 
rayol-farm2_2019-03-22_07-30-09.wav,44100,16,60,1,bioacoustic_index,512,2000,8000,2.01348001902528,NA 
rayol-farm2_2019-03-22_07-32-09.wav,44100,16,60,1,bioacoustic_index,512,2000,8000,1.11648466316016,NA 
rayol-farm2_2019-03-22_07-34-09.wav,44100,16,60,1,bioacoustic_index,512,2000,8000,1.49724011545744,NA 
rayol-farm2_2019-03-22_07-36-09.wav,44100,16,60,1,bioacoustic_index,512,2000,8000,1.36277021268899,NA 
rayol-farm2_2019-03-22_07-38-09.wav,44100,16,60,1,bioacoustic_index,512,2000,8000,1.58306078089597,NA 
rayol-farm2_2019-03-22_07-40-10.wav,44100,16,60,1,bioacoustic_index,512,2000,8000,1.49786098257972,NA 
rayol-farm2_2019-03-22_07-42-10.wav,44100,16,60,1,bioacoustic_index,512,2000,8000,1.48091522989893,NA 
rayol-farm2_2019-03-22_07-44-10.wav,44100,16,60,1,bioacoustic_index,512,2000,8000,1.25826823184178,NA 
rayol-farm2_2019-03-22_07-46-10.wav,44100,16,60,1,bioacoustic_index,512,2000,8000,1.35838690084185,NA 
rayol-farm2_2019-03-22_07-48-10.wav,44100,16,60,1,bioacoustic_index,512,2000,8000,1.21111064444067,NA 
rayol-farm2_2019-03-22_07-50-10.wav,44100,16,60,1,bioacoustic_index,512,2000,8000,4.88424713429766,NA 
rayol-farm2_2019-03-22_07-52-10.wav,44100,16,60,1,bioacoustic_index,512,2000,8000,3.7769513167755,NA 
rayol-farm2_2019-03-22_07-54-10.wav,44100,16,60,1,bioacoustic_index,512,2000,8000,1.58097091291726,NA 
rayol-farm2_2019-03-22_07-56-10.wav,44100,16,60,1,bioacoustic_index,512,2000,8000,1.79954643607433,NA 
rayol-farm2_2019-03-22_07-58-11.wav,44100,16,60,1,bioacoustic_index,512,2000,8000,1.71957901815469,NA 
rayol-farm2_2019-03-22_08-00-11.wav,44100,16,60,1,bioacoustic_index,512,2000,8000,1.22952730780402,NA 
rayol-farm2_2019-03-22_08-02-11.wav,44100,16,60,1,bioacoustic_index,512,2000,8000,1.42931365204274,NA 
rayol-farm2_2019-03-22_08-04-11.wav,44100,16,60,1,bioacoustic_index,512,2000,8000,1.83510525265287,NA 
rayol-farm2_2019-03-22_08-06-11.wav,44100,16,60,1,bioacoustic_index,512,2000,8000,1.29215060894272,NA 
rayol-farm2_2019-03-22_08-08-11.wav,44100,16,60,1,bioacoustic_index,512,2000,8000,2.35298954082345,NA 
rayol-farm2_2019-03-22_08-10-11.wav,44100,16,60,1,bioacoustic_index,512,2000,8000,1.46134549693521,NA 
rayol-farm2_2019-03-22_08-12-11.wav,44100,16,60,1,bioacoustic_index,512,2000,8000,3.80681563363301,NA 
rayol-farm2_2019-03-22_08-14-12.wav,44100,16,60,1,bioacoustic_index,512,2000,8000,1.89934824887899,NA 
rayol-farm2_2019-03-22_08-16-12.wav,44100,16,60,1,bioacoustic_index,512,2000,8000,1.18127303139627,NA 
rayol-farm2_2019-03-22_08-18-12.wav,44100,16,60,1,bioacoustic_index,512,2000,8000,1.18755483141888,NA 
rayol-farm2_2019-03-22_08-20-12.wav,44100,16,60,1,bioacoustic_index,512,2000,8000,2.68821317756767,NA 
rayol-farm2_2019-03-22_08-22-12.wav,44100,16,60,1,bioacoustic_index,512,2000,8000,2.49889961482094,NA 
rayol-farm2_2019-03-22_08-24-12.wav,44100,16,60,1,bioacoustic_index,512,2000,8000,1.3232659270882,NA 
rayol-farm2_2019-03-22_08-26-12.wav,44100,16,60,1,bioacoustic_index,512,2000,8000,1.46890828627236,NA 
rayol-farm2_2019-03-22_08-28-12.wav,44100,16,60,1,bioacoustic_index,512,2000,8000,2.12594982799665,NA 
rayol-farm2_2019-03-22_08-30-13.wav,44100,16,60,1,bioacoustic_index,512,2000,8000,1.45706671943058,NA 
rayol-farm2_2019-03-22_08-32-13.wav,44100,16,60,1,bioacoustic_index,512,2000,8000,1.14349216571756,NA 
rayol-farm2_2019-03-22_08-34-13.wav,44100,16,60,1,bioacoustic_index,512,2000,8000,1.38365869582182,NA 
rayol-farm2_2019-03-22_08-36-13.wav,44100,16,60,1,bioacoustic_index,512,2000,8000,1.37885927345567,NA 
rayol-farm2_2019-03-22_08-38-13.wav,44100,16,60,1,bioacoustic_index,512,2000,8000,1.18761054994309,NA 
rayol-farm2_2019-03-22_08-40-13.wav,44100,16,60,1,bioacoustic_index,512,2000,8000,1.56524047208178,NA 
rayol-farm2_2019-03-22_08-42-13.wav,44100,16,60,1,bioacoustic_index,512,2000,8000,1.39139898507132,NA 
rayol-farm2_2019-03-22_08-44-13.wav,44100,16,60,1,bioacoustic_index,512,2000,8000,1.58792005047992,NA 
rayol-farm2_2019-03-22_08-46-14.wav,44100,16,60,1,bioacoustic_index,512,2000,8000,1.82911270609212,NA 
rayol-farm2_2019-03-22_08-48-14.wav,44100,16,60,1,bioacoustic_index,512,2000,8000,1.51796394010573,NA 
rayol-farm2_2019-03-22_08-50-14.wav,44100,16,60,1,bioacoustic_index,512,2000,8000,1.10277945419455,NA 
rayol-farm2_2019-03-22_08-52-14.wav,44100,16,60,1,bioacoustic_index,512,2000,8000,1.63504787636009,NA 
rayol-farm2_2019-03-22_08-54-14.wav,44100,16,60,1,bioacoustic_index,512,2000,8000,1.51038635800391,NA 
rayol-farm2_2019-03-22_08-56-14.wav,44100,16,60,1,bioacoustic_index,512,2000,8000,1.31390723710294,NA 
rayol-farm2_2019-03-22_08-58-14.wav,44100,16,60,1,bioacoustic_index,512,2000,8000,1.05843022269975,NA 
rayol-farm2_2019-03-22_09-00-14.wav,44100,16,60,1,bioacoustic_index,512,2000,8000,1.14017498948582,NA 
rayol-farm2_2019-03-22_09-02-14.wav,44100,16,60,1,bioacoustic_index,512,2000,8000,1.29791256284176,NA 
rayol-farm2_2019-03-22_09-04-15.wav,44100,16,60,1,bioacoustic_index,512,2000,8000,1.47379699696415,NA 
rayol-farm2_2019-03-22_09-06-15.wav,44100,16,60,1,bioacoustic_index,512,2000,8000,3.6235991763181,NA 
rayol-farm2_2019-03-22_09-08-15.wav,44100,16,60,1,bioacoustic_index,512,2000,8000,0.981187962725475,NA 
rayol-farm2_2019-03-22_09-10-15.wav,44100,16,60,1,bioacoustic_index,512,2000,8000,1.09227813906719,NA 
rayol-farm2_2019-03-22_09-12-15.wav,44100,16,60,1,bioacoustic_index,512,2000,8000,4.09329095031153,NA 
rayol-farm2_2019-03-22_09-14-15.wav,44100,16,60,1,bioacoustic_index,512,2000,8000,1.01507347116925,NA 
rayol-farm2_2019-03-22_09-16-15.wav,44100,16,60,1,bioacoustic_index,512,2000,8000,4.75155928222214,NA 
rayol-farm2_2019-03-22_09-18-15.wav,44100,16,60,1,bioacoustic_index,512,2000,8000,3.08123967493998,NA 
rayol-farm2_2019-03-22_09-20-16.wav,44100,16,60,1,bioacoustic_index,512,2000,8000,0.980494941950828,NA 
rayol-farm2_2019-03-22_09-22-16.wav,44100,16,60,1,bioacoustic_index,512,2000,8000,0.943275812418574,NA 
rayol-farm2_2019-03-22_09-24-16.wav,44100,16,60,1,bioacoustic_index,512,2000,8000,0.914799654020524,NA 
rayol-farm2_2019-03-22_09-26-16.wav,44100,16,60,1,bioacoustic_index,512,2000,8000,0.967885266491547,NA 
rayol-farm2_2019-03-22_09-28-16.wav,44100,16,60,1,bioacoustic_index,512,2000,8000,1.30854287792468,NA 
rayol-farm2_2019-03-22_09-30-16.wav,44100,16,60,1,bioacoustic_index,512,2000,8000,1.35936777111533,NA 
rayol-farm2_2019-03-22_09-32-16.wav,44100,16,60,1,bioacoustic_index,512,2000,8000,1.70673540964101,NA 
rayol-farm2_2019-03-22_09-34-16.wav,44100,16,60,1,bioacoustic_index,512,2000,8000,1.33645302444918,NA 
rayol-farm2_2019-03-22_09-36-17.wav,44100,16,60,1,bioacoustic_index,512,2000,8000,1.89730194720828,NA 
rayol-farm2_2019-03-22_09-38-17.wav,44100,16,60,1,bioacoustic_index,512,2000,8000,1.17418477152279,NA 
rayol-farm2_2019-03-22_09-40-17.wav,44100,16,60,1,bioacoustic_index,512,2000,8000,1.11974480128914,NA 
rayol-farm2_2019-03-22_09-42-17.wav,44100,16,60,1,bioacoustic_index,512,2000,8000,2.29628097015499,NA 
rayol-farm2_2019-03-22_09-44-17.wav,44100,16,60,1,bioacoustic_index,512,2000,8000,4.18829111142721,NA 
rayol-farm2_2019-03-22_09-46-17.wav,44100,16,60,1,bioacoustic_index,512,2000,8000,1.18170804155496,NA 
rayol-farm2_2019-03-22_09-48-17.wav,44100,16,60,1,bioacoustic_index,512,2000,8000,1.48773252808988,NA 
rayol-farm2_2019-03-22_09-50-17.wav,44100,16,60,1,bioacoustic_index,512,2000,8000,3.20103961059811,NA 
rayol-farm2_2019-03-22_09-52-18.wav,44100,16,60,1,bioacoustic_index,512,2000,8000,1.33692780051661,NA 
rayol-farm2_2019-03-22_09-54-18.wav,44100,16,60,1,bioacoustic_index,512,2000,8000,1.55196832628762,NA 
rayol-farm2_2019-03-22_09-56-18.wav,44100,16,60,1,bioacoustic_index,512,2000,8000,1.52229816741503,NA 
rayol-farm2_2019-03-22_09-58-18.wav,44100,16,60,1,bioacoustic_index,512,2000,8000,1.46551368549485,NA 
rayol-farm2_2019-03-22_10-00-18.wav,44100,16,60,1,bioacoustic_index,512,2000,8000,1.3487676368441,NA 
rayol-farm2_2019-03-22_10-02-18.wav,44100,16,60,1,bioacoustic_index,512,2000,8000,1.99891447054866,NA 
rayol-farm2_2019-03-22_10-04-18.wav,44100,16,60,1,bioacoustic_index,512,2000,8000,1.59691088610365,NA 
rayol-farm2_2019-03-22_10-06-18.wav,44100,16,60,1,bioacoustic_index,512,2000,8000,2.04598537811777,NA 
rayol-farm2_2019-03-22_10-08-18.wav,44100,16,60,1,bioacoustic_index,512,2000,8000,2.21343617047727,NA 
rayol-farm2_2019-03-22_10-10-19.wav,44100,16,60,1,bioacoustic_index,512,2000,8000,3.28760436245114,NA 
rayol-farm2_2019-03-22_10-12-19.wav,44100,16,60,1,bioacoustic_index,512,2000,8000,1.38999470415154,NA 
rayol-farm2_2019-03-22_10-14-19.wav,44100,16,60,1,bioacoustic_index,512,2000,8000,1.05124950333744,NA 
rayol-farm2_2019-03-22_10-16-19.wav,44100,16,60,1,bioacoustic_index,512,2000,8000,1.08943642723598,NA 
rayol-farm2_2019-03-22_10-18-19.wav,44100,16,60,1,bioacoustic_index,512,2000,8000,0.992409247246771,NA 
rayol-farm2_2019-03-22_10-20-19.wav,44100,16,60,1,bioacoustic_index,512,2000,8000,1.12033206257231,NA 
rayol-farm2_2019-03-22_10-22-19.wav,44100,16,60,1,bioacoustic_index,512,2000,8000,0.891933589736781,NA 
rayol-farm2_2019-03-22_10-24-19.wav,44100,16,60,1,bioacoustic_index,512,2000,8000,0.840631339891181,NA 
rayol-farm2_2019-03-22_10-26-20.wav,44100,16,60,1,bioacoustic_index,512,2000,8000,1.19062737100178,NA 
rayol-farm2_2019-03-22_10-28-20.wav,44100,16,60,1,bioacoustic_index,512,2000,8000,1.64252252061733,NA 
rayol-farm2_2019-03-22_10-30-20.wav,44100,16,60,1,bioacoustic_index,512,2000,8000,2.2699436796956,NA 
rayol-farm2_2019-03-22_10-32-20.wav,44100,16,60,1,bioacoustic_index,512,2000,8000,2.70376834343539,NA 
rayol-farm2_2019-03-22_10-34-20.wav,44100,16,60,1,bioacoustic_index,512,2000,8000,1.66361927906336,NA 
rayol-farm2_2019-03-22_10-36-20.wav,44100,16,60,1,bioacoustic_index,512,2000,8000,1.48117558263338,NA 
rayol-farm2_2019-03-22_10-38-20.wav,44100,16,60,1,bioacoustic_index,512,2000,8000,1.09670849500032,NA 
rayol-farm2_2019-03-22_10-40-20.wav,44100,16,60,1,bioacoustic_index,512,2000,8000,1.08643111451372,NA 
rayol-farm2_2019-03-22_10-42-21.wav,44100,16,60,1,bioacoustic_index,512,2000,8000,1.17551300103281,NA 
rayol-farm2_2019-03-22_10-44-21.wav,44100,16,60,1,bioacoustic_index,512,2000,8000,1.07485179751848,NA 
rayol-farm2_2019-03-22_10-46-21.wav,44100,16,60,1,bioacoustic_index,512,2000,8000,1.00156333940715,NA 
rayol-farm2_2019-03-22_10-48-21.wav,44100,16,60,1,bioacoustic_index,512,2000,8000,1.06074727502261,NA 
rayol-farm2_2019-03-22_10-50-21.wav,44100,16,60,1,bioacoustic_index,512,2000,8000,1.23159747832281,NA 
rayol-farm2_2019-03-22_10-52-21.wav,44100,16,60,1,bioacoustic_index,512,2000,8000,1.54465892200647,NA 
rayol-farm2_2019-03-22_10-54-21.wav,44100,16,60,1,bioacoustic_index,512,2000,8000,0.985087299666317,NA 
rayol-farm2_2019-03-22_10-56-21.wav,44100,16,60,1,bioacoustic_index,512,2000,8000,2.25422809433744,NA 
rayol-farm2_2019-03-22_10-58-22.wav,44100,16,60,1,bioacoustic_index,512,2000,8000,4.01757829665324,NA 
rayol-farm2_2019-03-22_11-00-22.wav,44100,16,60,1,bioacoustic_index,512,2000,8000,5.77517092234319,NA 
rayol-farm2_2019-03-22_11-02-22.wav,44100,16,60,1,bioacoustic_index,512,2000,8000,1.29127452973051,NA 
rayol-farm2_2019-03-22_11-04-22.wav,44100,16,60,1,bioacoustic_index,512,2000,8000,1.09533703012102,NA 
rayol-farm2_2019-03-22_11-06-22.wav,44100,16,60,1,bioacoustic_index,512,2000,8000,1.88274444585787,NA 
rayol-farm2_2019-03-22_11-08-22.wav,44100,16,60,1,bioacoustic_index,512,2000,8000,0.976624171355087,NA 
rayol-farm2_2019-03-22_11-10-22.wav,44100,16,60,1,bioacoustic_index,512,2000,8000,0.929616899858291,NA 
rayol-farm2_2019-03-22_11-12-22.wav,44100,16,60,1,bioacoustic_index,512,2000,8000,0.884309540622892,NA 
rayol-farm2_2019-03-22_11-14-23.wav,44100,16,60,1,bioacoustic_index,512,2000,8000,0.987032687580002,NA 
rayol-farm2_2019-03-22_11-16-23.wav,44100,16,60,1,bioacoustic_index,512,2000,8000,1.12964117105046,NA 
rayol-farm2_2019-03-22_11-18-23.wav,44100,16,60,1,bioacoustic_index,512,2000,8000,1.78905089810519,NA 
rayol-farm2_2019-03-22_11-20-23.wav,44100,16,60,1,bioacoustic_index,512,2000,8000,1.80070008669644,NA 
rayol-farm2_2019-03-22_11-22-23.wav,44100,16,60,1,bioacoustic_index,512,2000,8000,3.11258115693499,NA 
rayol-farm2_2019-03-22_11-24-23.wav,44100,16,60,1,bioacoustic_index,512,2000,8000,1.14875506653504,NA 
rayol-farm2_2019-03-22_11-26-23.wav,44100,16,60,1,bioacoustic_index,512,2000,8000,1.42171572643438,NA 
rayol-farm2_2019-03-22_11-28-23.wav,44100,16,60,1,bioacoustic_index,512,2000,8000,1.22664750358058,NA 
rayol-farm2_2019-03-22_11-30-23.wav,44100,16,60,1,bioacoustic_index,512,2000,8000,3.31529927243555,NA 
rayol-farm2_2019-03-22_11-32-24.wav,44100,16,60,1,bioacoustic_index,512,2000,8000,1.22262820406122,NA 
rayol-farm2_2019-03-22_11-34-24.wav,44100,16,60,1,bioacoustic_index,512,2000,8000,1.08122696994425,NA 
rayol-farm2_2019-03-22_11-36-24.wav,44100,16,60,1,bioacoustic_index,512,2000,8000,0.947263486057215,NA 
rayol-farm2_2019-03-22_11-38-24.wav,44100,16,60,1,bioacoustic_index,512,2000,8000,2.12457872009004,NA 
rayol-farm2_2019-03-22_11-40-24.wav,44100,16,60,1,bioacoustic_index,512,2000,8000,1.58268935651919,NA 
rayol-farm2_2019-03-22_11-42-24.wav,44100,16,60,1,bioacoustic_index,512,2000,8000,1.38869569244394,NA 
rayol-farm2_2019-03-22_11-44-24.wav,44100,16,60,1,bioacoustic_index,512,2000,8000,2.30908166070811,NA 
rayol-farm2_2019-03-22_11-46-24.wav,44100,16,60,1,bioacoustic_index,512,2000,8000,1.10412078730184,NA 
rayol-farm2_2019-03-22_11-48-25.wav,44100,16,60,1,bioacoustic_index,512,2000,8000,1.29211672070397,NA 
rayol-farm2_2019-03-22_11-50-25.wav,44100,16,60,1,bioacoustic_index,512,2000,8000,2.08692742839801,NA 
rayol-farm2_2019-03-22_11-52-25.wav,44100,16,60,1,bioacoustic_index,512,2000,8000,1.89974285045632,NA 
rayol-farm2_2019-03-22_11-54-25.wav,44100,16,60,1,bioacoustic_index,512,2000,8000,3.132935110831,NA 
rayol-farm2_2019-03-22_11-56-25.wav,44100,16,60,1,bioacoustic_index,512,2000,8000,3.27989675713667,NA 
rayol-farm2_2019-03-22_11-58-25.wav,44100,16,60,1,bioacoustic_index,512,2000,8000,2.50791744207143,NA 
rayol-farm2_2019-03-22_12-00-25.wav,44100,16,60,1,bioacoustic_index,512,2000,8000,1.23418088346721,NA 
rayol-farm2_2019-03-22_12-02-25.wav,44100,16,60,1,bioacoustic_index,512,2000,8000,1.50550951795054,NA 
rayol-farm2_2019-03-22_12-04-26.wav,44100,16,60,1,bioacoustic_index,512,2000,8000,1.77228653832627,NA 
rayol-farm2_2019-03-22_12-06-26.wav,44100,16,60,1,bioacoustic_index,512,2000,8000,0.909710295288429,NA 
rayol-farm2_2019-03-22_12-08-26.wav,44100,16,60,1,bioacoustic_index,512,2000,8000,1.19890859196418,NA 
rayol-farm2_2019-03-22_12-10-26.wav,44100,16,60,1,bioacoustic_index,512,2000,8000,1.05141059040061,NA 
rayol-farm2_2019-03-22_12-12-26.wav,44100,16,60,1,bioacoustic_index,512,2000,8000,1.06596329774169,NA 
rayol-farm2_2019-03-22_12-14-26.wav,44100,16,60,1,bioacoustic_index,512,2000,8000,1.1579399092016,NA 
rayol-farm2_2019-03-22_12-16-26.wav,44100,16,60,1,bioacoustic_index,512,2000,8000,1.43921328597431,NA 
rayol-farm2_2019-03-22_12-18-26.wav,44100,16,60,1,bioacoustic_index,512,2000,8000,0.930656224930315,NA 
rayol-farm2_2019-03-22_12-20-26.wav,44100,16,60,1,bioacoustic_index,512,2000,8000,0.932882491588426,NA 
rayol-farm2_2019-03-22_12-22-27.wav,44100,16,60,1,bioacoustic_index,512,2000,8000,1.08493116577008,NA 
rayol-farm2_2019-03-22_12-24-27.wav,44100,16,60,1,bioacoustic_index,512,2000,8000,1.09668277928031,NA 
rayol-farm2_2019-03-22_12-26-27.wav,44100,16,60,1,bioacoustic_index,512,2000,8000,0.963189193845353,NA 
rayol-farm2_2019-03-22_12-28-27.wav,44100,16,60,1,bioacoustic_index,512,2000,8000,0.930673665225412,NA 
rayol-farm2_2019-03-22_12-30-27.wav,44100,16,60,1,bioacoustic_index,512,2000,8000,1.14219793939111,NA 
rayol-farm2_2019-03-22_12-32-27.wav,44100,16,60,1,bioacoustic_index,512,2000,8000,1.15073125779327,NA 
rayol-farm2_2019-03-22_12-34-27.wav,44100,16,60,1,bioacoustic_index,512,2000,8000,1.01047016504996,NA 
rayol-farm2_2019-03-22_12-36-27.wav,44100,16,60,1,bioacoustic_index,512,2000,8000,2.09796089060839,NA 
rayol-farm2_2019-03-22_12-38-28.wav,44100,16,60,1,bioacoustic_index,512,2000,8000,1.15145996799409,NA 
rayol-farm2_2019-03-22_12-40-28.wav,44100,16,60,1,bioacoustic_index,512,2000,8000,1.19965594764398,NA 
rayol-farm2_2019-03-22_12-42-28.wav,44100,16,60,1,bioacoustic_index,512,2000,8000,2.6546769091664,NA 
rayol-farm2_2019-03-22_12-44-28.wav,44100,16,60,1,bioacoustic_index,512,2000,8000,2.3536747882301,NA 
rayol-farm2_2019-03-22_12-46-28.wav,44100,16,60,1,bioacoustic_index,512,2000,8000,2.19441359529647,NA 
rayol-farm2_2019-03-22_12-48-28.wav,44100,16,60,1,bioacoustic_index,512,2000,8000,0.921067308748769,NA 
rayol-farm2_2019-03-22_12-50-28.wav,44100,16,60,1,bioacoustic_index,512,2000,8000,1.14742172525339,NA 
rayol-farm2_2019-03-22_12-52-28.wav,44100,16,60,1,bioacoustic_index,512,2000,8000,1.25825939712127,NA 
rayol-farm2_2019-03-22_12-54-29.wav,44100,16,60,1,bioacoustic_index,512,2000,8000,1.12310669987437,NA 
rayol-farm2_2019-03-22_12-56-29.wav,44100,16,60,1,bioacoustic_index,512,2000,8000,5.46688536402476,NA 
rayol-farm2_2019-03-22_12-58-29.wav,44100,16,60,1,bioacoustic_index,512,2000,8000,1.02212765261074,NA 
rayol-farm2_2019-03-22_13-00-29.wav,44100,16,60,1,bioacoustic_index,512,2000,8000,0.995369708966846,NA 
rayol-farm2_2019-03-22_13-02-29.wav,44100,16,60,1,bioacoustic_index,512,2000,8000,0.970765013737872,NA 
rayol-farm2_2019-03-22_13-04-29.wav,44100,16,60,1,bioacoustic_index,512,2000,8000,1.20638406779666,NA 
rayol-farm2_2019-03-22_13-06-29.wav,44100,16,60,1,bioacoustic_index,512,2000,8000,0.934123245184079,NA 
rayol-farm2_2019-03-22_13-08-29.wav,44100,16,60,1,bioacoustic_index,512,2000,8000,1.09136458590387,NA 
rayol-farm2_2019-03-22_13-10-30.wav,44100,16,60,1,bioacoustic_index,512,2000,8000,1.25128634060042,NA 
rayol-farm2_2019-03-22_13-12-30.wav,44100,16,60,1,bioacoustic_index,512,2000,8000,0.953193353922163,NA 
rayol-farm2_2019-03-22_13-14-30.wav,44100,16,60,1,bioacoustic_index,512,2000,8000,1.07033062770558,NA 
rayol-farm2_2019-03-22_13-16-30.wav,44100,16,60,1,bioacoustic_index,512,2000,8000,1.12642098964839,NA 
rayol-farm2_2019-03-22_13-18-30.wav,44100,16,60,1,bioacoustic_index,512,2000,8000,1.21817963914966,NA 
rayol-farm2_2019-03-22_13-20-30.wav,44100,16,60,1,bioacoustic_index,512,2000,8000,1.40110193111643,NA 
rayol-farm2_2019-03-22_13-22-30.wav,44100,16,60,1,bioacoustic_index,512,2000,8000,1.18029102894493,NA 
rayol-farm2_2019-03-22_13-24-30.wav,44100,16,60,1,bioacoustic_index,512,2000,8000,1.02723147348495,NA 
rayol-farm2_2019-03-22_13-26-30.wav,44100,16,60,1,bioacoustic_index,512,2000,8000,2.18816709045744,NA 
rayol-farm2_2019-03-22_13-28-31.wav,44100,16,60,1,bioacoustic_index,512,2000,8000,1.2642502972327,NA 
rayol-farm2_2019-03-22_13-30-31.wav,44100,16,60,1,bioacoustic_index,512,2000,8000,1.34261741294644,NA 
rayol-farm2_2019-03-22_13-32-31.wav,44100,16,60,1,bioacoustic_index,512,2000,8000,1.20003718295861,NA 
rayol-farm2_2019-03-22_13-34-31.wav,44100,16,60,1,bioacoustic_index,512,2000,8000,1.10913268213488,NA 
rayol-farm2_2019-03-22_13-36-31.wav,44100,16,60,1,bioacoustic_index,512,2000,8000,1.12520891788027,NA 
rayol-farm2_2019-03-22_13-38-31.wav,44100,16,60,1,bioacoustic_index,512,2000,8000,1.20962622727206,NA 
rayol-farm2_2019-03-22_13-40-31.wav,44100,16,60,1,bioacoustic_index,512,2000,8000,1.71624454714315,NA 
rayol-farm2_2019-03-22_13-42-31.wav,44100,16,60,1,bioacoustic_index,512,2000,8000,1.306309531193,NA 
rayol-farm2_2019-03-22_13-44-32.wav,44100,16,60,1,bioacoustic_index,512,2000,8000,1.69318793865637,NA 
rayol-farm2_2019-03-22_13-46-32.wav,44100,16,60,1,bioacoustic_index,512,2000,8000,1.47022142476537,NA 
rayol-farm2_2019-03-22_13-48-32.wav,44100,16,60,1,bioacoustic_index,512,2000,8000,1.17875939207795,NA 
rayol-farm2_2019-03-22_13-50-32.wav,44100,16,60,1,bioacoustic_index,512,2000,8000,1.55603306949271,NA 
rayol-farm2_2019-03-22_13-52-32.wav,44100,16,60,1,bioacoustic_index,512,2000,8000,1.18842181079235,NA 
rayol-farm2_2019-03-22_13-54-32.wav,44100,16,60,1,bioacoustic_index,512,2000,8000,1.59826705956743,NA 
rayol-farm2_2019-03-22_13-56-32.wav,44100,16,60,1,bioacoustic_index,512,2000,8000,1.49699225557028,NA 
rayol-farm2_2019-03-22_13-58-32.wav,44100,16,60,1,bioacoustic_index,512,2000,8000,2.07671889838103,NA 
rayol-farm2_2019-03-22_14-00-33.wav,44100,16,60,1,bioacoustic_index,512,2000,8000,2.96129733269734,NA 
rayol-farm2_2019-03-22_14-02-33.wav,44100,16,60,1,bioacoustic_index,512,2000,8000,1.2480074669141,NA 
rayol-farm2_2019-03-22_14-04-33.wav,44100,16,60,1,bioacoustic_index,512,2000,8000,1.27442448612249,NA 
rayol-farm2_2019-03-22_14-06-33.wav,44100,16,60,1,bioacoustic_index,512,2000,8000,2.15222563661331,NA 
rayol-farm2_2019-03-22_14-08-33.wav,44100,16,60,1,bioacoustic_index,512,2000,8000,1.3360129352009,NA 
rayol-farm2_2019-03-22_14-10-33.wav,44100,16,60,1,bioacoustic_index,512,2000,8000,6.05428016978147,NA 
rayol-farm2_2019-03-22_14-12-33.wav,44100,16,60,1,bioacoustic_index,512,2000,8000,2.03228534940292,NA 
rayol-farm2_2019-03-22_14-14-33.wav,44100,16,60,1,bioacoustic_index,512,2000,8000,1.30433020247105,NA 
rayol-farm2_2019-03-22_14-16-34.wav,44100,16,60,1,bioacoustic_index,512,2000,8000,1.26424069985682,NA 
rayol-farm2_2019-03-22_14-18-34.wav,44100,16,60,1,bioacoustic_index,512,2000,8000,1.79988132135882,NA 
rayol-farm2_2019-03-22_14-20-34.wav,44100,16,60,1,bioacoustic_index,512,2000,8000,3.7325478915668,NA 
rayol-farm2_2019-03-22_14-22-34.wav,44100,16,60,1,bioacoustic_index,512,2000,8000,1.3925232503519,NA 
rayol-farm2_2019-03-22_14-24-34.wav,44100,16,60,1,bioacoustic_index,512,2000,8000,1.71166358444877,NA 
rayol-farm2_2019-03-22_14-26-34.wav,44100,16,60,1,bioacoustic_index,512,2000,8000,2.12051559339444,NA 
rayol-farm2_2019-03-22_14-28-34.wav,44100,16,60,1,bioacoustic_index,512,2000,8000,1.83229716653021,NA 
rayol-farm2_2019-03-22_14-30-34.wav,44100,16,60,1,bioacoustic_index,512,2000,8000,1.52389196588529,NA 
rayol-farm2_2019-03-22_14-32-34.wav,44100,16,60,1,bioacoustic_index,512,2000,8000,3.1368447834301,NA 
rayol-farm2_2019-03-22_14-34-35.wav,44100,16,60,1,bioacoustic_index,512,2000,8000,1.25986948246727,NA 
rayol-farm2_2019-03-22_14-36-35.wav,44100,16,60,1,bioacoustic_index,512,2000,8000,1.36224408995857,NA 
rayol-farm2_2019-03-22_14-38-35.wav,44100,16,60,1,bioacoustic_index,512,2000,8000,3.34338101852031,NA 
rayol-farm2_2019-03-22_14-40-35.wav,44100,16,60,1,bioacoustic_index,512,2000,8000,1.33489963604694,NA 
rayol-farm2_2019-03-22_14-42-35.wav,44100,16,60,1,bioacoustic_index,512,2000,8000,1.09276651344762,NA 
rayol-farm2_2019-03-22_14-44-35.wav,44100,16,60,1,bioacoustic_index,512,2000,8000,1.29136961471263,NA 
rayol-farm2_2019-03-22_14-46-35.wav,44100,16,60,1,bioacoustic_index,512,2000,8000,1.06956192130694,NA 
rayol-farm2_2019-03-22_14-48-35.wav,44100,16,60,1,bioacoustic_index,512,2000,8000,1.08127434351082,NA 
rayol-farm2_2019-03-22_14-50-36.wav,44100,16,60,1,bioacoustic_index,512,2000,8000,1.14832010398457,NA 
rayol-farm2_2019-03-22_14-52-36.wav,44100,16,60,1,bioacoustic_index,512,2000,8000,1.16644911901106,NA 
rayol-farm2_2019-03-22_14-54-36.wav,44100,16,60,1,bioacoustic_index,512,2000,8000,1.19373835145205,NA 
rayol-farm2_2019-03-22_14-56-36.wav,44100,16,60,1,bioacoustic_index,512,2000,8000,3.08747115731427,NA 
rayol-farm2_2019-03-22_14-58-36.wav,44100,16,60,1,bioacoustic_index,512,2000,8000,2.72463608795794,NA 
rayol-farm2_2019-03-22_15-00-36.wav,44100,16,60,1,bioacoustic_index,512,2000,8000,2.87820289937912,NA 
rayol-farm2_2019-03-22_15-02-36.wav,44100,16,60,1,bioacoustic_index,512,2000,8000,1.85204819027375,NA 
rayol-farm2_2019-03-22_15-04-36.wav,44100,16,60,1,bioacoustic_index,512,2000,8000,1.24384323758399,NA 
rayol-farm2_2019-03-22_15-06-37.wav,44100,16,60,1,bioacoustic_index,512,2000,8000,1.06371136684301,NA 
rayol-farm2_2019-03-22_15-08-37.wav,44100,16,60,1,bioacoustic_index,512,2000,8000,1.40756848414809,NA 
rayol-farm2_2019-03-22_15-10-37.wav,44100,16,60,1,bioacoustic_index,512,2000,8000,1.30305434354733,NA 
rayol-farm2_2019-03-22_15-12-37.wav,44100,16,60,1,bioacoustic_index,512,2000,8000,1.4843844138644,NA 
rayol-farm2_2019-03-22_15-14-37.wav,44100,16,60,1,bioacoustic_index,512,2000,8000,1.35422752593184,NA 
rayol-farm2_2019-03-22_15-16-37.wav,44100,16,60,1,bioacoustic_index,512,2000,8000,1.20993899282687,NA 
rayol-farm2_2019-03-22_15-18-37.wav,44100,16,60,1,bioacoustic_index,512,2000,8000,1.18798562684888,NA 
rayol-farm2_2019-03-22_15-20-37.wav,44100,16,60,1,bioacoustic_index,512,2000,8000,1.17153579989539,NA 
rayol-farm2_2019-03-22_15-22-38.wav,44100,16,60,1,bioacoustic_index,512,2000,8000,1.12980136465592,NA 
rayol-farm2_2019-03-22_15-24-38.wav,44100,16,60,1,bioacoustic_index,512,2000,8000,1.82138851339314,NA 
rayol-farm2_2019-03-22_15-26-38.wav,44100,16,60,1,bioacoustic_index,512,2000,8000,1.93582287585253,NA 
rayol-farm2_2019-03-22_15-28-38.wav,44100,16,60,1,bioacoustic_index,512,2000,8000,1.68819309669147,NA 
rayol-farm2_2019-03-22_15-30-38.wav,44100,16,60,1,bioacoustic_index,512,2000,8000,1.16647054839356,NA 
rayol-farm2_2019-03-22_15-32-38.wav,44100,16,60,1,bioacoustic_index,512,2000,8000,1.21487017653043,NA 
rayol-farm2_2019-03-22_15-34-38.wav,44100,16,60,1,bioacoustic_index,512,2000,8000,1.58957203584328,NA 
rayol-farm2_2019-03-22_15-36-38.wav,44100,16,60,1,bioacoustic_index,512,2000,8000,1.94325969030113,NA 
rayol-farm2_2019-03-22_15-38-38.wav,44100,16,60,1,bioacoustic_index,512,2000,8000,1.4613796319613,NA 
rayol-farm2_2019-03-22_15-40-39.wav,44100,16,60,1,bioacoustic_index,512,2000,8000,3.68138778574842,NA 
rayol-farm2_2019-03-22_15-42-39.wav,44100,16,60,1,bioacoustic_index,512,2000,8000,1.09290322769335,NA 
rayol-farm2_2019-03-22_15-44-39.wav,44100,16,60,1,bioacoustic_index,512,2000,8000,1.17978035421876,NA 
rayol-farm2_2019-03-22_15-46-39.wav,44100,16,60,1,bioacoustic_index,512,2000,8000,1.09592516475536,NA 
rayol-farm2_2019-03-22_15-48-39.wav,44100,16,60,1,bioacoustic_index,512,2000,8000,1.14754649181503,NA 
rayol-farm2_2019-03-22_15-50-39.wav,44100,16,60,1,bioacoustic_index,512,2000,8000,1.69419597904889,NA 
rayol-farm2_2019-03-22_15-52-39.wav,44100,16,60,1,bioacoustic_index,512,2000,8000,1.15682409161284,NA 
rayol-farm2_2019-03-22_15-54-39.wav,44100,16,60,1,bioacoustic_index,512,2000,8000,1.74921747948466,NA 
rayol-farm2_2019-03-22_15-56-40.wav,44100,16,60,1,bioacoustic_index,512,2000,8000,1.19712034716242,NA 
rayol-farm2_2019-03-22_15-58-40.wav,44100,16,60,1,bioacoustic_index,512,2000,8000,1.15177855461834,NA 
rayol-farm2_2019-03-22_16-00-40.wav,44100,16,60,1,bioacoustic_index,512,2000,8000,2.59778957756125,NA 
rayol-farm2_2019-03-22_16-02-40.wav,44100,16,60,1,bioacoustic_index,512,2000,8000,2.76090888527672,NA 
rayol-farm2_2019-03-22_16-04-40.wav,44100,16,60,1,bioacoustic_index,512,2000,8000,2.24588843291476,NA 
rayol-farm2_2019-03-22_16-06-40.wav,44100,16,60,1,bioacoustic_index,512,2000,8000,1.25156907384781,NA 
rayol-farm2_2019-03-22_16-08-40.wav,44100,16,60,1,bioacoustic_index,512,2000,8000,2.03287185860746,NA 
rayol-farm2_2019-03-22_16-10-40.wav,44100,16,60,1,bioacoustic_index,512,2000,8000,1.20119873880351,NA 
rayol-farm2_2019-03-22_16-12-41.wav,44100,16,60,1,bioacoustic_index,512,2000,8000,1.69714758737533,NA 
rayol-farm2_2019-03-22_16-14-41.wav,44100,16,60,1,bioacoustic_index,512,2000,8000,1.37242952082929,NA 
rayol-farm2_2019-03-22_16-16-41.wav,44100,16,60,1,bioacoustic_index,512,2000,8000,2.56266971898829,NA 
rayol-farm2_2019-03-22_16-18-41.wav,44100,16,60,1,bioacoustic_index,512,2000,8000,2.61232882970095,NA 
rayol-farm2_2019-03-22_16-20-41.wav,44100,16,60,1,bioacoustic_index,512,2000,8000,2.12469185489994,NA 
rayol-farm2_2019-03-22_16-22-41.wav,44100,16,60,1,bioacoustic_index,512,2000,8000,1.1206400420849,NA 
rayol-farm2_2019-03-22_16-24-41.wav,44100,16,60,1,bioacoustic_index,512,2000,8000,1.13672823852005,NA 
rayol-farm2_2019-03-22_16-26-41.wav,44100,16,60,1,bioacoustic_index,512,2000,8000,1.18843679956445,NA 
rayol-farm2_2019-03-22_16-28-42.wav,44100,16,60,1,bioacoustic_index,512,2000,8000,1.73720437001658,NA 
rayol-farm2_2019-03-22_16-30-42.wav,44100,16,60,1,bioacoustic_index,512,2000,8000,1.14774485017057,NA 
rayol-farm2_2019-03-22_16-32-42.wav,44100,16,60,1,bioacoustic_index,512,2000,8000,1.03999289711269,NA 
rayol-farm2_2019-03-22_16-34-42.wav,44100,16,60,1,bioacoustic_index,512,2000,8000,1.42756616841773,NA 
rayol-farm2_2019-03-22_16-36-42.wav,44100,16,60,1,bioacoustic_index,512,2000,8000,1.82249824950896,NA 
rayol-farm2_2019-03-22_16-38-42.wav,44100,16,60,1,bioacoustic_index,512,2000,8000,2.74604205420344,NA 
rayol-farm2_2019-03-22_16-40-42.wav,44100,16,60,1,bioacoustic_index,512,2000,8000,1.91468999769846,NA 
rayol-farm2_2019-03-22_16-42-42.wav,44100,16,60,1,bioacoustic_index,512,2000,8000,1.47383715132836,NA 
rayol-farm2_2019-03-22_16-44-42.wav,44100,16,60,1,bioacoustic_index,512,2000,8000,1.08438750238476,NA 
rayol-farm2_2019-03-22_16-46-43.wav,44100,16,60,1,bioacoustic_index,512,2000,8000,1.16327996529669,NA 
rayol-farm2_2019-03-22_16-48-43.wav,44100,16,60,1,bioacoustic_index,512,2000,8000,1.09545481633171,NA 
rayol-farm2_2019-03-22_16-50-43.wav,44100,16,60,1,bioacoustic_index,512,2000,8000,1.10446318876077,NA 
rayol-farm2_2019-03-22_16-52-43.wav,44100,16,60,1,bioacoustic_index,512,2000,8000,1.14832460673197,NA 
rayol-farm2_2019-03-22_16-54-43.wav,44100,16,60,1,bioacoustic_index,512,2000,8000,1.14784261769126,NA 
rayol-farm2_2019-03-22_16-56-43.wav,44100,16,60,1,bioacoustic_index,512,2000,8000,1.15010479270181,NA 
rayol-farm2_2019-03-22_16-58-43.wav,44100,16,60,1,bioacoustic_index,512,2000,8000,1.29894653274106,NA 
rayol-farm2_2019-03-22_17-00-43.wav,44100,16,60,1,bioacoustic_index,512,2000,8000,1.18464884783783,NA 
rayol-farm2_2019-03-22_17-02-44.wav,44100,16,60,1,bioacoustic_index,512,2000,8000,1.36436248879802,NA 
rayol-farm2_2019-03-22_17-04-44.wav,44100,16,60,1,bioacoustic_index,512,2000,8000,1.34170490836191,NA 
rayol-farm2_2019-03-22_17-06-44.wav,44100,16,60,1,bioacoustic_index,512,2000,8000,1.1507666349876,NA 
rayol-farm2_2019-03-22_17-08-44.wav,44100,16,60,1,bioacoustic_index,512,2000,8000,2.15847830138538,NA 
rayol-farm2_2019-03-22_17-10-44.wav,44100,16,60,1,bioacoustic_index,512,2000,8000,2.03931219203263,NA 
rayol-farm2_2019-03-22_17-12-44.wav,44100,16,60,1,bioacoustic_index,512,2000,8000,4.42134360271151,NA 
rayol-farm2_2019-03-22_17-14-44.wav,44100,16,60,1,bioacoustic_index,512,2000,8000,1.50260226515463,NA 
rayol-farm2_2019-03-22_17-16-44.wav,44100,16,60,1,bioacoustic_index,512,2000,8000,1.16573770555694,NA 
rayol-farm2_2019-03-22_17-18-45.wav,44100,16,60,1,bioacoustic_index,512,2000,8000,2.011667442027,NA 
rayol-farm2_2019-03-22_17-20-45.wav,44100,16,60,1,bioacoustic_index,512,2000,8000,1.10467728578575,NA 
rayol-farm2_2019-03-22_17-22-45.wav,44100,16,60,1,bioacoustic_index,512,2000,8000,1.99636299382692,NA 
rayol-farm2_2019-03-22_17-24-45.wav,44100,16,60,1,bioacoustic_index,512,2000,8000,1.42256711490731,NA 
rayol-farm2_2019-03-22_17-26-45.wav,44100,16,60,1,bioacoustic_index,512,2000,8000,1.08274647935229,NA 
rayol-farm2_2019-03-22_17-28-45.wav,44100,16,60,1,bioacoustic_index,512,2000,8000,1.06323532502412,NA 
rayol-farm2_2019-03-22_17-30-45.wav,44100,16,60,1,bioacoustic_index,512,2000,8000,1.10227806357668,NA 
rayol-farm2_2019-03-22_17-32-45.wav,44100,16,60,1,bioacoustic_index,512,2000,8000,1.10775274437846,NA 
rayol-farm2_2019-03-22_17-34-46.wav,44100,16,60,1,bioacoustic_index,512,2000,8000,1.0641674420712,NA 
rayol-farm2_2019-03-22_17-36-46.wav,44100,16,60,1,bioacoustic_index,512,2000,8000,1.07810031889395,NA 
rayol-farm2_2019-03-22_17-38-46.wav,44100,16,60,1,bioacoustic_index,512,2000,8000,1.60581720230414,NA 
rayol-farm2_2019-03-22_17-40-46.wav,44100,16,60,1,bioacoustic_index,512,2000,8000,1.23659450968342,NA 
rayol-farm2_2019-03-22_17-42-46.wav,44100,16,60,1,bioacoustic_index,512,2000,8000,1.63449444178057,NA 
rayol-farm2_2019-03-22_17-44-46.wav,44100,16,60,1,bioacoustic_index,512,2000,8000,2.80418551153317,NA 
rayol-farm2_2019-03-22_17-46-46.wav,44100,16,60,1,bioacoustic_index,512,2000,8000,2.18110049860498,NA 
rayol-farm2_2019-03-22_17-48-46.wav,44100,16,60,1,bioacoustic_index,512,2000,8000,2.76809366492669,NA 
rayol-farm2_2019-03-22_17-50-46.wav,44100,16,60,1,bioacoustic_index,512,2000,8000,4.16500534185654,NA 
rayol-farm2_2019-03-22_17-52-47.wav,44100,16,60,1,bioacoustic_index,512,2000,8000,3.78258624663833,NA 
rayol-farm2_2019-03-22_17-54-47.wav,44100,16,60,1,bioacoustic_index,512,2000,8000,2.11558317473858,NA 
rayol-farm2_2019-03-22_17-56-47.wav,44100,16,60,1,bioacoustic_index,512,2000,8000,1.62589357530543,NA 
rayol-farm2_2019-03-22_17-58-47.wav,44100,16,60,1,bioacoustic_index,512,2000,8000,1.28276229471398,NA 
rayol-farm2_2019-03-22_18-00-47.wav,44100,16,60,1,bioacoustic_index,512,2000,8000,1.43907298081863,NA 
rayol-farm2_2019-03-22_18-02-47.wav,44100,16,60,1,bioacoustic_index,512,2000,8000,1.15041935850051,NA 
rayol-farm2_2019-03-22_18-04-47.wav,44100,16,60,1,bioacoustic_index,512,2000,8000,1.63842491436651,NA 
rayol-farm2_2019-03-22_18-06-47.wav,44100,16,60,1,bioacoustic_index,512,2000,8000,1.60977558755161,NA 
rayol-farm2_2019-03-22_18-08-48.wav,44100,16,60,1,bioacoustic_index,512,2000,8000,3.69675611319875,NA 
rayol-farm2_2019-03-22_18-10-48.wav,44100,16,60,1,bioacoustic_index,512,2000,8000,4.85778371297867,NA 
rayol-farm2_2019-03-22_18-12-48.wav,44100,16,60,1,bioacoustic_index,512,2000,8000,3.47757649587386,NA 
rayol-farm2_2019-03-22_18-14-48.wav,44100,16,60,1,bioacoustic_index,512,2000,8000,6.21996070722603,NA 
rayol-farm2_2019-03-22_18-16-48.wav,44100,16,60,1,bioacoustic_index,512,2000,8000,1.98126877593486,NA 
rayol-farm2_2019-03-22_18-18-48.wav,44100,16,60,1,bioacoustic_index,512,2000,8000,1.93299760329238,NA 
rayol-farm2_2019-03-22_18-20-48.wav,44100,16,60,1,bioacoustic_index,512,2000,8000,1.14531471016414,NA 
rayol-farm2_2019-03-22_18-22-48.wav,44100,16,60,1,bioacoustic_index,512,2000,8000,1.68841265155602,NA 
rayol-farm2_2019-03-22_18-24-49.wav,44100,16,60,1,bioacoustic_index,512,2000,8000,1.04103484830636,NA 
rayol-farm2_2019-03-22_18-26-49.wav,44100,16,60,1,bioacoustic_index,512,2000,8000,7.09212648559704,NA 
rayol-farm2_2019-03-22_18-28-49.wav,44100,16,60,1,bioacoustic_index,512,2000,8000,4.25005704486264,NA 
rayol-farm2_2019-03-22_18-30-49.wav,44100,16,60,1,bioacoustic_index,512,2000,8000,3.8068773482382,NA 
rayol-farm2_2019-03-22_18-32-49.wav,44100,16,60,1,bioacoustic_index,512,2000,8000,1.46463951775214,NA 
rayol-farm2_2019-03-22_18-34-49.wav,44100,16,60,1,bioacoustic_index,512,2000,8000,2.23461518317463,NA 
rayol-farm2_2019-03-22_18-36-49.wav,44100,16,60,1,bioacoustic_index,512,2000,8000,1.0801873561372,NA 
rayol-farm2_2019-03-22_18-38-49.wav,44100,16,60,1,bioacoustic_index,512,2000,8000,1.05648234730736,NA 
rayol-farm2_2019-03-22_18-40-50.wav,44100,16,60,1,bioacoustic_index,512,2000,8000,2.09489563235634,NA 
rayol-farm2_2019-03-22_18-42-50.wav,44100,16,60,1,bioacoustic_index,512,2000,8000,1.82159660845697,NA 
rayol-farm2_2019-03-22_18-44-50.wav,44100,16,60,1,bioacoustic_index,512,2000,8000,2.55032224600195,NA 
rayol-farm2_2019-03-22_18-46-50.wav,44100,16,60,1,bioacoustic_index,512,2000,8000,1.46654939529902,NA 
rayol-farm2_2019-03-22_18-48-50.wav,44100,16,60,1,bioacoustic_index,512,2000,8000,1.08846356842643,NA 
rayol-farm2_2019-03-22_18-50-50.wav,44100,16,60,1,bioacoustic_index,512,2000,8000,1.18632859113977,NA 
rayol-farm2_2019-03-22_18-52-50.wav,44100,16,60,1,bioacoustic_index,512,2000,8000,1.82969898530071,NA 
rayol-farm2_2019-03-22_18-54-50.wav,44100,16,60,1,bioacoustic_index,512,2000,8000,0.904146196913346,NA 
rayol-farm2_2019-03-22_18-56-50.wav,44100,16,60,1,bioacoustic_index,512,2000,8000,0.982142611713057,NA 
rayol-farm2_2019-03-22_18-58-51.wav,44100,16,60,1,bioacoustic_index,512,2000,8000,2.33439509284768,NA 
rayol-farm2_2019-03-22_19-00-51.wav,44100,16,60,1,bioacoustic_index,512,2000,8000,2.728555109341,NA 
rayol-farm2_2019-03-22_19-02-51.wav,44100,16,60,1,bioacoustic_index,512,2000,8000,2.95896974070316,NA 
rayol-farm2_2019-03-22_19-04-51.wav,44100,16,60,1,bioacoustic_index,512,2000,8000,1.14590600324977,NA 
rayol-farm2_2019-03-22_19-06-51.wav,44100,16,60,1,bioacoustic_index,512,2000,8000,1.10795551886587,NA 
rayol-farm2_2019-03-22_19-08-51.wav,44100,16,60,1,bioacoustic_index,512,2000,8000,1.43351493605044,NA 
rayol-farm2_2019-03-22_19-10-51.wav,44100,16,60,1,bioacoustic_index,512,2000,8000,2.86219052942525,NA 
rayol-farm2_2019-03-22_19-12-51.wav,44100,16,60,1,bioacoustic_index,512,2000,8000,1.55452645067317,NA 
rayol-farm2_2019-03-22_19-14-52.wav,44100,16,60,1,bioacoustic_index,512,2000,8000,3.70792060090361,NA 
rayol-farm2_2019-03-22_19-16-52.wav,44100,16,60,1,bioacoustic_index,512,2000,8000,3.03064455796249,NA 
rayol-farm2_2019-03-22_19-18-52.wav,44100,16,60,1,bioacoustic_index,512,2000,8000,1.93609053253709,NA 
rayol-farm2_2019-03-22_19-20-52.wav,44100,16,60,1,bioacoustic_index,512,2000,8000,1.09683717541454,NA 
rayol-farm2_2019-03-22_19-22-52.wav,44100,16,60,1,bioacoustic_index,512,2000,8000,1.30214973778567,NA 
rayol-farm2_2019-03-22_19-24-52.wav,44100,16,60,1,bioacoustic_index,512,2000,8000,1.31765350209311,NA 
rayol-farm2_2019-03-22_19-26-52.wav,44100,16,60,1,bioacoustic_index,512,2000,8000,1.21675842377211,NA 
rayol-farm2_2019-03-22_19-28-52.wav,44100,16,60,1,bioacoustic_index,512,2000,8000,1.1721583649327,NA 
rayol-farm2_2019-03-22_19-30-53.wav,44100,16,60,1,bioacoustic_index,512,2000,8000,1.16067962194887,NA 
rayol-farm2_2019-03-22_19-32-53.wav,44100,16,60,1,bioacoustic_index,512,2000,8000,1.12337543277364,NA 
rayol-farm2_2019-03-22_19-34-53.wav,44100,16,60,1,bioacoustic_index,512,2000,8000,1.1636776798196,NA 
rayol-farm2_2019-03-22_19-36-53.wav,44100,16,60,1,bioacoustic_index,512,2000,8000,1.12027934033967,NA 
rayol-farm2_2019-03-22_19-38-53.wav,44100,16,60,1,bioacoustic_index,512,2000,8000,1.05066521384364,NA 
rayol-farm2_2019-03-22_19-40-53.wav,44100,16,60,1,bioacoustic_index,512,2000,8000,1.13958843035547,NA 
rayol-farm2_2019-03-22_19-42-53.wav,44100,16,60,1,bioacoustic_index,512,2000,8000,1.14527744638402,NA 
rayol-farm2_2019-03-22_19-44-53.wav,44100,16,60,1,bioacoustic_index,512,2000,8000,1.07414793013266,NA 
rayol-farm2_2019-03-22_19-46-54.wav,44100,16,60,1,bioacoustic_index,512,2000,8000,1.12289967663945,NA 
rayol-farm2_2019-03-22_19-48-54.wav,44100,16,60,1,bioacoustic_index,512,2000,8000,1.15201063247111,NA 
rayol-farm2_2019-03-22_19-50-54.wav,44100,16,60,1,bioacoustic_index,512,2000,8000,1.16197752291237,NA 
rayol-farm2_2019-03-22_19-52-54.wav,44100,16,60,1,bioacoustic_index,512,2000,8000,1.11569119451461,NA 
rayol-farm2_2019-03-22_19-54-54.wav,44100,16,60,1,bioacoustic_index,512,2000,8000,1.12615606572635,NA 
rayol-farm2_2019-03-22_19-56-54.wav,44100,16,60,1,bioacoustic_index,512,2000,8000,1.0353167762055,NA 
rayol-farm2_2019-03-22_19-58-54.wav,44100,16,60,1,bioacoustic_index,512,2000,8000,1.08537305124563,NA 
rayol-farm2_2019-03-22_20-00-54.wav,44100,16,60,1,bioacoustic_index,512,2000,8000,1.07601700288442,NA 
rayol-farm2_2019-03-22_20-02-55.wav,44100,16,60,1,bioacoustic_index,512,2000,8000,1.07773232893596,NA 
rayol-farm2_2019-03-22_20-04-55.wav,44100,16,60,1,bioacoustic_index,512,2000,8000,1.14599102510428,NA 
rayol-farm2_2019-03-22_20-06-55.wav,44100,16,60,1,bioacoustic_index,512,2000,8000,1.07358864529383,NA 
rayol-farm2_2019-03-22_20-08-55.wav,44100,16,60,1,bioacoustic_index,512,2000,8000,1.12101909449949,NA 
rayol-farm2_2019-03-22_20-10-55.wav,44100,16,60,1,bioacoustic_index,512,2000,8000,1.09113556557924,NA 
rayol-farm2_2019-03-22_20-12-55.wav,44100,16,60,1,bioacoustic_index,512,2000,8000,1.07478663240675,NA 
rayol-farm2_2019-03-22_20-14-55.wav,44100,16,60,1,bioacoustic_index,512,2000,8000,1.07910396592979,NA 
rayol-farm2_2019-03-22_20-16-55.wav,44100,16,60,1,bioacoustic_index,512,2000,8000,1.14037644028274,NA 
rayol-farm2_2019-03-22_20-18-55.wav,44100,16,60,1,bioacoustic_index,512,2000,8000,1.14141174611709,NA 
rayol-farm2_2019-03-22_20-20-56.wav,44100,16,60,1,bioacoustic_index,512,2000,8000,1.06171428850123,NA 
rayol-farm2_2019-03-22_20-22-56.wav,44100,16,60,1,bioacoustic_index,512,2000,8000,1.09266377309767,NA 
rayol-farm2_2019-03-22_20-24-56.wav,44100,16,60,1,bioacoustic_index,512,2000,8000,1.12854741104165,NA 
rayol-farm2_2019-03-22_20-26-56.wav,44100,16,60,1,bioacoustic_index,512,2000,8000,1.16906999398144,NA 
rayol-farm2_2019-03-22_20-28-56.wav,44100,16,60,1,bioacoustic_index,512,2000,8000,1.06411007728918,NA 
rayol-farm2_2019-03-22_20-30-56.wav,44100,16,60,1,bioacoustic_index,512,2000,8000,1.16049724867057,NA 
rayol-farm2_2019-03-22_20-32-56.wav,44100,16,60,1,bioacoustic_index,512,2000,8000,1.16710229763349,NA 
rayol-farm2_2019-03-22_20-34-56.wav,44100,16,60,1,bioacoustic_index,512,2000,8000,1.08822474152648,NA 
rayol-farm2_2019-03-22_20-36-57.wav,44100,16,60,1,bioacoustic_index,512,2000,8000,1.0660879496588,NA 
rayol-farm2_2019-03-22_20-38-57.wav,44100,16,60,1,bioacoustic_index,512,2000,8000,1.09584083400855,NA 
rayol-farm2_2019-03-22_20-40-57.wav,44100,16,60,1,bioacoustic_index,512,2000,8000,1.09751733940081,NA 
rayol-farm2_2019-03-22_20-42-57.wav,44100,16,60,1,bioacoustic_index,512,2000,8000,1.0467067641404,NA 
rayol-farm2_2019-03-22_20-44-57.wav,44100,16,60,1,bioacoustic_index,512,2000,8000,1.07857203362878,NA 
rayol-farm2_2019-03-22_20-46-57.wav,44100,16,60,1,bioacoustic_index,512,2000,8000,1.14012503885205,NA 
rayol-farm2_2019-03-22_20-48-57.wav,44100,16,60,1,bioacoustic_index,512,2000,8000,1.06233705354917,NA 
rayol-farm2_2019-03-22_20-50-57.wav,44100,16,60,1,bioacoustic_index,512,2000,8000,1.07795368138981,NA 
rayol-farm2_2019-03-22_20-52-58.wav,44100,16,60,1,bioacoustic_index,512,2000,8000,1.12521663967649,NA 
rayol-farm2_2019-03-22_20-54-58.wav,44100,16,60,1,bioacoustic_index,512,2000,8000,1.14690214991151,NA 
rayol-farm2_2019-03-22_20-56-58.wav,44100,16,60,1,bioacoustic_index,512,2000,8000,1.21633194486681,NA 
rayol-farm2_2019-03-22_20-58-58.wav,44100,16,60,1,bioacoustic_index,512,2000,8000,1.13828212568043,NA 
rayol-farm2_2019-03-22_21-00-58.wav,44100,16,60,1,bioacoustic_index,512,2000,8000,1.13984873126323,NA 
rayol-farm2_2019-03-22_21-02-58.wav,44100,16,60,1,bioacoustic_index,512,2000,8000,1.13433037065758,NA 
rayol-farm2_2019-03-22_21-04-58.wav,44100,16,60,1,bioacoustic_index,512,2000,8000,1.07652058904577,NA 
rayol-farm2_2019-03-22_21-06-58.wav,44100,16,60,1,bioacoustic_index,512,2000,8000,1.0697030595995,NA 
rayol-farm2_2019-03-22_21-08-59.wav,44100,16,60,1,bioacoustic_index,512,2000,8000,1.08753869659005,NA 
rayol-farm2_2019-03-22_21-10-59.wav,44100,16,60,1,bioacoustic_index,512,2000,8000,1.11655432169034,NA 
rayol-farm2_2019-03-22_21-12-59.wav,44100,16,60,1,bioacoustic_index,512,2000,8000,1.09481589057827,NA 
rayol-farm2_2019-03-22_21-14-59.wav,44100,16,60,1,bioacoustic_index,512,2000,8000,1.11050302469912,NA 
rayol-farm2_2019-03-22_21-16-59.wav,44100,16,60,1,bioacoustic_index,512,2000,8000,1.1262541699633,NA 
rayol-farm2_2019-03-22_21-18-59.wav,44100,16,60,1,bioacoustic_index,512,2000,8000,1.09710743427871,NA 
rayol-farm2_2019-03-22_21-20-59.wav,44100,16,60,1,bioacoustic_index,512,2000,8000,1.08573930960562,NA 
rayol-farm2_2019-03-22_21-22-59.wav,44100,16,60,1,bioacoustic_index,512,2000,8000,1.09498987788651,NA 
rayol-farm2_2019-03-22_21-24-59.wav,44100,16,60,1,bioacoustic_index,512,2000,8000,1.13939275576986,NA 
rayol-farm2_2019-03-22_21-27-00.wav,44100,16,60,1,bioacoustic_index,512,2000,8000,1.15689746658904,NA 
rayol-farm2_2019-03-22_21-29-00.wav,44100,16,60,1,bioacoustic_index,512,2000,8000,1.09738151181344,NA 
rayol-farm2_2019-03-22_21-31-00.wav,44100,16,60,1,bioacoustic_index,512,2000,8000,1.14115452220349,NA 
rayol-farm2_2019-03-22_21-33-00.wav,44100,16,60,1,bioacoustic_index,512,2000,8000,1.12102788004071,NA 
rayol-farm2_2019-03-22_21-35-00.wav,44100,16,60,1,bioacoustic_index,512,2000,8000,1.0912219832344,NA 
rayol-farm2_2019-03-22_21-37-00.wav,44100,16,60,1,bioacoustic_index,512,2000,8000,1.11366814830622,NA 
rayol-farm2_2019-03-22_21-39-00.wav,44100,16,60,1,bioacoustic_index,512,2000,8000,1.10510522828491,NA 
rayol-farm2_2019-03-22_21-41-00.wav,44100,16,60,1,bioacoustic_index,512,2000,8000,1.0674713250105,NA 
rayol-farm2_2019-03-22_21-43-01.wav,44100,16,60,1,bioacoustic_index,512,2000,8000,1.05845730052518,NA 
rayol-farm2_2019-03-22_21-45-01.wav,44100,16,60,1,bioacoustic_index,512,2000,8000,1.11329897136644,NA 
rayol-farm2_2019-03-22_21-47-01.wav,44100,16,60,1,bioacoustic_index,512,2000,8000,1.20294944602668,NA 
rayol-farm2_2019-03-22_21-49-01.wav,44100,16,60,1,bioacoustic_index,512,2000,8000,1.15445372661247,NA 
rayol-farm2_2019-03-22_21-51-01.wav,44100,16,60,1,bioacoustic_index,512,2000,8000,1.09701896404877,NA 
rayol-farm2_2019-03-22_21-53-01.wav,44100,16,60,1,bioacoustic_index,512,2000,8000,1.10554293773128,NA 
rayol-farm2_2019-03-22_21-55-01.wav,44100,16,60,1,bioacoustic_index,512,2000,8000,1.10032895683949,NA 
rayol-farm2_2019-03-22_21-57-01.wav,44100,16,60,1,bioacoustic_index,512,2000,8000,1.07605218278355,NA 
rayol-farm2_2019-03-22_21-59-02.wav,44100,16,60,1,bioacoustic_index,512,2000,8000,1.10319405830058,NA 
rayol-farm2_2019-03-22_22-01-02.wav,44100,16,60,1,bioacoustic_index,512,2000,8000,1.14270471824956,NA 
rayol-farm2_2019-03-22_22-03-02.wav,44100,16,60,1,bioacoustic_index,512,2000,8000,1.09182554113853,NA 
rayol-farm2_2019-03-22_22-05-02.wav,44100,16,60,1,bioacoustic_index,512,2000,8000,1.14260349220554,NA 
rayol-farm2_2019-03-22_22-07-02.wav,44100,16,60,1,bioacoustic_index,512,2000,8000,1.13180802355803,NA 
rayol-farm2_2019-03-22_22-09-02.wav,44100,16,60,1,bioacoustic_index,512,2000,8000,1.17145740527352,NA 
rayol-farm2_2019-03-22_22-11-02.wav,44100,16,60,1,bioacoustic_index,512,2000,8000,1.17133960895794,NA 
rayol-farm2_2019-03-22_22-13-02.wav,44100,16,60,1,bioacoustic_index,512,2000,8000,1.1347318232677,NA 
rayol-farm2_2019-03-22_22-15-03.wav,44100,16,60,1,bioacoustic_index,512,2000,8000,1.13523988405138,NA 
rayol-farm2_2019-03-22_22-17-03.wav,44100,16,60,1,bioacoustic_index,512,2000,8000,1.12995207169864,NA 
rayol-farm2_2019-03-22_22-19-03.wav,44100,16,60,1,bioacoustic_index,512,2000,8000,1.1113625891362,NA 
rayol-farm2_2019-03-22_22-21-03.wav,44100,16,60,1,bioacoustic_index,512,2000,8000,1.17859787901124,NA 
rayol-farm2_2019-03-22_22-23-03.wav,44100,16,60,1,bioacoustic_index,512,2000,8000,1.0782690961401,NA 
rayol-farm2_2019-03-22_22-25-03.wav,44100,16,60,1,bioacoustic_index,512,2000,8000,1.10775027628677,NA 
rayol-farm2_2019-03-22_22-27-03.wav,44100,16,60,1,bioacoustic_index,512,2000,8000,1.18144619126139,NA 
rayol-farm2_2019-03-22_22-29-03.wav,44100,16,60,1,bioacoustic_index,512,2000,8000,1.11122445731794,NA 
rayol-farm2_2019-03-22_22-31-03.wav,44100,16,60,1,bioacoustic_index,512,2000,8000,1.12464282128476,NA 
rayol-farm2_2019-03-22_22-33-04.wav,44100,16,60,1,bioacoustic_index,512,2000,8000,1.10666334415434,NA 
rayol-farm2_2019-03-22_22-35-04.wav,44100,16,60,1,bioacoustic_index,512,2000,8000,1.09386903727387,NA 
rayol-farm2_2019-03-22_22-37-04.wav,44100,16,60,1,bioacoustic_index,512,2000,8000,1.11270784005345,NA 
rayol-farm2_2019-03-22_22-39-04.wav,44100,16,60,1,bioacoustic_index,512,2000,8000,1.08767213397625,NA 
rayol-farm2_2019-03-22_22-41-04.wav,44100,16,60,1,bioacoustic_index,512,2000,8000,1.12297799688986,NA 
rayol-farm2_2019-03-22_22-43-04.wav,44100,16,60,1,bioacoustic_index,512,2000,8000,1.12602168804055,NA 
rayol-farm2_2019-03-22_22-45-04.wav,44100,16,60,1,bioacoustic_index,512,2000,8000,1.12636467675708,NA 
rayol-farm2_2019-03-22_22-47-04.wav,44100,16,60,1,bioacoustic_index,512,2000,8000,1.13491593504162,NA 
rayol-farm2_2019-03-22_22-49-05.wav,44100,16,60,1,bioacoustic_index,512,2000,8000,1.16074913148946,NA 
rayol-farm2_2019-03-22_22-51-05.wav,44100,16,60,1,bioacoustic_index,512,2000,8000,1.09307807987222,NA 
rayol-farm2_2019-03-22_22-53-05.wav,44100,16,60,1,bioacoustic_index,512,2000,8000,1.0694097706252,NA 
rayol-farm2_2019-03-22_22-55-05.wav,44100,16,60,1,bioacoustic_index,512,2000,8000,1.10250468666559,NA 
rayol-farm2_2019-03-22_22-57-05.wav,44100,16,60,1,bioacoustic_index,512,2000,8000,1.14449896723206,NA 
rayol-farm2_2019-03-22_22-59-05.wav,44100,16,60,1,bioacoustic_index,512,2000,8000,1.15084648554608,NA 
rayol-farm2_2019-03-22_23-01-05.wav,44100,16,60,1,bioacoustic_index,512,2000,8000,1.10668177453828,NA 
rayol-farm2_2019-03-22_23-03-05.wav,44100,16,60,1,bioacoustic_index,512,2000,8000,1.13521037465863,NA 
rayol-farm2_2019-03-22_23-05-06.wav,44100,16,60,1,bioacoustic_index,512,2000,8000,1.17197265261438,NA 
rayol-farm2_2019-03-22_23-07-06.wav,44100,16,60,1,bioacoustic_index,512,2000,8000,1.12400804593181,NA 
rayol-farm2_2019-03-22_23-09-06.wav,44100,16,60,1,bioacoustic_index,512,2000,8000,1.05386555086853,NA 
rayol-farm2_2019-03-22_23-11-06.wav,44100,16,60,1,bioacoustic_index,512,2000,8000,1.0919920616901,NA 
rayol-farm2_2019-03-22_23-13-06.wav,44100,16,60,1,bioacoustic_index,512,2000,8000,1.13579229233138,NA 
rayol-farm2_2019-03-22_23-15-06.wav,44100,16,60,1,bioacoustic_index,512,2000,8000,1.07607320531497,NA 
rayol-farm2_2019-03-22_23-17-06.wav,44100,16,60,1,bioacoustic_index,512,2000,8000,1.11265617091341,NA 
rayol-farm2_2019-03-22_23-19-06.wav,44100,16,60,1,bioacoustic_index,512,2000,8000,1.12585749824416,NA 
rayol-farm2_2019-03-22_23-21-07.wav,44100,16,60,1,bioacoustic_index,512,2000,8000,1.13988101854436,NA 
rayol-farm2_2019-03-22_23-23-07.wav,44100,16,60,1,bioacoustic_index,512,2000,8000,1.09581326326333,NA 
rayol-farm2_2019-03-22_23-25-07.wav,44100,16,60,1,bioacoustic_index,512,2000,8000,1.06971607561946,NA 
rayol-farm2_2019-03-22_23-27-07.wav,44100,16,60,1,bioacoustic_index,512,2000,8000,1.07684522147876,NA 
rayol-farm2_2019-03-22_23-29-07.wav,44100,16,60,1,bioacoustic_index,512,2000,8000,1.0623125952092,NA 
rayol-farm2_2019-03-22_23-31-07.wav,44100,16,60,1,bioacoustic_index,512,2000,8000,1.06141898580102,NA 
rayol-farm2_2019-03-22_23-33-07.wav,44100,16,60,1,bioacoustic_index,512,2000,8000,1.10178980880767,NA 
rayol-farm2_2019-03-22_23-35-07.wav,44100,16,60,1,bioacoustic_index,512,2000,8000,1.07741183990578,NA 
rayol-farm2_2019-03-22_23-37-08.wav,44100,16,60,1,bioacoustic_index,512,2000,8000,1.05416260820648,NA 
rayol-farm2_2019-03-22_23-39-08.wav,44100,16,60,1,bioacoustic_index,512,2000,8000,1.04803559109355,NA 
rayol-farm2_2019-03-22_23-41-08.wav,44100,16,60,1,bioacoustic_index,512,2000,8000,1.12638124823578,NA 
rayol-farm2_2019-03-22_23-43-08.wav,44100,16,60,1,bioacoustic_index,512,2000,8000,1.12683332658078,NA 
rayol-farm2_2019-03-22_23-45-08.wav,44100,16,60,1,bioacoustic_index,512,2000,8000,1.10316589569538,NA 
rayol-farm2_2019-03-22_23-47-08.wav,44100,16,60,1,bioacoustic_index,512,2000,8000,1.11071093389545,NA 
rayol-farm2_2019-03-22_23-49-08.wav,44100,16,60,1,bioacoustic_index,512,2000,8000,1.10267976956005,NA 
rayol-farm2_2019-03-22_23-51-08.wav,44100,16,60,1,bioacoustic_index,512,2000,8000,1.11195831132998,NA 
rayol-farm2_2019-03-22_23-53-08.wav,44100,16,60,1,bioacoustic_index,512,2000,8000,1.16961824726641,NA 
rayol-farm2_2019-03-22_23-55-09.wav,44100,16,60,1,bioacoustic_index,512,2000,8000,1.1469820297948,NA 
rayol-farm2_2019-03-22_23-57-09.wav,44100,16,60,1,bioacoustic_index,512,2000,8000,1.07097472118038,NA 
rayol-farm2_2019-03-22_23-59-09.wav,44100,16,60,1,bioacoustic_index,512,2000,8000,1.0957181926876,NA
