FILENAME,SAMPLINGRATE,BIT,DURATION,CHANNELS,INDEX,MAX_FREQ,DB_THRESHOLD,FREQ_STEPS,LEFT_CHANNEL,RIGHT_CHANNEL
rayol-farm2_2019-03-28_19-25-04.wav,44100,16,60,1,acoustic_diversity,10000,-,1000,2.295227,NA 
rayol-farm2_2019-03-28_19-27-04.wav,44100,16,60,1,acoustic_diversity,10000,-,1000,2.295091,NA 
rayol-farm2_2019-03-28_19-29-04.wav,44100,16,60,1,acoustic_diversity,10000,-,1000,2.302297,NA 
rayol-farm2_2019-03-28_19-31-04.wav,44100,16,60,1,acoustic_diversity,10000,-,1000,2.302129,NA 
rayol-farm2_2019-03-28_19-33-05.wav,44100,16,60,1,acoustic_diversity,10000,-,1000,2.30216,NA 
rayol-farm2_2019-03-28_19-35-05.wav,44100,16,60,1,acoustic_diversity,10000,-,1000,2.302436,NA 
rayol-farm2_2019-03-28_19-37-05.wav,44100,16,60,1,acoustic_diversity,10000,-,1000,2.302452,NA 
rayol-farm2_2019-03-28_19-39-05.wav,44100,16,60,1,acoustic_diversity,10000,-,1000,2.302245,NA 
rayol-farm2_2019-03-28_19-41-05.wav,44100,16,60,1,acoustic_diversity,10000,-,1000,2.302191,NA 
rayol-farm2_2019-03-28_19-43-05.wav,44100,16,60,1,acoustic_diversity,10000,-,1000,2.301973,NA 
rayol-farm2_2019-03-28_19-45-05.wav,44100,16,60,1,acoustic_diversity,10000,-,1000,2.302198,NA 
rayol-farm2_2019-03-28_19-47-05.wav,44100,16,60,1,acoustic_diversity,10000,-,1000,2.302474,NA 
rayol-farm2_2019-03-28_19-49-06.wav,44100,16,60,1,acoustic_diversity,10000,-,1000,2.302283,NA 
rayol-farm2_2019-03-28_19-51-06.wav,44100,16,60,1,acoustic_diversity,10000,-,1000,2.301889,NA 
rayol-farm2_2019-03-28_19-53-06.wav,44100,16,60,1,acoustic_diversity,10000,-,1000,2.302295,NA 
rayol-farm2_2019-03-28_19-55-06.wav,44100,16,60,1,acoustic_diversity,10000,-,1000,2.301481,NA 
rayol-farm2_2019-03-28_19-57-06.wav,44100,16,60,1,acoustic_diversity,10000,-,1000,2.301053,NA 
rayol-farm2_2019-03-28_19-59-06.wav,44100,16,60,1,acoustic_diversity,10000,-,1000,2.301931,NA 
rayol-farm2_2019-03-28_20-01-06.wav,44100,16,60,1,acoustic_diversity,10000,-,1000,2.302179,NA 
rayol-farm2_2019-03-28_20-03-06.wav,44100,16,60,1,acoustic_diversity,10000,-,1000,2.302372,NA 
rayol-farm2_2019-03-28_20-05-07.wav,44100,16,60,1,acoustic_diversity,10000,-,1000,2.302442,NA 
rayol-farm2_2019-03-28_20-07-07.wav,44100,16,60,1,acoustic_diversity,10000,-,1000,2.302446,NA 
rayol-farm2_2019-03-28_20-09-07.wav,44100,16,60,1,acoustic_diversity,10000,-,1000,2.30233,NA 
rayol-farm2_2019-03-28_20-11-07.wav,44100,16,60,1,acoustic_diversity,10000,-,1000,2.302215,NA 
rayol-farm2_2019-03-28_20-13-07.wav,44100,16,60,1,acoustic_diversity,10000,-,1000,2.302209,NA 
rayol-farm2_2019-03-28_20-15-07.wav,44100,16,60,1,acoustic_diversity,10000,-,1000,2.30244,NA 
rayol-farm2_2019-03-28_20-17-07.wav,44100,16,60,1,acoustic_diversity,10000,-,1000,2.302273,NA 
rayol-farm2_2019-03-28_20-19-07.wav,44100,16,60,1,acoustic_diversity,10000,-,1000,2.302348,NA 
rayol-farm2_2019-03-28_20-21-07.wav,44100,16,60,1,acoustic_diversity,10000,-,1000,2.302435,NA 
rayol-farm2_2019-03-28_20-23-08.wav,44100,16,60,1,acoustic_diversity,10000,-,1000,2.302426,NA 
rayol-farm2_2019-03-28_20-25-08.wav,44100,16,60,1,acoustic_diversity,10000,-,1000,2.302487,NA 
rayol-farm2_2019-03-28_20-27-08.wav,44100,16,60,1,acoustic_diversity,10000,-,1000,2.30206,NA 
rayol-farm2_2019-03-28_20-29-08.wav,44100,16,60,1,acoustic_diversity,10000,-,1000,2.302226,NA 
rayol-farm2_2019-03-28_20-31-08.wav,44100,16,60,1,acoustic_diversity,10000,-,1000,2.302409,NA 
rayol-farm2_2019-03-28_20-33-08.wav,44100,16,60,1,acoustic_diversity,10000,-,1000,2.302455,NA 
rayol-farm2_2019-03-28_20-35-08.wav,44100,16,60,1,acoustic_diversity,10000,-,1000,2.30237,NA 
rayol-farm2_2019-03-28_20-37-08.wav,44100,16,60,1,acoustic_diversity,10000,-,1000,2.302393,NA 
rayol-farm2_2019-03-28_20-39-09.wav,44100,16,60,1,acoustic_diversity,10000,-,1000,2.302486,NA 
rayol-farm2_2019-03-28_20-41-09.wav,44100,16,60,1,acoustic_diversity,10000,-,1000,2.302523,NA 
rayol-farm2_2019-03-28_20-43-09.wav,44100,16,60,1,acoustic_diversity,10000,-,1000,2.302502,NA 
rayol-farm2_2019-03-28_20-45-09.wav,44100,16,60,1,acoustic_diversity,10000,-,1000,2.302215,NA 
rayol-farm2_2019-03-28_20-47-09.wav,44100,16,60,1,acoustic_diversity,10000,-,1000,2.302374,NA 
rayol-farm2_2019-03-28_20-49-09.wav,44100,16,60,1,acoustic_diversity,10000,-,1000,2.302441,NA 
rayol-farm2_2019-03-28_20-51-09.wav,44100,16,60,1,acoustic_diversity,10000,-,1000,2.302043,NA 
rayol-farm2_2019-03-28_20-53-09.wav,44100,16,60,1,acoustic_diversity,10000,-,1000,2.302307,NA 
rayol-farm2_2019-03-28_20-55-10.wav,44100,16,60,1,acoustic_diversity,10000,-,1000,2.214257,NA 
rayol-farm2_2019-03-28_20-57-10.wav,44100,16,60,1,acoustic_diversity,10000,-,1000,2.302174,NA 
rayol-farm2_2019-03-28_20-59-10.wav,44100,16,60,1,acoustic_diversity,10000,-,1000,2.302207,NA 
rayol-farm2_2019-03-28_21-01-10.wav,44100,16,60,1,acoustic_diversity,10000,-,1000,2.301472,NA 
rayol-farm2_2019-03-28_21-03-10.wav,44100,16,60,1,acoustic_diversity,10000,-,1000,2.302359,NA 
rayol-farm2_2019-03-28_21-05-10.wav,44100,16,60,1,acoustic_diversity,10000,-,1000,2.302468,NA 
rayol-farm2_2019-03-28_21-07-10.wav,44100,16,60,1,acoustic_diversity,10000,-,1000,2.302155,NA 
rayol-farm2_2019-03-28_21-09-10.wav,44100,16,60,1,acoustic_diversity,10000,-,1000,2.302293,NA 
rayol-farm2_2019-03-28_21-11-11.wav,44100,16,60,1,acoustic_diversity,10000,-,1000,2.302414,NA 
rayol-farm2_2019-03-28_21-13-11.wav,44100,16,60,1,acoustic_diversity,10000,-,1000,2.302512,NA 
rayol-farm2_2019-03-28_21-15-11.wav,44100,16,60,1,acoustic_diversity,10000,-,1000,2.302474,NA 
rayol-farm2_2019-03-28_21-17-11.wav,44100,16,60,1,acoustic_diversity,10000,-,1000,2.301987,NA 
rayol-farm2_2019-03-28_21-19-11.wav,44100,16,60,1,acoustic_diversity,10000,-,1000,2.302473,NA 
rayol-farm2_2019-03-28_21-21-11.wav,44100,16,60,1,acoustic_diversity,10000,-,1000,2.302304,NA 
rayol-farm2_2019-03-28_21-23-11.wav,44100,16,60,1,acoustic_diversity,10000,-,1000,2.302485,NA 
rayol-farm2_2019-03-28_21-25-11.wav,44100,16,60,1,acoustic_diversity,10000,-,1000,2.302464,NA 
rayol-farm2_2019-03-28_21-27-12.wav,44100,16,60,1,acoustic_diversity,10000,-,1000,2.302387,NA 
rayol-farm2_2019-03-28_21-29-12.wav,44100,16,60,1,acoustic_diversity,10000,-,1000,2.302454,NA 
rayol-farm2_2019-03-28_21-31-12.wav,44100,16,60,1,acoustic_diversity,10000,-,1000,2.30222,NA 
rayol-farm2_2019-03-28_21-33-12.wav,44100,16,60,1,acoustic_diversity,10000,-,1000,2.302275,NA 
rayol-farm2_2019-03-28_21-35-12.wav,44100,16,60,1,acoustic_diversity,10000,-,1000,2.302458,NA 
rayol-farm2_2019-03-28_21-37-12.wav,44100,16,60,1,acoustic_diversity,10000,-,1000,2.302494,NA 
rayol-farm2_2019-03-28_21-39-12.wav,44100,16,60,1,acoustic_diversity,10000,-,1000,2.302437,NA 
rayol-farm2_2019-03-28_21-41-12.wav,44100,16,60,1,acoustic_diversity,10000,-,1000,2.302398,NA 
rayol-farm2_2019-03-28_21-43-12.wav,44100,16,60,1,acoustic_diversity,10000,-,1000,2.302303,NA 
rayol-farm2_2019-03-28_21-45-13.wav,44100,16,60,1,acoustic_diversity,10000,-,1000,2.302495,NA 
rayol-farm2_2019-03-28_21-47-13.wav,44100,16,60,1,acoustic_diversity,10000,-,1000,2.302513,NA 
rayol-farm2_2019-03-28_21-49-13.wav,44100,16,60,1,acoustic_diversity,10000,-,1000,2.302505,NA 
rayol-farm2_2019-03-28_21-51-13.wav,44100,16,60,1,acoustic_diversity,10000,-,1000,2.302526,NA 
rayol-farm2_2019-03-28_21-53-13.wav,44100,16,60,1,acoustic_diversity,10000,-,1000,2.302505,NA 
rayol-farm2_2019-03-28_21-55-13.wav,44100,16,60,1,acoustic_diversity,10000,-,1000,2.302308,NA 
rayol-farm2_2019-03-28_21-57-13.wav,44100,16,60,1,acoustic_diversity,10000,-,1000,2.302186,NA 
rayol-farm2_2019-03-28_21-59-13.wav,44100,16,60,1,acoustic_diversity,10000,-,1000,2.302329,NA 
rayol-farm2_2019-03-28_22-01-14.wav,44100,16,60,1,acoustic_diversity,10000,-,1000,2.302131,NA 
rayol-farm2_2019-03-28_22-03-14.wav,44100,16,60,1,acoustic_diversity,10000,-,1000,2.302475,NA 
rayol-farm2_2019-03-28_22-05-14.wav,44100,16,60,1,acoustic_diversity,10000,-,1000,2.302485,NA 
rayol-farm2_2019-03-28_22-07-14.wav,44100,16,60,1,acoustic_diversity,10000,-,1000,2.302461,NA 
rayol-farm2_2019-03-28_22-09-14.wav,44100,16,60,1,acoustic_diversity,10000,-,1000,2.302497,NA 
rayol-farm2_2019-03-28_22-11-14.wav,44100,16,60,1,acoustic_diversity,10000,-,1000,2.302422,NA 
rayol-farm2_2019-03-28_22-13-14.wav,44100,16,60,1,acoustic_diversity,10000,-,1000,2.302453,NA 
rayol-farm2_2019-03-28_22-15-14.wav,44100,16,60,1,acoustic_diversity,10000,-,1000,2.302411,NA 
rayol-farm2_2019-03-28_22-17-15.wav,44100,16,60,1,acoustic_diversity,10000,-,1000,2.302399,NA 
rayol-farm2_2019-03-28_22-19-15.wav,44100,16,60,1,acoustic_diversity,10000,-,1000,2.302472,NA 
rayol-farm2_2019-03-28_22-21-15.wav,44100,16,60,1,acoustic_diversity,10000,-,1000,2.302166,NA 
rayol-farm2_2019-03-28_22-23-15.wav,44100,16,60,1,acoustic_diversity,10000,-,1000,2.302457,NA 
rayol-farm2_2019-03-28_22-25-15.wav,44100,16,60,1,acoustic_diversity,10000,-,1000,2.301731,NA 
rayol-farm2_2019-03-28_22-27-15.wav,44100,16,60,1,acoustic_diversity,10000,-,1000,2.302184,NA 
rayol-farm2_2019-03-28_22-29-15.wav,44100,16,60,1,acoustic_diversity,10000,-,1000,2.302485,NA 
rayol-farm2_2019-03-28_22-31-15.wav,44100,16,60,1,acoustic_diversity,10000,-,1000,2.302331,NA 
rayol-farm2_2019-03-28_22-33-16.wav,44100,16,60,1,acoustic_diversity,10000,-,1000,2.302377,NA 
rayol-farm2_2019-03-28_22-35-16.wav,44100,16,60,1,acoustic_diversity,10000,-,1000,2.302335,NA 
rayol-farm2_2019-03-28_22-37-16.wav,44100,16,60,1,acoustic_diversity,10000,-,1000,2.302447,NA 
rayol-farm2_2019-03-28_22-39-16.wav,44100,16,60,1,acoustic_diversity,10000,-,1000,2.302469,NA 
rayol-farm2_2019-03-28_22-41-16.wav,44100,16,60,1,acoustic_diversity,10000,-,1000,2.301728,NA 
rayol-farm2_2019-03-28_22-43-16.wav,44100,16,60,1,acoustic_diversity,10000,-,1000,2.301146,NA 
rayol-farm2_2019-03-28_22-45-16.wav,44100,16,60,1,acoustic_diversity,10000,-,1000,2.302385,NA 
rayol-farm2_2019-03-28_22-47-16.wav,44100,16,60,1,acoustic_diversity,10000,-,1000,2.302493,NA 
rayol-farm2_2019-03-28_22-49-16.wav,44100,16,60,1,acoustic_diversity,10000,-,1000,2.302468,NA 
rayol-farm2_2019-03-28_22-51-17.wav,44100,16,60,1,acoustic_diversity,10000,-,1000,2.302382,NA 
rayol-farm2_2019-03-28_22-53-17.wav,44100,16,60,1,acoustic_diversity,10000,-,1000,2.302384,NA 
rayol-farm2_2019-03-28_22-55-17.wav,44100,16,60,1,acoustic_diversity,10000,-,1000,2.302495,NA 
rayol-farm2_2019-03-28_22-57-17.wav,44100,16,60,1,acoustic_diversity,10000,-,1000,2.302509,NA 
rayol-farm2_2019-03-28_22-59-17.wav,44100,16,60,1,acoustic_diversity,10000,-,1000,2.302474,NA 
rayol-farm2_2019-03-28_23-01-17.wav,44100,16,60,1,acoustic_diversity,10000,-,1000,2.302511,NA 
rayol-farm2_2019-03-28_23-03-17.wav,44100,16,60,1,acoustic_diversity,10000,-,1000,2.302367,NA 
rayol-farm2_2019-03-28_23-05-17.wav,44100,16,60,1,acoustic_diversity,10000,-,1000,2.301564,NA 
rayol-farm2_2019-03-28_23-07-18.wav,44100,16,60,1,acoustic_diversity,10000,-,1000,2.302436,NA 
rayol-farm2_2019-03-28_23-09-18.wav,44100,16,60,1,acoustic_diversity,10000,-,1000,2.302415,NA 
rayol-farm2_2019-03-28_23-11-18.wav,44100,16,60,1,acoustic_diversity,10000,-,1000,2.302094,NA 
rayol-farm2_2019-03-28_23-13-18.wav,44100,16,60,1,acoustic_diversity,10000,-,1000,2.302284,NA 
rayol-farm2_2019-03-28_23-15-18.wav,44100,16,60,1,acoustic_diversity,10000,-,1000,2.302479,NA 
rayol-farm2_2019-03-28_23-17-18.wav,44100,16,60,1,acoustic_diversity,10000,-,1000,2.302493,NA 
rayol-farm2_2019-03-28_23-19-18.wav,44100,16,60,1,acoustic_diversity,10000,-,1000,2.302519,NA 
rayol-farm2_2019-03-28_23-21-18.wav,44100,16,60,1,acoustic_diversity,10000,-,1000,2.302503,NA 
rayol-farm2_2019-03-28_23-23-19.wav,44100,16,60,1,acoustic_diversity,10000,-,1000,2.302493,NA 
rayol-farm2_2019-03-28_23-25-19.wav,44100,16,60,1,acoustic_diversity,10000,-,1000,2.302501,NA 
rayol-farm2_2019-03-28_23-27-19.wav,44100,16,60,1,acoustic_diversity,10000,-,1000,2.302388,NA 
rayol-farm2_2019-03-28_23-29-19.wav,44100,16,60,1,acoustic_diversity,10000,-,1000,2.302396,NA 
rayol-farm2_2019-03-28_23-31-19.wav,44100,16,60,1,acoustic_diversity,10000,-,1000,2.302399,NA 
rayol-farm2_2019-03-28_23-33-19.wav,44100,16,60,1,acoustic_diversity,10000,-,1000,2.302503,NA 
rayol-farm2_2019-03-28_23-35-19.wav,44100,16,60,1,acoustic_diversity,10000,-,1000,2.302482,NA 
rayol-farm2_2019-03-28_23-37-19.wav,44100,16,60,1,acoustic_diversity,10000,-,1000,2.302463,NA 
rayol-farm2_2019-03-28_23-39-20.wav,44100,16,60,1,acoustic_diversity,10000,-,1000,2.302471,NA 
rayol-farm2_2019-03-28_23-41-20.wav,44100,16,60,1,acoustic_diversity,10000,-,1000,2.302314,NA 
rayol-farm2_2019-03-28_23-43-20.wav,44100,16,60,1,acoustic_diversity,10000,-,1000,2.302212,NA 
rayol-farm2_2019-03-28_23-45-20.wav,44100,16,60,1,acoustic_diversity,10000,-,1000,2.302511,NA 
rayol-farm2_2019-03-28_23-47-20.wav,44100,16,60,1,acoustic_diversity,10000,-,1000,2.302217,NA 
rayol-farm2_2019-03-28_23-49-20.wav,44100,16,60,1,acoustic_diversity,10000,-,1000,2.302376,NA 
rayol-farm2_2019-03-28_23-51-20.wav,44100,16,60,1,acoustic_diversity,10000,-,1000,2.302475,NA 
rayol-farm2_2019-03-28_23-53-20.wav,44100,16,60,1,acoustic_diversity,10000,-,1000,2.302522,NA 
rayol-farm2_2019-03-28_23-55-20.wav,44100,16,60,1,acoustic_diversity,10000,-,1000,2.302501,NA 
rayol-farm2_2019-03-28_23-57-21.wav,44100,16,60,1,acoustic_diversity,10000,-,1000,2.302498,NA 
rayol-farm2_2019-03-28_23-59-21.wav,44100,16,60,1,acoustic_diversity,10000,-,1000,2.30225,NA

rayol-farm2_2019-03-28_19-25-04.wav,44100,16,60,1,acoustic_diversity,10000,50,1000,2.295227,NA 
rayol-farm2_2019-03-28_19-27-04.wav,44100,16,60,1,acoustic_diversity,10000,50,1000,2.295091,NA 
rayol-farm2_2019-03-28_19-29-04.wav,44100,16,60,1,acoustic_diversity,10000,50,1000,2.302297,NA 
rayol-farm2_2019-03-28_19-31-04.wav,44100,16,60,1,acoustic_diversity,10000,50,1000,2.302129,NA 
rayol-farm2_2019-03-28_19-33-05.wav,44100,16,60,1,acoustic_diversity,10000,50,1000,2.30216,NA 
rayol-farm2_2019-03-28_19-35-05.wav,44100,16,60,1,acoustic_diversity,10000,50,1000,2.302436,NA 
rayol-farm2_2019-03-28_19-37-05.wav,44100,16,60,1,acoustic_diversity,10000,50,1000,2.302452,NA 
rayol-farm2_2019-03-28_19-39-05.wav,44100,16,60,1,acoustic_diversity,10000,50,1000,2.302245,NA 
rayol-farm2_2019-03-28_19-41-05.wav,44100,16,60,1,acoustic_diversity,10000,50,1000,2.302191,NA 
rayol-farm2_2019-03-28_19-43-05.wav,44100,16,60,1,acoustic_diversity,10000,50,1000,2.301973,NA 
rayol-farm2_2019-03-28_19-45-05.wav,44100,16,60,1,acoustic_diversity,10000,50,1000,2.302198,NA 
rayol-farm2_2019-03-28_19-47-05.wav,44100,16,60,1,acoustic_diversity,10000,50,1000,2.302474,NA 
rayol-farm2_2019-03-28_19-49-06.wav,44100,16,60,1,acoustic_diversity,10000,50,1000,2.302283,NA 
rayol-farm2_2019-03-28_19-51-06.wav,44100,16,60,1,acoustic_diversity,10000,50,1000,2.301889,NA 
rayol-farm2_2019-03-28_19-53-06.wav,44100,16,60,1,acoustic_diversity,10000,50,1000,2.302295,NA 
rayol-farm2_2019-03-28_19-55-06.wav,44100,16,60,1,acoustic_diversity,10000,50,1000,2.301481,NA 
rayol-farm2_2019-03-28_19-57-06.wav,44100,16,60,1,acoustic_diversity,10000,50,1000,2.301053,NA 
rayol-farm2_2019-03-28_19-59-06.wav,44100,16,60,1,acoustic_diversity,10000,50,1000,2.301931,NA 
rayol-farm2_2019-03-28_20-01-06.wav,44100,16,60,1,acoustic_diversity,10000,50,1000,2.302179,NA 
rayol-farm2_2019-03-28_20-03-06.wav,44100,16,60,1,acoustic_diversity,10000,50,1000,2.302372,NA 
rayol-farm2_2019-03-28_20-05-07.wav,44100,16,60,1,acoustic_diversity,10000,50,1000,2.302442,NA 
rayol-farm2_2019-03-28_20-07-07.wav,44100,16,60,1,acoustic_diversity,10000,50,1000,2.302446,NA 
rayol-farm2_2019-03-28_20-09-07.wav,44100,16,60,1,acoustic_diversity,10000,50,1000,2.30233,NA 
rayol-farm2_2019-03-28_20-11-07.wav,44100,16,60,1,acoustic_diversity,10000,50,1000,2.302215,NA 
rayol-farm2_2019-03-28_20-13-07.wav,44100,16,60,1,acoustic_diversity,10000,50,1000,2.302209,NA 
rayol-farm2_2019-03-28_20-15-07.wav,44100,16,60,1,acoustic_diversity,10000,50,1000,2.30244,NA 
rayol-farm2_2019-03-28_20-17-07.wav,44100,16,60,1,acoustic_diversity,10000,50,1000,2.302273,NA 
rayol-farm2_2019-03-28_20-19-07.wav,44100,16,60,1,acoustic_diversity,10000,50,1000,2.302348,NA 
rayol-farm2_2019-03-28_20-21-07.wav,44100,16,60,1,acoustic_diversity,10000,50,1000,2.302435,NA 
rayol-farm2_2019-03-28_20-23-08.wav,44100,16,60,1,acoustic_diversity,10000,50,1000,2.302426,NA 
rayol-farm2_2019-03-28_20-25-08.wav,44100,16,60,1,acoustic_diversity,10000,50,1000,2.302487,NA 
rayol-farm2_2019-03-28_20-27-08.wav,44100,16,60,1,acoustic_diversity,10000,50,1000,2.30206,NA 
rayol-farm2_2019-03-28_20-29-08.wav,44100,16,60,1,acoustic_diversity,10000,50,1000,2.302226,NA 
rayol-farm2_2019-03-28_20-31-08.wav,44100,16,60,1,acoustic_diversity,10000,50,1000,2.302409,NA 
rayol-farm2_2019-03-28_20-33-08.wav,44100,16,60,1,acoustic_diversity,10000,50,1000,2.302455,NA 
rayol-farm2_2019-03-28_20-35-08.wav,44100,16,60,1,acoustic_diversity,10000,50,1000,2.30237,NA 
rayol-farm2_2019-03-28_20-37-08.wav,44100,16,60,1,acoustic_diversity,10000,50,1000,2.302393,NA 
rayol-farm2_2019-03-28_20-39-09.wav,44100,16,60,1,acoustic_diversity,10000,50,1000,2.302486,NA 
rayol-farm2_2019-03-28_20-41-09.wav,44100,16,60,1,acoustic_diversity,10000,50,1000,2.302523,NA 
rayol-farm2_2019-03-28_20-43-09.wav,44100,16,60,1,acoustic_diversity,10000,50,1000,2.302502,NA 
rayol-farm2_2019-03-28_20-45-09.wav,44100,16,60,1,acoustic_diversity,10000,50,1000,2.302215,NA 
rayol-farm2_2019-03-28_20-47-09.wav,44100,16,60,1,acoustic_diversity,10000,50,1000,2.302374,NA 
rayol-farm2_2019-03-28_20-49-09.wav,44100,16,60,1,acoustic_diversity,10000,50,1000,2.302441,NA 
rayol-farm2_2019-03-28_20-51-09.wav,44100,16,60,1,acoustic_diversity,10000,50,1000,2.302043,NA 
rayol-farm2_2019-03-28_20-53-09.wav,44100,16,60,1,acoustic_diversity,10000,50,1000,2.302307,NA 
rayol-farm2_2019-03-28_20-55-10.wav,44100,16,60,1,acoustic_diversity,10000,50,1000,2.214257,NA 
rayol-farm2_2019-03-28_20-57-10.wav,44100,16,60,1,acoustic_diversity,10000,50,1000,2.302174,NA 
rayol-farm2_2019-03-28_20-59-10.wav,44100,16,60,1,acoustic_diversity,10000,50,1000,2.302207,NA 
rayol-farm2_2019-03-28_21-01-10.wav,44100,16,60,1,acoustic_diversity,10000,50,1000,2.301472,NA 
rayol-farm2_2019-03-28_21-03-10.wav,44100,16,60,1,acoustic_diversity,10000,50,1000,2.302359,NA 
rayol-farm2_2019-03-28_21-05-10.wav,44100,16,60,1,acoustic_diversity,10000,50,1000,2.302468,NA 
rayol-farm2_2019-03-28_21-07-10.wav,44100,16,60,1,acoustic_diversity,10000,50,1000,2.302155,NA 
rayol-farm2_2019-03-28_21-09-10.wav,44100,16,60,1,acoustic_diversity,10000,50,1000,2.302293,NA 
rayol-farm2_2019-03-28_21-11-11.wav,44100,16,60,1,acoustic_diversity,10000,50,1000,2.302414,NA 
rayol-farm2_2019-03-28_21-13-11.wav,44100,16,60,1,acoustic_diversity,10000,50,1000,2.302512,NA 
rayol-farm2_2019-03-28_21-15-11.wav,44100,16,60,1,acoustic_diversity,10000,50,1000,2.302474,NA 
rayol-farm2_2019-03-28_21-17-11.wav,44100,16,60,1,acoustic_diversity,10000,50,1000,2.301987,NA 
rayol-farm2_2019-03-28_21-19-11.wav,44100,16,60,1,acoustic_diversity,10000,50,1000,2.302473,NA 
rayol-farm2_2019-03-28_21-21-11.wav,44100,16,60,1,acoustic_diversity,10000,50,1000,2.302304,NA 
rayol-farm2_2019-03-28_21-23-11.wav,44100,16,60,1,acoustic_diversity,10000,50,1000,2.302485,NA 
rayol-farm2_2019-03-28_21-25-11.wav,44100,16,60,1,acoustic_diversity,10000,50,1000,2.302464,NA 
rayol-farm2_2019-03-28_21-27-12.wav,44100,16,60,1,acoustic_diversity,10000,50,1000,2.302387,NA 
rayol-farm2_2019-03-28_21-29-12.wav,44100,16,60,1,acoustic_diversity,10000,50,1000,2.302454,NA 
rayol-farm2_2019-03-28_21-31-12.wav,44100,16,60,1,acoustic_diversity,10000,50,1000,2.30222,NA 
rayol-farm2_2019-03-28_21-33-12.wav,44100,16,60,1,acoustic_diversity,10000,50,1000,2.302275,NA 
rayol-farm2_2019-03-28_21-35-12.wav,44100,16,60,1,acoustic_diversity,10000,50,1000,2.302458,NA 
rayol-farm2_2019-03-28_21-37-12.wav,44100,16,60,1,acoustic_diversity,10000,50,1000,2.302494,NA 
rayol-farm2_2019-03-28_21-39-12.wav,44100,16,60,1,acoustic_diversity,10000,50,1000,2.302437,NA 
rayol-farm2_2019-03-28_21-41-12.wav,44100,16,60,1,acoustic_diversity,10000,50,1000,2.302398,NA 
rayol-farm2_2019-03-28_21-43-12.wav,44100,16,60,1,acoustic_diversity,10000,50,1000,2.302303,NA 
rayol-farm2_2019-03-28_21-45-13.wav,44100,16,60,1,acoustic_diversity,10000,50,1000,2.302495,NA 
rayol-farm2_2019-03-28_21-47-13.wav,44100,16,60,1,acoustic_diversity,10000,50,1000,2.302513,NA 
rayol-farm2_2019-03-28_21-49-13.wav,44100,16,60,1,acoustic_diversity,10000,50,1000,2.302505,NA 
rayol-farm2_2019-03-28_21-51-13.wav,44100,16,60,1,acoustic_diversity,10000,50,1000,2.302526,NA 
rayol-farm2_2019-03-28_21-53-13.wav,44100,16,60,1,acoustic_diversity,10000,50,1000,2.302505,NA 
rayol-farm2_2019-03-28_21-55-13.wav,44100,16,60,1,acoustic_diversity,10000,50,1000,2.302308,NA 
rayol-farm2_2019-03-28_21-57-13.wav,44100,16,60,1,acoustic_diversity,10000,50,1000,2.302186,NA 
rayol-farm2_2019-03-28_21-59-13.wav,44100,16,60,1,acoustic_diversity,10000,50,1000,2.302329,NA 
rayol-farm2_2019-03-28_22-01-14.wav,44100,16,60,1,acoustic_diversity,10000,50,1000,2.302131,NA 
rayol-farm2_2019-03-28_22-03-14.wav,44100,16,60,1,acoustic_diversity,10000,50,1000,2.302475,NA 
rayol-farm2_2019-03-28_22-05-14.wav,44100,16,60,1,acoustic_diversity,10000,50,1000,2.302485,NA 
rayol-farm2_2019-03-28_22-07-14.wav,44100,16,60,1,acoustic_diversity,10000,50,1000,2.302461,NA 
rayol-farm2_2019-03-28_22-09-14.wav,44100,16,60,1,acoustic_diversity,10000,50,1000,2.302497,NA 
rayol-farm2_2019-03-28_22-11-14.wav,44100,16,60,1,acoustic_diversity,10000,50,1000,2.302422,NA 
rayol-farm2_2019-03-28_22-13-14.wav,44100,16,60,1,acoustic_diversity,10000,50,1000,2.302453,NA 
rayol-farm2_2019-03-28_22-15-14.wav,44100,16,60,1,acoustic_diversity,10000,50,1000,2.302411,NA 
rayol-farm2_2019-03-28_22-17-15.wav,44100,16,60,1,acoustic_diversity,10000,50,1000,2.302399,NA 
rayol-farm2_2019-03-28_22-19-15.wav,44100,16,60,1,acoustic_diversity,10000,50,1000,2.302472,NA 
rayol-farm2_2019-03-28_22-21-15.wav,44100,16,60,1,acoustic_diversity,10000,50,1000,2.302166,NA 
rayol-farm2_2019-03-28_22-23-15.wav,44100,16,60,1,acoustic_diversity,10000,50,1000,2.302457,NA 
rayol-farm2_2019-03-28_22-25-15.wav,44100,16,60,1,acoustic_diversity,10000,50,1000,2.301731,NA 
rayol-farm2_2019-03-28_22-27-15.wav,44100,16,60,1,acoustic_diversity,10000,50,1000,2.302184,NA 
rayol-farm2_2019-03-28_22-29-15.wav,44100,16,60,1,acoustic_diversity,10000,50,1000,2.302485,NA 
rayol-farm2_2019-03-28_22-31-15.wav,44100,16,60,1,acoustic_diversity,10000,50,1000,2.302331,NA 
rayol-farm2_2019-03-28_22-33-16.wav,44100,16,60,1,acoustic_diversity,10000,50,1000,2.302377,NA 
rayol-farm2_2019-03-28_22-35-16.wav,44100,16,60,1,acoustic_diversity,10000,50,1000,2.302335,NA 
rayol-farm2_2019-03-28_22-37-16.wav,44100,16,60,1,acoustic_diversity,10000,50,1000,2.302447,NA 
rayol-farm2_2019-03-28_22-39-16.wav,44100,16,60,1,acoustic_diversity,10000,50,1000,2.302469,NA 
rayol-farm2_2019-03-28_22-41-16.wav,44100,16,60,1,acoustic_diversity,10000,50,1000,2.301728,NA 
rayol-farm2_2019-03-28_22-43-16.wav,44100,16,60,1,acoustic_diversity,10000,50,1000,2.301146,NA 
rayol-farm2_2019-03-28_22-45-16.wav,44100,16,60,1,acoustic_diversity,10000,50,1000,2.302385,NA 
rayol-farm2_2019-03-28_22-47-16.wav,44100,16,60,1,acoustic_diversity,10000,50,1000,2.302493,NA 
rayol-farm2_2019-03-28_22-49-16.wav,44100,16,60,1,acoustic_diversity,10000,50,1000,2.302468,NA 
rayol-farm2_2019-03-28_22-51-17.wav,44100,16,60,1,acoustic_diversity,10000,50,1000,2.302382,NA 
rayol-farm2_2019-03-28_22-53-17.wav,44100,16,60,1,acoustic_diversity,10000,50,1000,2.302384,NA 
rayol-farm2_2019-03-28_22-55-17.wav,44100,16,60,1,acoustic_diversity,10000,50,1000,2.302495,NA 
rayol-farm2_2019-03-28_22-57-17.wav,44100,16,60,1,acoustic_diversity,10000,50,1000,2.302509,NA 
rayol-farm2_2019-03-28_22-59-17.wav,44100,16,60,1,acoustic_diversity,10000,50,1000,2.302474,NA 
rayol-farm2_2019-03-28_23-01-17.wav,44100,16,60,1,acoustic_diversity,10000,50,1000,2.302511,NA 
rayol-farm2_2019-03-28_23-03-17.wav,44100,16,60,1,acoustic_diversity,10000,50,1000,2.302367,NA 
rayol-farm2_2019-03-28_23-05-17.wav,44100,16,60,1,acoustic_diversity,10000,50,1000,2.301564,NA 
rayol-farm2_2019-03-28_23-07-18.wav,44100,16,60,1,acoustic_diversity,10000,50,1000,2.302436,NA 
rayol-farm2_2019-03-28_23-09-18.wav,44100,16,60,1,acoustic_diversity,10000,50,1000,2.302415,NA 
rayol-farm2_2019-03-28_23-11-18.wav,44100,16,60,1,acoustic_diversity,10000,50,1000,2.302094,NA 
rayol-farm2_2019-03-28_23-13-18.wav,44100,16,60,1,acoustic_diversity,10000,50,1000,2.302284,NA 
rayol-farm2_2019-03-28_23-15-18.wav,44100,16,60,1,acoustic_diversity,10000,50,1000,2.302479,NA 
rayol-farm2_2019-03-28_23-17-18.wav,44100,16,60,1,acoustic_diversity,10000,50,1000,2.302493,NA 
rayol-farm2_2019-03-28_23-19-18.wav,44100,16,60,1,acoustic_diversity,10000,50,1000,2.302519,NA 
rayol-farm2_2019-03-28_23-21-18.wav,44100,16,60,1,acoustic_diversity,10000,50,1000,2.302503,NA 
rayol-farm2_2019-03-28_23-23-19.wav,44100,16,60,1,acoustic_diversity,10000,50,1000,2.302493,NA 
rayol-farm2_2019-03-28_23-25-19.wav,44100,16,60,1,acoustic_diversity,10000,50,1000,2.302501,NA 
rayol-farm2_2019-03-28_23-27-19.wav,44100,16,60,1,acoustic_diversity,10000,50,1000,2.302388,NA 
rayol-farm2_2019-03-28_23-29-19.wav,44100,16,60,1,acoustic_diversity,10000,50,1000,2.302396,NA 
rayol-farm2_2019-03-28_23-31-19.wav,44100,16,60,1,acoustic_diversity,10000,50,1000,2.302399,NA 
rayol-farm2_2019-03-28_23-33-19.wav,44100,16,60,1,acoustic_diversity,10000,50,1000,2.302503,NA 
rayol-farm2_2019-03-28_23-35-19.wav,44100,16,60,1,acoustic_diversity,10000,50,1000,2.302482,NA 
rayol-farm2_2019-03-28_23-37-19.wav,44100,16,60,1,acoustic_diversity,10000,50,1000,2.302463,NA 
rayol-farm2_2019-03-28_23-39-20.wav,44100,16,60,1,acoustic_diversity,10000,50,1000,2.302471,NA 
rayol-farm2_2019-03-28_23-41-20.wav,44100,16,60,1,acoustic_diversity,10000,50,1000,2.302314,NA 
rayol-farm2_2019-03-28_23-43-20.wav,44100,16,60,1,acoustic_diversity,10000,50,1000,2.302212,NA 
rayol-farm2_2019-03-28_23-45-20.wav,44100,16,60,1,acoustic_diversity,10000,50,1000,2.302511,NA 
rayol-farm2_2019-03-28_23-47-20.wav,44100,16,60,1,acoustic_diversity,10000,50,1000,2.302217,NA 
rayol-farm2_2019-03-28_23-49-20.wav,44100,16,60,1,acoustic_diversity,10000,50,1000,2.302376,NA 
rayol-farm2_2019-03-28_23-51-20.wav,44100,16,60,1,acoustic_diversity,10000,50,1000,2.302475,NA 
rayol-farm2_2019-03-28_23-53-20.wav,44100,16,60,1,acoustic_diversity,10000,50,1000,2.302522,NA 
rayol-farm2_2019-03-28_23-55-20.wav,44100,16,60,1,acoustic_diversity,10000,50,1000,2.302501,NA 
rayol-farm2_2019-03-28_23-57-21.wav,44100,16,60,1,acoustic_diversity,10000,50,1000,2.302498,NA 
rayol-farm2_2019-03-28_23-59-21.wav,44100,16,60,1,acoustic_diversity,10000,50,1000,2.30225,NA
