FILENAME,SAMPLINGRATE,BIT,DURATION,CHANNELS,INDEX,FFT_W,ANTHRO_MIN,ANTHRO_MAX,BIO_MIN,BIO_MAX,LEFT_CHANNEL,RIGHT_CHANNEL
rayol-farm2_2019-05-01_00-00-46.wav,44100,16,60,1,ndsi,1024,1000,2000,2000,11000,0.911979837037918,NA 
rayol-farm2_2019-05-01_00-04-47.wav,44100,16,60,1,ndsi,1024,1000,2000,2000,11000,0.911542685713323,NA 
rayol-farm2_2019-05-01_00-06-47.wav,44100,16,60,1,ndsi,1024,1000,2000,2000,11000,0.910740142541002,NA 
rayol-farm2_2019-05-01_00-10-47.wav,44100,16,60,1,ndsi,1024,1000,2000,2000,11000,0.910460513467983,NA 
rayol-farm2_2019-05-01_00-14-47.wav,44100,16,60,1,ndsi,1024,1000,2000,2000,11000,0.91091795398161,NA 
rayol-farm2_2019-05-01_00-16-47.wav,44100,16,60,1,ndsi,1024,1000,2000,2000,11000,0.913371771046997,NA 
rayol-farm2_2019-05-01_00-18-48.wav,44100,16,60,1,ndsi,1024,1000,2000,2000,11000,0.912385539830013,NA 
rayol-farm2_2019-05-01_00-20-48.wav,44100,16,60,1,ndsi,1024,1000,2000,2000,11000,0.912145515221315,NA 
rayol-farm2_2019-05-01_00-24-48.wav,44100,16,60,1,ndsi,1024,1000,2000,2000,11000,0.91082454109645,NA 
rayol-farm2_2019-05-01_00-26-48.wav,44100,16,60,1,ndsi,1024,1000,2000,2000,11000,0.910789088119258,NA 
rayol-farm2_2019-05-01_00-28-49.wav,44100,16,60,1,ndsi,1024,1000,2000,2000,11000,0.911372650483723,NA 
rayol-farm2_2019-05-01_00-30-49.wav,44100,16,60,1,ndsi,1024,1000,2000,2000,11000,0.909652757394287,NA 
rayol-farm2_2019-05-01_00-32-49.wav,44100,16,60,1,ndsi,1024,1000,2000,2000,11000,0.910622769678316,NA 
rayol-farm2_2019-05-01_00-34-49.wav,44100,16,60,1,ndsi,1024,1000,2000,2000,11000,0.909529430532777,NA 
rayol-farm2_2019-05-01_00-36-49.wav,44100,16,60,1,ndsi,1024,1000,2000,2000,11000,0.911779683696246,NA 
rayol-farm2_2019-05-01_00-38-49.wav,44100,16,60,1,ndsi,1024,1000,2000,2000,11000,0.906887795323945,NA 
rayol-farm2_2019-05-01_00-40-49.wav,44100,16,60,1,ndsi,1024,1000,2000,2000,11000,0.90895556102666,NA 
rayol-farm2_2019-05-01_00-42-49.wav,44100,16,60,1,ndsi,1024,1000,2000,2000,11000,0.911501976562158,NA 
rayol-farm2_2019-05-01_00-44-49.wav,44100,16,60,1,ndsi,1024,1000,2000,2000,11000,0.911628712839856,NA 
rayol-farm2_2019-05-01_00-46-50.wav,44100,16,60,1,ndsi,1024,1000,2000,2000,11000,0.909391747954744,NA 
rayol-farm2_2019-05-01_00-50-50.wav,44100,16,60,1,ndsi,1024,1000,2000,2000,11000,0.900636090274166,NA 
rayol-farm2_2019-05-01_00-52-50.wav,44100,16,60,1,ndsi,1024,1000,2000,2000,11000,0.90745426474516,NA 
rayol-farm2_2019-05-01_00-54-50.wav,44100,16,60,1,ndsi,1024,1000,2000,2000,11000,0.910711482495364,NA 
rayol-farm2_2019-05-01_00-56-50.wav,44100,16,60,1,ndsi,1024,1000,2000,2000,11000,0.911880018585422,NA 
rayol-farm2_2019-05-01_01-00-50.wav,44100,16,60,1,ndsi,1024,1000,2000,2000,11000,0.909521923122962,NA 
rayol-farm2_2019-05-01_01-02-51.wav,44100,16,60,1,ndsi,1024,1000,2000,2000,11000,0.910517589237949,NA 
rayol-farm2_2019-05-01_01-04-51.wav,44100,16,60,1,ndsi,1024,1000,2000,2000,11000,0.909741944221293,NA 
rayol-farm2_2019-05-01_01-06-51.wav,44100,16,60,1,ndsi,1024,1000,2000,2000,11000,0.91068724108571,NA 
rayol-farm2_2019-05-01_01-10-51.wav,44100,16,60,1,ndsi,1024,1000,2000,2000,11000,0.910098741028636,NA 
rayol-farm2_2019-05-01_01-12-51.wav,44100,16,60,1,ndsi,1024,1000,2000,2000,11000,0.911510467340631,NA 
rayol-farm2_2019-05-01_01-14-51.wav,44100,16,60,1,ndsi,1024,1000,2000,2000,11000,0.911714699467995,NA 
rayol-farm2_2019-05-01_01-16-51.wav,44100,16,60,1,ndsi,1024,1000,2000,2000,11000,0.910574728813376,NA 
rayol-farm2_2019-05-01_01-20-52.wav,44100,16,60,1,ndsi,1024,1000,2000,2000,11000,0.911201749984061,NA 
rayol-farm2_2019-05-01_01-24-52.wav,44100,16,60,1,ndsi,1024,1000,2000,2000,11000,0.909850740436673,NA 
rayol-farm2_2019-05-01_01-26-52.wav,44100,16,60,1,ndsi,1024,1000,2000,2000,11000,0.911332949773621,NA 
rayol-farm2_2019-05-01_01-28-52.wav,44100,16,60,1,ndsi,1024,1000,2000,2000,11000,0.906150134214285,NA 
rayol-farm2_2019-05-01_01-30-52.wav,44100,16,60,1,ndsi,1024,1000,2000,2000,11000,0.910003829144045,NA 
rayol-farm2_2019-05-01_01-34-53.wav,44100,16,60,1,ndsi,1024,1000,2000,2000,11000,0.912723130437865,NA 
rayol-farm2_2019-05-01_01-36-53.wav,44100,16,60,1,ndsi,1024,1000,2000,2000,11000,0.911153232623839,NA 
rayol-farm2_2019-05-01_01-38-53.wav,44100,16,60,1,ndsi,1024,1000,2000,2000,11000,0.910463704530683,NA 
rayol-farm2_2019-05-01_01-40-53.wav,44100,16,60,1,ndsi,1024,1000,2000,2000,11000,0.909881632118995,NA 
rayol-farm2_2019-05-01_01-42-53.wav,44100,16,60,1,ndsi,1024,1000,2000,2000,11000,0.910557936009497,NA 
rayol-farm2_2019-05-01_01-44-53.wav,44100,16,60,1,ndsi,1024,1000,2000,2000,11000,0.909269779414892,NA 
rayol-farm2_2019-05-01_01-46-53.wav,44100,16,60,1,ndsi,1024,1000,2000,2000,11000,0.909865764905581,NA 
rayol-farm2_2019-05-01_01-48-53.wav,44100,16,60,1,ndsi,1024,1000,2000,2000,11000,0.909304653025506,NA 
rayol-farm2_2019-05-01_01-50-54.wav,44100,16,60,1,ndsi,1024,1000,2000,2000,11000,0.910967239375119,NA 
rayol-farm2_2019-05-01_01-52-54.wav,44100,16,60,1,ndsi,1024,1000,2000,2000,11000,0.910119246086848,NA 
rayol-farm2_2019-05-01_01-54-54.wav,44100,16,60,1,ndsi,1024,1000,2000,2000,11000,0.912480061756513,NA 
rayol-farm2_2019-05-01_01-58-54.wav,44100,16,60,1,ndsi,1024,1000,2000,2000,11000,0.909978160832486,NA 
rayol-farm2_2019-05-01_02-02-54.wav,44100,16,60,1,ndsi,1024,1000,2000,2000,11000,0.911124961589814,NA 
rayol-farm2_2019-05-01_02-04-54.wav,44100,16,60,1,ndsi,1024,1000,2000,2000,11000,0.910890977030766,NA 
rayol-farm2_2019-05-01_02-06-54.wav,44100,16,60,1,ndsi,1024,1000,2000,2000,11000,0.910202769103311,NA 
rayol-farm2_2019-05-01_02-08-55.wav,44100,16,60,1,ndsi,1024,1000,2000,2000,11000,0.911092664053521,NA 
rayol-farm2_2019-05-01_02-12-55.wav,44100,16,60,1,ndsi,1024,1000,2000,2000,11000,0.908820594583874,NA 
rayol-farm2_2019-05-01_02-14-55.wav,44100,16,60,1,ndsi,1024,1000,2000,2000,11000,0.909760453315513,NA 
rayol-farm2_2019-05-01_02-16-55.wav,44100,16,60,1,ndsi,1024,1000,2000,2000,11000,0.9072404946535,NA 
rayol-farm2_2019-05-01_02-18-55.wav,44100,16,60,1,ndsi,1024,1000,2000,2000,11000,0.910145785901103,NA 
rayol-farm2_2019-05-01_02-22-55.wav,44100,16,60,1,ndsi,1024,1000,2000,2000,11000,0.910837577988257,NA 
rayol-farm2_2019-05-01_02-24-56.wav,44100,16,60,1,ndsi,1024,1000,2000,2000,11000,0.910283540691631,NA 
rayol-farm2_2019-05-01_02-26-56.wav,44100,16,60,1,ndsi,1024,1000,2000,2000,11000,0.911029290446192,NA 
rayol-farm2_2019-05-01_02-28-56.wav,44100,16,60,1,ndsi,1024,1000,2000,2000,11000,0.911236756418005,NA 
rayol-farm2_2019-05-01_02-32-56.wav,44100,16,60,1,ndsi,1024,1000,2000,2000,11000,0.911749622686502,NA 
rayol-farm2_2019-05-01_02-34-56.wav,44100,16,60,1,ndsi,1024,1000,2000,2000,11000,0.910659245573776,NA 
rayol-farm2_2019-05-01_02-38-56.wav,44100,16,60,1,ndsi,1024,1000,2000,2000,11000,0.909875655327239,NA 
rayol-farm2_2019-05-01_02-42-57.wav,44100,16,60,1,ndsi,1024,1000,2000,2000,11000,0.910595052150371,NA 
rayol-farm2_2019-05-01_02-44-57.wav,44100,16,60,1,ndsi,1024,1000,2000,2000,11000,0.912827973504844,NA 
rayol-farm2_2019-05-01_02-46-57.wav,44100,16,60,1,ndsi,1024,1000,2000,2000,11000,0.912890205218186,NA 
rayol-farm2_2019-05-01_02-48-57.wav,44100,16,60,1,ndsi,1024,1000,2000,2000,11000,0.912421728078003,NA 
rayol-farm2_2019-05-01_02-50-57.wav,44100,16,60,1,ndsi,1024,1000,2000,2000,11000,0.910843070181863,NA 
rayol-farm2_2019-05-01_02-52-57.wav,44100,16,60,1,ndsi,1024,1000,2000,2000,11000,0.913081517488987,NA 
rayol-farm2_2019-05-01_02-54-57.wav,44100,16,60,1,ndsi,1024,1000,2000,2000,11000,0.912636048087473,NA 
rayol-farm2_2019-05-01_02-56-58.wav,44100,16,60,1,ndsi,1024,1000,2000,2000,11000,0.91209788677518,NA 
rayol-farm2_2019-05-01_02-58-58.wav,44100,16,60,1,ndsi,1024,1000,2000,2000,11000,0.905284641389141,NA 
rayol-farm2_2019-05-01_03-00-58.wav,44100,16,60,1,ndsi,1024,1000,2000,2000,11000,0.911948608828751,NA 
rayol-farm2_2019-05-01_03-02-58.wav,44100,16,60,1,ndsi,1024,1000,2000,2000,11000,0.911976960495824,NA 
rayol-farm2_2019-05-01_03-04-58.wav,44100,16,60,1,ndsi,1024,1000,2000,2000,11000,0.912700366968401,NA 
rayol-farm2_2019-05-01_03-06-58.wav,44100,16,60,1,ndsi,1024,1000,2000,2000,11000,0.908655301639567,NA 
rayol-farm2_2019-05-01_03-10-58.wav,44100,16,60,1,ndsi,1024,1000,2000,2000,11000,0.910329893321889,NA 
rayol-farm2_2019-05-01_03-14-59.wav,44100,16,60,1,ndsi,1024,1000,2000,2000,11000,0.9095859617159,NA 
rayol-farm2_2019-05-01_03-16-59.wav,44100,16,60,1,ndsi,1024,1000,2000,2000,11000,0.912040943868565,NA 
rayol-farm2_2019-05-01_03-18-59.wav,44100,16,60,1,ndsi,1024,1000,2000,2000,11000,0.911626656676237,NA 
rayol-farm2_2019-05-01_03-20-59.wav,44100,16,60,1,ndsi,1024,1000,2000,2000,11000,0.903194099883077,NA 
rayol-farm2_2019-05-01_03-22-59.wav,44100,16,60,1,ndsi,1024,1000,2000,2000,11000,0.906327434342528,NA 
rayol-farm2_2019-05-01_03-24-59.wav,44100,16,60,1,ndsi,1024,1000,2000,2000,11000,0.90908255732378,NA 
rayol-farm2_2019-05-01_03-28-59.wav,44100,16,60,1,ndsi,1024,1000,2000,2000,11000,0.910445630448456,NA 
rayol-farm2_2019-05-01_03-31-00.wav,44100,16,60,1,ndsi,1024,1000,2000,2000,11000,0.918771251764695,NA 
rayol-farm2_2019-05-01_03-33-00.wav,44100,16,60,1,ndsi,1024,1000,2000,2000,11000,0.90957858724211,NA 
rayol-farm2_2019-05-01_03-35-00.wav,44100,16,60,1,ndsi,1024,1000,2000,2000,11000,0.910525370460314,NA 
rayol-farm2_2019-05-01_03-39-00.wav,44100,16,60,1,ndsi,1024,1000,2000,2000,11000,0.911157443000653,NA 
rayol-farm2_2019-05-01_03-41-00.wav,44100,16,60,1,ndsi,1024,1000,2000,2000,11000,0.909617196611839,NA 
rayol-farm2_2019-05-01_03-43-00.wav,44100,16,60,1,ndsi,1024,1000,2000,2000,11000,0.910546077651608,NA 
rayol-farm2_2019-05-01_03-47-01.wav,44100,16,60,1,ndsi,1024,1000,2000,2000,11000,0.90993458525682,NA 
rayol-farm2_2019-05-01_03-51-01.wav,44100,16,60,1,ndsi,1024,1000,2000,2000,11000,0.909995798403507,NA 
rayol-farm2_2019-05-01_03-53-01.wav,44100,16,60,1,ndsi,1024,1000,2000,2000,11000,0.907391454009787,NA 
rayol-farm2_2019-05-01_03-55-01.wav,44100,16,60,1,ndsi,1024,1000,2000,2000,11000,0.911034212469048,NA 
rayol-farm2_2019-05-01_03-59-01.wav,44100,16,60,1,ndsi,1024,1000,2000,2000,11000,0.909861815335379,NA 
rayol-farm2_2019-05-01_04-01-01.wav,44100,16,60,1,ndsi,1024,1000,2000,2000,11000,0.908535378966776,NA 
rayol-farm2_2019-05-01_04-03-02.wav,44100,16,60,1,ndsi,1024,1000,2000,2000,11000,0.912146543369213,NA 
rayol-farm2_2019-05-01_04-05-02.wav,44100,16,60,1,ndsi,1024,1000,2000,2000,11000,0.90984166908338,NA 
rayol-farm2_2019-05-01_04-07-02.wav,44100,16,60,1,ndsi,1024,1000,2000,2000,11000,0.909179989644073,NA 
rayol-farm2_2019-05-01_04-09-02.wav,44100,16,60,1,ndsi,1024,1000,2000,2000,11000,0.917175624979942,NA 
rayol-farm2_2019-05-01_04-11-02.wav,44100,16,60,1,ndsi,1024,1000,2000,2000,11000,0.913084242645549,NA 
rayol-farm2_2019-05-01_04-13-02.wav,44100,16,60,1,ndsi,1024,1000,2000,2000,11000,0.915926227581315,NA 
rayol-farm2_2019-05-01_04-15-02.wav,44100,16,60,1,ndsi,1024,1000,2000,2000,11000,0.910938835087858,NA 
rayol-farm2_2019-05-01_04-17-02.wav,44100,16,60,1,ndsi,1024,1000,2000,2000,11000,0.915080586631255,NA 
rayol-farm2_2019-05-01_04-19-03.wav,44100,16,60,1,ndsi,1024,1000,2000,2000,11000,0.913564500808072,NA 
rayol-farm2_2019-05-01_04-23-03.wav,44100,16,60,1,ndsi,1024,1000,2000,2000,11000,0.906025738212413,NA 
rayol-farm2_2019-05-01_04-27-03.wav,44100,16,60,1,ndsi,1024,1000,2000,2000,11000,0.909972468475733,NA 
rayol-farm2_2019-05-01_04-29-03.wav,44100,16,60,1,ndsi,1024,1000,2000,2000,11000,0.916017941560124,NA 
rayol-farm2_2019-05-01_04-33-03.wav,44100,16,60,1,ndsi,1024,1000,2000,2000,11000,0.917963802377501,NA 
rayol-farm2_2019-05-01_04-35-04.wav,44100,16,60,1,ndsi,1024,1000,2000,2000,11000,0.916206436320731,NA 
rayol-farm2_2019-05-01_04-37-04.wav,44100,16,60,1,ndsi,1024,1000,2000,2000,11000,0.922928990458986,NA 
rayol-farm2_2019-05-01_04-39-04.wav,44100,16,60,1,ndsi,1024,1000,2000,2000,11000,0.909156288558416,NA 
rayol-farm2_2019-05-01_04-41-04.wav,44100,16,60,1,ndsi,1024,1000,2000,2000,11000,0.917719988222579,NA 
rayol-farm2_2019-05-01_04-43-04.wav,44100,16,60,1,ndsi,1024,1000,2000,2000,11000,0.918122308981136,NA 
rayol-farm2_2019-05-01_04-45-04.wav,44100,16,60,1,ndsi,1024,1000,2000,2000,11000,0.91029710622436,NA 
rayol-farm2_2019-05-01_04-49-04.wav,44100,16,60,1,ndsi,1024,1000,2000,2000,11000,0.911239719769723,NA 
rayol-farm2_2019-05-01_04-51-04.wav,44100,16,60,1,ndsi,1024,1000,2000,2000,11000,0.913924163914468,NA 
rayol-farm2_2019-05-01_04-53-05.wav,44100,16,60,1,ndsi,1024,1000,2000,2000,11000,0.914016355582492,NA 
rayol-farm2_2019-05-01_04-57-05.wav,44100,16,60,1,ndsi,1024,1000,2000,2000,11000,0.911979840705489,NA 
rayol-farm2_2019-05-01_05-01-05.wav,44100,16,60,1,ndsi,1024,1000,2000,2000,11000,0.916626712151506,NA 
rayol-farm2_2019-05-01_05-03-05.wav,44100,16,60,1,ndsi,1024,1000,2000,2000,11000,0.911878121740057,NA 
rayol-farm2_2019-05-01_05-07-05.wav,44100,16,60,1,ndsi,1024,1000,2000,2000,11000,0.914063065451454,NA 
rayol-farm2_2019-05-01_05-09-06.wav,44100,16,60,1,ndsi,1024,1000,2000,2000,11000,0.908426557621931,NA 
rayol-farm2_2019-05-01_05-11-06.wav,44100,16,60,1,ndsi,1024,1000,2000,2000,11000,0.910010917646757,NA 
rayol-farm2_2019-05-01_05-13-06.wav,44100,16,60,1,ndsi,1024,1000,2000,2000,11000,0.908877967259878,NA 
rayol-farm2_2019-05-01_05-15-06.wav,44100,16,60,1,ndsi,1024,1000,2000,2000,11000,0.917026297839364,NA 
rayol-farm2_2019-05-01_05-17-06.wav,44100,16,60,1,ndsi,1024,1000,2000,2000,11000,0.915251333563732,NA 
rayol-farm2_2019-05-01_05-19-06.wav,44100,16,60,1,ndsi,1024,1000,2000,2000,11000,0.921545777271537,NA 
rayol-farm2_2019-05-01_05-21-06.wav,44100,16,60,1,ndsi,1024,1000,2000,2000,11000,0.920285135742326,NA 
rayol-farm2_2019-05-01_05-23-06.wav,44100,16,60,1,ndsi,1024,1000,2000,2000,11000,0.916594872075975,NA 
rayol-farm2_2019-05-01_05-25-07.wav,44100,16,60,1,ndsi,1024,1000,2000,2000,11000,0.893029303473161,NA 
rayol-farm2_2019-05-01_05-27-07.wav,44100,16,60,1,ndsi,1024,1000,2000,2000,11000,0.91101479369769,NA 
rayol-farm2_2019-05-01_05-29-07.wav,44100,16,60,1,ndsi,1024,1000,2000,2000,11000,0.919545432778691,NA 
rayol-farm2_2019-05-01_05-31-07.wav,44100,16,60,1,ndsi,1024,1000,2000,2000,11000,0.912461864765631,NA 
rayol-farm2_2019-05-01_05-37-07.wav,44100,16,60,1,ndsi,1024,1000,2000,2000,11000,0.919074149911674,NA 
rayol-farm2_2019-05-01_05-39-07.wav,44100,16,60,1,ndsi,1024,1000,2000,2000,11000,0.918708997343544,NA 
rayol-farm2_2019-05-01_05-41-08.wav,44100,16,60,1,ndsi,1024,1000,2000,2000,11000,0.908369874691512,NA 
rayol-farm2_2019-05-01_05-43-08.wav,44100,16,60,1,ndsi,1024,1000,2000,2000,11000,0.912533454633727,NA 
rayol-farm2_2019-05-01_05-49-08.wav,44100,16,60,1,ndsi,1024,1000,2000,2000,11000,0.913087920373864,NA 
rayol-farm2_2019-05-01_05-51-08.wav,44100,16,60,1,ndsi,1024,1000,2000,2000,11000,0.891803135242904,NA 
rayol-farm2_2019-05-01_05-53-08.wav,44100,16,60,1,ndsi,1024,1000,2000,2000,11000,0.904288872841409,NA 
rayol-farm2_2019-05-01_05-57-09.wav,44100,16,60,1,ndsi,1024,1000,2000,2000,11000,0.8929625308796,NA 
rayol-farm2_2019-05-01_05-59-09.wav,44100,16,60,1,ndsi,1024,1000,2000,2000,11000,0.913120901211104,NA 
rayol-farm2_2019-05-01_06-03-09.wav,44100,16,60,1,ndsi,1024,1000,2000,2000,11000,0.931764080294197,NA 
rayol-farm2_2019-05-01_06-05-09.wav,44100,16,60,1,ndsi,1024,1000,2000,2000,11000,0.927322840367172,NA 
rayol-farm2_2019-05-01_06-07-09.wav,44100,16,60,1,ndsi,1024,1000,2000,2000,11000,0.932317507941609,NA 
rayol-farm2_2019-05-01_06-09-09.wav,44100,16,60,1,ndsi,1024,1000,2000,2000,11000,0.803295859133683,NA 
rayol-farm2_2019-05-01_06-13-09.wav,44100,16,60,1,ndsi,1024,1000,2000,2000,11000,0.920070189909587,NA 
rayol-farm2_2019-05-01_06-17-10.wav,44100,16,60,1,ndsi,1024,1000,2000,2000,11000,0.947938998872431,NA 
rayol-farm2_2019-05-01_06-19-10.wav,44100,16,60,1,ndsi,1024,1000,2000,2000,11000,0.900305419449955,NA 
rayol-farm2_2019-05-01_06-21-10.wav,44100,16,60,1,ndsi,1024,1000,2000,2000,11000,0.917671402477307,NA 
rayol-farm2_2019-05-01_06-25-10.wav,44100,16,60,1,ndsi,1024,1000,2000,2000,11000,0.901030360280104,NA 
rayol-farm2_2019-05-01_06-27-10.wav,44100,16,60,1,ndsi,1024,1000,2000,2000,11000,-0.901980015345754,NA 
rayol-farm2_2019-05-01_06-29-10.wav,44100,16,60,1,ndsi,1024,1000,2000,2000,11000,-0.451227500234355,NA 
rayol-farm2_2019-05-01_06-31-11.wav,44100,16,60,1,ndsi,1024,1000,2000,2000,11000,-0.193621350953034,NA 
rayol-farm2_2019-05-01_06-33-11.wav,44100,16,60,1,ndsi,1024,1000,2000,2000,11000,0.904075468641672,NA 
rayol-farm2_2019-05-01_06-35-11.wav,44100,16,60,1,ndsi,1024,1000,2000,2000,11000,0.897991964403084,NA 
rayol-farm2_2019-05-01_06-37-11.wav,44100,16,60,1,ndsi,1024,1000,2000,2000,11000,0.922263256644923,NA 
rayol-farm2_2019-05-01_06-39-11.wav,44100,16,60,1,ndsi,1024,1000,2000,2000,11000,0.917452605697683,NA 
rayol-farm2_2019-05-01_06-41-11.wav,44100,16,60,1,ndsi,1024,1000,2000,2000,11000,0.912507912463949,NA 
rayol-farm2_2019-05-01_06-43-11.wav,44100,16,60,1,ndsi,1024,1000,2000,2000,11000,0.901925113864675,NA 
rayol-farm2_2019-05-01_06-45-11.wav,44100,16,60,1,ndsi,1024,1000,2000,2000,11000,0.900534427403013,NA 
rayol-farm2_2019-05-01_06-51-12.wav,44100,16,60,1,ndsi,1024,1000,2000,2000,11000,0.928728947757971,NA 
rayol-farm2_2019-05-01_06-53-12.wav,44100,16,60,1,ndsi,1024,1000,2000,2000,11000,0.935794163261456,NA 
rayol-farm2_2019-05-01_06-57-12.wav,44100,16,60,1,ndsi,1024,1000,2000,2000,11000,0.925031243317677,NA 
rayol-farm2_2019-05-01_06-59-12.wav,44100,16,60,1,ndsi,1024,1000,2000,2000,11000,0.895474309982124,NA 
rayol-farm2_2019-05-01_07-01-12.wav,44100,16,60,1,ndsi,1024,1000,2000,2000,11000,0.92666560309484,NA 
rayol-farm2_2019-05-01_07-05-13.wav,44100,16,60,1,ndsi,1024,1000,2000,2000,11000,0.0968769973108547,NA 
rayol-farm2_2019-05-01_07-07-16.wav,44100,16,60,1,ndsi,1024,1000,2000,2000,11000,0.899918560867068,NA 
rayol-farm2_2019-05-01_07-09-16.wav,44100,16,60,1,ndsi,1024,1000,2000,2000,11000,0.905569565395148,NA 
rayol-farm2_2019-05-01_07-13-16.wav,44100,16,60,1,ndsi,1024,1000,2000,2000,11000,0.908609428054444,NA 
rayol-farm2_2019-05-01_07-15-17.wav,44100,16,60,1,ndsi,1024,1000,2000,2000,11000,0.908759976512224,NA 
rayol-farm2_2019-05-01_07-17-17.wav,44100,16,60,1,ndsi,1024,1000,2000,2000,11000,0.893624325690836,NA 
rayol-farm2_2019-05-01_07-19-17.wav,44100,16,60,1,ndsi,1024,1000,2000,2000,11000,0.903214133005279,NA 
rayol-farm2_2019-05-01_07-21-17.wav,44100,16,60,1,ndsi,1024,1000,2000,2000,11000,0.898339278936419,NA 
rayol-farm2_2019-05-01_07-25-17.wav,44100,16,60,1,ndsi,1024,1000,2000,2000,11000,0.899744903959204,NA 
rayol-farm2_2019-05-01_07-27-17.wav,44100,16,60,1,ndsi,1024,1000,2000,2000,11000,0.881033410070969,NA 
rayol-farm2_2019-05-01_07-29-17.wav,44100,16,60,1,ndsi,1024,1000,2000,2000,11000,0.944781760417222,NA 
rayol-farm2_2019-05-01_07-31-17.wav,44100,16,60,1,ndsi,1024,1000,2000,2000,11000,0.91828623111921,NA 
rayol-farm2_2019-05-01_07-33-18.wav,44100,16,60,1,ndsi,1024,1000,2000,2000,11000,0.927215079262476,NA 
rayol-farm2_2019-05-01_07-35-18.wav,44100,16,60,1,ndsi,1024,1000,2000,2000,11000,0.917240846092991,NA 
rayol-farm2_2019-05-01_07-37-18.wav,44100,16,60,1,ndsi,1024,1000,2000,2000,11000,0.927639365716867,NA 
rayol-farm2_2019-05-01_07-39-18.wav,44100,16,60,1,ndsi,1024,1000,2000,2000,11000,0.913061818869584,NA 
rayol-farm2_2019-05-01_07-41-18.wav,44100,16,60,1,ndsi,1024,1000,2000,2000,11000,0.910045975360475,NA 
rayol-farm2_2019-05-01_07-43-18.wav,44100,16,60,1,ndsi,1024,1000,2000,2000,11000,0.881205814260005,NA 
rayol-farm2_2019-05-01_07-45-18.wav,44100,16,60,1,ndsi,1024,1000,2000,2000,11000,0.896581440276543,NA 
rayol-farm2_2019-05-01_07-47-18.wav,44100,16,60,1,ndsi,1024,1000,2000,2000,11000,0.449949373790057,NA 
rayol-farm2_2019-05-01_07-49-19.wav,44100,16,60,1,ndsi,1024,1000,2000,2000,11000,0.405007400582782,NA 
rayol-farm2_2019-05-01_07-51-19.wav,44100,16,60,1,ndsi,1024,1000,2000,2000,11000,0.372567038400703,NA 
rayol-farm2_2019-05-01_07-53-19.wav,44100,16,60,1,ndsi,1024,1000,2000,2000,11000,0.637331371959032,NA 
rayol-farm2_2019-05-01_07-55-19.wav,44100,16,60,1,ndsi,1024,1000,2000,2000,11000,0.904148133270388,NA 
rayol-farm2_2019-05-01_07-57-19.wav,44100,16,60,1,ndsi,1024,1000,2000,2000,11000,0.882772003898873,NA 
rayol-farm2_2019-05-01_07-59-19.wav,44100,16,60,1,ndsi,1024,1000,2000,2000,11000,0.890058072936104,NA 
rayol-farm2_2019-05-01_08-01-19.wav,44100,16,60,1,ndsi,1024,1000,2000,2000,11000,0.877042286994956,NA 
rayol-farm2_2019-05-01_08-03-19.wav,44100,16,60,1,ndsi,1024,1000,2000,2000,11000,0.876070053963495,NA 
rayol-farm2_2019-05-01_08-05-20.wav,44100,16,60,1,ndsi,1024,1000,2000,2000,11000,0.926170505523303,NA 
rayol-farm2_2019-05-01_08-09-20.wav,44100,16,60,1,ndsi,1024,1000,2000,2000,11000,0.836878752938583,NA 
rayol-farm2_2019-05-01_08-13-20.wav,44100,16,60,1,ndsi,1024,1000,2000,2000,11000,0.888606996028633,NA 
rayol-farm2_2019-05-01_08-15-20.wav,44100,16,60,1,ndsi,1024,1000,2000,2000,11000,0.872029977627691,NA 
rayol-farm2_2019-05-01_08-17-20.wav,44100,16,60,1,ndsi,1024,1000,2000,2000,11000,0.894300033844353,NA 
rayol-farm2_2019-05-01_08-19-20.wav,44100,16,60,1,ndsi,1024,1000,2000,2000,11000,0.366240953924585,NA 
rayol-farm2_2019-05-01_08-21-21.wav,44100,16,60,1,ndsi,1024,1000,2000,2000,11000,0.749700677558803,NA 
rayol-farm2_2019-05-01_08-23-21.wav,44100,16,60,1,ndsi,1024,1000,2000,2000,11000,0.903448204185623,NA 
rayol-farm2_2019-05-01_08-25-21.wav,44100,16,60,1,ndsi,1024,1000,2000,2000,11000,0.931085981324896,NA 
rayol-farm2_2019-05-01_08-27-21.wav,44100,16,60,1,ndsi,1024,1000,2000,2000,11000,0.886947145248525,NA 
rayol-farm2_2019-05-01_08-29-21.wav,44100,16,60,1,ndsi,1024,1000,2000,2000,11000,0.93508838395019,NA 
rayol-farm2_2019-05-01_08-31-21.wav,44100,16,60,1,ndsi,1024,1000,2000,2000,11000,0.891238125377744,NA 
rayol-farm2_2019-05-01_08-33-21.wav,44100,16,60,1,ndsi,1024,1000,2000,2000,11000,0.92778835477016,NA 
rayol-farm2_2019-05-01_08-35-21.wav,44100,16,60,1,ndsi,1024,1000,2000,2000,11000,0.898574256628445,NA 
rayol-farm2_2019-05-01_08-37-22.wav,44100,16,60,1,ndsi,1024,1000,2000,2000,11000,0.441945741402951,NA 
rayol-farm2_2019-05-01_08-39-22.wav,44100,16,60,1,ndsi,1024,1000,2000,2000,11000,0.908346915977136,NA 
rayol-farm2_2019-05-01_08-41-22.wav,44100,16,60,1,ndsi,1024,1000,2000,2000,11000,0.918171392754116,NA 
rayol-farm2_2019-05-01_08-43-22.wav,44100,16,60,1,ndsi,1024,1000,2000,2000,11000,0.909314605859095,NA 
rayol-farm2_2019-05-01_08-45-22.wav,44100,16,60,1,ndsi,1024,1000,2000,2000,11000,0.753133898875901,NA 
rayol-farm2_2019-05-01_08-47-22.wav,44100,16,60,1,ndsi,1024,1000,2000,2000,11000,0.920596546836657,NA 
rayol-farm2_2019-05-01_08-49-22.wav,44100,16,60,1,ndsi,1024,1000,2000,2000,11000,0.942189398425928,NA 
rayol-farm2_2019-05-01_08-51-22.wav,44100,16,60,1,ndsi,1024,1000,2000,2000,11000,0.887290393675069,NA 
rayol-farm2_2019-05-01_08-53-23.wav,44100,16,60,1,ndsi,1024,1000,2000,2000,11000,0.927754482556923,NA 
rayol-farm2_2019-05-01_08-55-23.wav,44100,16,60,1,ndsi,1024,1000,2000,2000,11000,0.92899105320266,NA 
rayol-farm2_2019-05-01_08-57-23.wav,44100,16,60,1,ndsi,1024,1000,2000,2000,11000,0.923207747350055,NA 
rayol-farm2_2019-05-01_08-59-23.wav,44100,16,60,1,ndsi,1024,1000,2000,2000,11000,0.932452381683978,NA 
rayol-farm2_2019-05-01_09-01-27.wav,44100,16,60,1,ndsi,1024,1000,2000,2000,11000,0.930259806034489,NA 
rayol-farm2_2019-05-01_09-03-27.wav,44100,16,60,1,ndsi,1024,1000,2000,2000,11000,0.912262225225643,NA 
rayol-farm2_2019-05-01_09-05-27.wav,44100,16,60,1,ndsi,1024,1000,2000,2000,11000,0.931875076869595,NA 
rayol-farm2_2019-05-01_09-07-27.wav,44100,16,60,1,ndsi,1024,1000,2000,2000,11000,0.932519339561212,NA 
rayol-farm2_2019-05-01_09-09-27.wav,44100,16,60,1,ndsi,1024,1000,2000,2000,11000,0.930329343503513,NA 
rayol-farm2_2019-05-01_09-11-27.wav,44100,16,60,1,ndsi,1024,1000,2000,2000,11000,0.936790330117404,NA 
rayol-farm2_2019-05-01_09-13-28.wav,44100,16,60,1,ndsi,1024,1000,2000,2000,11000,0.923923792065932,NA 
rayol-farm2_2019-05-01_09-15-28.wav,44100,16,60,1,ndsi,1024,1000,2000,2000,11000,0.414865340400955,NA 
rayol-farm2_2019-05-01_09-17-28.wav,44100,16,60,1,ndsi,1024,1000,2000,2000,11000,0.390193820483261,NA 
rayol-farm2_2019-05-01_09-19-28.wav,44100,16,60,1,ndsi,1024,1000,2000,2000,11000,0.25119676176468,NA 
rayol-farm2_2019-05-01_09-21-28.wav,44100,16,60,1,ndsi,1024,1000,2000,2000,11000,0.897174821470191,NA 
rayol-farm2_2019-05-01_09-23-28.wav,44100,16,60,1,ndsi,1024,1000,2000,2000,11000,0.886365717782437,NA 
rayol-farm2_2019-05-01_09-25-28.wav,44100,16,60,1,ndsi,1024,1000,2000,2000,11000,0.924564215781649,NA 
rayol-farm2_2019-05-01_09-27-28.wav,44100,16,60,1,ndsi,1024,1000,2000,2000,11000,0.942949845516191,NA 
rayol-farm2_2019-05-01_09-29-29.wav,44100,16,60,1,ndsi,1024,1000,2000,2000,11000,0.936922121333721,NA 
rayol-farm2_2019-05-01_09-31-29.wav,44100,16,60,1,ndsi,1024,1000,2000,2000,11000,0.941173552146708,NA 
rayol-farm2_2019-05-01_09-33-29.wav,44100,16,60,1,ndsi,1024,1000,2000,2000,11000,0.938547973136479,NA 
rayol-farm2_2019-05-01_09-35-29.wav,44100,16,60,1,ndsi,1024,1000,2000,2000,11000,0.942172514032791,NA 
rayol-farm2_2019-05-01_09-37-29.wav,44100,16,60,1,ndsi,1024,1000,2000,2000,11000,0.871030936216537,NA 
rayol-farm2_2019-05-01_09-39-29.wav,44100,16,60,1,ndsi,1024,1000,2000,2000,11000,0.790398980273923,NA 
rayol-farm2_2019-05-01_09-41-29.wav,44100,16,60,1,ndsi,1024,1000,2000,2000,11000,0.871913865135414,NA 
rayol-farm2_2019-05-01_09-43-29.wav,44100,16,60,1,ndsi,1024,1000,2000,2000,11000,0.703231676069728,NA 
rayol-farm2_2019-05-01_09-45-30.wav,44100,16,60,1,ndsi,1024,1000,2000,2000,11000,0.921822132843015,NA 
rayol-farm2_2019-05-01_09-47-30.wav,44100,16,60,1,ndsi,1024,1000,2000,2000,11000,0.931470766206919,NA 
rayol-farm2_2019-05-01_09-49-30.wav,44100,16,60,1,ndsi,1024,1000,2000,2000,11000,0.889245945804101,NA 
rayol-farm2_2019-05-01_09-51-30.wav,44100,16,60,1,ndsi,1024,1000,2000,2000,11000,0.921434204286607,NA 
rayol-farm2_2019-05-01_09-53-30.wav,44100,16,60,1,ndsi,1024,1000,2000,2000,11000,0.848712958783699,NA 
rayol-farm2_2019-05-01_09-55-30.wav,44100,16,60,1,ndsi,1024,1000,2000,2000,11000,0.935275091203338,NA 
rayol-farm2_2019-05-01_09-57-30.wav,44100,16,60,1,ndsi,1024,1000,2000,2000,11000,0.936321998053053,NA 
rayol-farm2_2019-05-01_09-59-30.wav,44100,16,60,1,ndsi,1024,1000,2000,2000,11000,0.933996496205385,NA 
rayol-farm2_2019-05-01_10-01-31.wav,44100,16,60,1,ndsi,1024,1000,2000,2000,11000,0.926895499424278,NA 
rayol-farm2_2019-05-01_10-03-31.wav,44100,16,60,1,ndsi,1024,1000,2000,2000,11000,0.699454128201423,NA 
rayol-farm2_2019-05-01_10-05-31.wav,44100,16,60,1,ndsi,1024,1000,2000,2000,11000,0.899720146886002,NA 
rayol-farm2_2019-05-01_10-07-31.wav,44100,16,60,1,ndsi,1024,1000,2000,2000,11000,0.748827242814301,NA 
rayol-farm2_2019-05-01_10-09-31.wav,44100,16,60,1,ndsi,1024,1000,2000,2000,11000,0.878566782775822,NA 
rayol-farm2_2019-05-01_10-11-31.wav,44100,16,60,1,ndsi,1024,1000,2000,2000,11000,0.811524271956721,NA 
rayol-farm2_2019-05-01_10-13-31.wav,44100,16,60,1,ndsi,1024,1000,2000,2000,11000,0.893305612864901,NA 
rayol-farm2_2019-05-01_10-15-31.wav,44100,16,60,1,ndsi,1024,1000,2000,2000,11000,0.880509693171747,NA 
rayol-farm2_2019-05-01_10-17-31.wav,44100,16,60,1,ndsi,1024,1000,2000,2000,11000,0.850775151329047,NA 
rayol-farm2_2019-05-01_10-19-32.wav,44100,16,60,1,ndsi,1024,1000,2000,2000,11000,0.581865094591884,NA 
rayol-farm2_2019-05-01_10-21-32.wav,44100,16,60,1,ndsi,1024,1000,2000,2000,11000,0.874804448774305,NA 
rayol-farm2_2019-05-01_10-23-32.wav,44100,16,60,1,ndsi,1024,1000,2000,2000,11000,0.888616662614532,NA 
rayol-farm2_2019-05-01_10-25-32.wav,44100,16,60,1,ndsi,1024,1000,2000,2000,11000,0.760263757766375,NA 
rayol-farm2_2019-05-01_10-27-32.wav,44100,16,60,1,ndsi,1024,1000,2000,2000,11000,0.860956768802414,NA 
rayol-farm2_2019-05-01_10-29-32.wav,44100,16,60,1,ndsi,1024,1000,2000,2000,11000,0.844882467660074,NA 
rayol-farm2_2019-05-01_10-31-32.wav,44100,16,60,1,ndsi,1024,1000,2000,2000,11000,0.881278067531312,NA 
rayol-farm2_2019-05-01_10-33-32.wav,44100,16,60,1,ndsi,1024,1000,2000,2000,11000,0.877204916290791,NA 
rayol-farm2_2019-05-01_10-37-33.wav,44100,16,60,1,ndsi,1024,1000,2000,2000,11000,0.604315321422958,NA 
rayol-farm2_2019-05-01_10-39-33.wav,44100,16,60,1,ndsi,1024,1000,2000,2000,11000,0.48052213999607,NA 
rayol-farm2_2019-05-01_10-41-33.wav,44100,16,60,1,ndsi,1024,1000,2000,2000,11000,0.838604978584254,NA 
rayol-farm2_2019-05-01_10-43-33.wav,44100,16,60,1,ndsi,1024,1000,2000,2000,11000,0.863368650179383,NA 
rayol-farm2_2019-05-01_10-45-33.wav,44100,16,60,1,ndsi,1024,1000,2000,2000,11000,0.844104160790366,NA 
rayol-farm2_2019-05-01_10-47-33.wav,44100,16,60,1,ndsi,1024,1000,2000,2000,11000,0.59084303844597,NA 
rayol-farm2_2019-05-01_10-49-33.wav,44100,16,60,1,ndsi,1024,1000,2000,2000,11000,0.545562603626706,NA 
rayol-farm2_2019-05-01_10-51-34.wav,44100,16,60,1,ndsi,1024,1000,2000,2000,11000,0.678978871878435,NA 
rayol-farm2_2019-05-01_10-55-34.wav,44100,16,60,1,ndsi,1024,1000,2000,2000,11000,0.921894657062418,NA 
rayol-farm2_2019-05-01_10-57-34.wav,44100,16,60,1,ndsi,1024,1000,2000,2000,11000,0.73259414423073,NA 
rayol-farm2_2019-05-01_10-59-34.wav,44100,16,60,1,ndsi,1024,1000,2000,2000,11000,0.903869150283755,NA 
rayol-farm2_2019-05-01_11-01-34.wav,44100,16,60,1,ndsi,1024,1000,2000,2000,11000,0.471519512021417,NA 
rayol-farm2_2019-05-01_11-03-34.wav,44100,16,60,1,ndsi,1024,1000,2000,2000,11000,0.495103444437363,NA 
rayol-farm2_2019-05-01_11-05-34.wav,44100,16,60,1,ndsi,1024,1000,2000,2000,11000,0.871030383764708,NA 
rayol-farm2_2019-05-01_11-07-35.wav,44100,16,60,1,ndsi,1024,1000,2000,2000,11000,0.904214592832407,NA 
rayol-farm2_2019-05-01_11-09-35.wav,44100,16,60,1,ndsi,1024,1000,2000,2000,11000,0.924295442887366,NA 
rayol-farm2_2019-05-01_11-11-35.wav,44100,16,60,1,ndsi,1024,1000,2000,2000,11000,0.527361090161823,NA 
rayol-farm2_2019-05-01_11-13-35.wav,44100,16,60,1,ndsi,1024,1000,2000,2000,11000,0.698128963972042,NA 
rayol-farm2_2019-05-01_11-15-35.wav,44100,16,60,1,ndsi,1024,1000,2000,2000,11000,0.813963743373386,NA 
rayol-farm2_2019-05-01_11-17-35.wav,44100,16,60,1,ndsi,1024,1000,2000,2000,11000,0.61810202301476,NA 
rayol-farm2_2019-05-01_11-19-35.wav,44100,16,60,1,ndsi,1024,1000,2000,2000,11000,0.901492833691353,NA 
rayol-farm2_2019-05-01_11-21-35.wav,44100,16,60,1,ndsi,1024,1000,2000,2000,11000,0.764036481485254,NA 
rayol-farm2_2019-05-01_11-23-36.wav,44100,16,60,1,ndsi,1024,1000,2000,2000,11000,0.840768616847769,NA 
rayol-farm2_2019-05-01_11-25-36.wav,44100,16,60,1,ndsi,1024,1000,2000,2000,11000,0.867272174148589,NA 
rayol-farm2_2019-05-01_11-27-36.wav,44100,16,60,1,ndsi,1024,1000,2000,2000,11000,0.928549003405789,NA 
rayol-farm2_2019-05-01_11-29-36.wav,44100,16,60,1,ndsi,1024,1000,2000,2000,11000,0.922385416869601,NA 
rayol-farm2_2019-05-01_11-31-36.wav,44100,16,60,1,ndsi,1024,1000,2000,2000,11000,0.936296637084432,NA 
rayol-farm2_2019-05-01_11-33-36.wav,44100,16,60,1,ndsi,1024,1000,2000,2000,11000,0.873574710437387,NA 
rayol-farm2_2019-05-01_11-35-36.wav,44100,16,60,1,ndsi,1024,1000,2000,2000,11000,0.855641505168186,NA 
rayol-farm2_2019-05-01_11-37-36.wav,44100,16,60,1,ndsi,1024,1000,2000,2000,11000,0.886770750353314,NA 
rayol-farm2_2019-05-01_11-39-36.wav,44100,16,60,1,ndsi,1024,1000,2000,2000,11000,0.648747154549596,NA 
rayol-farm2_2019-05-01_11-41-37.wav,44100,16,60,1,ndsi,1024,1000,2000,2000,11000,0.932559066714178,NA 
rayol-farm2_2019-05-01_11-43-37.wav,44100,16,60,1,ndsi,1024,1000,2000,2000,11000,0.884425186410484,NA 
rayol-farm2_2019-05-01_11-45-37.wav,44100,16,60,1,ndsi,1024,1000,2000,2000,11000,0.913809707268896,NA 
rayol-farm2_2019-05-01_11-47-37.wav,44100,16,60,1,ndsi,1024,1000,2000,2000,11000,0.885722498487675,NA 
rayol-farm2_2019-05-01_11-49-37.wav,44100,16,60,1,ndsi,1024,1000,2000,2000,11000,0.901076436404967,NA 
rayol-farm2_2019-05-01_11-51-37.wav,44100,16,60,1,ndsi,1024,1000,2000,2000,11000,0.875616933209173,NA 
rayol-farm2_2019-05-01_11-53-37.wav,44100,16,60,1,ndsi,1024,1000,2000,2000,11000,0.865767972795268,NA 
rayol-farm2_2019-05-01_11-55-37.wav,44100,16,60,1,ndsi,1024,1000,2000,2000,11000,0.879870975011477,NA 
rayol-farm2_2019-05-01_11-57-38.wav,44100,16,60,1,ndsi,1024,1000,2000,2000,11000,0.726616849251278,NA 
rayol-farm2_2019-05-01_11-59-38.wav,44100,16,60,1,ndsi,1024,1000,2000,2000,11000,0.873844930630999,NA 
rayol-farm2_2019-05-01_12-01-38.wav,44100,16,60,1,ndsi,1024,1000,2000,2000,11000,0.881141468793175,NA 
rayol-farm2_2019-05-01_12-03-38.wav,44100,16,60,1,ndsi,1024,1000,2000,2000,11000,0.886463435795344,NA 
rayol-farm2_2019-05-01_12-05-38.wav,44100,16,60,1,ndsi,1024,1000,2000,2000,11000,0.885619069608919,NA 
rayol-farm2_2019-05-01_12-07-38.wav,44100,16,60,1,ndsi,1024,1000,2000,2000,11000,0.930718913744014,NA 
rayol-farm2_2019-05-01_12-09-38.wav,44100,16,60,1,ndsi,1024,1000,2000,2000,11000,0.755651911962939,NA 
rayol-farm2_2019-05-01_12-11-38.wav,44100,16,60,1,ndsi,1024,1000,2000,2000,11000,0.888581578284915,NA 
rayol-farm2_2019-05-01_12-13-39.wav,44100,16,60,1,ndsi,1024,1000,2000,2000,11000,0.886173406634907,NA 
rayol-farm2_2019-05-01_12-15-39.wav,44100,16,60,1,ndsi,1024,1000,2000,2000,11000,0.89296015674723,NA 
rayol-farm2_2019-05-01_12-17-39.wav,44100,16,60,1,ndsi,1024,1000,2000,2000,11000,0.845348916309003,NA 
rayol-farm2_2019-05-01_12-19-39.wav,44100,16,60,1,ndsi,1024,1000,2000,2000,11000,0.705072818855109,NA 
rayol-farm2_2019-05-01_12-21-39.wav,44100,16,60,1,ndsi,1024,1000,2000,2000,11000,0.840456368059882,NA 
rayol-farm2_2019-05-01_12-23-39.wav,44100,16,60,1,ndsi,1024,1000,2000,2000,11000,0.825122524194659,NA 
rayol-farm2_2019-05-01_12-25-39.wav,44100,16,60,1,ndsi,1024,1000,2000,2000,11000,0.74663926825159,NA 
rayol-farm2_2019-05-01_12-27-39.wav,44100,16,60,1,ndsi,1024,1000,2000,2000,11000,0.87766336406618,NA 
rayol-farm2_2019-05-01_12-29-40.wav,44100,16,60,1,ndsi,1024,1000,2000,2000,11000,0.875167704343381,NA 
rayol-farm2_2019-05-01_12-31-40.wav,44100,16,60,1,ndsi,1024,1000,2000,2000,11000,0.744878147462939,NA 
rayol-farm2_2019-05-01_12-33-40.wav,44100,16,60,1,ndsi,1024,1000,2000,2000,11000,0.811971242127602,NA 
rayol-farm2_2019-05-01_12-35-40.wav,44100,16,60,1,ndsi,1024,1000,2000,2000,11000,0.703711144375863,NA 
rayol-farm2_2019-05-01_12-37-40.wav,44100,16,60,1,ndsi,1024,1000,2000,2000,11000,0.741473589808624,NA 
rayol-farm2_2019-05-01_12-39-40.wav,44100,16,60,1,ndsi,1024,1000,2000,2000,11000,0.766280334968712,NA 
rayol-farm2_2019-05-01_12-41-40.wav,44100,16,60,1,ndsi,1024,1000,2000,2000,11000,0.82418496547097,NA 
rayol-farm2_2019-05-01_12-43-40.wav,44100,16,60,1,ndsi,1024,1000,2000,2000,11000,0.691627820663873,NA 
rayol-farm2_2019-05-01_12-45-41.wav,44100,16,60,1,ndsi,1024,1000,2000,2000,11000,0.752133246731483,NA 
rayol-farm2_2019-05-01_12-47-41.wav,44100,16,60,1,ndsi,1024,1000,2000,2000,11000,0.713179353814906,NA 
rayol-farm2_2019-05-01_12-49-41.wav,44100,16,60,1,ndsi,1024,1000,2000,2000,11000,0.782537372949294,NA 
rayol-farm2_2019-05-01_12-51-41.wav,44100,16,60,1,ndsi,1024,1000,2000,2000,11000,0.868450024748424,NA 
rayol-farm2_2019-05-01_12-53-45.wav,44100,16,60,1,ndsi,1024,1000,2000,2000,11000,0.663992359786679,NA 
rayol-farm2_2019-05-01_12-55-45.wav,44100,16,60,1,ndsi,1024,1000,2000,2000,11000,0.777171582033774,NA 
rayol-farm2_2019-05-01_12-57-45.wav,44100,16,60,1,ndsi,1024,1000,2000,2000,11000,0.817457530525193,NA 
rayol-farm2_2019-05-01_12-59-45.wav,44100,16,60,1,ndsi,1024,1000,2000,2000,11000,0.849272378983206,NA 
rayol-farm2_2019-05-01_13-01-45.wav,44100,16,60,1,ndsi,1024,1000,2000,2000,11000,0.834823329479588,NA 
rayol-farm2_2019-05-01_13-03-45.wav,44100,16,60,1,ndsi,1024,1000,2000,2000,11000,0.651962783084001,NA 
rayol-farm2_2019-05-01_13-05-46.wav,44100,16,60,1,ndsi,1024,1000,2000,2000,11000,0.865770157385821,NA 
rayol-farm2_2019-05-01_13-07-46.wav,44100,16,60,1,ndsi,1024,1000,2000,2000,11000,0.581956106865041,NA 
rayol-farm2_2019-05-01_13-09-46.wav,44100,16,60,1,ndsi,1024,1000,2000,2000,11000,0.753753115036666,NA 
rayol-farm2_2019-05-01_13-11-46.wav,44100,16,60,1,ndsi,1024,1000,2000,2000,11000,0.851667423070654,NA 
rayol-farm2_2019-05-01_13-13-46.wav,44100,16,60,1,ndsi,1024,1000,2000,2000,11000,0.839593225735408,NA 
rayol-farm2_2019-05-01_13-15-46.wav,44100,16,60,1,ndsi,1024,1000,2000,2000,11000,0.841025006090751,NA 
rayol-farm2_2019-05-01_13-17-46.wav,44100,16,60,1,ndsi,1024,1000,2000,2000,11000,0.826133175516848,NA 
rayol-farm2_2019-05-01_13-19-46.wav,44100,16,60,1,ndsi,1024,1000,2000,2000,11000,0.621009837975335,NA 
rayol-farm2_2019-05-01_13-21-47.wav,44100,16,60,1,ndsi,1024,1000,2000,2000,11000,0.875524543786334,NA 
rayol-farm2_2019-05-01_13-23-47.wav,44100,16,60,1,ndsi,1024,1000,2000,2000,11000,0.78290784538612,NA 
rayol-farm2_2019-05-01_13-25-47.wav,44100,16,60,1,ndsi,1024,1000,2000,2000,11000,0.679877131382752,NA 
rayol-farm2_2019-05-01_13-27-47.wav,44100,16,60,1,ndsi,1024,1000,2000,2000,11000,0.455074006447194,NA 
rayol-farm2_2019-05-01_13-29-47.wav,44100,16,60,1,ndsi,1024,1000,2000,2000,11000,0.630507770815677,NA 
rayol-farm2_2019-05-01_13-31-47.wav,44100,16,60,1,ndsi,1024,1000,2000,2000,11000,0.521234683956642,NA 
rayol-farm2_2019-05-01_13-33-47.wav,44100,16,60,1,ndsi,1024,1000,2000,2000,11000,0.532538886971601,NA 
rayol-farm2_2019-05-01_13-35-47.wav,44100,16,60,1,ndsi,1024,1000,2000,2000,11000,0.709438125277513,NA 
rayol-farm2_2019-05-01_13-37-48.wav,44100,16,60,1,ndsi,1024,1000,2000,2000,11000,0.808612566360915,NA 
rayol-farm2_2019-05-01_13-39-48.wav,44100,16,60,1,ndsi,1024,1000,2000,2000,11000,0.695494731156607,NA 
rayol-farm2_2019-05-01_13-41-48.wav,44100,16,60,1,ndsi,1024,1000,2000,2000,11000,0.681226512466288,NA 
rayol-farm2_2019-05-01_13-43-48.wav,44100,16,60,1,ndsi,1024,1000,2000,2000,11000,0.739644630520856,NA 
rayol-farm2_2019-05-01_13-45-48.wav,44100,16,60,1,ndsi,1024,1000,2000,2000,11000,0.478392518440205,NA 
rayol-farm2_2019-05-01_13-47-48.wav,44100,16,60,1,ndsi,1024,1000,2000,2000,11000,0.702691362157914,NA 
rayol-farm2_2019-05-01_13-49-48.wav,44100,16,60,1,ndsi,1024,1000,2000,2000,11000,0.755708103475934,NA 
rayol-farm2_2019-05-01_13-51-48.wav,44100,16,60,1,ndsi,1024,1000,2000,2000,11000,0.596890917504373,NA 
rayol-farm2_2019-05-01_13-53-49.wav,44100,16,60,1,ndsi,1024,1000,2000,2000,11000,0.619742601837331,NA 
rayol-farm2_2019-05-01_13-55-49.wav,44100,16,60,1,ndsi,1024,1000,2000,2000,11000,0.77380951416488,NA 
rayol-farm2_2019-05-01_13-57-49.wav,44100,16,60,1,ndsi,1024,1000,2000,2000,11000,0.795608383870544,NA 
rayol-farm2_2019-05-01_13-59-49.wav,44100,16,60,1,ndsi,1024,1000,2000,2000,11000,0.76615571822714,NA 
rayol-farm2_2019-05-01_14-01-49.wav,44100,16,60,1,ndsi,1024,1000,2000,2000,11000,0.793518119899598,NA 
rayol-farm2_2019-05-01_14-03-49.wav,44100,16,60,1,ndsi,1024,1000,2000,2000,11000,0.824890775865242,NA 
rayol-farm2_2019-05-01_14-05-49.wav,44100,16,60,1,ndsi,1024,1000,2000,2000,11000,0.746482792291642,NA 
rayol-farm2_2019-05-01_14-07-49.wav,44100,16,60,1,ndsi,1024,1000,2000,2000,11000,0.835806835453691,NA 
rayol-farm2_2019-05-01_14-09-49.wav,44100,16,60,1,ndsi,1024,1000,2000,2000,11000,0.725146395686193,NA 
rayol-farm2_2019-05-01_14-11-50.wav,44100,16,60,1,ndsi,1024,1000,2000,2000,11000,0.809710382744613,NA 
rayol-farm2_2019-05-01_14-13-50.wav,44100,16,60,1,ndsi,1024,1000,2000,2000,11000,0.691330246795769,NA 
rayol-farm2_2019-05-01_14-15-50.wav,44100,16,60,1,ndsi,1024,1000,2000,2000,11000,0.441474196916849,NA 
rayol-farm2_2019-05-01_14-17-50.wav,44100,16,60,1,ndsi,1024,1000,2000,2000,11000,0.35835623288537,NA 
rayol-farm2_2019-05-01_14-19-50.wav,44100,16,60,1,ndsi,1024,1000,2000,2000,11000,0.428895081306189,NA 
rayol-farm2_2019-05-01_14-21-50.wav,44100,16,60,1,ndsi,1024,1000,2000,2000,11000,0.312155456918057,NA 
rayol-farm2_2019-05-01_14-23-50.wav,44100,16,60,1,ndsi,1024,1000,2000,2000,11000,0.633745408159181,NA 
rayol-farm2_2019-05-01_14-25-50.wav,44100,16,60,1,ndsi,1024,1000,2000,2000,11000,0.545896492964152,NA 
rayol-farm2_2019-05-01_14-27-51.wav,44100,16,60,1,ndsi,1024,1000,2000,2000,11000,0.773562550697334,NA 
rayol-farm2_2019-05-01_14-29-51.wav,44100,16,60,1,ndsi,1024,1000,2000,2000,11000,0.783343995713192,NA 
rayol-farm2_2019-05-01_14-31-51.wav,44100,16,60,1,ndsi,1024,1000,2000,2000,11000,0.824854082827849,NA 
rayol-farm2_2019-05-01_14-33-51.wav,44100,16,60,1,ndsi,1024,1000,2000,2000,11000,0.826342952632447,NA 
rayol-farm2_2019-05-01_14-35-51.wav,44100,16,60,1,ndsi,1024,1000,2000,2000,11000,0.724365481648291,NA 
rayol-farm2_2019-05-01_14-37-51.wav,44100,16,60,1,ndsi,1024,1000,2000,2000,11000,0.881988002331352,NA 
rayol-farm2_2019-05-01_14-39-51.wav,44100,16,60,1,ndsi,1024,1000,2000,2000,11000,0.849279099050468,NA 
rayol-farm2_2019-05-01_14-41-51.wav,44100,16,60,1,ndsi,1024,1000,2000,2000,11000,0.831989192698795,NA 
rayol-farm2_2019-05-01_14-43-52.wav,44100,16,60,1,ndsi,1024,1000,2000,2000,11000,0.819703148083197,NA 
rayol-farm2_2019-05-01_14-45-52.wav,44100,16,60,1,ndsi,1024,1000,2000,2000,11000,0.913891800969986,NA 
rayol-farm2_2019-05-01_14-47-52.wav,44100,16,60,1,ndsi,1024,1000,2000,2000,11000,0.821717750112896,NA 
rayol-farm2_2019-05-01_14-49-52.wav,44100,16,60,1,ndsi,1024,1000,2000,2000,11000,0.829039350312653,NA 
rayol-farm2_2019-05-01_14-51-52.wav,44100,16,60,1,ndsi,1024,1000,2000,2000,11000,0.481679536200806,NA 
rayol-farm2_2019-05-01_14-53-52.wav,44100,16,60,1,ndsi,1024,1000,2000,2000,11000,0.807730351695841,NA 
rayol-farm2_2019-05-01_14-55-52.wav,44100,16,60,1,ndsi,1024,1000,2000,2000,11000,0.84895696190095,NA 
rayol-farm2_2019-05-01_14-57-52.wav,44100,16,60,1,ndsi,1024,1000,2000,2000,11000,0.768431874269485,NA 
rayol-farm2_2019-05-01_14-59-53.wav,44100,16,60,1,ndsi,1024,1000,2000,2000,11000,0.715515564781301,NA 
rayol-farm2_2019-05-01_15-01-53.wav,44100,16,60,1,ndsi,1024,1000,2000,2000,11000,0.8709003658881,NA 
rayol-farm2_2019-05-01_15-03-53.wav,44100,16,60,1,ndsi,1024,1000,2000,2000,11000,0.622547468972781,NA 
rayol-farm2_2019-05-01_15-05-53.wav,44100,16,60,1,ndsi,1024,1000,2000,2000,11000,0.65147175127546,NA 
rayol-farm2_2019-05-01_15-07-53.wav,44100,16,60,1,ndsi,1024,1000,2000,2000,11000,0.640704895232215,NA 
rayol-farm2_2019-05-01_15-09-53.wav,44100,16,60,1,ndsi,1024,1000,2000,2000,11000,0.762435456062352,NA 
rayol-farm2_2019-05-01_15-11-53.wav,44100,16,60,1,ndsi,1024,1000,2000,2000,11000,0.79757279725983,NA 
rayol-farm2_2019-05-01_15-13-53.wav,44100,16,60,1,ndsi,1024,1000,2000,2000,11000,0.6536318424488,NA 
rayol-farm2_2019-05-01_15-15-53.wav,44100,16,60,1,ndsi,1024,1000,2000,2000,11000,0.547644983656353,NA 
rayol-farm2_2019-05-01_15-17-54.wav,44100,16,60,1,ndsi,1024,1000,2000,2000,11000,0.838419892229597,NA 
rayol-farm2_2019-05-01_15-19-54.wav,44100,16,60,1,ndsi,1024,1000,2000,2000,11000,0.874100264332897,NA 
rayol-farm2_2019-05-01_15-21-54.wav,44100,16,60,1,ndsi,1024,1000,2000,2000,11000,0.324450275478892,NA 
rayol-farm2_2019-05-01_15-23-54.wav,44100,16,60,1,ndsi,1024,1000,2000,2000,11000,0.840248535843517,NA 
rayol-farm2_2019-05-01_15-25-54.wav,44100,16,60,1,ndsi,1024,1000,2000,2000,11000,0.879175676371249,NA 
rayol-farm2_2019-05-01_15-27-54.wav,44100,16,60,1,ndsi,1024,1000,2000,2000,11000,0.808065104630998,NA 
rayol-farm2_2019-05-01_15-29-54.wav,44100,16,60,1,ndsi,1024,1000,2000,2000,11000,0.712244783719869,NA 
rayol-farm2_2019-05-01_15-31-54.wav,44100,16,60,1,ndsi,1024,1000,2000,2000,11000,0.917373907187865,NA 
rayol-farm2_2019-05-01_15-33-55.wav,44100,16,60,1,ndsi,1024,1000,2000,2000,11000,0.63845927316237,NA 
rayol-farm2_2019-05-01_15-35-55.wav,44100,16,60,1,ndsi,1024,1000,2000,2000,11000,0.769336209051702,NA 
rayol-farm2_2019-05-01_15-37-55.wav,44100,16,60,1,ndsi,1024,1000,2000,2000,11000,0.858388239840796,NA 
rayol-farm2_2019-05-01_15-39-55.wav,44100,16,60,1,ndsi,1024,1000,2000,2000,11000,0.900610834264682,NA 
rayol-farm2_2019-05-01_15-41-55.wav,44100,16,60,1,ndsi,1024,1000,2000,2000,11000,0.756657939485509,NA 
rayol-farm2_2019-05-01_15-43-55.wav,44100,16,60,1,ndsi,1024,1000,2000,2000,11000,0.848706996095759,NA 
rayol-farm2_2019-05-01_15-45-55.wav,44100,16,60,1,ndsi,1024,1000,2000,2000,11000,0.886952989158222,NA 
rayol-farm2_2019-05-01_15-47-55.wav,44100,16,60,1,ndsi,1024,1000,2000,2000,11000,0.837507608352594,NA 
rayol-farm2_2019-05-01_15-49-56.wav,44100,16,60,1,ndsi,1024,1000,2000,2000,11000,0.823074408226735,NA 
rayol-farm2_2019-05-01_15-51-56.wav,44100,16,60,1,ndsi,1024,1000,2000,2000,11000,0.878414286073016,NA 
rayol-farm2_2019-05-01_15-53-56.wav,44100,16,60,1,ndsi,1024,1000,2000,2000,11000,0.817253161526647,NA 
rayol-farm2_2019-05-01_15-55-56.wav,44100,16,60,1,ndsi,1024,1000,2000,2000,11000,0.909826700719681,NA 
rayol-farm2_2019-05-01_15-57-56.wav,44100,16,60,1,ndsi,1024,1000,2000,2000,11000,0.766171109231013,NA 
rayol-farm2_2019-05-01_15-59-56.wav,44100,16,60,1,ndsi,1024,1000,2000,2000,11000,0.866133895570609,NA 
rayol-farm2_2019-05-01_16-01-56.wav,44100,16,60,1,ndsi,1024,1000,2000,2000,11000,0.897282967713345,NA 
rayol-farm2_2019-05-01_16-03-56.wav,44100,16,60,1,ndsi,1024,1000,2000,2000,11000,0.594012411564032,NA 
rayol-farm2_2019-05-01_16-05-57.wav,44100,16,60,1,ndsi,1024,1000,2000,2000,11000,0.87129633806747,NA 
rayol-farm2_2019-05-01_16-07-57.wav,44100,16,60,1,ndsi,1024,1000,2000,2000,11000,0.403663463230135,NA 
rayol-farm2_2019-05-01_16-09-57.wav,44100,16,60,1,ndsi,1024,1000,2000,2000,11000,0.870369982339629,NA 
rayol-farm2_2019-05-01_16-11-57.wav,44100,16,60,1,ndsi,1024,1000,2000,2000,11000,0.708426036988672,NA 
rayol-farm2_2019-05-01_16-13-57.wav,44100,16,60,1,ndsi,1024,1000,2000,2000,11000,0.721127342375983,NA 
rayol-farm2_2019-05-01_16-15-57.wav,44100,16,60,1,ndsi,1024,1000,2000,2000,11000,0.839073716263073,NA 
rayol-farm2_2019-05-01_16-17-57.wav,44100,16,60,1,ndsi,1024,1000,2000,2000,11000,0.739554106690014,NA 
rayol-farm2_2019-05-01_16-19-57.wav,44100,16,60,1,ndsi,1024,1000,2000,2000,11000,0.696533577640418,NA 
rayol-farm2_2019-05-01_16-21-57.wav,44100,16,60,1,ndsi,1024,1000,2000,2000,11000,0.865214735197509,NA 
rayol-farm2_2019-05-01_16-23-58.wav,44100,16,60,1,ndsi,1024,1000,2000,2000,11000,0.863043666105854,NA 
rayol-farm2_2019-05-01_16-25-58.wav,44100,16,60,1,ndsi,1024,1000,2000,2000,11000,0.877252848986622,NA 
rayol-farm2_2019-05-01_16-27-58.wav,44100,16,60,1,ndsi,1024,1000,2000,2000,11000,0.893727595191465,NA 
rayol-farm2_2019-05-01_16-29-58.wav,44100,16,60,1,ndsi,1024,1000,2000,2000,11000,0.887498426979975,NA 
rayol-farm2_2019-05-01_16-31-58.wav,44100,16,60,1,ndsi,1024,1000,2000,2000,11000,0.890091645590279,NA 
rayol-farm2_2019-05-01_16-33-58.wav,44100,16,60,1,ndsi,1024,1000,2000,2000,11000,0.846138846950127,NA 
rayol-farm2_2019-05-01_16-35-58.wav,44100,16,60,1,ndsi,1024,1000,2000,2000,11000,0.620104231282015,NA 
rayol-farm2_2019-05-01_16-37-58.wav,44100,16,60,1,ndsi,1024,1000,2000,2000,11000,0.692365164011987,NA 
rayol-farm2_2019-05-01_16-39-59.wav,44100,16,60,1,ndsi,1024,1000,2000,2000,11000,0.748905354144291,NA 
rayol-farm2_2019-05-01_16-41-59.wav,44100,16,60,1,ndsi,1024,1000,2000,2000,11000,0.831179345612642,NA 
rayol-farm2_2019-05-01_16-43-59.wav,44100,16,60,1,ndsi,1024,1000,2000,2000,11000,0.7519177629208,NA 
rayol-farm2_2019-05-01_16-45-59.wav,44100,16,60,1,ndsi,1024,1000,2000,2000,11000,0.473228550955317,NA 
rayol-farm2_2019-05-01_16-47-59.wav,44100,16,60,1,ndsi,1024,1000,2000,2000,11000,0.922048763955038,NA 
rayol-farm2_2019-05-01_16-49-59.wav,44100,16,60,1,ndsi,1024,1000,2000,2000,11000,0.884380525123391,NA 
rayol-farm2_2019-05-01_16-51-59.wav,44100,16,60,1,ndsi,1024,1000,2000,2000,11000,0.912436480240784,NA 
rayol-farm2_2019-05-01_16-53-59.wav,44100,16,60,1,ndsi,1024,1000,2000,2000,11000,0.889196488884897,NA 
rayol-farm2_2019-05-01_16-56-00.wav,44100,16,60,1,ndsi,1024,1000,2000,2000,11000,0.750281025619151,NA 
rayol-farm2_2019-05-01_16-58-00.wav,44100,16,60,1,ndsi,1024,1000,2000,2000,11000,0.59989295709068,NA 
rayol-farm2_2019-05-01_17-00-00.wav,44100,16,60,1,ndsi,1024,1000,2000,2000,11000,0.654471234812051,NA 
rayol-farm2_2019-05-01_17-02-00.wav,44100,16,60,1,ndsi,1024,1000,2000,2000,11000,0.629467938292041,NA 
rayol-farm2_2019-05-01_17-04-00.wav,44100,16,60,1,ndsi,1024,1000,2000,2000,11000,0.785081305343033,NA 
rayol-farm2_2019-05-01_17-06-00.wav,44100,16,60,1,ndsi,1024,1000,2000,2000,11000,0.71929212386294,NA 
rayol-farm2_2019-05-01_17-08-00.wav,44100,16,60,1,ndsi,1024,1000,2000,2000,11000,0.120258031510984,NA 
rayol-farm2_2019-05-01_17-10-00.wav,44100,16,60,1,ndsi,1024,1000,2000,2000,11000,0.317940480294676,NA 
rayol-farm2_2019-05-01_17-12-01.wav,44100,16,60,1,ndsi,1024,1000,2000,2000,11000,0.793080002016249,NA 
rayol-farm2_2019-05-01_17-14-01.wav,44100,16,60,1,ndsi,1024,1000,2000,2000,11000,0.69356665128281,NA 
rayol-farm2_2019-05-01_17-16-01.wav,44100,16,60,1,ndsi,1024,1000,2000,2000,11000,0.924493614449907,NA 
rayol-farm2_2019-05-01_17-18-01.wav,44100,16,60,1,ndsi,1024,1000,2000,2000,11000,0.863803030391954,NA 
rayol-farm2_2019-05-01_17-20-01.wav,44100,16,60,1,ndsi,1024,1000,2000,2000,11000,0.771551597739514,NA 
rayol-farm2_2019-05-01_17-22-01.wav,44100,16,60,1,ndsi,1024,1000,2000,2000,11000,0.796334975052844,NA 
rayol-farm2_2019-05-01_17-24-01.wav,44100,16,60,1,ndsi,1024,1000,2000,2000,11000,0.72994734809777,NA 
rayol-farm2_2019-05-01_17-26-01.wav,44100,16,60,1,ndsi,1024,1000,2000,2000,11000,0.857725047930334,NA 
rayol-farm2_2019-05-01_17-28-02.wav,44100,16,60,1,ndsi,1024,1000,2000,2000,11000,0.896709514277669,NA 
rayol-farm2_2019-05-01_17-30-02.wav,44100,16,60,1,ndsi,1024,1000,2000,2000,11000,0.777695453802322,NA 
rayol-farm2_2019-05-01_17-32-02.wav,44100,16,60,1,ndsi,1024,1000,2000,2000,11000,0.857746802019505,NA 
rayol-farm2_2019-05-01_17-34-02.wav,44100,16,60,1,ndsi,1024,1000,2000,2000,11000,0.683507343624227,NA 
rayol-farm2_2019-05-01_17-36-02.wav,44100,16,60,1,ndsi,1024,1000,2000,2000,11000,0.850279940091674,NA 
rayol-farm2_2019-05-01_17-38-02.wav,44100,16,60,1,ndsi,1024,1000,2000,2000,11000,0.854646103629304,NA 
rayol-farm2_2019-05-01_17-40-02.wav,44100,16,60,1,ndsi,1024,1000,2000,2000,11000,0.837568069745081,NA 
rayol-farm2_2019-05-01_17-42-02.wav,44100,16,60,1,ndsi,1024,1000,2000,2000,11000,0.625169665854791,NA 
rayol-farm2_2019-05-01_17-44-03.wav,44100,16,60,1,ndsi,1024,1000,2000,2000,11000,0.803773796981004,NA 
rayol-farm2_2019-05-01_17-46-03.wav,44100,16,60,1,ndsi,1024,1000,2000,2000,11000,0.118067711386241,NA 
rayol-farm2_2019-05-01_17-48-03.wav,44100,16,60,1,ndsi,1024,1000,2000,2000,11000,0.0189334560179235,NA 
rayol-farm2_2019-05-01_17-50-03.wav,44100,16,60,1,ndsi,1024,1000,2000,2000,11000,0.760591278814334,NA 
rayol-farm2_2019-05-01_17-52-03.wav,44100,16,60,1,ndsi,1024,1000,2000,2000,11000,0.794764447476597,NA 
rayol-farm2_2019-05-01_17-54-03.wav,44100,16,60,1,ndsi,1024,1000,2000,2000,11000,0.637986221236142,NA 
rayol-farm2_2019-05-01_17-56-03.wav,44100,16,60,1,ndsi,1024,1000,2000,2000,11000,0.726915950160057,NA 
rayol-farm2_2019-05-01_17-58-03.wav,44100,16,60,1,ndsi,1024,1000,2000,2000,11000,0.887457640765113,NA 
rayol-farm2_2019-05-01_18-00-03.wav,44100,16,60,1,ndsi,1024,1000,2000,2000,11000,0.861295160525073,NA 
rayol-farm2_2019-05-01_18-02-04.wav,44100,16,60,1,ndsi,1024,1000,2000,2000,11000,0.870930503007605,NA 
rayol-farm2_2019-05-01_18-04-04.wav,44100,16,60,1,ndsi,1024,1000,2000,2000,11000,0.897729175206341,NA 
rayol-farm2_2019-05-01_18-06-04.wav,44100,16,60,1,ndsi,1024,1000,2000,2000,11000,0.900176313244944,NA 
rayol-farm2_2019-05-01_18-08-04.wav,44100,16,60,1,ndsi,1024,1000,2000,2000,11000,0.905925137263625,NA 
rayol-farm2_2019-05-01_18-10-04.wav,44100,16,60,1,ndsi,1024,1000,2000,2000,11000,0.861597918583459,NA 
rayol-farm2_2019-05-01_18-12-04.wav,44100,16,60,1,ndsi,1024,1000,2000,2000,11000,0.820536472391672,NA 
rayol-farm2_2019-05-01_18-14-04.wav,44100,16,60,1,ndsi,1024,1000,2000,2000,11000,0.88296581990497,NA 
rayol-farm2_2019-05-01_18-16-04.wav,44100,16,60,1,ndsi,1024,1000,2000,2000,11000,0.909035592342756,NA 
rayol-farm2_2019-05-01_18-18-05.wav,44100,16,60,1,ndsi,1024,1000,2000,2000,11000,0.899877668298683,NA 
rayol-farm2_2019-05-01_18-20-05.wav,44100,16,60,1,ndsi,1024,1000,2000,2000,11000,0.931713580241292,NA 
rayol-farm2_2019-05-01_18-22-05.wav,44100,16,60,1,ndsi,1024,1000,2000,2000,11000,0.912073821837896,NA 
rayol-farm2_2019-05-01_18-24-05.wav,44100,16,60,1,ndsi,1024,1000,2000,2000,11000,0.894296187641179,NA 
rayol-farm2_2019-05-01_18-26-05.wav,44100,16,60,1,ndsi,1024,1000,2000,2000,11000,0.853951370537223,NA 
rayol-farm2_2019-05-01_18-28-05.wav,44100,16,60,1,ndsi,1024,1000,2000,2000,11000,0.933497976261052,NA 
rayol-farm2_2019-05-01_18-30-05.wav,44100,16,60,1,ndsi,1024,1000,2000,2000,11000,0.940157819646818,NA 
rayol-farm2_2019-05-01_18-32-05.wav,44100,16,60,1,ndsi,1024,1000,2000,2000,11000,0.937536971202343,NA 
rayol-farm2_2019-05-01_18-34-06.wav,44100,16,60,1,ndsi,1024,1000,2000,2000,11000,0.943167563785705,NA 
rayol-farm2_2019-05-01_18-36-06.wav,44100,16,60,1,ndsi,1024,1000,2000,2000,11000,0.941089587089195,NA 
rayol-farm2_2019-05-01_18-38-06.wav,44100,16,60,1,ndsi,1024,1000,2000,2000,11000,0.915020304402497,NA 
rayol-farm2_2019-05-01_18-40-06.wav,44100,16,60,1,ndsi,1024,1000,2000,2000,11000,0.937907994605773,NA 
rayol-farm2_2019-05-01_18-42-06.wav,44100,16,60,1,ndsi,1024,1000,2000,2000,11000,0.936198003717159,NA 
rayol-farm2_2019-05-01_18-44-06.wav,44100,16,60,1,ndsi,1024,1000,2000,2000,11000,0.937197065786469,NA 
rayol-farm2_2019-05-01_18-46-06.wav,44100,16,60,1,ndsi,1024,1000,2000,2000,11000,0.934917718379377,NA 
rayol-farm2_2019-05-01_18-48-06.wav,44100,16,60,1,ndsi,1024,1000,2000,2000,11000,0.936398667969043,NA 
rayol-farm2_2019-05-01_18-50-07.wav,44100,16,60,1,ndsi,1024,1000,2000,2000,11000,0.942996768394321,NA 
rayol-farm2_2019-05-01_18-52-07.wav,44100,16,60,1,ndsi,1024,1000,2000,2000,11000,0.938304481020088,NA 
rayol-farm2_2019-05-01_18-54-07.wav,44100,16,60,1,ndsi,1024,1000,2000,2000,11000,0.924472136322114,NA 
rayol-farm2_2019-05-01_18-56-07.wav,44100,16,60,1,ndsi,1024,1000,2000,2000,11000,0.912938180311884,NA 
rayol-farm2_2019-05-01_18-58-07.wav,44100,16,60,1,ndsi,1024,1000,2000,2000,11000,0.914864422560019,NA 
rayol-farm2_2019-05-01_19-00-07.wav,44100,16,60,1,ndsi,1024,1000,2000,2000,11000,0.913300756155906,NA 
rayol-farm2_2019-05-01_19-02-07.wav,44100,16,60,1,ndsi,1024,1000,2000,2000,11000,0.910064623051073,NA 
rayol-farm2_2019-05-01_19-04-07.wav,44100,16,60,1,ndsi,1024,1000,2000,2000,11000,0.897245368350986,NA 
rayol-farm2_2019-05-01_19-06-07.wav,44100,16,60,1,ndsi,1024,1000,2000,2000,11000,0.907185326827277,NA 
rayol-farm2_2019-05-01_19-08-08.wav,44100,16,60,1,ndsi,1024,1000,2000,2000,11000,0.905946991715975,NA 
rayol-farm2_2019-05-01_19-10-08.wav,44100,16,60,1,ndsi,1024,1000,2000,2000,11000,0.918486087438937,NA 
rayol-farm2_2019-05-01_19-12-08.wav,44100,16,60,1,ndsi,1024,1000,2000,2000,11000,0.922338729820319,NA 
rayol-farm2_2019-05-01_19-14-08.wav,44100,16,60,1,ndsi,1024,1000,2000,2000,11000,0.943636672687749,NA 
rayol-farm2_2019-05-01_19-16-08.wav,44100,16,60,1,ndsi,1024,1000,2000,2000,11000,0.921422925486988,NA 
rayol-farm2_2019-05-01_19-18-08.wav,44100,16,60,1,ndsi,1024,1000,2000,2000,11000,0.914557108772419,NA 
rayol-farm2_2019-05-01_19-20-08.wav,44100,16,60,1,ndsi,1024,1000,2000,2000,11000,0.9080939559404,NA 
rayol-farm2_2019-05-01_19-22-08.wav,44100,16,60,1,ndsi,1024,1000,2000,2000,11000,0.912209927673749,NA 
rayol-farm2_2019-05-01_19-24-09.wav,44100,16,60,1,ndsi,1024,1000,2000,2000,11000,0.901006984826383,NA 
rayol-farm2_2019-05-01_19-26-09.wav,44100,16,60,1,ndsi,1024,1000,2000,2000,11000,0.909656267795828,NA 
rayol-farm2_2019-05-01_19-28-09.wav,44100,16,60,1,ndsi,1024,1000,2000,2000,11000,0.908452250425437,NA 
rayol-farm2_2019-05-01_19-30-09.wav,44100,16,60,1,ndsi,1024,1000,2000,2000,11000,0.906740566421418,NA 
rayol-farm2_2019-05-01_19-32-09.wav,44100,16,60,1,ndsi,1024,1000,2000,2000,11000,0.914278827195291,NA 
rayol-farm2_2019-05-01_19-34-09.wav,44100,16,60,1,ndsi,1024,1000,2000,2000,11000,0.911714259143811,NA 
rayol-farm2_2019-05-01_19-36-09.wav,44100,16,60,1,ndsi,1024,1000,2000,2000,11000,0.913181647356207,NA 
rayol-farm2_2019-05-01_19-38-09.wav,44100,16,60,1,ndsi,1024,1000,2000,2000,11000,0.913860451878028,NA 
rayol-farm2_2019-05-01_19-40-10.wav,44100,16,60,1,ndsi,1024,1000,2000,2000,11000,0.91548596969579,NA 
rayol-farm2_2019-05-01_19-42-10.wav,44100,16,60,1,ndsi,1024,1000,2000,2000,11000,0.92997416766654,NA 
rayol-farm2_2019-05-01_19-44-10.wav,44100,16,60,1,ndsi,1024,1000,2000,2000,11000,0.92790284026867,NA 
rayol-farm2_2019-05-01_19-46-10.wav,44100,16,60,1,ndsi,1024,1000,2000,2000,11000,0.913601783784826,NA 
rayol-farm2_2019-05-01_19-48-10.wav,44100,16,60,1,ndsi,1024,1000,2000,2000,11000,0.913656458858687,NA 
rayol-farm2_2019-05-01_19-50-10.wav,44100,16,60,1,ndsi,1024,1000,2000,2000,11000,0.91173058653774,NA 
rayol-farm2_2019-05-01_19-52-10.wav,44100,16,60,1,ndsi,1024,1000,2000,2000,11000,0.925589631411955,NA 
rayol-farm2_2019-05-01_19-54-10.wav,44100,16,60,1,ndsi,1024,1000,2000,2000,11000,0.926861400138876,NA 
rayol-farm2_2019-05-01_19-56-11.wav,44100,16,60,1,ndsi,1024,1000,2000,2000,11000,0.920808800444536,NA 
rayol-farm2_2019-05-01_19-58-11.wav,44100,16,60,1,ndsi,1024,1000,2000,2000,11000,0.913278502123508,NA 
rayol-farm2_2019-05-01_20-00-11.wav,44100,16,60,1,ndsi,1024,1000,2000,2000,11000,0.91755086458956,NA 
rayol-farm2_2019-05-01_20-02-11.wav,44100,16,60,1,ndsi,1024,1000,2000,2000,11000,0.95796230030804,NA 
rayol-farm2_2019-05-01_20-04-11.wav,44100,16,60,1,ndsi,1024,1000,2000,2000,11000,0.923516717609735,NA 
rayol-farm2_2019-05-01_20-06-11.wav,44100,16,60,1,ndsi,1024,1000,2000,2000,11000,0.911963520386282,NA 
rayol-farm2_2019-05-01_20-08-11.wav,44100,16,60,1,ndsi,1024,1000,2000,2000,11000,0.917995983066082,NA 
rayol-farm2_2019-05-01_20-10-11.wav,44100,16,60,1,ndsi,1024,1000,2000,2000,11000,0.969576217133783,NA 
rayol-farm2_2019-05-01_20-12-11.wav,44100,16,60,1,ndsi,1024,1000,2000,2000,11000,0.956275097435611,NA 
rayol-farm2_2019-05-01_20-14-12.wav,44100,16,60,1,ndsi,1024,1000,2000,2000,11000,0.936083411545793,NA 
rayol-farm2_2019-05-01_20-16-12.wav,44100,16,60,1,ndsi,1024,1000,2000,2000,11000,0.920921434427003,NA 
rayol-farm2_2019-05-01_20-18-12.wav,44100,16,60,1,ndsi,1024,1000,2000,2000,11000,0.917164012181742,NA 
rayol-farm2_2019-05-01_20-20-12.wav,44100,16,60,1,ndsi,1024,1000,2000,2000,11000,0.914896272405739,NA 
rayol-farm2_2019-05-01_20-22-12.wav,44100,16,60,1,ndsi,1024,1000,2000,2000,11000,0.915413398413909,NA 
rayol-farm2_2019-05-01_20-24-12.wav,44100,16,60,1,ndsi,1024,1000,2000,2000,11000,0.913980286450763,NA 
rayol-farm2_2019-05-01_20-26-12.wav,44100,16,60,1,ndsi,1024,1000,2000,2000,11000,0.912394437895812,NA 
rayol-farm2_2019-05-01_20-28-12.wav,44100,16,60,1,ndsi,1024,1000,2000,2000,11000,0.911945209637207,NA 
rayol-farm2_2019-05-01_20-30-13.wav,44100,16,60,1,ndsi,1024,1000,2000,2000,11000,0.914483764970502,NA 
rayol-farm2_2019-05-01_20-32-13.wav,44100,16,60,1,ndsi,1024,1000,2000,2000,11000,0.911449003917657,NA 
rayol-farm2_2019-05-01_20-34-13.wav,44100,16,60,1,ndsi,1024,1000,2000,2000,11000,0.914259926175009,NA 
rayol-farm2_2019-05-01_20-36-13.wav,44100,16,60,1,ndsi,1024,1000,2000,2000,11000,0.908153656786346,NA 
rayol-farm2_2019-05-01_20-38-13.wav,44100,16,60,1,ndsi,1024,1000,2000,2000,11000,0.921351445679329,NA 
rayol-farm2_2019-05-01_20-40-13.wav,44100,16,60,1,ndsi,1024,1000,2000,2000,11000,0.930172771796857,NA 
rayol-farm2_2019-05-01_20-42-13.wav,44100,16,60,1,ndsi,1024,1000,2000,2000,11000,0.927715986537969,NA 
rayol-farm2_2019-05-01_20-44-13.wav,44100,16,60,1,ndsi,1024,1000,2000,2000,11000,0.908230301063963,NA 
rayol-farm2_2019-05-01_20-46-14.wav,44100,16,60,1,ndsi,1024,1000,2000,2000,11000,0.907510612452691,NA 
rayol-farm2_2019-05-01_20-48-14.wav,44100,16,60,1,ndsi,1024,1000,2000,2000,11000,0.91248029563967,NA 
rayol-farm2_2019-05-01_20-50-14.wav,44100,16,60,1,ndsi,1024,1000,2000,2000,11000,0.912838073105764,NA 
rayol-farm2_2019-05-01_20-52-14.wav,44100,16,60,1,ndsi,1024,1000,2000,2000,11000,0.913028222197809,NA 
rayol-farm2_2019-05-01_20-54-14.wav,44100,16,60,1,ndsi,1024,1000,2000,2000,11000,0.910500016389895,NA 
rayol-farm2_2019-05-01_20-56-14.wav,44100,16,60,1,ndsi,1024,1000,2000,2000,11000,0.9095375006478,NA 
rayol-farm2_2019-05-01_20-58-14.wav,44100,16,60,1,ndsi,1024,1000,2000,2000,11000,0.912056352928898,NA 
rayol-farm2_2019-05-01_21-00-14.wav,44100,16,60,1,ndsi,1024,1000,2000,2000,11000,0.911901087519593,NA 
rayol-farm2_2019-05-01_21-02-15.wav,44100,16,60,1,ndsi,1024,1000,2000,2000,11000,0.911217461441623,NA 
rayol-farm2_2019-05-01_21-04-15.wav,44100,16,60,1,ndsi,1024,1000,2000,2000,11000,0.91167047162694,NA 
rayol-farm2_2019-05-01_21-06-15.wav,44100,16,60,1,ndsi,1024,1000,2000,2000,11000,0.939078898076049,NA 
rayol-farm2_2019-05-01_21-08-15.wav,44100,16,60,1,ndsi,1024,1000,2000,2000,11000,0.941271616577438,NA 
rayol-farm2_2019-05-01_21-10-15.wav,44100,16,60,1,ndsi,1024,1000,2000,2000,11000,0.937682845346261,NA 
rayol-farm2_2019-05-01_21-12-15.wav,44100,16,60,1,ndsi,1024,1000,2000,2000,11000,0.942155479425018,NA 
rayol-farm2_2019-05-01_21-14-15.wav,44100,16,60,1,ndsi,1024,1000,2000,2000,11000,0.941030019647406,NA 
rayol-farm2_2019-05-01_21-16-15.wav,44100,16,60,1,ndsi,1024,1000,2000,2000,11000,0.942094398576455,NA 
rayol-farm2_2019-05-01_21-18-16.wav,44100,16,60,1,ndsi,1024,1000,2000,2000,11000,0.954609680826908,NA 
rayol-farm2_2019-05-01_21-20-16.wav,44100,16,60,1,ndsi,1024,1000,2000,2000,11000,0.941736045356258,NA 
rayol-farm2_2019-05-01_21-22-16.wav,44100,16,60,1,ndsi,1024,1000,2000,2000,11000,0.946988930901048,NA 
rayol-farm2_2019-05-01_21-24-16.wav,44100,16,60,1,ndsi,1024,1000,2000,2000,11000,0.909978612847882,NA 
rayol-farm2_2019-05-01_21-26-16.wav,44100,16,60,1,ndsi,1024,1000,2000,2000,11000,0.916196411709497,NA 
rayol-farm2_2019-05-01_21-28-16.wav,44100,16,60,1,ndsi,1024,1000,2000,2000,11000,0.927300066112973,NA 
rayol-farm2_2019-05-01_21-30-16.wav,44100,16,60,1,ndsi,1024,1000,2000,2000,11000,0.929558160585576,NA 
rayol-farm2_2019-05-01_21-32-16.wav,44100,16,60,1,ndsi,1024,1000,2000,2000,11000,0.931554919851971,NA 
rayol-farm2_2019-05-01_21-34-16.wav,44100,16,60,1,ndsi,1024,1000,2000,2000,11000,0.935145431595572,NA 
rayol-farm2_2019-05-01_21-36-17.wav,44100,16,60,1,ndsi,1024,1000,2000,2000,11000,0.9342606793954,NA 
rayol-farm2_2019-05-01_21-38-17.wav,44100,16,60,1,ndsi,1024,1000,2000,2000,11000,0.933631590164555,NA 
rayol-farm2_2019-05-01_21-40-17.wav,44100,16,60,1,ndsi,1024,1000,2000,2000,11000,0.93619330509534,NA 
rayol-farm2_2019-05-01_21-42-17.wav,44100,16,60,1,ndsi,1024,1000,2000,2000,11000,0.939479036458238,NA 
rayol-farm2_2019-05-01_21-44-17.wav,44100,16,60,1,ndsi,1024,1000,2000,2000,11000,0.940028048421497,NA 
rayol-farm2_2019-05-01_21-46-17.wav,44100,16,60,1,ndsi,1024,1000,2000,2000,11000,0.939314541681415,NA 
rayol-farm2_2019-05-01_21-48-17.wav,44100,16,60,1,ndsi,1024,1000,2000,2000,11000,0.937433868101837,NA 
rayol-farm2_2019-05-01_21-50-17.wav,44100,16,60,1,ndsi,1024,1000,2000,2000,11000,0.9425569535737,NA 
rayol-farm2_2019-05-01_21-52-18.wav,44100,16,60,1,ndsi,1024,1000,2000,2000,11000,0.93631319196013,NA 
rayol-farm2_2019-05-01_21-54-18.wav,44100,16,60,1,ndsi,1024,1000,2000,2000,11000,0.915301646285561,NA 
rayol-farm2_2019-05-01_21-56-18.wav,44100,16,60,1,ndsi,1024,1000,2000,2000,11000,0.919374058752378,NA 
rayol-farm2_2019-05-01_21-58-18.wav,44100,16,60,1,ndsi,1024,1000,2000,2000,11000,0.928305306830195,NA 
rayol-farm2_2019-05-01_22-00-18.wav,44100,16,60,1,ndsi,1024,1000,2000,2000,11000,0.92667181478456,NA 
rayol-farm2_2019-05-01_22-02-18.wav,44100,16,60,1,ndsi,1024,1000,2000,2000,11000,0.927408136955487,NA 
rayol-farm2_2019-05-01_22-04-18.wav,44100,16,60,1,ndsi,1024,1000,2000,2000,11000,0.928129901565933,NA 
rayol-farm2_2019-05-01_22-06-18.wav,44100,16,60,1,ndsi,1024,1000,2000,2000,11000,0.931690534871277,NA 
rayol-farm2_2019-05-01_22-08-19.wav,44100,16,60,1,ndsi,1024,1000,2000,2000,11000,0.926962527087348,NA 
rayol-farm2_2019-05-01_22-10-19.wav,44100,16,60,1,ndsi,1024,1000,2000,2000,11000,0.915661378787006,NA 
rayol-farm2_2019-05-01_22-12-19.wav,44100,16,60,1,ndsi,1024,1000,2000,2000,11000,0.925650667991155,NA 
rayol-farm2_2019-05-01_22-14-19.wav,44100,16,60,1,ndsi,1024,1000,2000,2000,11000,0.927737925344449,NA 
rayol-farm2_2019-05-01_22-16-19.wav,44100,16,60,1,ndsi,1024,1000,2000,2000,11000,0.929683776302045,NA 
rayol-farm2_2019-05-01_22-18-19.wav,44100,16,60,1,ndsi,1024,1000,2000,2000,11000,0.929914822632695,NA 
rayol-farm2_2019-05-01_22-20-19.wav,44100,16,60,1,ndsi,1024,1000,2000,2000,11000,0.904612756005652,NA 
rayol-farm2_2019-05-01_22-22-19.wav,44100,16,60,1,ndsi,1024,1000,2000,2000,11000,0.925520149242434,NA 
rayol-farm2_2019-05-01_22-24-20.wav,44100,16,60,1,ndsi,1024,1000,2000,2000,11000,0.929331864788879,NA 
rayol-farm2_2019-05-01_22-26-20.wav,44100,16,60,1,ndsi,1024,1000,2000,2000,11000,0.931080654035495,NA 
rayol-farm2_2019-05-01_22-28-20.wav,44100,16,60,1,ndsi,1024,1000,2000,2000,11000,0.92942748624475,NA 
rayol-farm2_2019-05-01_22-30-20.wav,44100,16,60,1,ndsi,1024,1000,2000,2000,11000,0.929727872998892,NA 
rayol-farm2_2019-05-01_22-32-20.wav,44100,16,60,1,ndsi,1024,1000,2000,2000,11000,0.927225951395903,NA 
rayol-farm2_2019-05-01_22-34-20.wav,44100,16,60,1,ndsi,1024,1000,2000,2000,11000,0.930284328990459,NA 
rayol-farm2_2019-05-01_22-36-20.wav,44100,16,60,1,ndsi,1024,1000,2000,2000,11000,0.910859698450511,NA 
rayol-farm2_2019-05-01_22-38-20.wav,44100,16,60,1,ndsi,1024,1000,2000,2000,11000,0.911910364395983,NA 
rayol-farm2_2019-05-01_22-40-20.wav,44100,16,60,1,ndsi,1024,1000,2000,2000,11000,0.911393030916518,NA 
rayol-farm2_2019-05-01_22-42-21.wav,44100,16,60,1,ndsi,1024,1000,2000,2000,11000,0.910393620033261,NA 
rayol-farm2_2019-05-01_22-44-21.wav,44100,16,60,1,ndsi,1024,1000,2000,2000,11000,0.90852536507679,NA 
rayol-farm2_2019-05-01_22-46-21.wav,44100,16,60,1,ndsi,1024,1000,2000,2000,11000,0.912732981164726,NA 
rayol-farm2_2019-05-01_22-48-21.wav,44100,16,60,1,ndsi,1024,1000,2000,2000,11000,0.910972273899158,NA 
rayol-farm2_2019-05-01_22-50-21.wav,44100,16,60,1,ndsi,1024,1000,2000,2000,11000,0.910381647276446,NA 
rayol-farm2_2019-05-01_22-52-21.wav,44100,16,60,1,ndsi,1024,1000,2000,2000,11000,0.912442772286956,NA 
rayol-farm2_2019-05-01_22-54-21.wav,44100,16,60,1,ndsi,1024,1000,2000,2000,11000,0.914418065650802,NA 
rayol-farm2_2019-05-01_22-56-21.wav,44100,16,60,1,ndsi,1024,1000,2000,2000,11000,0.911971127964968,NA 
rayol-farm2_2019-05-01_22-58-22.wav,44100,16,60,1,ndsi,1024,1000,2000,2000,11000,0.916771269648883,NA 
rayol-farm2_2019-05-01_23-00-22.wav,44100,16,60,1,ndsi,1024,1000,2000,2000,11000,0.917565564721093,NA 
rayol-farm2_2019-05-01_23-02-22.wav,44100,16,60,1,ndsi,1024,1000,2000,2000,11000,0.917000888915318,NA 
rayol-farm2_2019-05-01_23-04-22.wav,44100,16,60,1,ndsi,1024,1000,2000,2000,11000,0.914722398234229,NA 
rayol-farm2_2019-05-01_23-06-22.wav,44100,16,60,1,ndsi,1024,1000,2000,2000,11000,0.913133925452855,NA 
rayol-farm2_2019-05-01_23-08-22.wav,44100,16,60,1,ndsi,1024,1000,2000,2000,11000,0.917996286465216,NA 
rayol-farm2_2019-05-01_23-10-22.wav,44100,16,60,1,ndsi,1024,1000,2000,2000,11000,0.917975656522576,NA 
rayol-farm2_2019-05-01_23-12-22.wav,44100,16,60,1,ndsi,1024,1000,2000,2000,11000,0.905364022706139,NA 
rayol-farm2_2019-05-01_23-14-23.wav,44100,16,60,1,ndsi,1024,1000,2000,2000,11000,0.915292702774323,NA 
rayol-farm2_2019-05-01_23-16-23.wav,44100,16,60,1,ndsi,1024,1000,2000,2000,11000,0.911571040583889,NA 
rayol-farm2_2019-05-01_23-18-23.wav,44100,16,60,1,ndsi,1024,1000,2000,2000,11000,0.916653986070616,NA 
rayol-farm2_2019-05-01_23-20-23.wav,44100,16,60,1,ndsi,1024,1000,2000,2000,11000,0.918513788635006,NA 
rayol-farm2_2019-05-01_23-22-23.wav,44100,16,60,1,ndsi,1024,1000,2000,2000,11000,0.916289272261037,NA 
rayol-farm2_2019-05-01_23-24-23.wav,44100,16,60,1,ndsi,1024,1000,2000,2000,11000,0.916903336058478,NA 
rayol-farm2_2019-05-01_23-26-23.wav,44100,16,60,1,ndsi,1024,1000,2000,2000,11000,0.919237104655912,NA 
rayol-farm2_2019-05-01_23-28-23.wav,44100,16,60,1,ndsi,1024,1000,2000,2000,11000,0.91726735761267,NA 
rayol-farm2_2019-05-01_23-30-24.wav,44100,16,60,1,ndsi,1024,1000,2000,2000,11000,0.912216284306638,NA 
rayol-farm2_2019-05-01_23-32-24.wav,44100,16,60,1,ndsi,1024,1000,2000,2000,11000,0.919252620977383,NA 
rayol-farm2_2019-05-01_23-34-24.wav,44100,16,60,1,ndsi,1024,1000,2000,2000,11000,0.918224221819447,NA 
rayol-farm2_2019-05-01_23-36-24.wav,44100,16,60,1,ndsi,1024,1000,2000,2000,11000,0.914679566958828,NA 
rayol-farm2_2019-05-01_23-38-24.wav,44100,16,60,1,ndsi,1024,1000,2000,2000,11000,0.906476200154407,NA 
rayol-farm2_2019-05-01_23-40-24.wav,44100,16,60,1,ndsi,1024,1000,2000,2000,11000,0.916998490163599,NA 
rayol-farm2_2019-05-01_23-42-24.wav,44100,16,60,1,ndsi,1024,1000,2000,2000,11000,0.915449680835189,NA 
rayol-farm2_2019-05-01_23-44-24.wav,44100,16,60,1,ndsi,1024,1000,2000,2000,11000,0.911812723463725,NA 
rayol-farm2_2019-05-01_23-46-25.wav,44100,16,60,1,ndsi,1024,1000,2000,2000,11000,0.911300368163841,NA 
rayol-farm2_2019-05-01_23-48-25.wav,44100,16,60,1,ndsi,1024,1000,2000,2000,11000,0.912116605545932,NA 
rayol-farm2_2019-05-01_23-50-25.wav,44100,16,60,1,ndsi,1024,1000,2000,2000,11000,0.912662241930259,NA 
rayol-farm2_2019-05-01_23-52-25.wav,44100,16,60,1,ndsi,1024,1000,2000,2000,11000,0.912685107587563,NA 
rayol-farm2_2019-05-01_23-54-25.wav,44100,16,60,1,ndsi,1024,1000,2000,2000,11000,0.913101263785053,NA 
rayol-farm2_2019-05-01_23-56-25.wav,44100,16,60,1,ndsi,1024,1000,2000,2000,11000,0.912729579341494,NA 
rayol-farm2_2019-05-01_23-58-25.wav,44100,16,60,1,ndsi,1024,1000,2000,2000,11000,0.912988008022101,NA
