FILENAME,SAMPLINGRATE,BIT,DURATION,CHANNELS,INDEX,FFT_W,MIN_FREQ,MAX_FREQ,J,LEFT_CHANNEL,RIGHT_CHANNEL
rayol-farm2_2019-03-25_00-00-03.wav,44100,16,60,1,acoustic_complexity,512,1,NA,5,1807.36794123888,NA 
rayol-farm2_2019-03-25_00-02-03.wav,44100,16,60,1,acoustic_complexity,512,1,NA,5,1817.27953149584,NA 
rayol-farm2_2019-03-25_00-04-04.wav,44100,16,60,1,acoustic_complexity,512,1,NA,5,1811.09037342284,NA 
rayol-farm2_2019-03-25_00-06-04.wav,44100,16,60,1,acoustic_complexity,512,1,NA,5,1800.24644170583,NA 
rayol-farm2_2019-03-25_00-08-04.wav,44100,16,60,1,acoustic_complexity,512,1,NA,5,1828.09565333584,NA 
rayol-farm2_2019-03-25_00-10-04.wav,44100,16,60,1,acoustic_complexity,512,1,NA,5,1812.55076345486,NA 
rayol-farm2_2019-03-25_00-12-04.wav,44100,16,60,1,acoustic_complexity,512,1,NA,5,1811.28849246833,NA 
rayol-farm2_2019-03-25_00-14-04.wav,44100,16,60,1,acoustic_complexity,512,1,NA,5,1820.57066052689,NA 
rayol-farm2_2019-03-25_00-16-04.wav,44100,16,60,1,acoustic_complexity,512,1,NA,5,1815.55316529297,NA 
rayol-farm2_2019-03-25_00-18-04.wav,44100,16,60,1,acoustic_complexity,512,1,NA,5,1812.85291533485,NA 
rayol-farm2_2019-03-25_00-20-05.wav,44100,16,60,1,acoustic_complexity,512,1,NA,5,1815.53964261914,NA 
rayol-farm2_2019-03-25_00-22-05.wav,44100,16,60,1,acoustic_complexity,512,1,NA,5,1819.45390241622,NA 
rayol-farm2_2019-03-25_00-24-05.wav,44100,16,60,1,acoustic_complexity,512,1,NA,5,1826.99489639168,NA 
rayol-farm2_2019-03-25_00-26-05.wav,44100,16,60,1,acoustic_complexity,512,1,NA,5,1801.26392810495,NA 
rayol-farm2_2019-03-25_00-28-05.wav,44100,16,60,1,acoustic_complexity,512,1,NA,5,1831.48713036766,NA 
rayol-farm2_2019-03-25_00-30-05.wav,44100,16,60,1,acoustic_complexity,512,1,NA,5,1818.79581688712,NA 
rayol-farm2_2019-03-25_00-32-05.wav,44100,16,60,1,acoustic_complexity,512,1,NA,5,1812.03224448397,NA 
rayol-farm2_2019-03-25_00-34-05.wav,44100,16,60,1,acoustic_complexity,512,1,NA,5,1822.19408662321,NA 
rayol-farm2_2019-03-25_00-36-06.wav,44100,16,60,1,acoustic_complexity,512,1,NA,5,1814.20102697252,NA 
rayol-farm2_2019-03-25_00-38-06.wav,44100,16,60,1,acoustic_complexity,512,1,NA,5,1808.83864750527,NA 
rayol-farm2_2019-03-25_00-40-06.wav,44100,16,60,1,acoustic_complexity,512,1,NA,5,1817.79902343033,NA 
rayol-farm2_2019-03-25_00-42-06.wav,44100,16,60,1,acoustic_complexity,512,1,NA,5,1813.30733258568,NA 
rayol-farm2_2019-03-25_00-44-06.wav,44100,16,60,1,acoustic_complexity,512,1,NA,5,1820.95256563405,NA 
rayol-farm2_2019-03-25_00-46-06.wav,44100,16,60,1,acoustic_complexity,512,1,NA,5,1811.23305807389,NA 
rayol-farm2_2019-03-25_00-48-06.wav,44100,16,60,1,acoustic_complexity,512,1,NA,5,1812.00456886154,NA 
rayol-farm2_2019-03-25_00-50-06.wav,44100,16,60,1,acoustic_complexity,512,1,NA,5,1817.18555050347,NA 
rayol-farm2_2019-03-25_00-52-06.wav,44100,16,60,1,acoustic_complexity,512,1,NA,5,1808.6991948615,NA 
rayol-farm2_2019-03-25_00-54-07.wav,44100,16,60,1,acoustic_complexity,512,1,NA,5,1820.68536881938,NA 
rayol-farm2_2019-03-25_00-56-07.wav,44100,16,60,1,acoustic_complexity,512,1,NA,5,1807.18090962784,NA 
rayol-farm2_2019-03-25_00-58-07.wav,44100,16,60,1,acoustic_complexity,512,1,NA,5,1811.21048240259,NA 
rayol-farm2_2019-03-25_01-00-07.wav,44100,16,60,1,acoustic_complexity,512,1,NA,5,1826.62648507237,NA 
rayol-farm2_2019-03-25_01-02-07.wav,44100,16,60,1,acoustic_complexity,512,1,NA,5,1820.58902062448,NA 
rayol-farm2_2019-03-25_01-04-07.wav,44100,16,60,1,acoustic_complexity,512,1,NA,5,1809.43280264393,NA 
rayol-farm2_2019-03-25_01-06-07.wav,44100,16,60,1,acoustic_complexity,512,1,NA,5,1799.9587686835,NA 
rayol-farm2_2019-03-25_01-08-07.wav,44100,16,60,1,acoustic_complexity,512,1,NA,5,1814.56027240115,NA 
rayol-farm2_2019-03-25_01-10-08.wav,44100,16,60,1,acoustic_complexity,512,1,NA,5,1795.52301297704,NA 
rayol-farm2_2019-03-25_01-12-08.wav,44100,16,60,1,acoustic_complexity,512,1,NA,5,1803.9720656362,NA 
rayol-farm2_2019-03-25_01-14-08.wav,44100,16,60,1,acoustic_complexity,512,1,NA,5,1810.78329686225,NA 
rayol-farm2_2019-03-25_01-16-08.wav,44100,16,60,1,acoustic_complexity,512,1,NA,5,1815.86018045307,NA 
rayol-farm2_2019-03-25_01-18-08.wav,44100,16,60,1,acoustic_complexity,512,1,NA,5,1822.1992039268,NA 
rayol-farm2_2019-03-25_01-20-08.wav,44100,16,60,1,acoustic_complexity,512,1,NA,5,1833.64668892762,NA 
rayol-farm2_2019-03-25_01-22-08.wav,44100,16,60,1,acoustic_complexity,512,1,NA,5,1821.11752267126,NA 
rayol-farm2_2019-03-25_01-24-08.wav,44100,16,60,1,acoustic_complexity,512,1,NA,5,1812.00567002985,NA 
rayol-farm2_2019-03-25_01-26-09.wav,44100,16,60,1,acoustic_complexity,512,1,NA,5,1809.93906223747,NA 
rayol-farm2_2019-03-25_01-28-09.wav,44100,16,60,1,acoustic_complexity,512,1,NA,5,1814.36526121255,NA 
rayol-farm2_2019-03-25_01-30-09.wav,44100,16,60,1,acoustic_complexity,512,1,NA,5,1818.66018205635,NA 
rayol-farm2_2019-03-25_01-32-09.wav,44100,16,60,1,acoustic_complexity,512,1,NA,5,1815.78831733872,NA 
rayol-farm2_2019-03-25_01-34-09.wav,44100,16,60,1,acoustic_complexity,512,1,NA,5,1812.56565310501,NA 
rayol-farm2_2019-03-25_01-36-09.wav,44100,16,60,1,acoustic_complexity,512,1,NA,5,1822.76755392519,NA 
rayol-farm2_2019-03-25_01-38-09.wav,44100,16,60,1,acoustic_complexity,512,1,NA,5,1823.28888596504,NA 
rayol-farm2_2019-03-25_01-40-09.wav,44100,16,60,1,acoustic_complexity,512,1,NA,5,1828.53121155932,NA 
rayol-farm2_2019-03-25_01-42-10.wav,44100,16,60,1,acoustic_complexity,512,1,NA,5,1833.61340068723,NA 
rayol-farm2_2019-03-25_01-44-10.wav,44100,16,60,1,acoustic_complexity,512,1,NA,5,1824.30098044285,NA 
rayol-farm2_2019-03-25_01-46-10.wav,44100,16,60,1,acoustic_complexity,512,1,NA,5,1816.08245331448,NA 
rayol-farm2_2019-03-25_01-48-10.wav,44100,16,60,1,acoustic_complexity,512,1,NA,5,1813.81221126683,NA 
rayol-farm2_2019-03-25_01-50-10.wav,44100,16,60,1,acoustic_complexity,512,1,NA,5,1817.02141117741,NA 
rayol-farm2_2019-03-25_01-52-10.wav,44100,16,60,1,acoustic_complexity,512,1,NA,5,1808.53979796932,NA 
rayol-farm2_2019-03-25_01-54-10.wav,44100,16,60,1,acoustic_complexity,512,1,NA,5,1807.00022255611,NA 
rayol-farm2_2019-03-25_01-56-10.wav,44100,16,60,1,acoustic_complexity,512,1,NA,5,1807.91934093869,NA 
rayol-farm2_2019-03-25_01-58-11.wav,44100,16,60,1,acoustic_complexity,512,1,NA,5,1813.56136413289,NA 
rayol-farm2_2019-03-25_02-00-11.wav,44100,16,60,1,acoustic_complexity,512,1,NA,5,1816.14369055461,NA 
rayol-farm2_2019-03-25_02-02-11.wav,44100,16,60,1,acoustic_complexity,512,1,NA,5,1833.42834095972,NA 
rayol-farm2_2019-03-25_02-04-11.wav,44100,16,60,1,acoustic_complexity,512,1,NA,5,1816.53128115418,NA 
rayol-farm2_2019-03-25_02-06-11.wav,44100,16,60,1,acoustic_complexity,512,1,NA,5,1810.33821407184,NA 
rayol-farm2_2019-03-25_02-08-11.wav,44100,16,60,1,acoustic_complexity,512,1,NA,5,1819.27495178519,NA 
rayol-farm2_2019-03-25_02-10-11.wav,44100,16,60,1,acoustic_complexity,512,1,NA,5,1812.0812908732,NA 
rayol-farm2_2019-03-25_02-12-11.wav,44100,16,60,1,acoustic_complexity,512,1,NA,5,1811.31915344049,NA 
rayol-farm2_2019-03-25_02-14-11.wav,44100,16,60,1,acoustic_complexity,512,1,NA,5,1836.62615903203,NA 
rayol-farm2_2019-03-25_02-16-12.wav,44100,16,60,1,acoustic_complexity,512,1,NA,5,1821.94758212828,NA 
rayol-farm2_2019-03-25_02-18-12.wav,44100,16,60,1,acoustic_complexity,512,1,NA,5,1810.95934246194,NA 
rayol-farm2_2019-03-25_02-20-12.wav,44100,16,60,1,acoustic_complexity,512,1,NA,5,1832.91367050645,NA 
rayol-farm2_2019-03-25_02-22-12.wav,44100,16,60,1,acoustic_complexity,512,1,NA,5,1821.1059668602,NA 
rayol-farm2_2019-03-25_02-24-12.wav,44100,16,60,1,acoustic_complexity,512,1,NA,5,1813.45196295107,NA 
rayol-farm2_2019-03-25_02-26-12.wav,44100,16,60,1,acoustic_complexity,512,1,NA,5,1814.83436512079,NA 
rayol-farm2_2019-03-25_02-28-12.wav,44100,16,60,1,acoustic_complexity,512,1,NA,5,1820.0547272563,NA 
rayol-farm2_2019-03-25_02-30-12.wav,44100,16,60,1,acoustic_complexity,512,1,NA,5,1816.36518015768,NA 
rayol-farm2_2019-03-25_02-32-13.wav,44100,16,60,1,acoustic_complexity,512,1,NA,5,1807.90354100989,NA 
rayol-farm2_2019-03-25_02-34-13.wav,44100,16,60,1,acoustic_complexity,512,1,NA,5,1823.12689395325,NA 
rayol-farm2_2019-03-25_02-36-13.wav,44100,16,60,1,acoustic_complexity,512,1,NA,5,1815.17923972287,NA 
rayol-farm2_2019-03-25_02-38-13.wav,44100,16,60,1,acoustic_complexity,512,1,NA,5,1811.64656735305,NA 
rayol-farm2_2019-03-25_02-40-13.wav,44100,16,60,1,acoustic_complexity,512,1,NA,5,1812.52694324685,NA 
rayol-farm2_2019-03-25_02-42-13.wav,44100,16,60,1,acoustic_complexity,512,1,NA,5,1817.53384434855,NA 
rayol-farm2_2019-03-25_02-44-13.wav,44100,16,60,1,acoustic_complexity,512,1,NA,5,1804.38492609612,NA 
rayol-farm2_2019-03-25_02-46-13.wav,44100,16,60,1,acoustic_complexity,512,1,NA,5,1804.10327943269,NA 
rayol-farm2_2019-03-25_02-48-13.wav,44100,16,60,1,acoustic_complexity,512,1,NA,5,1808.83883523468,NA 
rayol-farm2_2019-03-25_02-50-14.wav,44100,16,60,1,acoustic_complexity,512,1,NA,5,1810.20472399333,NA 
rayol-farm2_2019-03-25_02-52-14.wav,44100,16,60,1,acoustic_complexity,512,1,NA,5,1803.3750269097,NA 
rayol-farm2_2019-03-25_02-54-14.wav,44100,16,60,1,acoustic_complexity,512,1,NA,5,1789.06849634268,NA 
rayol-farm2_2019-03-25_02-56-14.wav,44100,16,60,1,acoustic_complexity,512,1,NA,5,1800.80651055185,NA 
rayol-farm2_2019-03-25_02-58-14.wav,44100,16,60,1,acoustic_complexity,512,1,NA,5,1816.23809543967,NA 
rayol-farm2_2019-03-25_03-00-14.wav,44100,16,60,1,acoustic_complexity,512,1,NA,5,1816.21472975747,NA 
rayol-farm2_2019-03-25_03-02-14.wav,44100,16,60,1,acoustic_complexity,512,1,NA,5,1815.58359554301,NA 
rayol-farm2_2019-03-25_03-04-14.wav,44100,16,60,1,acoustic_complexity,512,1,NA,5,1811.08324869965,NA 
rayol-farm2_2019-03-25_03-06-15.wav,44100,16,60,1,acoustic_complexity,512,1,NA,5,1815.11174464615,NA 
rayol-farm2_2019-03-25_03-08-15.wav,44100,16,60,1,acoustic_complexity,512,1,NA,5,1819.76388253956,NA 
rayol-farm2_2019-03-25_03-10-15.wav,44100,16,60,1,acoustic_complexity,512,1,NA,5,1803.14919841061,NA 
rayol-farm2_2019-03-25_03-12-15.wav,44100,16,60,1,acoustic_complexity,512,1,NA,5,1818.86411359429,NA 
rayol-farm2_2019-03-25_03-14-15.wav,44100,16,60,1,acoustic_complexity,512,1,NA,5,1803.14129600275,NA 
rayol-farm2_2019-03-25_03-16-15.wav,44100,16,60,1,acoustic_complexity,512,1,NA,5,1807.93392924653,NA 
rayol-farm2_2019-03-25_03-18-15.wav,44100,16,60,1,acoustic_complexity,512,1,NA,5,1813.76796178061,NA 
rayol-farm2_2019-03-25_03-20-15.wav,44100,16,60,1,acoustic_complexity,512,1,NA,5,1809.29376281727,NA 
rayol-farm2_2019-03-25_03-22-16.wav,44100,16,60,1,acoustic_complexity,512,1,NA,5,1821.66771812094,NA 
rayol-farm2_2019-03-25_03-24-16.wav,44100,16,60,1,acoustic_complexity,512,1,NA,5,1815.06415567831,NA 
rayol-farm2_2019-03-25_03-26-16.wav,44100,16,60,1,acoustic_complexity,512,1,NA,5,1810.38374783351,NA 
rayol-farm2_2019-03-25_03-28-16.wav,44100,16,60,1,acoustic_complexity,512,1,NA,5,1801.46553231796,NA 
rayol-farm2_2019-03-25_03-30-16.wav,44100,16,60,1,acoustic_complexity,512,1,NA,5,1808.68658186543,NA 
rayol-farm2_2019-03-25_03-32-16.wav,44100,16,60,1,acoustic_complexity,512,1,NA,5,1818.69405181128,NA 
rayol-farm2_2019-03-25_03-34-16.wav,44100,16,60,1,acoustic_complexity,512,1,NA,5,1805.38316466095,NA 
rayol-farm2_2019-03-25_03-36-16.wav,44100,16,60,1,acoustic_complexity,512,1,NA,5,1800.31484503911,NA 
rayol-farm2_2019-03-25_03-38-17.wav,44100,16,60,1,acoustic_complexity,512,1,NA,5,1810.14240224676,NA 
rayol-farm2_2019-03-25_03-40-17.wav,44100,16,60,1,acoustic_complexity,512,1,NA,5,1819.12900778508,NA 
rayol-farm2_2019-03-25_03-42-17.wav,44100,16,60,1,acoustic_complexity,512,1,NA,5,1828.28995020646,NA 
rayol-farm2_2019-03-25_03-44-17.wav,44100,16,60,1,acoustic_complexity,512,1,NA,5,1821.01563013406,NA 
rayol-farm2_2019-03-25_03-46-17.wav,44100,16,60,1,acoustic_complexity,512,1,NA,5,1812.87195388614,NA 
rayol-farm2_2019-03-25_03-48-17.wav,44100,16,60,1,acoustic_complexity,512,1,NA,5,1822.26563146749,NA 
rayol-farm2_2019-03-25_03-50-17.wav,44100,16,60,1,acoustic_complexity,512,1,NA,5,1804.2117387091,NA 
rayol-farm2_2019-03-25_03-52-17.wav,44100,16,60,1,acoustic_complexity,512,1,NA,5,1801.42008550512,NA 
rayol-farm2_2019-03-25_03-54-17.wav,44100,16,60,1,acoustic_complexity,512,1,NA,5,1812.63225099132,NA 
rayol-farm2_2019-03-25_03-56-18.wav,44100,16,60,1,acoustic_complexity,512,1,NA,5,1818.60921636834,NA 
rayol-farm2_2019-03-25_03-58-18.wav,44100,16,60,1,acoustic_complexity,512,1,NA,5,1812.76943786962,NA 
rayol-farm2_2019-03-25_04-00-18.wav,44100,16,60,1,acoustic_complexity,512,1,NA,5,1817.20452791515,NA 
rayol-farm2_2019-03-25_04-02-18.wav,44100,16,60,1,acoustic_complexity,512,1,NA,5,1813.89229110394,NA 
rayol-farm2_2019-03-25_04-04-18.wav,44100,16,60,1,acoustic_complexity,512,1,NA,5,1827.63109154869,NA 
rayol-farm2_2019-03-25_04-06-18.wav,44100,16,60,1,acoustic_complexity,512,1,NA,5,1814.09970071938,NA 
rayol-farm2_2019-03-25_04-08-18.wav,44100,16,60,1,acoustic_complexity,512,1,NA,5,1801.70412775631,NA 
rayol-farm2_2019-03-25_04-10-18.wav,44100,16,60,1,acoustic_complexity,512,1,NA,5,1817.61081494782,NA 
rayol-farm2_2019-03-25_04-12-19.wav,44100,16,60,1,acoustic_complexity,512,1,NA,5,1808.39527403559,NA 
rayol-farm2_2019-03-25_04-14-19.wav,44100,16,60,1,acoustic_complexity,512,1,NA,5,1819.32183264304,NA 
rayol-farm2_2019-03-25_04-16-19.wav,44100,16,60,1,acoustic_complexity,512,1,NA,5,1799.53406675958,NA 
rayol-farm2_2019-03-25_04-18-19.wav,44100,16,60,1,acoustic_complexity,512,1,NA,5,1813.28839894409,NA 
rayol-farm2_2019-03-25_04-20-19.wav,44100,16,60,1,acoustic_complexity,512,1,NA,5,1823.47703405424,NA 
rayol-farm2_2019-03-25_04-22-19.wav,44100,16,60,1,acoustic_complexity,512,1,NA,5,1819.16368090306,NA 
rayol-farm2_2019-03-25_04-24-19.wav,44100,16,60,1,acoustic_complexity,512,1,NA,5,1824.94591459464,NA 
rayol-farm2_2019-03-25_04-26-19.wav,44100,16,60,1,acoustic_complexity,512,1,NA,5,1821.61134908782,NA 
rayol-farm2_2019-03-25_04-28-20.wav,44100,16,60,1,acoustic_complexity,512,1,NA,5,1814.89122432415,NA 
rayol-farm2_2019-03-25_04-30-20.wav,44100,16,60,1,acoustic_complexity,512,1,NA,5,1820.14586089195,NA 
rayol-farm2_2019-03-25_04-32-20.wav,44100,16,60,1,acoustic_complexity,512,1,NA,5,1826.21950641293,NA 
rayol-farm2_2019-03-25_04-34-20.wav,44100,16,60,1,acoustic_complexity,512,1,NA,5,1811.67035525434,NA 
rayol-farm2_2019-03-25_04-36-20.wav,44100,16,60,1,acoustic_complexity,512,1,NA,5,1826.8089855735,NA 
rayol-farm2_2019-03-25_04-38-20.wav,44100,16,60,1,acoustic_complexity,512,1,NA,5,1807.99417699679,NA 
rayol-farm2_2019-03-25_04-40-20.wav,44100,16,60,1,acoustic_complexity,512,1,NA,5,1817.03568811308,NA 
rayol-farm2_2019-03-25_04-42-20.wav,44100,16,60,1,acoustic_complexity,512,1,NA,5,1822.42415506612,NA 
rayol-farm2_2019-03-25_04-44-20.wav,44100,16,60,1,acoustic_complexity,512,1,NA,5,1817.29521796209,NA 
rayol-farm2_2019-03-25_04-46-21.wav,44100,16,60,1,acoustic_complexity,512,1,NA,5,1827.17232642379,NA 
rayol-farm2_2019-03-25_04-48-21.wav,44100,16,60,1,acoustic_complexity,512,1,NA,5,1819.05781998913,NA 
rayol-farm2_2019-03-25_04-50-21.wav,44100,16,60,1,acoustic_complexity,512,1,NA,5,1812.39058682025,NA 
rayol-farm2_2019-03-25_04-52-21.wav,44100,16,60,1,acoustic_complexity,512,1,NA,5,1821.51387742591,NA 
rayol-farm2_2019-03-25_04-54-21.wav,44100,16,60,1,acoustic_complexity,512,1,NA,5,1817.72774869326,NA 
rayol-farm2_2019-03-25_04-56-21.wav,44100,16,60,1,acoustic_complexity,512,1,NA,5,1816.77352474283,NA 
rayol-farm2_2019-03-25_04-58-21.wav,44100,16,60,1,acoustic_complexity,512,1,NA,5,1805.32887720625,NA 
rayol-farm2_2019-03-25_05-00-21.wav,44100,16,60,1,acoustic_complexity,512,1,NA,5,1819.93613332416,NA 
rayol-farm2_2019-03-25_05-02-22.wav,44100,16,60,1,acoustic_complexity,512,1,NA,5,1818.76800488403,NA 
rayol-farm2_2019-03-25_05-04-22.wav,44100,16,60,1,acoustic_complexity,512,1,NA,5,1827.11960862804,NA 
rayol-farm2_2019-03-25_05-06-22.wav,44100,16,60,1,acoustic_complexity,512,1,NA,5,1831.66953382972,NA 
rayol-farm2_2019-03-25_05-08-22.wav,44100,16,60,1,acoustic_complexity,512,1,NA,5,1814.62838180192,NA 
rayol-farm2_2019-03-25_05-10-22.wav,44100,16,60,1,acoustic_complexity,512,1,NA,5,1816.69343755004,NA 
rayol-farm2_2019-03-25_05-12-22.wav,44100,16,60,1,acoustic_complexity,512,1,NA,5,1809.62536483712,NA 
rayol-farm2_2019-03-25_05-14-22.wav,44100,16,60,1,acoustic_complexity,512,1,NA,5,1810.53489613363,NA 
rayol-farm2_2019-03-25_05-16-22.wav,44100,16,60,1,acoustic_complexity,512,1,NA,5,1817.81496628521,NA 
rayol-farm2_2019-03-25_05-18-23.wav,44100,16,60,1,acoustic_complexity,512,1,NA,5,1823.90471887635,NA 
rayol-farm2_2019-03-25_05-20-23.wav,44100,16,60,1,acoustic_complexity,512,1,NA,5,1828.30841644973,NA 
rayol-farm2_2019-03-25_05-22-23.wav,44100,16,60,1,acoustic_complexity,512,1,NA,5,1828.46762648286,NA 
rayol-farm2_2019-03-25_05-24-23.wav,44100,16,60,1,acoustic_complexity,512,1,NA,5,1816.5471283386,NA 
rayol-farm2_2019-03-25_05-26-23.wav,44100,16,60,1,acoustic_complexity,512,1,NA,5,1821.30866153034,NA 
rayol-farm2_2019-03-25_05-28-23.wav,44100,16,60,1,acoustic_complexity,512,1,NA,5,1818.85388138066,NA 
rayol-farm2_2019-03-25_05-30-23.wav,44100,16,60,1,acoustic_complexity,512,1,NA,5,1823.95585770986,NA 
rayol-farm2_2019-03-25_05-32-23.wav,44100,16,60,1,acoustic_complexity,512,1,NA,5,1813.40534810478,NA 
rayol-farm2_2019-03-25_05-34-24.wav,44100,16,60,1,acoustic_complexity,512,1,NA,5,1921.89806639842,NA 
rayol-farm2_2019-03-25_05-36-24.wav,44100,16,60,1,acoustic_complexity,512,1,NA,5,1822.19444192305,NA 
rayol-farm2_2019-03-25_05-38-24.wav,44100,16,60,1,acoustic_complexity,512,1,NA,5,1782.28023848631,NA 
rayol-farm2_2019-03-25_05-40-24.wav,44100,16,60,1,acoustic_complexity,512,1,NA,5,1836.70123862921,NA 
rayol-farm2_2019-03-25_05-42-24.wav,44100,16,60,1,acoustic_complexity,512,1,NA,5,1824.33770888283,NA 
rayol-farm2_2019-03-25_05-44-24.wav,44100,16,60,1,acoustic_complexity,512,1,NA,5,1833.75325452336,NA 
rayol-farm2_2019-03-25_05-46-24.wav,44100,16,60,1,acoustic_complexity,512,1,NA,5,1840.01550791225,NA 
rayol-farm2_2019-03-25_05-48-24.wav,44100,16,60,1,acoustic_complexity,512,1,NA,5,1793.85071553852,NA 
rayol-farm2_2019-03-25_05-50-24.wav,44100,16,60,1,acoustic_complexity,512,1,NA,5,1800.64347162345,NA 
rayol-farm2_2019-03-25_05-52-25.wav,44100,16,60,1,acoustic_complexity,512,1,NA,5,1813.31855265634,NA 
rayol-farm2_2019-03-25_05-54-25.wav,44100,16,60,1,acoustic_complexity,512,1,NA,5,1812.0399997735,NA 
rayol-farm2_2019-03-25_05-56-25.wav,44100,16,60,1,acoustic_complexity,512,1,NA,5,1822.85255727254,NA 
rayol-farm2_2019-03-25_05-58-25.wav,44100,16,60,1,acoustic_complexity,512,1,NA,5,1829.73580612883,NA 
rayol-farm2_2019-03-25_06-00-25.wav,44100,16,60,1,acoustic_complexity,512,1,NA,5,1823.52803298861,NA 
rayol-farm2_2019-03-25_06-02-25.wav,44100,16,60,1,acoustic_complexity,512,1,NA,5,1831.60559872025,NA 
rayol-farm2_2019-03-25_06-04-25.wav,44100,16,60,1,acoustic_complexity,512,1,NA,5,1812.8465569787,NA 
rayol-farm2_2019-03-25_06-06-25.wav,44100,16,60,1,acoustic_complexity,512,1,NA,5,1824.69106592012,NA 
rayol-farm2_2019-03-25_06-08-26.wav,44100,16,60,1,acoustic_complexity,512,1,NA,5,1836.09993280218,NA 
rayol-farm2_2019-03-25_06-10-26.wav,44100,16,60,1,acoustic_complexity,512,1,NA,5,1807.03099755961,NA 
rayol-farm2_2019-03-25_06-12-26.wav,44100,16,60,1,acoustic_complexity,512,1,NA,5,1801.21077569282,NA 
rayol-farm2_2019-03-25_06-14-26.wav,44100,16,60,1,acoustic_complexity,512,1,NA,5,1814.34304750617,NA 
rayol-farm2_2019-03-25_06-16-26.wav,44100,16,60,1,acoustic_complexity,512,1,NA,5,1799.23014661315,NA 
rayol-farm2_2019-03-25_06-18-26.wav,44100,16,60,1,acoustic_complexity,512,1,NA,5,1801.45637840424,NA 
rayol-farm2_2019-03-25_06-20-26.wav,44100,16,60,1,acoustic_complexity,512,1,NA,5,1813.67963419698,NA 
rayol-farm2_2019-03-25_06-22-26.wav,44100,16,60,1,acoustic_complexity,512,1,NA,5,1797.13412434616,NA 
rayol-farm2_2019-03-25_06-24-27.wav,44100,16,60,1,acoustic_complexity,512,1,NA,5,1805.64851673666,NA 
rayol-farm2_2019-03-25_06-26-27.wav,44100,16,60,1,acoustic_complexity,512,1,NA,5,1801.44912402411,NA 
rayol-farm2_2019-03-25_06-28-27.wav,44100,16,60,1,acoustic_complexity,512,1,NA,5,1794.23748745546,NA 
rayol-farm2_2019-03-25_06-30-27.wav,44100,16,60,1,acoustic_complexity,512,1,NA,5,1789.93713626691,NA 
rayol-farm2_2019-03-25_06-32-27.wav,44100,16,60,1,acoustic_complexity,512,1,NA,5,1788.52385318468,NA 
rayol-farm2_2019-03-25_06-34-27.wav,44100,16,60,1,acoustic_complexity,512,1,NA,5,1823.54345589642,NA 
rayol-farm2_2019-03-25_06-36-27.wav,44100,16,60,1,acoustic_complexity,512,1,NA,5,1860.66203461071,NA 
rayol-farm2_2019-03-25_06-38-27.wav,44100,16,60,1,acoustic_complexity,512,1,NA,5,1797.22309401157,NA 
rayol-farm2_2019-03-25_06-40-28.wav,44100,16,60,1,acoustic_complexity,512,1,NA,5,1793.64350328635,NA 
rayol-farm2_2019-03-25_06-42-28.wav,44100,16,60,1,acoustic_complexity,512,1,NA,5,1792.86583922574,NA 
rayol-farm2_2019-03-25_06-44-28.wav,44100,16,60,1,acoustic_complexity,512,1,NA,5,1798.41021530384,NA 
rayol-farm2_2019-03-25_06-46-28.wav,44100,16,60,1,acoustic_complexity,512,1,NA,5,1816.11705212374,NA 
rayol-farm2_2019-03-25_06-48-28.wav,44100,16,60,1,acoustic_complexity,512,1,NA,5,1798.57471989052,NA 
rayol-farm2_2019-03-25_06-50-28.wav,44100,16,60,1,acoustic_complexity,512,1,NA,5,1792.71773742471,NA 
rayol-farm2_2019-03-25_06-52-28.wav,44100,16,60,1,acoustic_complexity,512,1,NA,5,1785.403631072,NA 
rayol-farm2_2019-03-25_06-54-28.wav,44100,16,60,1,acoustic_complexity,512,1,NA,5,1807.95411263206,NA 
rayol-farm2_2019-03-25_06-56-28.wav,44100,16,60,1,acoustic_complexity,512,1,NA,5,1789.09553341427,NA 
rayol-farm2_2019-03-25_06-58-29.wav,44100,16,60,1,acoustic_complexity,512,1,NA,5,1797.84489647738,NA 
rayol-farm2_2019-03-25_07-00-29.wav,44100,16,60,1,acoustic_complexity,512,1,NA,5,1793.55722588403,NA 
rayol-farm2_2019-03-25_07-02-29.wav,44100,16,60,1,acoustic_complexity,512,1,NA,5,1800.30638151396,NA 
rayol-farm2_2019-03-25_07-04-29.wav,44100,16,60,1,acoustic_complexity,512,1,NA,5,1784.81803106085,NA 
rayol-farm2_2019-03-25_07-06-29.wav,44100,16,60,1,acoustic_complexity,512,1,NA,5,1803.82612148481,NA 
rayol-farm2_2019-03-25_07-08-29.wav,44100,16,60,1,acoustic_complexity,512,1,NA,5,1798.7951843175,NA 
rayol-farm2_2019-03-25_07-10-29.wav,44100,16,60,1,acoustic_complexity,512,1,NA,5,1801.91322096441,NA 
rayol-farm2_2019-03-25_07-12-29.wav,44100,16,60,1,acoustic_complexity,512,1,NA,5,1807.48702933355,NA 
rayol-farm2_2019-03-25_07-14-30.wav,44100,16,60,1,acoustic_complexity,512,1,NA,5,1804.39796919941,NA 
rayol-farm2_2019-03-25_07-16-30.wav,44100,16,60,1,acoustic_complexity,512,1,NA,5,1796.216793772,NA 
rayol-farm2_2019-03-25_07-18-30.wav,44100,16,60,1,acoustic_complexity,512,1,NA,5,1787.40624760746,NA 
rayol-farm2_2019-03-25_07-20-30.wav,44100,16,60,1,acoustic_complexity,512,1,NA,5,1801.72870546647,NA 
rayol-farm2_2019-03-25_07-22-30.wav,44100,16,60,1,acoustic_complexity,512,1,NA,5,1790.45000450962,NA 
rayol-farm2_2019-03-25_07-24-30.wav,44100,16,60,1,acoustic_complexity,512,1,NA,5,1784.89776238604,NA 
rayol-farm2_2019-03-25_07-26-30.wav,44100,16,60,1,acoustic_complexity,512,1,NA,5,1799.30187467178,NA 
rayol-farm2_2019-03-25_07-28-30.wav,44100,16,60,1,acoustic_complexity,512,1,NA,5,1799.21055554433,NA 
rayol-farm2_2019-03-25_07-30-31.wav,44100,16,60,1,acoustic_complexity,512,1,NA,5,1799.4910453438,NA 
rayol-farm2_2019-03-25_07-32-31.wav,44100,16,60,1,acoustic_complexity,512,1,NA,5,1807.78368385136,NA 
rayol-farm2_2019-03-25_07-34-31.wav,44100,16,60,1,acoustic_complexity,512,1,NA,5,1817.57052784994,NA 
rayol-farm2_2019-03-25_07-36-31.wav,44100,16,60,1,acoustic_complexity,512,1,NA,5,1800.49473951077,NA 
rayol-farm2_2019-03-25_07-38-31.wav,44100,16,60,1,acoustic_complexity,512,1,NA,5,1795.82349967724,NA 
rayol-farm2_2019-03-25_07-40-31.wav,44100,16,60,1,acoustic_complexity,512,1,NA,5,1800.66804909262,NA 
rayol-farm2_2019-03-25_07-42-31.wav,44100,16,60,1,acoustic_complexity,512,1,NA,5,1798.33183925062,NA 
rayol-farm2_2019-03-25_07-44-31.wav,44100,16,60,1,acoustic_complexity,512,1,NA,5,1791.76713270383,NA 
rayol-farm2_2019-03-25_07-46-32.wav,44100,16,60,1,acoustic_complexity,512,1,NA,5,1787.30519395552,NA 
rayol-farm2_2019-03-25_07-48-32.wav,44100,16,60,1,acoustic_complexity,512,1,NA,5,1808.02284224729,NA 
rayol-farm2_2019-03-25_07-50-32.wav,44100,16,60,1,acoustic_complexity,512,1,NA,5,1798.64876432428,NA 
rayol-farm2_2019-03-25_07-52-32.wav,44100,16,60,1,acoustic_complexity,512,1,NA,5,1796.40073144193,NA 
rayol-farm2_2019-03-25_07-54-32.wav,44100,16,60,1,acoustic_complexity,512,1,NA,5,1793.8531186533,NA 
rayol-farm2_2019-03-25_07-56-32.wav,44100,16,60,1,acoustic_complexity,512,1,NA,5,1807.62570283148,NA 
rayol-farm2_2019-03-25_07-58-32.wav,44100,16,60,1,acoustic_complexity,512,1,NA,5,1829.60545220188,NA 
rayol-farm2_2019-03-25_08-00-32.wav,44100,16,60,1,acoustic_complexity,512,1,NA,5,1815.25864308772,NA 
rayol-farm2_2019-03-25_08-02-32.wav,44100,16,60,1,acoustic_complexity,512,1,NA,5,1786.47442061411,NA 
rayol-farm2_2019-03-25_08-04-33.wav,44100,16,60,1,acoustic_complexity,512,1,NA,5,1761.28499799848,NA 
rayol-farm2_2019-03-25_08-06-33.wav,44100,16,60,1,acoustic_complexity,512,1,NA,5,1808.69762588573,NA 
rayol-farm2_2019-03-25_08-08-33.wav,44100,16,60,1,acoustic_complexity,512,1,NA,5,1806.8878801629,NA 
rayol-farm2_2019-03-25_08-10-33.wav,44100,16,60,1,acoustic_complexity,512,1,NA,5,1875.15779930508,NA 
rayol-farm2_2019-03-25_08-12-33.wav,44100,16,60,1,acoustic_complexity,512,1,NA,5,1817.4011268767,NA 
rayol-farm2_2019-03-25_08-14-33.wav,44100,16,60,1,acoustic_complexity,512,1,NA,5,1812.03301741994,NA 
rayol-farm2_2019-03-25_08-16-33.wav,44100,16,60,1,acoustic_complexity,512,1,NA,5,1817.00796281528,NA 
rayol-farm2_2019-03-25_08-18-33.wav,44100,16,60,1,acoustic_complexity,512,1,NA,5,1832.76255478546,NA 
rayol-farm2_2019-03-25_08-20-34.wav,44100,16,60,1,acoustic_complexity,512,1,NA,5,1820.34014783171,NA 
rayol-farm2_2019-03-25_08-22-34.wav,44100,16,60,1,acoustic_complexity,512,1,NA,5,1833.36234777346,NA 
rayol-farm2_2019-03-25_08-24-34.wav,44100,16,60,1,acoustic_complexity,512,1,NA,5,1825.6497105316,NA 
rayol-farm2_2019-03-25_08-26-34.wav,44100,16,60,1,acoustic_complexity,512,1,NA,5,1826.56516670024,NA 
rayol-farm2_2019-03-25_08-28-34.wav,44100,16,60,1,acoustic_complexity,512,1,NA,5,1826.99091765526,NA 
rayol-farm2_2019-03-25_08-30-34.wav,44100,16,60,1,acoustic_complexity,512,1,NA,5,1824.54620566168,NA 
rayol-farm2_2019-03-25_08-32-34.wav,44100,16,60,1,acoustic_complexity,512,1,NA,5,1809.89498602961,NA 
rayol-farm2_2019-03-25_08-34-34.wav,44100,16,60,1,acoustic_complexity,512,1,NA,5,1822.77098097882,NA 
rayol-farm2_2019-03-25_08-36-34.wav,44100,16,60,1,acoustic_complexity,512,1,NA,5,1819.46021161659,NA 
rayol-farm2_2019-03-25_08-38-35.wav,44100,16,60,1,acoustic_complexity,512,1,NA,5,1820.58363928926,NA 
rayol-farm2_2019-03-25_08-40-35.wav,44100,16,60,1,acoustic_complexity,512,1,NA,5,1835.0931081065,NA 
rayol-farm2_2019-03-25_08-42-35.wav,44100,16,60,1,acoustic_complexity,512,1,NA,5,1833.21539890079,NA 
rayol-farm2_2019-03-25_08-44-35.wav,44100,16,60,1,acoustic_complexity,512,1,NA,5,1838.5590813714,NA 
rayol-farm2_2019-03-25_08-46-35.wav,44100,16,60,1,acoustic_complexity,512,1,NA,5,1828.15478054303,NA 
rayol-farm2_2019-03-25_08-48-35.wav,44100,16,60,1,acoustic_complexity,512,1,NA,5,1820.70316699029,NA 
rayol-farm2_2019-03-25_08-50-35.wav,44100,16,60,1,acoustic_complexity,512,1,NA,5,1830.98120946431,NA 
rayol-farm2_2019-03-25_08-52-35.wav,44100,16,60,1,acoustic_complexity,512,1,NA,5,1839.28386064668,NA 
rayol-farm2_2019-03-25_08-54-36.wav,44100,16,60,1,acoustic_complexity,512,1,NA,5,1834.09815420869,NA 
rayol-farm2_2019-03-25_08-56-36.wav,44100,16,60,1,acoustic_complexity,512,1,NA,5,1881.87194909383,NA 
rayol-farm2_2019-03-25_08-58-36.wav,44100,16,60,1,acoustic_complexity,512,1,NA,5,1835.17575464349,NA 
rayol-farm2_2019-03-25_09-00-36.wav,44100,16,60,1,acoustic_complexity,512,1,NA,5,1826.44890397417,NA 
rayol-farm2_2019-03-25_09-02-36.wav,44100,16,60,1,acoustic_complexity,512,1,NA,5,1836.36945744144,NA 
rayol-farm2_2019-03-25_09-04-36.wav,44100,16,60,1,acoustic_complexity,512,1,NA,5,1879.0397861152,NA 
rayol-farm2_2019-03-25_09-06-36.wav,44100,16,60,1,acoustic_complexity,512,1,NA,5,1828.96696768247,NA 
rayol-farm2_2019-03-25_09-08-36.wav,44100,16,60,1,acoustic_complexity,512,1,NA,5,1858.03409010818,NA 
rayol-farm2_2019-03-25_09-10-37.wav,44100,16,60,1,acoustic_complexity,512,1,NA,5,1839.02516916922,NA 
rayol-farm2_2019-03-25_09-12-37.wav,44100,16,60,1,acoustic_complexity,512,1,NA,5,1839.32955017878,NA 
rayol-farm2_2019-03-25_09-14-37.wav,44100,16,60,1,acoustic_complexity,512,1,NA,5,1839.63168605874,NA 
rayol-farm2_2019-03-25_09-16-37.wav,44100,16,60,1,acoustic_complexity,512,1,NA,5,1834.8871329882,NA 
rayol-farm2_2019-03-25_09-18-37.wav,44100,16,60,1,acoustic_complexity,512,1,NA,5,1855.05294769812,NA 
rayol-farm2_2019-03-25_09-20-37.wav,44100,16,60,1,acoustic_complexity,512,1,NA,5,1847.59561097479,NA 
rayol-farm2_2019-03-25_09-22-37.wav,44100,16,60,1,acoustic_complexity,512,1,NA,5,1842.57702426294,NA 
rayol-farm2_2019-03-25_09-24-37.wav,44100,16,60,1,acoustic_complexity,512,1,NA,5,1824.62414569313,NA 
rayol-farm2_2019-03-25_09-26-38.wav,44100,16,60,1,acoustic_complexity,512,1,NA,5,1833.38878968875,NA 
rayol-farm2_2019-03-25_09-28-38.wav,44100,16,60,1,acoustic_complexity,512,1,NA,5,1952.40128081024,NA 
rayol-farm2_2019-03-25_09-30-38.wav,44100,16,60,1,acoustic_complexity,512,1,NA,5,1875.85862243257,NA 
rayol-farm2_2019-03-25_09-32-38.wav,44100,16,60,1,acoustic_complexity,512,1,NA,5,1834.39785806036,NA 
rayol-farm2_2019-03-25_09-34-38.wav,44100,16,60,1,acoustic_complexity,512,1,NA,5,1862.20475697137,NA 
rayol-farm2_2019-03-25_09-36-38.wav,44100,16,60,1,acoustic_complexity,512,1,NA,5,1941.70581451959,NA 
rayol-farm2_2019-03-25_09-38-38.wav,44100,16,60,1,acoustic_complexity,512,1,NA,5,1836.56277610133,NA 
rayol-farm2_2019-03-25_09-40-38.wav,44100,16,60,1,acoustic_complexity,512,1,NA,5,1849.09067980073,NA 
rayol-farm2_2019-03-25_09-42-38.wav,44100,16,60,1,acoustic_complexity,512,1,NA,5,1827.68296220361,NA 
rayol-farm2_2019-03-25_09-44-39.wav,44100,16,60,1,acoustic_complexity,512,1,NA,5,1830.69615245386,NA 
rayol-farm2_2019-03-25_09-46-39.wav,44100,16,60,1,acoustic_complexity,512,1,NA,5,1836.09373514724,NA 
rayol-farm2_2019-03-25_09-48-39.wav,44100,16,60,1,acoustic_complexity,512,1,NA,5,1852.54435599437,NA 
rayol-farm2_2019-03-25_09-50-39.wav,44100,16,60,1,acoustic_complexity,512,1,NA,5,1813.80535709835,NA 
rayol-farm2_2019-03-25_09-52-39.wav,44100,16,60,1,acoustic_complexity,512,1,NA,5,1831.65858644749,NA 
rayol-farm2_2019-03-25_09-54-39.wav,44100,16,60,1,acoustic_complexity,512,1,NA,5,1772.32874480903,NA 
rayol-farm2_2019-03-25_09-56-39.wav,44100,16,60,1,acoustic_complexity,512,1,NA,5,1837.31753193906,NA 
rayol-farm2_2019-03-25_09-58-39.wav,44100,16,60,1,acoustic_complexity,512,1,NA,5,1860.91694284907,NA 
rayol-farm2_2019-03-25_10-00-40.wav,44100,16,60,1,acoustic_complexity,512,1,NA,5,1831.84199915689,NA 
rayol-farm2_2019-03-25_10-02-40.wav,44100,16,60,1,acoustic_complexity,512,1,NA,5,1845.42881443807,NA 
rayol-farm2_2019-03-25_10-04-40.wav,44100,16,60,1,acoustic_complexity,512,1,NA,5,1831.16740252108,NA 
rayol-farm2_2019-03-25_10-06-40.wav,44100,16,60,1,acoustic_complexity,512,1,NA,5,1847.52442621564,NA 
rayol-farm2_2019-03-25_10-08-40.wav,44100,16,60,1,acoustic_complexity,512,1,NA,5,1814.45167717541,NA 
rayol-farm2_2019-03-25_10-10-40.wav,44100,16,60,1,acoustic_complexity,512,1,NA,5,1903.2711156997,NA 
rayol-farm2_2019-03-25_10-12-40.wav,44100,16,60,1,acoustic_complexity,512,1,NA,5,1903.48856195994,NA 
rayol-farm2_2019-03-25_10-14-40.wav,44100,16,60,1,acoustic_complexity,512,1,NA,5,1908.55005534428,NA 
rayol-farm2_2019-03-25_10-16-41.wav,44100,16,60,1,acoustic_complexity,512,1,NA,5,1857.30905428371,NA 
rayol-farm2_2019-03-25_10-18-41.wav,44100,16,60,1,acoustic_complexity,512,1,NA,5,1957.65118726525,NA 
rayol-farm2_2019-03-25_10-20-41.wav,44100,16,60,1,acoustic_complexity,512,1,NA,5,1824.88170005625,NA 
rayol-farm2_2019-03-25_10-22-41.wav,44100,16,60,1,acoustic_complexity,512,1,NA,5,1856.8053043029,NA 
rayol-farm2_2019-03-25_10-24-41.wav,44100,16,60,1,acoustic_complexity,512,1,NA,5,1873.24337224954,NA 
rayol-farm2_2019-03-25_10-26-41.wav,44100,16,60,1,acoustic_complexity,512,1,NA,5,1838.15446887178,NA 
rayol-farm2_2019-03-25_10-28-41.wav,44100,16,60,1,acoustic_complexity,512,1,NA,5,1818.99481699075,NA 
rayol-farm2_2019-03-25_10-30-41.wav,44100,16,60,1,acoustic_complexity,512,1,NA,5,1843.99648850086,NA 
rayol-farm2_2019-03-25_10-32-41.wav,44100,16,60,1,acoustic_complexity,512,1,NA,5,1836.50707676713,NA 
rayol-farm2_2019-03-25_10-34-42.wav,44100,16,60,1,acoustic_complexity,512,1,NA,5,1848.97350189157,NA 
rayol-farm2_2019-03-25_10-36-42.wav,44100,16,60,1,acoustic_complexity,512,1,NA,5,1846.61115395669,NA 
rayol-farm2_2019-03-25_10-38-42.wav,44100,16,60,1,acoustic_complexity,512,1,NA,5,1836.51330743106,NA 
rayol-farm2_2019-03-25_10-40-42.wav,44100,16,60,1,acoustic_complexity,512,1,NA,5,1955.51792206111,NA 
rayol-farm2_2019-03-25_10-42-42.wav,44100,16,60,1,acoustic_complexity,512,1,NA,5,1890.70054104839,NA 
rayol-farm2_2019-03-25_10-44-42.wav,44100,16,60,1,acoustic_complexity,512,1,NA,5,1872.08486032511,NA 
rayol-farm2_2019-03-25_10-46-42.wav,44100,16,60,1,acoustic_complexity,512,1,NA,5,1880.93482684391,NA 
rayol-farm2_2019-03-25_10-48-42.wav,44100,16,60,1,acoustic_complexity,512,1,NA,5,1866.66660336583,NA 
rayol-farm2_2019-03-25_10-50-43.wav,44100,16,60,1,acoustic_complexity,512,1,NA,5,1879.83045438688,NA 
rayol-farm2_2019-03-25_10-52-43.wav,44100,16,60,1,acoustic_complexity,512,1,NA,5,1911.93135654053,NA 
rayol-farm2_2019-03-25_10-54-43.wav,44100,16,60,1,acoustic_complexity,512,1,NA,5,1892.21742974835,NA 
rayol-farm2_2019-03-25_10-56-43.wav,44100,16,60,1,acoustic_complexity,512,1,NA,5,1891.68163201286,NA 
rayol-farm2_2019-03-25_10-58-43.wav,44100,16,60,1,acoustic_complexity,512,1,NA,5,1913.51399063413,NA 
rayol-farm2_2019-03-25_11-00-43.wav,44100,16,60,1,acoustic_complexity,512,1,NA,5,1845.36357602986,NA 
rayol-farm2_2019-03-25_11-02-43.wav,44100,16,60,1,acoustic_complexity,512,1,NA,5,1839.92424870044,NA 
rayol-farm2_2019-03-25_11-04-43.wav,44100,16,60,1,acoustic_complexity,512,1,NA,5,1838.52693373511,NA 
rayol-farm2_2019-03-25_11-06-44.wav,44100,16,60,1,acoustic_complexity,512,1,NA,5,1867.29613234879,NA 
rayol-farm2_2019-03-25_11-08-44.wav,44100,16,60,1,acoustic_complexity,512,1,NA,5,1903.70256152613,NA 
rayol-farm2_2019-03-25_11-10-44.wav,44100,16,60,1,acoustic_complexity,512,1,NA,5,1873.95316825736,NA 
rayol-farm2_2019-03-25_11-12-44.wav,44100,16,60,1,acoustic_complexity,512,1,NA,5,1886.23773753283,NA 
rayol-farm2_2019-03-25_11-14-44.wav,44100,16,60,1,acoustic_complexity,512,1,NA,5,1877.61981045046,NA 
rayol-farm2_2019-03-25_11-16-44.wav,44100,16,60,1,acoustic_complexity,512,1,NA,5,1947.32614240282,NA 
rayol-farm2_2019-03-25_11-18-44.wav,44100,16,60,1,acoustic_complexity,512,1,NA,5,1907.10932231868,NA 
rayol-farm2_2019-03-25_11-20-44.wav,44100,16,60,1,acoustic_complexity,512,1,NA,5,1939.22019893295,NA 
rayol-farm2_2019-03-25_11-22-44.wav,44100,16,60,1,acoustic_complexity,512,1,NA,5,1952.96661062521,NA 
rayol-farm2_2019-03-25_11-24-45.wav,44100,16,60,1,acoustic_complexity,512,1,NA,5,1908.62424027767,NA 
rayol-farm2_2019-03-25_11-26-45.wav,44100,16,60,1,acoustic_complexity,512,1,NA,5,1937.51516116547,NA 
rayol-farm2_2019-03-25_11-28-45.wav,44100,16,60,1,acoustic_complexity,512,1,NA,5,1926.93075148992,NA 
rayol-farm2_2019-03-25_11-30-45.wav,44100,16,60,1,acoustic_complexity,512,1,NA,5,1900.98178176174,NA 
rayol-farm2_2019-03-25_11-32-45.wav,44100,16,60,1,acoustic_complexity,512,1,NA,5,1907.88805134323,NA 
rayol-farm2_2019-03-25_11-34-45.wav,44100,16,60,1,acoustic_complexity,512,1,NA,5,1903.80369617237,NA 
rayol-farm2_2019-03-25_11-36-45.wav,44100,16,60,1,acoustic_complexity,512,1,NA,5,1910.15232972591,NA 
rayol-farm2_2019-03-25_11-38-45.wav,44100,16,60,1,acoustic_complexity,512,1,NA,5,1943.67646458941,NA 
rayol-farm2_2019-03-25_11-40-46.wav,44100,16,60,1,acoustic_complexity,512,1,NA,5,1811.63736072115,NA 
rayol-farm2_2019-03-25_11-42-46.wav,44100,16,60,1,acoustic_complexity,512,1,NA,5,1834.34850167043,NA 
rayol-farm2_2019-03-25_11-44-46.wav,44100,16,60,1,acoustic_complexity,512,1,NA,5,1841.49574953093,NA 
rayol-farm2_2019-03-25_11-46-46.wav,44100,16,60,1,acoustic_complexity,512,1,NA,5,1827.94290560762,NA 
rayol-farm2_2019-03-25_11-48-46.wav,44100,16,60,1,acoustic_complexity,512,1,NA,5,1909.57742430749,NA 
rayol-farm2_2019-03-25_11-50-46.wav,44100,16,60,1,acoustic_complexity,512,1,NA,5,1993.25498110704,NA 
rayol-farm2_2019-03-25_11-52-46.wav,44100,16,60,1,acoustic_complexity,512,1,NA,5,1908.6326712393,NA 
rayol-farm2_2019-03-25_11-54-46.wav,44100,16,60,1,acoustic_complexity,512,1,NA,5,1848.99310119241,NA 
rayol-farm2_2019-03-25_11-56-46.wav,44100,16,60,1,acoustic_complexity,512,1,NA,5,1862.57813402395,NA 
rayol-farm2_2019-03-25_11-58-47.wav,44100,16,60,1,acoustic_complexity,512,1,NA,5,1865.89755867582,NA 
rayol-farm2_2019-03-25_12-00-47.wav,44100,16,60,1,acoustic_complexity,512,1,NA,5,1855.76425890721,NA 
rayol-farm2_2019-03-25_12-02-47.wav,44100,16,60,1,acoustic_complexity,512,1,NA,5,1835.73847980033,NA 
rayol-farm2_2019-03-25_12-04-47.wav,44100,16,60,1,acoustic_complexity,512,1,NA,5,1825.42854895474,NA 
rayol-farm2_2019-03-25_12-06-47.wav,44100,16,60,1,acoustic_complexity,512,1,NA,5,1878.33068146913,NA 
rayol-farm2_2019-03-25_12-08-47.wav,44100,16,60,1,acoustic_complexity,512,1,NA,5,1876.61216331915,NA 
rayol-farm2_2019-03-25_12-10-47.wav,44100,16,60,1,acoustic_complexity,512,1,NA,5,1820.05302377325,NA 
rayol-farm2_2019-03-25_12-12-47.wav,44100,16,60,1,acoustic_complexity,512,1,NA,5,1920.79126662361,NA 
rayol-farm2_2019-03-25_12-14-48.wav,44100,16,60,1,acoustic_complexity,512,1,NA,5,1834.97532729011,NA 
rayol-farm2_2019-03-25_12-16-48.wav,44100,16,60,1,acoustic_complexity,512,1,NA,5,1844.55647738824,NA 
rayol-farm2_2019-03-25_12-18-48.wav,44100,16,60,1,acoustic_complexity,512,1,NA,5,1848.93947112678,NA 
rayol-farm2_2019-03-25_12-20-48.wav,44100,16,60,1,acoustic_complexity,512,1,NA,5,1829.49081298031,NA 
rayol-farm2_2019-03-25_12-22-48.wav,44100,16,60,1,acoustic_complexity,512,1,NA,5,1849.14781853315,NA 
rayol-farm2_2019-03-25_12-24-48.wav,44100,16,60,1,acoustic_complexity,512,1,NA,5,1850.79427126965,NA 
rayol-farm2_2019-03-25_12-26-48.wav,44100,16,60,1,acoustic_complexity,512,1,NA,5,1823.58937559812,NA 
rayol-farm2_2019-03-25_12-28-48.wav,44100,16,60,1,acoustic_complexity,512,1,NA,5,1820.00268686638,NA 
rayol-farm2_2019-03-25_12-30-49.wav,44100,16,60,1,acoustic_complexity,512,1,NA,5,1832.59106047162,NA 
rayol-farm2_2019-03-25_12-32-49.wav,44100,16,60,1,acoustic_complexity,512,1,NA,5,1833.08933843555,NA 
rayol-farm2_2019-03-25_12-34-49.wav,44100,16,60,1,acoustic_complexity,512,1,NA,5,1853.71033381311,NA 
rayol-farm2_2019-03-25_12-36-49.wav,44100,16,60,1,acoustic_complexity,512,1,NA,5,1850.50398655481,NA 
rayol-farm2_2019-03-25_12-38-49.wav,44100,16,60,1,acoustic_complexity,512,1,NA,5,1857.81142349036,NA 
rayol-farm2_2019-03-25_12-40-49.wav,44100,16,60,1,acoustic_complexity,512,1,NA,5,1828.48020219673,NA 
rayol-farm2_2019-03-25_12-42-49.wav,44100,16,60,1,acoustic_complexity,512,1,NA,5,1820.21116493911,NA 
rayol-farm2_2019-03-25_12-44-49.wav,44100,16,60,1,acoustic_complexity,512,1,NA,5,1830.73600468563,NA 
rayol-farm2_2019-03-25_12-46-50.wav,44100,16,60,1,acoustic_complexity,512,1,NA,5,1843.58705072036,NA 
rayol-farm2_2019-03-25_12-48-50.wav,44100,16,60,1,acoustic_complexity,512,1,NA,5,1847.6893758137,NA 
rayol-farm2_2019-03-25_12-50-50.wav,44100,16,60,1,acoustic_complexity,512,1,NA,5,1830.22594582237,NA 
rayol-farm2_2019-03-25_12-52-50.wav,44100,16,60,1,acoustic_complexity,512,1,NA,5,1824.42413482769,NA 
rayol-farm2_2019-03-25_12-54-50.wav,44100,16,60,1,acoustic_complexity,512,1,NA,5,1815.45578258521,NA 
rayol-farm2_2019-03-25_12-56-50.wav,44100,16,60,1,acoustic_complexity,512,1,NA,5,1840.51264630217,NA 
rayol-farm2_2019-03-25_12-58-50.wav,44100,16,60,1,acoustic_complexity,512,1,NA,5,1831.94247132115,NA 
rayol-farm2_2019-03-25_13-00-50.wav,44100,16,60,1,acoustic_complexity,512,1,NA,5,1832.7410320718,NA 
rayol-farm2_2019-03-25_13-02-50.wav,44100,16,60,1,acoustic_complexity,512,1,NA,5,1834.65324824847,NA 
rayol-farm2_2019-03-25_13-04-51.wav,44100,16,60,1,acoustic_complexity,512,1,NA,5,1831.56431265658,NA 
rayol-farm2_2019-03-25_13-06-51.wav,44100,16,60,1,acoustic_complexity,512,1,NA,5,1828.17443601592,NA 
rayol-farm2_2019-03-25_13-08-51.wav,44100,16,60,1,acoustic_complexity,512,1,NA,5,1835.40850534609,NA 
rayol-farm2_2019-03-25_13-10-51.wav,44100,16,60,1,acoustic_complexity,512,1,NA,5,1831.00995521659,NA 
rayol-farm2_2019-03-25_13-12-51.wav,44100,16,60,1,acoustic_complexity,512,1,NA,5,1867.30815565968,NA 
rayol-farm2_2019-03-25_13-14-51.wav,44100,16,60,1,acoustic_complexity,512,1,NA,5,1815.981655836,NA 
rayol-farm2_2019-03-25_13-16-51.wav,44100,16,60,1,acoustic_complexity,512,1,NA,5,1843.51119596141,NA
