FILENAME,SAMPLINGRATE,BIT,DURATION,CHANNELS,INDEX,WL,ENVT,MSMOOTH,KSMOOTH,LEFT_CHANNEL,RIGHT_CHANNEL
rayol-farm2_2019-04-30_00-01-19.wav,44100,16,60,1,H,512,hil,NULL,NULL,0.897533727605415,NA 
rayol-farm2_2019-04-30_00-03-19.wav,44100,16,60,1,H,512,hil,NULL,NULL,0.896082812354941,NA 
rayol-farm2_2019-04-30_00-05-20.wav,44100,16,60,1,H,512,hil,NULL,NULL,0.899379153613336,NA 
rayol-farm2_2019-04-30_00-07-20.wav,44100,16,60,1,H,512,hil,NULL,NULL,0.896721258745289,NA 
rayol-farm2_2019-04-30_00-09-20.wav,44100,16,60,1,H,512,hil,NULL,NULL,0.887131655648551,NA 
rayol-farm2_2019-04-30_00-11-20.wav,44100,16,60,1,H,512,hil,NULL,NULL,0.892707878831174,NA 
rayol-farm2_2019-04-30_00-13-20.wav,44100,16,60,1,H,512,hil,NULL,NULL,0.899565775924866,NA 
rayol-farm2_2019-04-30_00-15-20.wav,44100,16,60,1,H,512,hil,NULL,NULL,0.899350025073435,NA 
rayol-farm2_2019-04-30_00-17-20.wav,44100,16,60,1,H,512,hil,NULL,NULL,0.89659041878554,NA 
rayol-farm2_2019-04-30_00-19-20.wav,44100,16,60,1,H,512,hil,NULL,NULL,0.898369829986984,NA 
rayol-farm2_2019-04-30_00-21-21.wav,44100,16,60,1,H,512,hil,NULL,NULL,0.900615443960884,NA 
rayol-farm2_2019-04-30_00-23-21.wav,44100,16,60,1,H,512,hil,NULL,NULL,0.898009063561248,NA 
rayol-farm2_2019-04-30_00-25-21.wav,44100,16,60,1,H,512,hil,NULL,NULL,0.901168059789929,NA 
rayol-farm2_2019-04-30_00-27-21.wav,44100,16,60,1,H,512,hil,NULL,NULL,0.900573173265702,NA 
rayol-farm2_2019-04-30_00-29-21.wav,44100,16,60,1,H,512,hil,NULL,NULL,0.899064184193432,NA 
rayol-farm2_2019-04-30_00-31-21.wav,44100,16,60,1,H,512,hil,NULL,NULL,0.897930690113287,NA 
rayol-farm2_2019-04-30_00-33-21.wav,44100,16,60,1,H,512,hil,NULL,NULL,0.896510231552585,NA 
rayol-farm2_2019-04-30_00-35-21.wav,44100,16,60,1,H,512,hil,NULL,NULL,0.897351257230508,NA 
rayol-farm2_2019-04-30_00-37-22.wav,44100,16,60,1,H,512,hil,NULL,NULL,0.901171292292814,NA 
rayol-farm2_2019-04-30_00-39-22.wav,44100,16,60,1,H,512,hil,NULL,NULL,0.902066547753181,NA 
rayol-farm2_2019-04-30_00-41-22.wav,44100,16,60,1,H,512,hil,NULL,NULL,0.899068820618295,NA 
rayol-farm2_2019-04-30_00-43-22.wav,44100,16,60,1,H,512,hil,NULL,NULL,0.900564491737793,NA 
rayol-farm2_2019-04-30_00-45-22.wav,44100,16,60,1,H,512,hil,NULL,NULL,0.901712727445043,NA 
rayol-farm2_2019-04-30_00-47-22.wav,44100,16,60,1,H,512,hil,NULL,NULL,0.90121604088424,NA 
rayol-farm2_2019-04-30_00-49-22.wav,44100,16,60,1,H,512,hil,NULL,NULL,0.90123152669581,NA 
rayol-farm2_2019-04-30_00-51-22.wav,44100,16,60,1,H,512,hil,NULL,NULL,0.899974884906754,NA 
rayol-farm2_2019-04-30_00-53-22.wav,44100,16,60,1,H,512,hil,NULL,NULL,0.899814759868861,NA 
rayol-farm2_2019-04-30_00-55-23.wav,44100,16,60,1,H,512,hil,NULL,NULL,0.894951838691756,NA 
rayol-farm2_2019-04-30_00-57-23.wav,44100,16,60,1,H,512,hil,NULL,NULL,0.899549016245766,NA 
rayol-farm2_2019-04-30_00-59-23.wav,44100,16,60,1,H,512,hil,NULL,NULL,0.90374294307111,NA 
rayol-farm2_2019-04-30_01-01-23.wav,44100,16,60,1,H,512,hil,NULL,NULL,0.903747708846082,NA 
rayol-farm2_2019-04-30_01-03-23.wav,44100,16,60,1,H,512,hil,NULL,NULL,0.903222433744219,NA 
rayol-farm2_2019-04-30_01-05-23.wav,44100,16,60,1,H,512,hil,NULL,NULL,0.903298512243944,NA 
rayol-farm2_2019-04-30_01-07-23.wav,44100,16,60,1,H,512,hil,NULL,NULL,0.902261509450309,NA 
rayol-farm2_2019-04-30_01-09-23.wav,44100,16,60,1,H,512,hil,NULL,NULL,0.903658133631085,NA 
rayol-farm2_2019-04-30_01-11-24.wav,44100,16,60,1,H,512,hil,NULL,NULL,0.904308912960951,NA 
rayol-farm2_2019-04-30_01-13-24.wav,44100,16,60,1,H,512,hil,NULL,NULL,0.903768690123401,NA 
rayol-farm2_2019-04-30_01-15-24.wav,44100,16,60,1,H,512,hil,NULL,NULL,0.905260877985762,NA 
rayol-farm2_2019-04-30_01-17-24.wav,44100,16,60,1,H,512,hil,NULL,NULL,0.905058291438935,NA 
rayol-farm2_2019-04-30_01-19-24.wav,44100,16,60,1,H,512,hil,NULL,NULL,0.902783345936371,NA 
rayol-farm2_2019-04-30_01-21-24.wav,44100,16,60,1,H,512,hil,NULL,NULL,0.902741810229116,NA 
rayol-farm2_2019-04-30_01-23-24.wav,44100,16,60,1,H,512,hil,NULL,NULL,0.903524799315606,NA 
rayol-farm2_2019-04-30_01-25-24.wav,44100,16,60,1,H,512,hil,NULL,NULL,0.904241151914822,NA 
rayol-farm2_2019-04-30_01-27-25.wav,44100,16,60,1,H,512,hil,NULL,NULL,0.904783939002946,NA 
rayol-farm2_2019-04-30_01-29-25.wav,44100,16,60,1,H,512,hil,NULL,NULL,0.904750821509325,NA 
rayol-farm2_2019-04-30_01-31-25.wav,44100,16,60,1,H,512,hil,NULL,NULL,0.904807967654169,NA 
rayol-farm2_2019-04-30_01-33-25.wav,44100,16,60,1,H,512,hil,NULL,NULL,0.904448498074768,NA 
rayol-farm2_2019-04-30_01-35-25.wav,44100,16,60,1,H,512,hil,NULL,NULL,0.903684134323009,NA 
rayol-farm2_2019-04-30_01-37-25.wav,44100,16,60,1,H,512,hil,NULL,NULL,0.904094682590564,NA 
rayol-farm2_2019-04-30_01-39-25.wav,44100,16,60,1,H,512,hil,NULL,NULL,0.904934240319803,NA 
rayol-farm2_2019-04-30_01-41-25.wav,44100,16,60,1,H,512,hil,NULL,NULL,0.905592781138485,NA 
rayol-farm2_2019-04-30_01-43-26.wav,44100,16,60,1,H,512,hil,NULL,NULL,0.906210521380408,NA 
rayol-farm2_2019-04-30_01-45-26.wav,44100,16,60,1,H,512,hil,NULL,NULL,0.904838207441148,NA 
rayol-farm2_2019-04-30_01-47-26.wav,44100,16,60,1,H,512,hil,NULL,NULL,0.904268824762984,NA 
rayol-farm2_2019-04-30_01-49-26.wav,44100,16,60,1,H,512,hil,NULL,NULL,0.905513504316288,NA 
rayol-farm2_2019-04-30_01-51-26.wav,44100,16,60,1,H,512,hil,NULL,NULL,0.904818717124112,NA 
rayol-farm2_2019-04-30_01-53-26.wav,44100,16,60,1,H,512,hil,NULL,NULL,0.904786363261334,NA 
rayol-farm2_2019-04-30_01-55-26.wav,44100,16,60,1,H,512,hil,NULL,NULL,0.90496245250344,NA 
rayol-farm2_2019-04-30_01-57-26.wav,44100,16,60,1,H,512,hil,NULL,NULL,0.904617328227088,NA 
rayol-farm2_2019-04-30_01-59-26.wav,44100,16,60,1,H,512,hil,NULL,NULL,0.904687407835387,NA 
rayol-farm2_2019-04-30_02-01-27.wav,44100,16,60,1,H,512,hil,NULL,NULL,0.905960572798366,NA 
rayol-farm2_2019-04-30_02-03-27.wav,44100,16,60,1,H,512,hil,NULL,NULL,0.905899507940658,NA 
rayol-farm2_2019-04-30_02-05-27.wav,44100,16,60,1,H,512,hil,NULL,NULL,0.906090239373745,NA 
rayol-farm2_2019-04-30_02-07-27.wav,44100,16,60,1,H,512,hil,NULL,NULL,0.90512455286033,NA 
rayol-farm2_2019-04-30_02-09-27.wav,44100,16,60,1,H,512,hil,NULL,NULL,0.904137246923039,NA 
rayol-farm2_2019-04-30_02-11-27.wav,44100,16,60,1,H,512,hil,NULL,NULL,0.903081955004402,NA 
rayol-farm2_2019-04-30_02-13-27.wav,44100,16,60,1,H,512,hil,NULL,NULL,0.901668460351085,NA 
rayol-farm2_2019-04-30_02-15-27.wav,44100,16,60,1,H,512,hil,NULL,NULL,0.903329111723237,NA 
rayol-farm2_2019-04-30_02-17-28.wav,44100,16,60,1,H,512,hil,NULL,NULL,0.905155361945477,NA 
rayol-farm2_2019-04-30_02-19-28.wav,44100,16,60,1,H,512,hil,NULL,NULL,0.905125178625772,NA 
rayol-farm2_2019-04-30_02-21-28.wav,44100,16,60,1,H,512,hil,NULL,NULL,0.90417383141509,NA 
rayol-farm2_2019-04-30_02-23-28.wav,44100,16,60,1,H,512,hil,NULL,NULL,0.900729719512997,NA 
rayol-farm2_2019-04-30_02-25-28.wav,44100,16,60,1,H,512,hil,NULL,NULL,0.901211275766899,NA 
rayol-farm2_2019-04-30_02-27-28.wav,44100,16,60,1,H,512,hil,NULL,NULL,0.900958675498512,NA 
rayol-farm2_2019-04-30_02-29-28.wav,44100,16,60,1,H,512,hil,NULL,NULL,0.901898633334733,NA 
rayol-farm2_2019-04-30_02-31-28.wav,44100,16,60,1,H,512,hil,NULL,NULL,0.903909688035484,NA 
rayol-farm2_2019-04-30_02-33-29.wav,44100,16,60,1,H,512,hil,NULL,NULL,0.903939825562769,NA 
rayol-farm2_2019-04-30_02-35-29.wav,44100,16,60,1,H,512,hil,NULL,NULL,0.902083175201807,NA 
rayol-farm2_2019-04-30_02-37-29.wav,44100,16,60,1,H,512,hil,NULL,NULL,0.901947997311977,NA 
rayol-farm2_2019-04-30_02-39-29.wav,44100,16,60,1,H,512,hil,NULL,NULL,0.90105241126452,NA 
rayol-farm2_2019-04-30_02-41-29.wav,44100,16,60,1,H,512,hil,NULL,NULL,0.899146136587909,NA 
rayol-farm2_2019-04-30_02-43-29.wav,44100,16,60,1,H,512,hil,NULL,NULL,0.901320236586435,NA 
rayol-farm2_2019-04-30_02-45-29.wav,44100,16,60,1,H,512,hil,NULL,NULL,0.903194677475824,NA 
rayol-farm2_2019-04-30_02-47-29.wav,44100,16,60,1,H,512,hil,NULL,NULL,0.901936232132356,NA 
rayol-farm2_2019-04-30_02-49-30.wav,44100,16,60,1,H,512,hil,NULL,NULL,0.901272987292053,NA 
rayol-farm2_2019-04-30_02-51-30.wav,44100,16,60,1,H,512,hil,NULL,NULL,0.900451299818604,NA 
rayol-farm2_2019-04-30_02-53-30.wav,44100,16,60,1,H,512,hil,NULL,NULL,0.901377911164752,NA 
rayol-farm2_2019-04-30_02-55-30.wav,44100,16,60,1,H,512,hil,NULL,NULL,0.900702326241634,NA 
rayol-farm2_2019-04-30_02-57-30.wav,44100,16,60,1,H,512,hil,NULL,NULL,0.900041759337583,NA 
rayol-farm2_2019-04-30_02-59-30.wav,44100,16,60,1,H,512,hil,NULL,NULL,0.898910540616252,NA 
rayol-farm2_2019-04-30_03-01-30.wav,44100,16,60,1,H,512,hil,NULL,NULL,0.900067821278146,NA 
rayol-farm2_2019-04-30_03-03-30.wav,44100,16,60,1,H,512,hil,NULL,NULL,0.899666870303899,NA 
rayol-farm2_2019-04-30_03-05-31.wav,44100,16,60,1,H,512,hil,NULL,NULL,0.900463194519945,NA 
rayol-farm2_2019-04-30_03-07-31.wav,44100,16,60,1,H,512,hil,NULL,NULL,0.900802530135571,NA 
rayol-farm2_2019-04-30_03-09-31.wav,44100,16,60,1,H,512,hil,NULL,NULL,0.900706032085627,NA 
rayol-farm2_2019-04-30_03-11-31.wav,44100,16,60,1,H,512,hil,NULL,NULL,0.900668008194178,NA 
rayol-farm2_2019-04-30_03-13-31.wav,44100,16,60,1,H,512,hil,NULL,NULL,0.897779627805502,NA 
rayol-farm2_2019-04-30_03-15-31.wav,44100,16,60,1,H,512,hil,NULL,NULL,0.896719504345699,NA 
rayol-farm2_2019-04-30_03-17-31.wav,44100,16,60,1,H,512,hil,NULL,NULL,0.899811837524375,NA 
rayol-farm2_2019-04-30_03-19-31.wav,44100,16,60,1,H,512,hil,NULL,NULL,0.90115902183438,NA 
rayol-farm2_2019-04-30_03-21-31.wav,44100,16,60,1,H,512,hil,NULL,NULL,0.900287016180119,NA 
rayol-farm2_2019-04-30_03-23-32.wav,44100,16,60,1,H,512,hil,NULL,NULL,0.900452892723578,NA 
rayol-farm2_2019-04-30_03-25-32.wav,44100,16,60,1,H,512,hil,NULL,NULL,0.900280274161396,NA 
rayol-farm2_2019-04-30_03-27-32.wav,44100,16,60,1,H,512,hil,NULL,NULL,0.899979729908524,NA 
rayol-farm2_2019-04-30_03-29-32.wav,44100,16,60,1,H,512,hil,NULL,NULL,0.897432700315721,NA 
rayol-farm2_2019-04-30_03-31-32.wav,44100,16,60,1,H,512,hil,NULL,NULL,0.8976362005181,NA 
rayol-farm2_2019-04-30_03-33-32.wav,44100,16,60,1,H,512,hil,NULL,NULL,0.899491710236161,NA 
rayol-farm2_2019-04-30_03-35-32.wav,44100,16,60,1,H,512,hil,NULL,NULL,0.900054774827345,NA 
rayol-farm2_2019-04-30_03-37-32.wav,44100,16,60,1,H,512,hil,NULL,NULL,0.900123774328616,NA 
rayol-farm2_2019-04-30_03-39-33.wav,44100,16,60,1,H,512,hil,NULL,NULL,0.886999095494281,NA 
rayol-farm2_2019-04-30_03-41-33.wav,44100,16,60,1,H,512,hil,NULL,NULL,0.899064242014075,NA 
rayol-farm2_2019-04-30_03-43-33.wav,44100,16,60,1,H,512,hil,NULL,NULL,0.860825080301945,NA 
rayol-farm2_2019-04-30_03-45-33.wav,44100,16,60,1,H,512,hil,NULL,NULL,0.894769009501267,NA 
rayol-farm2_2019-04-30_03-47-33.wav,44100,16,60,1,H,512,hil,NULL,NULL,0.898638641850948,NA 
rayol-farm2_2019-04-30_03-49-33.wav,44100,16,60,1,H,512,hil,NULL,NULL,0.899045301082406,NA 
rayol-farm2_2019-04-30_03-51-33.wav,44100,16,60,1,H,512,hil,NULL,NULL,0.90027837345624,NA 
rayol-farm2_2019-04-30_03-53-33.wav,44100,16,60,1,H,512,hil,NULL,NULL,0.899642589680878,NA 
rayol-farm2_2019-04-30_03-55-34.wav,44100,16,60,1,H,512,hil,NULL,NULL,0.89873911041327,NA 
rayol-farm2_2019-04-30_03-57-34.wav,44100,16,60,1,H,512,hil,NULL,NULL,0.897290273059872,NA 
rayol-farm2_2019-04-30_03-59-34.wav,44100,16,60,1,H,512,hil,NULL,NULL,0.896226347265249,NA 
rayol-farm2_2019-04-30_04-01-34.wav,44100,16,60,1,H,512,hil,NULL,NULL,0.897746838584295,NA 
rayol-farm2_2019-04-30_04-03-34.wav,44100,16,60,1,H,512,hil,NULL,NULL,0.897242998180907,NA 
rayol-farm2_2019-04-30_04-05-34.wav,44100,16,60,1,H,512,hil,NULL,NULL,0.896542741763689,NA 
rayol-farm2_2019-04-30_04-07-34.wav,44100,16,60,1,H,512,hil,NULL,NULL,0.898188986868054,NA 
rayol-farm2_2019-04-30_04-09-34.wav,44100,16,60,1,H,512,hil,NULL,NULL,0.897572483456677,NA 
rayol-farm2_2019-04-30_04-11-35.wav,44100,16,60,1,H,512,hil,NULL,NULL,0.899032657996315,NA 
rayol-farm2_2019-04-30_04-13-35.wav,44100,16,60,1,H,512,hil,NULL,NULL,0.897029507567641,NA 
rayol-farm2_2019-04-30_04-15-35.wav,44100,16,60,1,H,512,hil,NULL,NULL,0.897204163130276,NA 
rayol-farm2_2019-04-30_04-17-35.wav,44100,16,60,1,H,512,hil,NULL,NULL,0.897408190327117,NA 
rayol-farm2_2019-04-30_04-19-35.wav,44100,16,60,1,H,512,hil,NULL,NULL,0.895472447450262,NA 
rayol-farm2_2019-04-30_04-21-35.wav,44100,16,60,1,H,512,hil,NULL,NULL,0.892797704930709,NA 
rayol-farm2_2019-04-30_04-23-35.wav,44100,16,60,1,H,512,hil,NULL,NULL,0.89851428942974,NA 
rayol-farm2_2019-04-30_04-25-35.wav,44100,16,60,1,H,512,hil,NULL,NULL,0.897937106228091,NA 
rayol-farm2_2019-04-30_04-27-35.wav,44100,16,60,1,H,512,hil,NULL,NULL,0.898663317244784,NA 
rayol-farm2_2019-04-30_04-29-36.wav,44100,16,60,1,H,512,hil,NULL,NULL,0.89839095610641,NA 
rayol-farm2_2019-04-30_04-31-36.wav,44100,16,60,1,H,512,hil,NULL,NULL,0.89743388069295,NA 
rayol-farm2_2019-04-30_04-33-36.wav,44100,16,60,1,H,512,hil,NULL,NULL,0.898082916501055,NA 
rayol-farm2_2019-04-30_04-35-36.wav,44100,16,60,1,H,512,hil,NULL,NULL,0.895066692656705,NA 
rayol-farm2_2019-04-30_04-37-36.wav,44100,16,60,1,H,512,hil,NULL,NULL,0.896057883573993,NA 
rayol-farm2_2019-04-30_04-39-36.wav,44100,16,60,1,H,512,hil,NULL,NULL,0.898988190066805,NA 
rayol-farm2_2019-04-30_04-41-36.wav,44100,16,60,1,H,512,hil,NULL,NULL,0.899111660592847,NA 
rayol-farm2_2019-04-30_04-43-36.wav,44100,16,60,1,H,512,hil,NULL,NULL,0.898632872253938,NA 
rayol-farm2_2019-04-30_04-45-37.wav,44100,16,60,1,H,512,hil,NULL,NULL,0.897670300137762,NA 
rayol-farm2_2019-04-30_04-47-37.wav,44100,16,60,1,H,512,hil,NULL,NULL,0.897390741572472,NA 
rayol-farm2_2019-04-30_04-49-37.wav,44100,16,60,1,H,512,hil,NULL,NULL,0.898977324910854,NA 
rayol-farm2_2019-04-30_04-51-37.wav,44100,16,60,1,H,512,hil,NULL,NULL,0.898076503021119,NA 
rayol-farm2_2019-04-30_04-53-37.wav,44100,16,60,1,H,512,hil,NULL,NULL,0.895771555287165,NA 
rayol-farm2_2019-04-30_04-55-37.wav,44100,16,60,1,H,512,hil,NULL,NULL,0.897298664539472,NA 
rayol-farm2_2019-04-30_04-57-37.wav,44100,16,60,1,H,512,hil,NULL,NULL,0.893371848003924,NA 
rayol-farm2_2019-04-30_04-59-37.wav,44100,16,60,1,H,512,hil,NULL,NULL,0.818124692227643,NA 
rayol-farm2_2019-04-30_05-01-38.wav,44100,16,60,1,H,512,hil,NULL,NULL,0.879679178165512,NA 
rayol-farm2_2019-04-30_05-03-38.wav,44100,16,60,1,H,512,hil,NULL,NULL,0.897480765401769,NA 
rayol-farm2_2019-04-30_05-05-38.wav,44100,16,60,1,H,512,hil,NULL,NULL,0.854105997022884,NA 
rayol-farm2_2019-04-30_05-07-38.wav,44100,16,60,1,H,512,hil,NULL,NULL,0.876866887599709,NA 
rayol-farm2_2019-04-30_05-09-38.wav,44100,16,60,1,H,512,hil,NULL,NULL,0.883322868691139,NA 
rayol-farm2_2019-04-30_05-11-38.wav,44100,16,60,1,H,512,hil,NULL,NULL,0.892771828535304,NA 
rayol-farm2_2019-04-30_05-13-38.wav,44100,16,60,1,H,512,hil,NULL,NULL,0.897869800770932,NA 
rayol-farm2_2019-04-30_05-15-38.wav,44100,16,60,1,H,512,hil,NULL,NULL,0.894490900807029,NA 
rayol-farm2_2019-04-30_05-17-39.wav,44100,16,60,1,H,512,hil,NULL,NULL,0.895405995590182,NA 
rayol-farm2_2019-04-30_05-19-39.wav,44100,16,60,1,H,512,hil,NULL,NULL,0.898195508969762,NA 
rayol-farm2_2019-04-30_05-21-39.wav,44100,16,60,1,H,512,hil,NULL,NULL,0.899739837877759,NA 
rayol-farm2_2019-04-30_05-23-39.wav,44100,16,60,1,H,512,hil,NULL,NULL,0.900435312734307,NA 
rayol-farm2_2019-04-30_05-25-39.wav,44100,16,60,1,H,512,hil,NULL,NULL,0.897981854971302,NA 
rayol-farm2_2019-04-30_05-27-39.wav,44100,16,60,1,H,512,hil,NULL,NULL,0.898410990150961,NA 
rayol-farm2_2019-04-30_05-29-39.wav,44100,16,60,1,H,512,hil,NULL,NULL,0.898567692929648,NA 
rayol-farm2_2019-04-30_05-31-39.wav,44100,16,60,1,H,512,hil,NULL,NULL,0.899766712008112,NA 
rayol-farm2_2019-04-30_05-33-39.wav,44100,16,60,1,H,512,hil,NULL,NULL,0.89938221352362,NA 
rayol-farm2_2019-04-30_05-35-40.wav,44100,16,60,1,H,512,hil,NULL,NULL,0.902290842379492,NA 
rayol-farm2_2019-04-30_05-37-40.wav,44100,16,60,1,H,512,hil,NULL,NULL,0.901378453265996,NA 
rayol-farm2_2019-04-30_05-39-40.wav,44100,16,60,1,H,512,hil,NULL,NULL,0.902263005571235,NA 
rayol-farm2_2019-04-30_05-41-40.wav,44100,16,60,1,H,512,hil,NULL,NULL,0.900976115739873,NA 
rayol-farm2_2019-04-30_05-43-40.wav,44100,16,60,1,H,512,hil,NULL,NULL,0.900421970398296,NA 
rayol-farm2_2019-04-30_05-45-40.wav,44100,16,60,1,H,512,hil,NULL,NULL,0.904365652513454,NA 
rayol-farm2_2019-04-30_05-47-40.wav,44100,16,60,1,H,512,hil,NULL,NULL,0.905805822674289,NA 
rayol-farm2_2019-04-30_05-49-40.wav,44100,16,60,1,H,512,hil,NULL,NULL,0.907734782012472,NA 
rayol-farm2_2019-04-30_05-51-41.wav,44100,16,60,1,H,512,hil,NULL,NULL,0.90764247158258,NA 
rayol-farm2_2019-04-30_05-53-41.wav,44100,16,60,1,H,512,hil,NULL,NULL,0.905693561413837,NA 
rayol-farm2_2019-04-30_05-55-41.wav,44100,16,60,1,H,512,hil,NULL,NULL,0.904034893411273,NA 
rayol-farm2_2019-04-30_05-57-41.wav,44100,16,60,1,H,512,hil,NULL,NULL,0.906863948553674,NA 
rayol-farm2_2019-04-30_05-59-41.wav,44100,16,60,1,H,512,hil,NULL,NULL,0.90487402678374,NA 
rayol-farm2_2019-04-30_06-01-41.wav,44100,16,60,1,H,512,hil,NULL,NULL,0.905210272203426,NA 
rayol-farm2_2019-04-30_06-03-41.wav,44100,16,60,1,H,512,hil,NULL,NULL,0.908193053311338,NA 
rayol-farm2_2019-04-30_06-05-41.wav,44100,16,60,1,H,512,hil,NULL,NULL,0.908188890954209,NA 
rayol-farm2_2019-04-30_06-07-42.wav,44100,16,60,1,H,512,hil,NULL,NULL,0.907305039995811,NA 
rayol-farm2_2019-04-30_06-09-42.wav,44100,16,60,1,H,512,hil,NULL,NULL,0.907626315360687,NA 
rayol-farm2_2019-04-30_06-11-42.wav,44100,16,60,1,H,512,hil,NULL,NULL,0.906340056399037,NA 
rayol-farm2_2019-04-30_06-13-42.wav,44100,16,60,1,H,512,hil,NULL,NULL,0.90699457378708,NA 
rayol-farm2_2019-04-30_06-15-42.wav,44100,16,60,1,H,512,hil,NULL,NULL,0.902894758407277,NA 
rayol-farm2_2019-04-30_06-17-42.wav,44100,16,60,1,H,512,hil,NULL,NULL,0.900141725098442,NA 
rayol-farm2_2019-04-30_06-19-42.wav,44100,16,60,1,H,512,hil,NULL,NULL,0.906280674487031,NA 
rayol-farm2_2019-04-30_06-21-42.wav,44100,16,60,1,H,512,hil,NULL,NULL,0.906730271429028,NA 
rayol-farm2_2019-04-30_06-23-43.wav,44100,16,60,1,H,512,hil,NULL,NULL,0.897151472593069,NA 
rayol-farm2_2019-04-30_06-25-43.wav,44100,16,60,1,H,512,hil,NULL,NULL,0.896032410654342,NA 
rayol-farm2_2019-04-30_06-27-43.wav,44100,16,60,1,H,512,hil,NULL,NULL,0.903139805474854,NA 
rayol-farm2_2019-04-30_06-29-43.wav,44100,16,60,1,H,512,hil,NULL,NULL,0.903399332713068,NA 
rayol-farm2_2019-04-30_06-31-43.wav,44100,16,60,1,H,512,hil,NULL,NULL,0.905043484294715,NA 
rayol-farm2_2019-04-30_06-33-43.wav,44100,16,60,1,H,512,hil,NULL,NULL,0.901898527147244,NA 
rayol-farm2_2019-04-30_06-35-43.wav,44100,16,60,1,H,512,hil,NULL,NULL,0.897915582131808,NA 
rayol-farm2_2019-04-30_06-37-43.wav,44100,16,60,1,H,512,hil,NULL,NULL,0.899623248063418,NA 
rayol-farm2_2019-04-30_06-39-44.wav,44100,16,60,1,H,512,hil,NULL,NULL,0.904926679781497,NA 
rayol-farm2_2019-04-30_06-41-44.wav,44100,16,60,1,H,512,hil,NULL,NULL,0.900058831818408,NA 
rayol-farm2_2019-04-30_06-43-44.wav,44100,16,60,1,H,512,hil,NULL,NULL,0.904154116898022,NA 
rayol-farm2_2019-04-30_06-45-44.wav,44100,16,60,1,H,512,hil,NULL,NULL,0.89958465562937,NA 
rayol-farm2_2019-04-30_06-47-44.wav,44100,16,60,1,H,512,hil,NULL,NULL,0.904025387751381,NA 
rayol-farm2_2019-04-30_06-49-44.wav,44100,16,60,1,H,512,hil,NULL,NULL,0.891315481561113,NA 
rayol-farm2_2019-04-30_06-51-44.wav,44100,16,60,1,H,512,hil,NULL,NULL,0.89533970985978,NA 
rayol-farm2_2019-04-30_06-53-44.wav,44100,16,60,1,H,512,hil,NULL,NULL,0.880975032284545,NA 
rayol-farm2_2019-04-30_06-55-44.wav,44100,16,60,1,H,512,hil,NULL,NULL,0.903784032064096,NA 
rayol-farm2_2019-04-30_06-57-45.wav,44100,16,60,1,H,512,hil,NULL,NULL,0.896816765221322,NA 
rayol-farm2_2019-04-30_06-59-45.wav,44100,16,60,1,H,512,hil,NULL,NULL,0.895558809445807,NA 
rayol-farm2_2019-04-30_07-01-45.wav,44100,16,60,1,H,512,hil,NULL,NULL,0.898779594288542,NA 
rayol-farm2_2019-04-30_07-03-45.wav,44100,16,60,1,H,512,hil,NULL,NULL,0.898425857685091,NA 
rayol-farm2_2019-04-30_07-05-45.wav,44100,16,60,1,H,512,hil,NULL,NULL,0.90403988324012,NA 
rayol-farm2_2019-04-30_07-07-45.wav,44100,16,60,1,H,512,hil,NULL,NULL,0.897900886333443,NA 
rayol-farm2_2019-04-30_07-09-45.wav,44100,16,60,1,H,512,hil,NULL,NULL,0.899393341540488,NA 
rayol-farm2_2019-04-30_07-11-45.wav,44100,16,60,1,H,512,hil,NULL,NULL,0.885620800657339,NA 
rayol-farm2_2019-04-30_07-13-46.wav,44100,16,60,1,H,512,hil,NULL,NULL,0.894403403145521,NA 
rayol-farm2_2019-04-30_07-15-46.wav,44100,16,60,1,H,512,hil,NULL,NULL,0.904141507264378,NA 
rayol-farm2_2019-04-30_07-17-46.wav,44100,16,60,1,H,512,hil,NULL,NULL,0.904336528833929,NA 
rayol-farm2_2019-04-30_07-19-46.wav,44100,16,60,1,H,512,hil,NULL,NULL,0.901734007223539,NA 
rayol-farm2_2019-04-30_07-21-46.wav,44100,16,60,1,H,512,hil,NULL,NULL,0.903182734455882,NA 
rayol-farm2_2019-04-30_07-23-46.wav,44100,16,60,1,H,512,hil,NULL,NULL,0.861594623074099,NA 
rayol-farm2_2019-04-30_07-25-46.wav,44100,16,60,1,H,512,hil,NULL,NULL,0.862332327993115,NA 
rayol-farm2_2019-04-30_07-27-46.wav,44100,16,60,1,H,512,hil,NULL,NULL,0.900344795404658,NA 
rayol-farm2_2019-04-30_07-29-47.wav,44100,16,60,1,H,512,hil,NULL,NULL,0.898127826736163,NA 
rayol-farm2_2019-04-30_07-31-47.wav,44100,16,60,1,H,512,hil,NULL,NULL,0.897690852338975,NA 
rayol-farm2_2019-04-30_07-33-47.wav,44100,16,60,1,H,512,hil,NULL,NULL,0.898429805574597,NA 
rayol-farm2_2019-04-30_07-35-47.wav,44100,16,60,1,H,512,hil,NULL,NULL,0.894387204368343,NA 
rayol-farm2_2019-04-30_07-37-47.wav,44100,16,60,1,H,512,hil,NULL,NULL,0.890881473718638,NA 
rayol-farm2_2019-04-30_07-39-47.wav,44100,16,60,1,H,512,hil,NULL,NULL,0.88398891505281,NA 
rayol-farm2_2019-04-30_07-41-47.wav,44100,16,60,1,H,512,hil,NULL,NULL,0.894936990701629,NA 
rayol-farm2_2019-04-30_07-43-47.wav,44100,16,60,1,H,512,hil,NULL,NULL,0.871255125207676,NA 
rayol-farm2_2019-04-30_07-45-47.wav,44100,16,60,1,H,512,hil,NULL,NULL,0.87031078856175,NA 
rayol-farm2_2019-04-30_07-47-48.wav,44100,16,60,1,H,512,hil,NULL,NULL,0.858154216692995,NA 
rayol-farm2_2019-04-30_07-49-48.wav,44100,16,60,1,H,512,hil,NULL,NULL,0.868764083210788,NA 
rayol-farm2_2019-04-30_07-51-48.wav,44100,16,60,1,H,512,hil,NULL,NULL,0.868199015661083,NA 
rayol-farm2_2019-04-30_07-53-48.wav,44100,16,60,1,H,512,hil,NULL,NULL,0.868770259746211,NA 
rayol-farm2_2019-04-30_07-55-48.wav,44100,16,60,1,H,512,hil,NULL,NULL,0.863085789825342,NA 
rayol-farm2_2019-04-30_07-57-48.wav,44100,16,60,1,H,512,hil,NULL,NULL,0.863278558177072,NA 
rayol-farm2_2019-04-30_07-59-48.wav,44100,16,60,1,H,512,hil,NULL,NULL,0.858788852683284,NA 
rayol-farm2_2019-04-30_08-01-48.wav,44100,16,60,1,H,512,hil,NULL,NULL,0.86775320625615,NA 
rayol-farm2_2019-04-30_08-03-49.wav,44100,16,60,1,H,512,hil,NULL,NULL,0.870686799663976,NA 
rayol-farm2_2019-04-30_08-05-49.wav,44100,16,60,1,H,512,hil,NULL,NULL,0.871266363797727,NA 
rayol-farm2_2019-04-30_08-07-49.wav,44100,16,60,1,H,512,hil,NULL,NULL,0.874015740269919,NA 
rayol-farm2_2019-04-30_08-09-49.wav,44100,16,60,1,H,512,hil,NULL,NULL,0.890825649040242,NA 
rayol-farm2_2019-04-30_08-11-49.wav,44100,16,60,1,H,512,hil,NULL,NULL,0.89383707168752,NA 
rayol-farm2_2019-04-30_08-13-49.wav,44100,16,60,1,H,512,hil,NULL,NULL,0.882961118902655,NA 
rayol-farm2_2019-04-30_08-15-49.wav,44100,16,60,1,H,512,hil,NULL,NULL,0.894410639316835,NA 
rayol-farm2_2019-04-30_08-17-49.wav,44100,16,60,1,H,512,hil,NULL,NULL,0.890221736802736,NA 
rayol-farm2_2019-04-30_08-19-50.wav,44100,16,60,1,H,512,hil,NULL,NULL,0.896063870287193,NA 
rayol-farm2_2019-04-30_08-21-50.wav,44100,16,60,1,H,512,hil,NULL,NULL,0.88289683547939,NA 
rayol-farm2_2019-04-30_08-23-50.wav,44100,16,60,1,H,512,hil,NULL,NULL,0.860864822698717,NA 
rayol-farm2_2019-04-30_08-25-50.wav,44100,16,60,1,H,512,hil,NULL,NULL,0.894051639018529,NA 
rayol-farm2_2019-04-30_08-27-50.wav,44100,16,60,1,H,512,hil,NULL,NULL,0.875340616195605,NA 
rayol-farm2_2019-04-30_08-29-50.wav,44100,16,60,1,H,512,hil,NULL,NULL,0.886279789216142,NA 
rayol-farm2_2019-04-30_08-31-50.wav,44100,16,60,1,H,512,hil,NULL,NULL,0.799424156864915,NA 
rayol-farm2_2019-04-30_08-33-50.wav,44100,16,60,1,H,512,hil,NULL,NULL,0.898018945200713,NA 
rayol-farm2_2019-04-30_08-35-50.wav,44100,16,60,1,H,512,hil,NULL,NULL,0.897289916623095,NA 
rayol-farm2_2019-04-30_08-37-51.wav,44100,16,60,1,H,512,hil,NULL,NULL,0.865224442723382,NA 
rayol-farm2_2019-04-30_08-39-51.wav,44100,16,60,1,H,512,hil,NULL,NULL,0.781306844067797,NA 
rayol-farm2_2019-04-30_08-41-51.wav,44100,16,60,1,H,512,hil,NULL,NULL,0.868911084258709,NA 
rayol-farm2_2019-04-30_08-43-51.wav,44100,16,60,1,H,512,hil,NULL,NULL,0.846411749882429,NA 
rayol-farm2_2019-04-30_08-45-51.wav,44100,16,60,1,H,512,hil,NULL,NULL,0.881697354136132,NA 
rayol-farm2_2019-04-30_08-47-51.wav,44100,16,60,1,H,512,hil,NULL,NULL,0.838124366172462,NA 
rayol-farm2_2019-04-30_08-49-51.wav,44100,16,60,1,H,512,hil,NULL,NULL,0.823591590308463,NA 
rayol-farm2_2019-04-30_08-51-51.wav,44100,16,60,1,H,512,hil,NULL,NULL,0.837729742927934,NA 
rayol-farm2_2019-04-30_08-53-52.wav,44100,16,60,1,H,512,hil,NULL,NULL,0.884480690288244,NA 
rayol-farm2_2019-04-30_08-55-52.wav,44100,16,60,1,H,512,hil,NULL,NULL,0.831028489886833,NA 
rayol-farm2_2019-04-30_08-57-52.wav,44100,16,60,1,H,512,hil,NULL,NULL,0.874382804375504,NA 
rayol-farm2_2019-04-30_08-59-52.wav,44100,16,60,1,H,512,hil,NULL,NULL,0.824026326000647,NA 
rayol-farm2_2019-04-30_09-01-52.wav,44100,16,60,1,H,512,hil,NULL,NULL,0.87082964737158,NA 
rayol-farm2_2019-04-30_09-03-52.wav,44100,16,60,1,H,512,hil,NULL,NULL,0.852614187164232,NA 
rayol-farm2_2019-04-30_09-05-52.wav,44100,16,60,1,H,512,hil,NULL,NULL,0.829046511499801,NA 
rayol-farm2_2019-04-30_09-07-52.wav,44100,16,60,1,H,512,hil,NULL,NULL,0.846675819456849,NA 
rayol-farm2_2019-04-30_09-09-53.wav,44100,16,60,1,H,512,hil,NULL,NULL,0.84320732794752,NA 
rayol-farm2_2019-04-30_09-11-53.wav,44100,16,60,1,H,512,hil,NULL,NULL,0.838505984389716,NA 
rayol-farm2_2019-04-30_09-13-53.wav,44100,16,60,1,H,512,hil,NULL,NULL,0.854300486614843,NA 
rayol-farm2_2019-04-30_09-15-53.wav,44100,16,60,1,H,512,hil,NULL,NULL,0.810828725948474,NA 
rayol-farm2_2019-04-30_09-17-53.wav,44100,16,60,1,H,512,hil,NULL,NULL,0.852333584890032,NA 
rayol-farm2_2019-04-30_09-19-53.wav,44100,16,60,1,H,512,hil,NULL,NULL,0.85284329204714,NA 
rayol-farm2_2019-04-30_09-21-53.wav,44100,16,60,1,H,512,hil,NULL,NULL,0.846798169258223,NA 
rayol-farm2_2019-04-30_09-23-53.wav,44100,16,60,1,H,512,hil,NULL,NULL,0.872984520881802,NA 
rayol-farm2_2019-04-30_09-25-54.wav,44100,16,60,1,H,512,hil,NULL,NULL,0.833516755338134,NA 
rayol-farm2_2019-04-30_09-27-54.wav,44100,16,60,1,H,512,hil,NULL,NULL,0.847325955182694,NA 
rayol-farm2_2019-04-30_09-29-54.wav,44100,16,60,1,H,512,hil,NULL,NULL,0.843635738397341,NA 
rayol-farm2_2019-04-30_09-31-54.wav,44100,16,60,1,H,512,hil,NULL,NULL,0.859509690117421,NA 
rayol-farm2_2019-04-30_09-33-54.wav,44100,16,60,1,H,512,hil,NULL,NULL,0.852582587752398,NA 
rayol-farm2_2019-04-30_09-35-54.wav,44100,16,60,1,H,512,hil,NULL,NULL,0.811474435778763,NA 
rayol-farm2_2019-04-30_09-37-54.wav,44100,16,60,1,H,512,hil,NULL,NULL,0.867281430718674,NA 
rayol-farm2_2019-04-30_09-39-54.wav,44100,16,60,1,H,512,hil,NULL,NULL,0.821384593421514,NA 
rayol-farm2_2019-04-30_09-41-55.wav,44100,16,60,1,H,512,hil,NULL,NULL,0.834680786351314,NA 
rayol-farm2_2019-04-30_09-43-55.wav,44100,16,60,1,H,512,hil,NULL,NULL,0.850969549990537,NA 
rayol-farm2_2019-04-30_09-45-55.wav,44100,16,60,1,H,512,hil,NULL,NULL,0.865990081553201,NA 
rayol-farm2_2019-04-30_09-47-55.wav,44100,16,60,1,H,512,hil,NULL,NULL,0.860636410277616,NA 
rayol-farm2_2019-04-30_09-49-55.wav,44100,16,60,1,H,512,hil,NULL,NULL,0.862562955921261,NA 
rayol-farm2_2019-04-30_09-51-55.wav,44100,16,60,1,H,512,hil,NULL,NULL,0.84867618840936,NA 
rayol-farm2_2019-04-30_09-53-55.wav,44100,16,60,1,H,512,hil,NULL,NULL,0.850641109446495,NA 
rayol-farm2_2019-04-30_09-55-55.wav,44100,16,60,1,H,512,hil,NULL,NULL,0.866242418327424,NA 
rayol-farm2_2019-04-30_09-57-55.wav,44100,16,60,1,H,512,hil,NULL,NULL,0.751921705355304,NA 
rayol-farm2_2019-04-30_09-59-56.wav,44100,16,60,1,H,512,hil,NULL,NULL,0.886194669869801,NA 
rayol-farm2_2019-04-30_10-01-56.wav,44100,16,60,1,H,512,hil,NULL,NULL,0.894822594556683,NA 
rayol-farm2_2019-04-30_10-03-56.wav,44100,16,60,1,H,512,hil,NULL,NULL,0.895490688969571,NA 
rayol-farm2_2019-04-30_10-05-56.wav,44100,16,60,1,H,512,hil,NULL,NULL,0.880415688770956,NA 
rayol-farm2_2019-04-30_10-07-56.wav,44100,16,60,1,H,512,hil,NULL,NULL,0.884091077550755,NA 
rayol-farm2_2019-04-30_10-09-56.wav,44100,16,60,1,H,512,hil,NULL,NULL,0.878795284849665,NA 
rayol-farm2_2019-04-30_10-11-56.wav,44100,16,60,1,H,512,hil,NULL,NULL,0.853341482890256,NA 
rayol-farm2_2019-04-30_10-13-56.wav,44100,16,60,1,H,512,hil,NULL,NULL,0.84344958143881,NA 
rayol-farm2_2019-04-30_10-15-57.wav,44100,16,60,1,H,512,hil,NULL,NULL,0.893044917603349,NA 
rayol-farm2_2019-04-30_10-17-57.wav,44100,16,60,1,H,512,hil,NULL,NULL,0.865369883216551,NA 
rayol-farm2_2019-04-30_10-19-57.wav,44100,16,60,1,H,512,hil,NULL,NULL,0.893207766927622,NA 
rayol-farm2_2019-04-30_10-21-57.wav,44100,16,60,1,H,512,hil,NULL,NULL,0.895257983079086,NA 
rayol-farm2_2019-04-30_10-23-57.wav,44100,16,60,1,H,512,hil,NULL,NULL,0.843397944662138,NA 
rayol-farm2_2019-04-30_10-25-57.wav,44100,16,60,1,H,512,hil,NULL,NULL,0.882352462820188,NA 
rayol-farm2_2019-04-30_10-27-57.wav,44100,16,60,1,H,512,hil,NULL,NULL,0.868373517073172,NA 
rayol-farm2_2019-04-30_10-29-57.wav,44100,16,60,1,H,512,hil,NULL,NULL,0.858742479078996,NA 
rayol-farm2_2019-04-30_10-31-58.wav,44100,16,60,1,H,512,hil,NULL,NULL,0.851773712230779,NA 
rayol-farm2_2019-04-30_10-33-58.wav,44100,16,60,1,H,512,hil,NULL,NULL,0.853805176131659,NA 
rayol-farm2_2019-04-30_10-35-58.wav,44100,16,60,1,H,512,hil,NULL,NULL,0.879774315391688,NA 
rayol-farm2_2019-04-30_10-37-58.wav,44100,16,60,1,H,512,hil,NULL,NULL,0.851413045822441,NA 
rayol-farm2_2019-04-30_10-39-58.wav,44100,16,60,1,H,512,hil,NULL,NULL,0.896643258962724,NA 
rayol-farm2_2019-04-30_10-41-58.wav,44100,16,60,1,H,512,hil,NULL,NULL,0.840897487997015,NA 
rayol-farm2_2019-04-30_10-43-58.wav,44100,16,60,1,H,512,hil,NULL,NULL,0.877250426839345,NA 
rayol-farm2_2019-04-30_10-45-58.wav,44100,16,60,1,H,512,hil,NULL,NULL,0.858655019548423,NA 
rayol-farm2_2019-04-30_10-47-58.wav,44100,16,60,1,H,512,hil,NULL,NULL,0.892979667266105,NA 
rayol-farm2_2019-04-30_10-49-59.wav,44100,16,60,1,H,512,hil,NULL,NULL,0.892636671745921,NA 
rayol-farm2_2019-04-30_10-51-59.wav,44100,16,60,1,H,512,hil,NULL,NULL,0.855068565898494,NA 
rayol-farm2_2019-04-30_10-53-59.wav,44100,16,60,1,H,512,hil,NULL,NULL,0.866830095603476,NA 
rayol-farm2_2019-04-30_10-55-59.wav,44100,16,60,1,H,512,hil,NULL,NULL,0.835634141946982,NA 
rayol-farm2_2019-04-30_10-57-59.wav,44100,16,60,1,H,512,hil,NULL,NULL,0.777080123302842,NA 
rayol-farm2_2019-04-30_10-59-59.wav,44100,16,60,1,H,512,hil,NULL,NULL,0.830360536072097,NA 
rayol-farm2_2019-04-30_11-01-59.wav,44100,16,60,1,H,512,hil,NULL,NULL,0.814238782203408,NA 
rayol-farm2_2019-04-30_11-03-59.wav,44100,16,60,1,H,512,hil,NULL,NULL,0.860883865664061,NA 
rayol-farm2_2019-04-30_11-06-00.wav,44100,16,60,1,H,512,hil,NULL,NULL,0.797518957432243,NA 
rayol-farm2_2019-04-30_11-08-00.wav,44100,16,60,1,H,512,hil,NULL,NULL,0.863514050972868,NA 
rayol-farm2_2019-04-30_11-10-00.wav,44100,16,60,1,H,512,hil,NULL,NULL,0.862697254469171,NA 
rayol-farm2_2019-04-30_11-12-00.wav,44100,16,60,1,H,512,hil,NULL,NULL,0.869442428200726,NA 
rayol-farm2_2019-04-30_11-14-00.wav,44100,16,60,1,H,512,hil,NULL,NULL,0.805166043320092,NA 
rayol-farm2_2019-04-30_11-16-00.wav,44100,16,60,1,H,512,hil,NULL,NULL,0.807250178878923,NA 
rayol-farm2_2019-04-30_11-18-00.wav,44100,16,60,1,H,512,hil,NULL,NULL,0.809111551018109,NA 
rayol-farm2_2019-04-30_11-20-00.wav,44100,16,60,1,H,512,hil,NULL,NULL,0.88384423154309,NA 
rayol-farm2_2019-04-30_11-22-01.wav,44100,16,60,1,H,512,hil,NULL,NULL,0.825799154032678,NA 
rayol-farm2_2019-04-30_11-24-01.wav,44100,16,60,1,H,512,hil,NULL,NULL,0.786775225036413,NA 
rayol-farm2_2019-04-30_11-26-01.wav,44100,16,60,1,H,512,hil,NULL,NULL,0.845622288298092,NA 
rayol-farm2_2019-04-30_11-28-01.wav,44100,16,60,1,H,512,hil,NULL,NULL,0.860633765026326,NA 
rayol-farm2_2019-04-30_11-30-01.wav,44100,16,60,1,H,512,hil,NULL,NULL,0.867188909830194,NA 
rayol-farm2_2019-04-30_11-32-01.wav,44100,16,60,1,H,512,hil,NULL,NULL,0.782426415010745,NA 
rayol-farm2_2019-04-30_11-34-01.wav,44100,16,60,1,H,512,hil,NULL,NULL,0.856162444349184,NA 
rayol-farm2_2019-04-30_11-36-01.wav,44100,16,60,1,H,512,hil,NULL,NULL,0.876485275728805,NA 
rayol-farm2_2019-04-30_11-38-01.wav,44100,16,60,1,H,512,hil,NULL,NULL,0.852915028083389,NA 
rayol-farm2_2019-04-30_11-40-02.wav,44100,16,60,1,H,512,hil,NULL,NULL,0.779919517452265,NA 
rayol-farm2_2019-04-30_11-42-02.wav,44100,16,60,1,H,512,hil,NULL,NULL,0.838923544157218,NA 
rayol-farm2_2019-04-30_11-44-02.wav,44100,16,60,1,H,512,hil,NULL,NULL,0.793247719929359,NA 
rayol-farm2_2019-04-30_11-46-02.wav,44100,16,60,1,H,512,hil,NULL,NULL,0.806150535155407,NA 
rayol-farm2_2019-04-30_11-48-02.wav,44100,16,60,1,H,512,hil,NULL,NULL,0.762032335692535,NA 
rayol-farm2_2019-04-30_11-50-02.wav,44100,16,60,1,H,512,hil,NULL,NULL,0.838878534331951,NA 
rayol-farm2_2019-04-30_11-52-02.wav,44100,16,60,1,H,512,hil,NULL,NULL,0.79667452861005,NA 
rayol-farm2_2019-04-30_11-54-02.wav,44100,16,60,1,H,512,hil,NULL,NULL,0.864555026887128,NA 
rayol-farm2_2019-04-30_11-56-03.wav,44100,16,60,1,H,512,hil,NULL,NULL,0.737227350992966,NA 
rayol-farm2_2019-04-30_11-58-03.wav,44100,16,60,1,H,512,hil,NULL,NULL,0.801124044391952,NA 
rayol-farm2_2019-04-30_12-00-03.wav,44100,16,60,1,H,512,hil,NULL,NULL,0.832246447905795,NA 
rayol-farm2_2019-04-30_12-02-03.wav,44100,16,60,1,H,512,hil,NULL,NULL,0.806994013803179,NA 
rayol-farm2_2019-04-30_12-04-03.wav,44100,16,60,1,H,512,hil,NULL,NULL,0.836719307703105,NA 
rayol-farm2_2019-04-30_12-06-03.wav,44100,16,60,1,H,512,hil,NULL,NULL,0.850603538640403,NA 
rayol-farm2_2019-04-30_12-08-03.wav,44100,16,60,1,H,512,hil,NULL,NULL,0.863561240326839,NA 
rayol-farm2_2019-04-30_12-10-03.wav,44100,16,60,1,H,512,hil,NULL,NULL,0.878512806936645,NA 
rayol-farm2_2019-04-30_12-12-04.wav,44100,16,60,1,H,512,hil,NULL,NULL,0.866269325242115,NA 
rayol-farm2_2019-04-30_12-14-04.wav,44100,16,60,1,H,512,hil,NULL,NULL,0.866028499126892,NA 
rayol-farm2_2019-04-30_12-16-04.wav,44100,16,60,1,H,512,hil,NULL,NULL,0.845306811430479,NA 
rayol-farm2_2019-04-30_12-18-04.wav,44100,16,60,1,H,512,hil,NULL,NULL,0.833209750715797,NA 
rayol-farm2_2019-04-30_12-20-04.wav,44100,16,60,1,H,512,hil,NULL,NULL,0.818600363813438,NA 
rayol-farm2_2019-04-30_12-22-04.wav,44100,16,60,1,H,512,hil,NULL,NULL,0.820904026301172,NA 
rayol-farm2_2019-04-30_12-24-04.wav,44100,16,60,1,H,512,hil,NULL,NULL,0.816100672971711,NA 
rayol-farm2_2019-04-30_12-26-04.wav,44100,16,60,1,H,512,hil,NULL,NULL,0.855437417712464,NA 
rayol-farm2_2019-04-30_12-28-05.wav,44100,16,60,1,H,512,hil,NULL,NULL,0.868683505853149,NA 
rayol-farm2_2019-04-30_12-30-05.wav,44100,16,60,1,H,512,hil,NULL,NULL,0.839597540044235,NA 
rayol-farm2_2019-04-30_12-32-05.wav,44100,16,60,1,H,512,hil,NULL,NULL,0.791913933635783,NA 
rayol-farm2_2019-04-30_12-34-05.wav,44100,16,60,1,H,512,hil,NULL,NULL,0.756238952009504,NA 
rayol-farm2_2019-04-30_12-36-05.wav,44100,16,60,1,H,512,hil,NULL,NULL,0.839624992028795,NA 
rayol-farm2_2019-04-30_12-38-05.wav,44100,16,60,1,H,512,hil,NULL,NULL,0.813812596050274,NA 
rayol-farm2_2019-04-30_12-40-05.wav,44100,16,60,1,H,512,hil,NULL,NULL,0.7345553344806,NA 
rayol-farm2_2019-04-30_12-42-05.wav,44100,16,60,1,H,512,hil,NULL,NULL,0.780708326526754,NA 
rayol-farm2_2019-04-30_12-44-06.wav,44100,16,60,1,H,512,hil,NULL,NULL,0.886397567824269,NA 
rayol-farm2_2019-04-30_12-46-06.wav,44100,16,60,1,H,512,hil,NULL,NULL,0.888882349033778,NA 
rayol-farm2_2019-04-30_12-48-06.wav,44100,16,60,1,H,512,hil,NULL,NULL,0.813954589024162,NA 
rayol-farm2_2019-04-30_12-50-06.wav,44100,16,60,1,H,512,hil,NULL,NULL,0.835098104229881,NA 
rayol-farm2_2019-04-30_12-52-06.wav,44100,16,60,1,H,512,hil,NULL,NULL,0.86248642931811,NA 
rayol-farm2_2019-04-30_12-54-06.wav,44100,16,60,1,H,512,hil,NULL,NULL,0.833708562212417,NA 
rayol-farm2_2019-04-30_12-56-06.wav,44100,16,60,1,H,512,hil,NULL,NULL,0.86669137356078,NA 
rayol-farm2_2019-04-30_12-58-06.wav,44100,16,60,1,H,512,hil,NULL,NULL,0.868477919968831,NA 
rayol-farm2_2019-04-30_13-00-06.wav,44100,16,60,1,H,512,hil,NULL,NULL,0.872894700467522,NA 
rayol-farm2_2019-04-30_13-02-07.wav,44100,16,60,1,H,512,hil,NULL,NULL,0.860742414874213,NA 
rayol-farm2_2019-04-30_13-04-07.wav,44100,16,60,1,H,512,hil,NULL,NULL,0.829085675480331,NA 
rayol-farm2_2019-04-30_13-06-07.wav,44100,16,60,1,H,512,hil,NULL,NULL,0.869519651609461,NA 
rayol-farm2_2019-04-30_13-08-07.wav,44100,16,60,1,H,512,hil,NULL,NULL,0.869021918245323,NA 
rayol-farm2_2019-04-30_13-10-07.wav,44100,16,60,1,H,512,hil,NULL,NULL,0.864412999481475,NA 
rayol-farm2_2019-04-30_13-12-07.wav,44100,16,60,1,H,512,hil,NULL,NULL,0.873469227769915,NA 
rayol-farm2_2019-04-30_13-14-07.wav,44100,16,60,1,H,512,hil,NULL,NULL,0.867868348633255,NA 
rayol-farm2_2019-04-30_13-16-07.wav,44100,16,60,1,H,512,hil,NULL,NULL,0.865021562705355,NA 
rayol-farm2_2019-04-30_13-18-08.wav,44100,16,60,1,H,512,hil,NULL,NULL,0.875957467219522,NA 
rayol-farm2_2019-04-30_13-20-08.wav,44100,16,60,1,H,512,hil,NULL,NULL,0.864532268891189,NA 
rayol-farm2_2019-04-30_13-22-08.wav,44100,16,60,1,H,512,hil,NULL,NULL,0.862944255188583,NA 
rayol-farm2_2019-04-30_13-24-08.wav,44100,16,60,1,H,512,hil,NULL,NULL,0.877965825143699,NA 
rayol-farm2_2019-04-30_13-26-08.wav,44100,16,60,1,H,512,hil,NULL,NULL,0.865385854297209,NA 
rayol-farm2_2019-04-30_13-28-08.wav,44100,16,60,1,H,512,hil,NULL,NULL,0.872314913189805,NA 
rayol-farm2_2019-04-30_13-30-08.wav,44100,16,60,1,H,512,hil,NULL,NULL,0.867484615535835,NA 
rayol-farm2_2019-04-30_13-32-08.wav,44100,16,60,1,H,512,hil,NULL,NULL,0.848055456523758,NA 
rayol-farm2_2019-04-30_13-34-09.wav,44100,16,60,1,H,512,hil,NULL,NULL,0.867861454350346,NA 
rayol-farm2_2019-04-30_13-36-09.wav,44100,16,60,1,H,512,hil,NULL,NULL,0.862898138961661,NA 
rayol-farm2_2019-04-30_13-38-09.wav,44100,16,60,1,H,512,hil,NULL,NULL,0.86703252984135,NA 
rayol-farm2_2019-04-30_13-40-09.wav,44100,16,60,1,H,512,hil,NULL,NULL,0.877451981117143,NA 
rayol-farm2_2019-04-30_13-42-09.wav,44100,16,60,1,H,512,hil,NULL,NULL,0.857547588307538,NA 
rayol-farm2_2019-04-30_13-44-09.wav,44100,16,60,1,H,512,hil,NULL,NULL,0.864956963386246,NA 
rayol-farm2_2019-04-30_13-46-09.wav,44100,16,60,1,H,512,hil,NULL,NULL,0.879998764593976,NA 
rayol-farm2_2019-04-30_13-48-09.wav,44100,16,60,1,H,512,hil,NULL,NULL,0.883225138200678,NA 
rayol-farm2_2019-04-30_13-50-09.wav,44100,16,60,1,H,512,hil,NULL,NULL,0.863375343943514,NA 
rayol-farm2_2019-04-30_13-52-10.wav,44100,16,60,1,H,512,hil,NULL,NULL,0.890213282089759,NA 
rayol-farm2_2019-04-30_13-54-10.wav,44100,16,60,1,H,512,hil,NULL,NULL,0.869718357443937,NA 
rayol-farm2_2019-04-30_13-56-10.wav,44100,16,60,1,H,512,hil,NULL,NULL,0.895658118908914,NA 
rayol-farm2_2019-04-30_13-58-10.wav,44100,16,60,1,H,512,hil,NULL,NULL,0.869885800792639,NA 
rayol-farm2_2019-04-30_14-00-10.wav,44100,16,60,1,H,512,hil,NULL,NULL,0.799080612615084,NA 
rayol-farm2_2019-04-30_14-02-10.wav,44100,16,60,1,H,512,hil,NULL,NULL,0.816190434496594,NA 
rayol-farm2_2019-04-30_14-04-10.wav,44100,16,60,1,H,512,hil,NULL,NULL,0.869834789805211,NA 
rayol-farm2_2019-04-30_14-06-10.wav,44100,16,60,1,H,512,hil,NULL,NULL,0.891644312881019,NA 
rayol-farm2_2019-04-30_14-08-11.wav,44100,16,60,1,H,512,hil,NULL,NULL,0.885437545974898,NA 
rayol-farm2_2019-04-30_14-10-11.wav,44100,16,60,1,H,512,hil,NULL,NULL,0.860322758420448,NA 
rayol-farm2_2019-04-30_14-12-11.wav,44100,16,60,1,H,512,hil,NULL,NULL,0.878574755454831,NA 
rayol-farm2_2019-04-30_14-14-11.wav,44100,16,60,1,H,512,hil,NULL,NULL,0.875207113280322,NA 
rayol-farm2_2019-04-30_14-16-11.wav,44100,16,60,1,H,512,hil,NULL,NULL,0.885183213416542,NA 
rayol-farm2_2019-04-30_14-18-11.wav,44100,16,60,1,H,512,hil,NULL,NULL,0.879688041986449,NA 
rayol-farm2_2019-04-30_14-20-11.wav,44100,16,60,1,H,512,hil,NULL,NULL,0.856359164788233,NA 
rayol-farm2_2019-04-30_14-22-11.wav,44100,16,60,1,H,512,hil,NULL,NULL,0.809053939038665,NA 
rayol-farm2_2019-04-30_14-24-12.wav,44100,16,60,1,H,512,hil,NULL,NULL,0.889279743029376,NA 
rayol-farm2_2019-04-30_14-26-12.wav,44100,16,60,1,H,512,hil,NULL,NULL,0.832020390147361,NA 
rayol-farm2_2019-04-30_14-28-12.wav,44100,16,60,1,H,512,hil,NULL,NULL,0.872499771928511,NA 
rayol-farm2_2019-04-30_14-30-12.wav,44100,16,60,1,H,512,hil,NULL,NULL,0.887580175093915,NA 
rayol-farm2_2019-04-30_14-32-12.wav,44100,16,60,1,H,512,hil,NULL,NULL,0.855686553380363,NA 
rayol-farm2_2019-04-30_14-34-12.wav,44100,16,60,1,H,512,hil,NULL,NULL,0.889581195644803,NA 
rayol-farm2_2019-04-30_14-36-12.wav,44100,16,60,1,H,512,hil,NULL,NULL,0.879182845575497,NA 
rayol-farm2_2019-04-30_14-38-12.wav,44100,16,60,1,H,512,hil,NULL,NULL,0.888754282152149,NA 
rayol-farm2_2019-04-30_14-40-12.wav,44100,16,60,1,H,512,hil,NULL,NULL,0.884826732583807,NA 
rayol-farm2_2019-04-30_14-42-13.wav,44100,16,60,1,H,512,hil,NULL,NULL,0.889717220974109,NA 
rayol-farm2_2019-04-30_14-44-13.wav,44100,16,60,1,H,512,hil,NULL,NULL,0.855277632923326,NA 
rayol-farm2_2019-04-30_14-46-13.wav,44100,16,60,1,H,512,hil,NULL,NULL,0.894058607020245,NA 
rayol-farm2_2019-04-30_14-48-13.wav,44100,16,60,1,H,512,hil,NULL,NULL,0.887302659689983,NA 
rayol-farm2_2019-04-30_14-50-13.wav,44100,16,60,1,H,512,hil,NULL,NULL,0.887515706252036,NA 
rayol-farm2_2019-04-30_14-52-13.wav,44100,16,60,1,H,512,hil,NULL,NULL,0.895377157070654,NA 
rayol-farm2_2019-04-30_14-54-13.wav,44100,16,60,1,H,512,hil,NULL,NULL,0.89060747610084,NA 
rayol-farm2_2019-04-30_14-56-13.wav,44100,16,60,1,H,512,hil,NULL,NULL,0.881816545970736,NA 
rayol-farm2_2019-04-30_14-58-14.wav,44100,16,60,1,H,512,hil,NULL,NULL,0.875037728911865,NA 
rayol-farm2_2019-04-30_15-00-14.wav,44100,16,60,1,H,512,hil,NULL,NULL,0.880459401262843,NA 
rayol-farm2_2019-04-30_15-02-14.wav,44100,16,60,1,H,512,hil,NULL,NULL,0.875891593403385,NA 
rayol-farm2_2019-04-30_15-04-14.wav,44100,16,60,1,H,512,hil,NULL,NULL,0.87980858560141,NA 
rayol-farm2_2019-04-30_15-06-14.wav,44100,16,60,1,H,512,hil,NULL,NULL,0.875153721046108,NA 
rayol-farm2_2019-04-30_15-08-14.wav,44100,16,60,1,H,512,hil,NULL,NULL,0.876908534351345,NA 
rayol-farm2_2019-04-30_15-10-14.wav,44100,16,60,1,H,512,hil,NULL,NULL,0.889732122860861,NA 
rayol-farm2_2019-04-30_15-12-14.wav,44100,16,60,1,H,512,hil,NULL,NULL,0.893066237984999,NA 
rayol-farm2_2019-04-30_15-14-15.wav,44100,16,60,1,H,512,hil,NULL,NULL,0.884534432660914,NA 
rayol-farm2_2019-04-30_15-16-15.wav,44100,16,60,1,H,512,hil,NULL,NULL,0.883626960986826,NA 
rayol-farm2_2019-04-30_15-18-15.wav,44100,16,60,1,H,512,hil,NULL,NULL,0.893362861120969,NA 
rayol-farm2_2019-04-30_15-20-15.wav,44100,16,60,1,H,512,hil,NULL,NULL,0.891512695354952,NA 
rayol-farm2_2019-04-30_15-22-15.wav,44100,16,60,1,H,512,hil,NULL,NULL,0.881436562682144,NA 
rayol-farm2_2019-04-30_15-24-15.wav,44100,16,60,1,H,512,hil,NULL,NULL,0.883758447977209,NA 
rayol-farm2_2019-04-30_15-26-15.wav,44100,16,60,1,H,512,hil,NULL,NULL,0.878937872955988,NA 
rayol-farm2_2019-04-30_15-28-15.wav,44100,16,60,1,H,512,hil,NULL,NULL,0.876646664640125,NA 
rayol-farm2_2019-04-30_15-30-16.wav,44100,16,60,1,H,512,hil,NULL,NULL,0.878474109224221,NA 
rayol-farm2_2019-04-30_15-32-16.wav,44100,16,60,1,H,512,hil,NULL,NULL,0.881465206231303,NA 
rayol-farm2_2019-04-30_15-34-16.wav,44100,16,60,1,H,512,hil,NULL,NULL,0.885765095503293,NA 
rayol-farm2_2019-04-30_15-36-16.wav,44100,16,60,1,H,512,hil,NULL,NULL,0.89033930932834,NA 
rayol-farm2_2019-04-30_15-38-16.wav,44100,16,60,1,H,512,hil,NULL,NULL,0.896730449123213,NA 
rayol-farm2_2019-04-30_15-40-16.wav,44100,16,60,1,H,512,hil,NULL,NULL,0.892678434967974,NA 
rayol-farm2_2019-04-30_15-42-16.wav,44100,16,60,1,H,512,hil,NULL,NULL,0.88605290723245,NA 
rayol-farm2_2019-04-30_15-44-16.wav,44100,16,60,1,H,512,hil,NULL,NULL,0.888502307313192,NA 
rayol-farm2_2019-04-30_15-46-16.wav,44100,16,60,1,H,512,hil,NULL,NULL,0.81022113058994,NA 
rayol-farm2_2019-04-30_15-48-17.wav,44100,16,60,1,H,512,hil,NULL,NULL,0.887173109547005,NA 
rayol-farm2_2019-04-30_15-50-17.wav,44100,16,60,1,H,512,hil,NULL,NULL,0.897618673391599,NA 
rayol-farm2_2019-04-30_15-52-17.wav,44100,16,60,1,H,512,hil,NULL,NULL,0.883818470449758,NA 
rayol-farm2_2019-04-30_15-54-17.wav,44100,16,60,1,H,512,hil,NULL,NULL,0.782030145174961,NA 
rayol-farm2_2019-04-30_15-56-17.wav,44100,16,60,1,H,512,hil,NULL,NULL,0.902889465653245,NA 
rayol-farm2_2019-04-30_15-58-17.wav,44100,16,60,1,H,512,hil,NULL,NULL,0.903088052647426,NA 
rayol-farm2_2019-04-30_16-00-17.wav,44100,16,60,1,H,512,hil,NULL,NULL,0.877094399792341,NA 
rayol-farm2_2019-04-30_16-02-17.wav,44100,16,60,1,H,512,hil,NULL,NULL,0.877037142885737,NA 
rayol-farm2_2019-04-30_16-04-18.wav,44100,16,60,1,H,512,hil,NULL,NULL,0.881021533912789,NA 
rayol-farm2_2019-04-30_16-06-18.wav,44100,16,60,1,H,512,hil,NULL,NULL,0.88780006412105,NA 
rayol-farm2_2019-04-30_16-08-18.wav,44100,16,60,1,H,512,hil,NULL,NULL,0.894325236849292,NA 
rayol-farm2_2019-04-30_16-10-18.wav,44100,16,60,1,H,512,hil,NULL,NULL,0.883360812025325,NA 
rayol-farm2_2019-04-30_16-12-18.wav,44100,16,60,1,H,512,hil,NULL,NULL,0.893633044524032,NA 
rayol-farm2_2019-04-30_16-14-18.wav,44100,16,60,1,H,512,hil,NULL,NULL,0.888034790538763,NA 
rayol-farm2_2019-04-30_16-16-18.wav,44100,16,60,1,H,512,hil,NULL,NULL,0.897866641143676,NA 
rayol-farm2_2019-04-30_16-18-18.wav,44100,16,60,1,H,512,hil,NULL,NULL,0.890969486031615,NA 
rayol-farm2_2019-04-30_16-20-19.wav,44100,16,60,1,H,512,hil,NULL,NULL,0.88945970289212,NA 
rayol-farm2_2019-04-30_16-22-19.wav,44100,16,60,1,H,512,hil,NULL,NULL,0.885335808277695,NA 
rayol-farm2_2019-04-30_16-24-19.wav,44100,16,60,1,H,512,hil,NULL,NULL,0.893653492480804,NA 
rayol-farm2_2019-04-30_16-26-19.wav,44100,16,60,1,H,512,hil,NULL,NULL,0.895715535158631,NA 
rayol-farm2_2019-04-30_16-28-19.wav,44100,16,60,1,H,512,hil,NULL,NULL,0.873079794580225,NA 
rayol-farm2_2019-04-30_16-30-19.wav,44100,16,60,1,H,512,hil,NULL,NULL,0.891311577262682,NA 
rayol-farm2_2019-04-30_16-32-19.wav,44100,16,60,1,H,512,hil,NULL,NULL,0.879171556123773,NA 
rayol-farm2_2019-04-30_16-34-19.wav,44100,16,60,1,H,512,hil,NULL,NULL,0.888502099279217,NA 
rayol-farm2_2019-04-30_16-36-20.wav,44100,16,60,1,H,512,hil,NULL,NULL,0.894740933693208,NA 
rayol-farm2_2019-04-30_16-38-20.wav,44100,16,60,1,H,512,hil,NULL,NULL,0.88890759088023,NA 
rayol-farm2_2019-04-30_16-40-20.wav,44100,16,60,1,H,512,hil,NULL,NULL,0.897425713450399,NA 
rayol-farm2_2019-04-30_16-42-20.wav,44100,16,60,1,H,512,hil,NULL,NULL,0.889383779478185,NA 
rayol-farm2_2019-04-30_16-44-20.wav,44100,16,60,1,H,512,hil,NULL,NULL,0.89016335116895,NA 
rayol-farm2_2019-04-30_16-46-20.wav,44100,16,60,1,H,512,hil,NULL,NULL,0.896518066752111,NA 
rayol-farm2_2019-04-30_16-48-20.wav,44100,16,60,1,H,512,hil,NULL,NULL,0.895927317080282,NA 
rayol-farm2_2019-04-30_16-50-20.wav,44100,16,60,1,H,512,hil,NULL,NULL,0.862276440259421,NA 
rayol-farm2_2019-04-30_16-52-20.wav,44100,16,60,1,H,512,hil,NULL,NULL,0.892606535019506,NA 
rayol-farm2_2019-04-30_16-54-21.wav,44100,16,60,1,H,512,hil,NULL,NULL,0.885658559527995,NA 
rayol-farm2_2019-04-30_16-56-21.wav,44100,16,60,1,H,512,hil,NULL,NULL,0.855209797622747,NA 
rayol-farm2_2019-04-30_16-58-21.wav,44100,16,60,1,H,512,hil,NULL,NULL,0.889284498856593,NA 
rayol-farm2_2019-04-30_17-00-21.wav,44100,16,60,1,H,512,hil,NULL,NULL,0.890666545451374,NA 
rayol-farm2_2019-04-30_17-02-21.wav,44100,16,60,1,H,512,hil,NULL,NULL,0.891054888230908,NA 
rayol-farm2_2019-04-30_17-04-21.wav,44100,16,60,1,H,512,hil,NULL,NULL,0.890257347298059,NA 
rayol-farm2_2019-04-30_17-06-21.wav,44100,16,60,1,H,512,hil,NULL,NULL,0.882253924712879,NA 
rayol-farm2_2019-04-30_17-08-21.wav,44100,16,60,1,H,512,hil,NULL,NULL,0.884407807387305,NA 
rayol-farm2_2019-04-30_17-10-22.wav,44100,16,60,1,H,512,hil,NULL,NULL,0.889033719735707,NA 
rayol-farm2_2019-04-30_17-12-22.wav,44100,16,60,1,H,512,hil,NULL,NULL,0.893423220178341,NA 
rayol-farm2_2019-04-30_17-14-22.wav,44100,16,60,1,H,512,hil,NULL,NULL,0.889017298311787,NA 
rayol-farm2_2019-04-30_17-16-22.wav,44100,16,60,1,H,512,hil,NULL,NULL,0.892699187729951,NA 
rayol-farm2_2019-04-30_17-18-22.wav,44100,16,60,1,H,512,hil,NULL,NULL,0.889276255558365,NA 
rayol-farm2_2019-04-30_17-20-22.wav,44100,16,60,1,H,512,hil,NULL,NULL,0.885201924256471,NA 
rayol-farm2_2019-04-30_17-22-22.wav,44100,16,60,1,H,512,hil,NULL,NULL,0.888303041512887,NA 
rayol-farm2_2019-04-30_17-24-22.wav,44100,16,60,1,H,512,hil,NULL,NULL,0.893110111869798,NA 
rayol-farm2_2019-04-30_17-26-23.wav,44100,16,60,1,H,512,hil,NULL,NULL,0.890442086506478,NA 
rayol-farm2_2019-04-30_17-28-23.wav,44100,16,60,1,H,512,hil,NULL,NULL,0.889464991415543,NA 
rayol-farm2_2019-04-30_17-30-23.wav,44100,16,60,1,H,512,hil,NULL,NULL,0.894422784236995,NA 
rayol-farm2_2019-04-30_17-32-23.wav,44100,16,60,1,H,512,hil,NULL,NULL,0.894671410059498,NA 
rayol-farm2_2019-04-30_17-34-23.wav,44100,16,60,1,H,512,hil,NULL,NULL,0.893136748662747,NA 
rayol-farm2_2019-04-30_17-36-23.wav,44100,16,60,1,H,512,hil,NULL,NULL,0.82666040097725,NA 
rayol-farm2_2019-04-30_17-38-23.wav,44100,16,60,1,H,512,hil,NULL,NULL,0.895257748752604,NA 
rayol-farm2_2019-04-30_17-40-23.wav,44100,16,60,1,H,512,hil,NULL,NULL,0.891255959119079,NA 
rayol-farm2_2019-04-30_17-42-23.wav,44100,16,60,1,H,512,hil,NULL,NULL,0.894664402076622,NA 
rayol-farm2_2019-04-30_17-44-24.wav,44100,16,60,1,H,512,hil,NULL,NULL,0.893739437818409,NA 
rayol-farm2_2019-04-30_17-46-24.wav,44100,16,60,1,H,512,hil,NULL,NULL,0.893358624103685,NA 
rayol-farm2_2019-04-30_17-48-24.wav,44100,16,60,1,H,512,hil,NULL,NULL,0.895157602169904,NA 
rayol-farm2_2019-04-30_17-50-24.wav,44100,16,60,1,H,512,hil,NULL,NULL,0.893073759678734,NA 
rayol-farm2_2019-04-30_17-52-24.wav,44100,16,60,1,H,512,hil,NULL,NULL,0.883689361728944,NA 
rayol-farm2_2019-04-30_17-54-24.wav,44100,16,60,1,H,512,hil,NULL,NULL,0.865959151845081,NA 
rayol-farm2_2019-04-30_17-56-24.wav,44100,16,60,1,H,512,hil,NULL,NULL,0.891135095838228,NA 
rayol-farm2_2019-04-30_17-58-24.wav,44100,16,60,1,H,512,hil,NULL,NULL,0.89003068725527,NA 
rayol-farm2_2019-04-30_18-00-25.wav,44100,16,60,1,H,512,hil,NULL,NULL,0.890171096308885,NA 
rayol-farm2_2019-04-30_18-02-25.wav,44100,16,60,1,H,512,hil,NULL,NULL,0.896917159704122,NA 
rayol-farm2_2019-04-30_18-04-25.wav,44100,16,60,1,H,512,hil,NULL,NULL,0.885438008013594,NA 
rayol-farm2_2019-04-30_18-06-25.wav,44100,16,60,1,H,512,hil,NULL,NULL,0.900178146602075,NA 
rayol-farm2_2019-04-30_18-08-25.wav,44100,16,60,1,H,512,hil,NULL,NULL,0.897681869696522,NA 
rayol-farm2_2019-04-30_18-10-25.wav,44100,16,60,1,H,512,hil,NULL,NULL,0.900271235591973,NA 
rayol-farm2_2019-04-30_18-12-25.wav,44100,16,60,1,H,512,hil,NULL,NULL,0.88639409976826,NA 
rayol-farm2_2019-04-30_18-14-25.wav,44100,16,60,1,H,512,hil,NULL,NULL,0.888197764611518,NA 
rayol-farm2_2019-04-30_18-16-26.wav,44100,16,60,1,H,512,hil,NULL,NULL,0.892191300985343,NA 
rayol-farm2_2019-04-30_18-18-26.wav,44100,16,60,1,H,512,hil,NULL,NULL,0.893086931972543,NA 
rayol-farm2_2019-04-30_18-20-26.wav,44100,16,60,1,H,512,hil,NULL,NULL,0.882188395915136,NA 
rayol-farm2_2019-04-30_18-22-26.wav,44100,16,60,1,H,512,hil,NULL,NULL,0.898294356284066,NA 
rayol-farm2_2019-04-30_18-24-26.wav,44100,16,60,1,H,512,hil,NULL,NULL,0.898837403870289,NA 
rayol-farm2_2019-04-30_18-26-26.wav,44100,16,60,1,H,512,hil,NULL,NULL,0.88909556241672,NA 
rayol-farm2_2019-04-30_18-28-26.wav,44100,16,60,1,H,512,hil,NULL,NULL,0.882460945578645,NA 
rayol-farm2_2019-04-30_18-30-26.wav,44100,16,60,1,H,512,hil,NULL,NULL,0.891572042682452,NA 
rayol-farm2_2019-04-30_18-32-26.wav,44100,16,60,1,H,512,hil,NULL,NULL,0.855622472164858,NA 
rayol-farm2_2019-04-30_18-34-27.wav,44100,16,60,1,H,512,hil,NULL,NULL,0.897580293096326,NA 
rayol-farm2_2019-04-30_18-36-27.wav,44100,16,60,1,H,512,hil,NULL,NULL,0.889614347753741,NA 
rayol-farm2_2019-04-30_18-38-27.wav,44100,16,60,1,H,512,hil,NULL,NULL,0.887334592607605,NA 
rayol-farm2_2019-04-30_18-40-27.wav,44100,16,60,1,H,512,hil,NULL,NULL,0.891731136769995,NA 
rayol-farm2_2019-04-30_18-42-27.wav,44100,16,60,1,H,512,hil,NULL,NULL,0.888173686698666,NA 
rayol-farm2_2019-04-30_18-44-27.wav,44100,16,60,1,H,512,hil,NULL,NULL,0.892177493986093,NA 
rayol-farm2_2019-04-30_18-46-27.wav,44100,16,60,1,H,512,hil,NULL,NULL,0.895698955476282,NA 
rayol-farm2_2019-04-30_18-48-27.wav,44100,16,60,1,H,512,hil,NULL,NULL,0.885638113561944,NA 
rayol-farm2_2019-04-30_18-50-28.wav,44100,16,60,1,H,512,hil,NULL,NULL,0.894634152035247,NA 
rayol-farm2_2019-04-30_18-52-28.wav,44100,16,60,1,H,512,hil,NULL,NULL,0.894208997001052,NA 
rayol-farm2_2019-04-30_18-54-28.wav,44100,16,60,1,H,512,hil,NULL,NULL,0.895345662044914,NA 
rayol-farm2_2019-04-30_18-56-28.wav,44100,16,60,1,H,512,hil,NULL,NULL,0.894436085089405,NA 
rayol-farm2_2019-04-30_18-58-28.wav,44100,16,60,1,H,512,hil,NULL,NULL,0.886992341094795,NA 
rayol-farm2_2019-04-30_19-00-28.wav,44100,16,60,1,H,512,hil,NULL,NULL,0.888658069969596,NA 
rayol-farm2_2019-04-30_19-02-28.wav,44100,16,60,1,H,512,hil,NULL,NULL,0.847482671247388,NA 
rayol-farm2_2019-04-30_19-04-28.wav,44100,16,60,1,H,512,hil,NULL,NULL,0.899479991840984,NA 
rayol-farm2_2019-04-30_19-06-29.wav,44100,16,60,1,H,512,hil,NULL,NULL,0.89862412419044,NA 
rayol-farm2_2019-04-30_19-08-29.wav,44100,16,60,1,H,512,hil,NULL,NULL,0.894117969526803,NA 
rayol-farm2_2019-04-30_19-10-29.wav,44100,16,60,1,H,512,hil,NULL,NULL,0.884961893486735,NA 
rayol-farm2_2019-04-30_19-12-29.wav,44100,16,60,1,H,512,hil,NULL,NULL,0.879650484194656,NA 
rayol-farm2_2019-04-30_19-14-29.wav,44100,16,60,1,H,512,hil,NULL,NULL,0.891852408251754,NA 
rayol-farm2_2019-04-30_19-16-29.wav,44100,16,60,1,H,512,hil,NULL,NULL,0.8890354903857,NA 
rayol-farm2_2019-04-30_19-18-29.wav,44100,16,60,1,H,512,hil,NULL,NULL,0.893803859475723,NA 
rayol-farm2_2019-04-30_19-20-29.wav,44100,16,60,1,H,512,hil,NULL,NULL,0.899791195144062,NA 
rayol-farm2_2019-04-30_19-22-29.wav,44100,16,60,1,H,512,hil,NULL,NULL,0.896401886208824,NA 
rayol-farm2_2019-04-30_19-24-30.wav,44100,16,60,1,H,512,hil,NULL,NULL,0.884228763874696,NA 
rayol-farm2_2019-04-30_19-26-30.wav,44100,16,60,1,H,512,hil,NULL,NULL,0.897295335871863,NA 
rayol-farm2_2019-04-30_19-28-30.wav,44100,16,60,1,H,512,hil,NULL,NULL,0.898585956937161,NA 
rayol-farm2_2019-04-30_19-30-30.wav,44100,16,60,1,H,512,hil,NULL,NULL,0.900619736320245,NA 
rayol-farm2_2019-04-30_19-32-30.wav,44100,16,60,1,H,512,hil,NULL,NULL,0.900910862173027,NA 
rayol-farm2_2019-04-30_19-34-30.wav,44100,16,60,1,H,512,hil,NULL,NULL,0.89805250009746,NA 
rayol-farm2_2019-04-30_19-36-30.wav,44100,16,60,1,H,512,hil,NULL,NULL,0.896990199609578,NA 
rayol-farm2_2019-04-30_19-38-30.wav,44100,16,60,1,H,512,hil,NULL,NULL,0.896985857681741,NA 
rayol-farm2_2019-04-30_19-40-31.wav,44100,16,60,1,H,512,hil,NULL,NULL,0.900782168725428,NA 
rayol-farm2_2019-04-30_19-42-31.wav,44100,16,60,1,H,512,hil,NULL,NULL,0.900254920079357,NA 
rayol-farm2_2019-04-30_19-44-31.wav,44100,16,60,1,H,512,hil,NULL,NULL,0.900016798023343,NA 
rayol-farm2_2019-04-30_19-46-31.wav,44100,16,60,1,H,512,hil,NULL,NULL,0.900660292461214,NA 
rayol-farm2_2019-04-30_19-48-31.wav,44100,16,60,1,H,512,hil,NULL,NULL,0.898811736391988,NA 
rayol-farm2_2019-04-30_19-50-31.wav,44100,16,60,1,H,512,hil,NULL,NULL,0.88832643455924,NA 
rayol-farm2_2019-04-30_19-52-31.wav,44100,16,60,1,H,512,hil,NULL,NULL,0.896202273970991,NA 
rayol-farm2_2019-04-30_19-54-31.wav,44100,16,60,1,H,512,hil,NULL,NULL,0.899357361954873,NA 
rayol-farm2_2019-04-30_19-56-32.wav,44100,16,60,1,H,512,hil,NULL,NULL,0.899726596728458,NA 
rayol-farm2_2019-04-30_19-58-32.wav,44100,16,60,1,H,512,hil,NULL,NULL,0.896607044521952,NA 
rayol-farm2_2019-04-30_20-00-32.wav,44100,16,60,1,H,512,hil,NULL,NULL,0.900902014346153,NA 
rayol-farm2_2019-04-30_20-02-32.wav,44100,16,60,1,H,512,hil,NULL,NULL,0.901391302449829,NA 
rayol-farm2_2019-04-30_20-04-32.wav,44100,16,60,1,H,512,hil,NULL,NULL,0.894512705778575,NA 
rayol-farm2_2019-04-30_20-06-32.wav,44100,16,60,1,H,512,hil,NULL,NULL,0.895019647486635,NA 
rayol-farm2_2019-04-30_20-08-32.wav,44100,16,60,1,H,512,hil,NULL,NULL,0.900323934151251,NA 
rayol-farm2_2019-04-30_20-10-32.wav,44100,16,60,1,H,512,hil,NULL,NULL,0.890566335843424,NA 
rayol-farm2_2019-04-30_20-12-33.wav,44100,16,60,1,H,512,hil,NULL,NULL,0.899216612743678,NA 
rayol-farm2_2019-04-30_20-14-33.wav,44100,16,60,1,H,512,hil,NULL,NULL,0.899708266132148,NA 
rayol-farm2_2019-04-30_20-16-33.wav,44100,16,60,1,H,512,hil,NULL,NULL,0.899693710423332,NA 
rayol-farm2_2019-04-30_20-18-33.wav,44100,16,60,1,H,512,hil,NULL,NULL,0.891379983271062,NA 
rayol-farm2_2019-04-30_20-20-33.wav,44100,16,60,1,H,512,hil,NULL,NULL,0.895784327477504,NA 
rayol-farm2_2019-04-30_20-22-33.wav,44100,16,60,1,H,512,hil,NULL,NULL,0.900827235253045,NA 
rayol-farm2_2019-04-30_20-24-33.wav,44100,16,60,1,H,512,hil,NULL,NULL,0.88953003257903,NA 
rayol-farm2_2019-04-30_20-26-33.wav,44100,16,60,1,H,512,hil,NULL,NULL,0.896047721823051,NA 
rayol-farm2_2019-04-30_20-28-33.wav,44100,16,60,1,H,512,hil,NULL,NULL,0.900207194390541,NA 
rayol-farm2_2019-04-30_20-30-34.wav,44100,16,60,1,H,512,hil,NULL,NULL,0.901714661739263,NA 
rayol-farm2_2019-04-30_20-32-34.wav,44100,16,60,1,H,512,hil,NULL,NULL,0.898126440192142,NA 
rayol-farm2_2019-04-30_20-34-34.wav,44100,16,60,1,H,512,hil,NULL,NULL,0.896883229877757,NA 
rayol-farm2_2019-04-30_20-36-34.wav,44100,16,60,1,H,512,hil,NULL,NULL,0.902445319489981,NA 
rayol-farm2_2019-04-30_20-38-34.wav,44100,16,60,1,H,512,hil,NULL,NULL,0.899900897223213,NA 
rayol-farm2_2019-04-30_20-40-34.wav,44100,16,60,1,H,512,hil,NULL,NULL,0.892919190143525,NA 
rayol-farm2_2019-04-30_20-42-34.wav,44100,16,60,1,H,512,hil,NULL,NULL,0.902625011232281,NA 
rayol-farm2_2019-04-30_20-44-34.wav,44100,16,60,1,H,512,hil,NULL,NULL,0.901695319432079,NA 
rayol-farm2_2019-04-30_20-46-35.wav,44100,16,60,1,H,512,hil,NULL,NULL,0.898999227610714,NA 
rayol-farm2_2019-04-30_20-48-35.wav,44100,16,60,1,H,512,hil,NULL,NULL,0.900838096889921,NA 
rayol-farm2_2019-04-30_20-50-35.wav,44100,16,60,1,H,512,hil,NULL,NULL,0.901945872063438,NA 
rayol-farm2_2019-04-30_20-52-35.wav,44100,16,60,1,H,512,hil,NULL,NULL,0.902100488137944,NA 
rayol-farm2_2019-04-30_20-54-35.wav,44100,16,60,1,H,512,hil,NULL,NULL,0.902540952848011,NA 
rayol-farm2_2019-04-30_20-56-35.wav,44100,16,60,1,H,512,hil,NULL,NULL,0.901039018182108,NA 
rayol-farm2_2019-04-30_20-58-35.wav,44100,16,60,1,H,512,hil,NULL,NULL,0.900544161482275,NA 
rayol-farm2_2019-04-30_21-00-35.wav,44100,16,60,1,H,512,hil,NULL,NULL,0.890968141962444,NA 
rayol-farm2_2019-04-30_21-02-36.wav,44100,16,60,1,H,512,hil,NULL,NULL,0.890893079692506,NA 
rayol-farm2_2019-04-30_21-04-36.wav,44100,16,60,1,H,512,hil,NULL,NULL,0.893695476867043,NA 
rayol-farm2_2019-04-30_21-06-36.wav,44100,16,60,1,H,512,hil,NULL,NULL,0.897749818624551,NA 
rayol-farm2_2019-04-30_21-08-36.wav,44100,16,60,1,H,512,hil,NULL,NULL,0.899562826477378,NA 
rayol-farm2_2019-04-30_21-10-36.wav,44100,16,60,1,H,512,hil,NULL,NULL,0.898747531248492,NA 
rayol-farm2_2019-04-30_21-12-36.wav,44100,16,60,1,H,512,hil,NULL,NULL,0.897316076749848,NA 
rayol-farm2_2019-04-30_21-14-36.wav,44100,16,60,1,H,512,hil,NULL,NULL,0.886985655841724,NA 
rayol-farm2_2019-04-30_21-16-36.wav,44100,16,60,1,H,512,hil,NULL,NULL,0.89143163357972,NA 
rayol-farm2_2019-04-30_21-18-37.wav,44100,16,60,1,H,512,hil,NULL,NULL,0.89388859570356,NA 
rayol-farm2_2019-04-30_21-20-37.wav,44100,16,60,1,H,512,hil,NULL,NULL,0.894242311348631,NA 
rayol-farm2_2019-04-30_21-22-37.wav,44100,16,60,1,H,512,hil,NULL,NULL,0.891386147330269,NA 
rayol-farm2_2019-04-30_21-24-37.wav,44100,16,60,1,H,512,hil,NULL,NULL,0.890553123059033,NA 
rayol-farm2_2019-04-30_21-26-37.wav,44100,16,60,1,H,512,hil,NULL,NULL,0.88243397038637,NA 
rayol-farm2_2019-04-30_21-28-37.wav,44100,16,60,1,H,512,hil,NULL,NULL,0.882588469488908,NA 
rayol-farm2_2019-04-30_21-30-37.wav,44100,16,60,1,H,512,hil,NULL,NULL,0.894477352626297,NA 
rayol-farm2_2019-04-30_21-32-37.wav,44100,16,60,1,H,512,hil,NULL,NULL,0.889615969851891,NA 
rayol-farm2_2019-04-30_21-34-38.wav,44100,16,60,1,H,512,hil,NULL,NULL,0.894762114242832,NA 
rayol-farm2_2019-04-30_21-36-38.wav,44100,16,60,1,H,512,hil,NULL,NULL,0.895762781596236,NA 
rayol-farm2_2019-04-30_21-38-38.wav,44100,16,60,1,H,512,hil,NULL,NULL,0.896802085127679,NA 
rayol-farm2_2019-04-30_21-40-38.wav,44100,16,60,1,H,512,hil,NULL,NULL,0.896586142005893,NA 
rayol-farm2_2019-04-30_21-42-38.wav,44100,16,60,1,H,512,hil,NULL,NULL,0.894177741631353,NA 
rayol-farm2_2019-04-30_21-44-38.wav,44100,16,60,1,H,512,hil,NULL,NULL,0.891681021142703,NA 
rayol-farm2_2019-04-30_21-46-38.wav,44100,16,60,1,H,512,hil,NULL,NULL,0.895291740182444,NA 
rayol-farm2_2019-04-30_21-48-38.wav,44100,16,60,1,H,512,hil,NULL,NULL,0.89152896920048,NA 
rayol-farm2_2019-04-30_21-50-39.wav,44100,16,60,1,H,512,hil,NULL,NULL,0.894377533716766,NA 
rayol-farm2_2019-04-30_21-52-39.wav,44100,16,60,1,H,512,hil,NULL,NULL,0.890014769795276,NA 
rayol-farm2_2019-04-30_21-54-39.wav,44100,16,59.87,1,H,512,hil,NULL,NULL,0.890860018263586,NA 
rayol-farm2_2019-04-30_21-56-39.wav,44100,16,60,1,H,512,hil,NULL,NULL,0.895529946507162,NA 
rayol-farm2_2019-04-30_22-00-39.wav,44100,16,60,1,H,512,hil,NULL,NULL,0.892405319919646,NA 
rayol-farm2_2019-04-30_22-02-39.wav,44100,16,60,1,H,512,hil,NULL,NULL,0.895034404914387,NA 
rayol-farm2_2019-04-30_22-04-39.wav,44100,16,60,1,H,512,hil,NULL,NULL,0.898241972001663,NA 
rayol-farm2_2019-04-30_22-06-39.wav,44100,16,60,1,H,512,hil,NULL,NULL,0.89831343816743,NA 
rayol-farm2_2019-04-30_22-08-40.wav,44100,16,60,1,H,512,hil,NULL,NULL,0.893155153471481,NA 
rayol-farm2_2019-04-30_22-10-40.wav,44100,16,60,1,H,512,hil,NULL,NULL,0.894537635456345,NA 
rayol-farm2_2019-04-30_22-12-40.wav,44100,16,60,1,H,512,hil,NULL,NULL,0.881847634988669,NA 
rayol-farm2_2019-04-30_22-14-40.wav,44100,16,60,1,H,512,hil,NULL,NULL,0.896991477856407,NA 
rayol-farm2_2019-04-30_22-16-40.wav,44100,16,60,1,H,512,hil,NULL,NULL,0.89849674711151,NA 
rayol-farm2_2019-04-30_22-18-40.wav,44100,16,60,1,H,512,hil,NULL,NULL,0.899341609798199,NA 
rayol-farm2_2019-04-30_22-20-40.wav,44100,16,60,1,H,512,hil,NULL,NULL,0.89971402928223,NA 
rayol-farm2_2019-04-30_22-22-40.wav,44100,16,60,1,H,512,hil,NULL,NULL,0.899148648348481,NA 
rayol-farm2_2019-04-30_22-24-41.wav,44100,16,60,1,H,512,hil,NULL,NULL,0.894780417492532,NA 
rayol-farm2_2019-04-30_22-26-41.wav,44100,16,60,1,H,512,hil,NULL,NULL,0.895267460991088,NA 
rayol-farm2_2019-04-30_22-32-41.wav,44100,16,60,1,H,512,hil,NULL,NULL,0.897362521425792,NA 
rayol-farm2_2019-04-30_22-34-41.wav,44100,16,60,1,H,512,hil,NULL,NULL,0.895765970629089,NA 
rayol-farm2_2019-04-30_22-36-41.wav,44100,16,60,1,H,512,hil,NULL,NULL,0.892545166985268,NA 
rayol-farm2_2019-04-30_22-38-41.wav,44100,16,60,1,H,512,hil,NULL,NULL,0.887564618673867,NA 
rayol-farm2_2019-04-30_22-40-42.wav,44100,16,60,1,H,512,hil,NULL,NULL,0.895722503603022,NA 
rayol-farm2_2019-04-30_22-42-42.wav,44100,16,60,1,H,512,hil,NULL,NULL,0.89815867043063,NA 
rayol-farm2_2019-04-30_22-44-42.wav,44100,16,60,1,H,512,hil,NULL,NULL,0.900439186994735,NA 
rayol-farm2_2019-04-30_22-46-42.wav,44100,16,60,1,H,512,hil,NULL,NULL,0.899683073431832,NA 
rayol-farm2_2019-04-30_22-48-42.wav,44100,16,60,1,H,512,hil,NULL,NULL,0.891138711896227,NA 
rayol-farm2_2019-04-30_22-52-42.wav,44100,16,60,1,H,512,hil,NULL,NULL,0.902059796923475,NA 
rayol-farm2_2019-04-30_22-54-42.wav,44100,16,60,1,H,512,hil,NULL,NULL,0.898721260614078,NA 
rayol-farm2_2019-04-30_22-56-43.wav,44100,16,60,1,H,512,hil,NULL,NULL,0.892888592076409,NA 
rayol-farm2_2019-04-30_23-00-43.wav,44100,16,60,1,H,512,hil,NULL,NULL,0.895391408301072,NA 
rayol-farm2_2019-04-30_23-04-43.wav,44100,16,60,1,H,512,hil,NULL,NULL,0.900168608620449,NA 
rayol-farm2_2019-04-30_23-06-43.wav,44100,16,60,1,H,512,hil,NULL,NULL,0.900509560415538,NA 
rayol-farm2_2019-04-30_23-08-43.wav,44100,16,60,1,H,512,hil,NULL,NULL,0.892321719085442,NA 
rayol-farm2_2019-04-30_23-10-43.wav,44100,16,60,1,H,512,hil,NULL,NULL,0.885772082977543,NA 
rayol-farm2_2019-04-30_23-14-44.wav,44100,16,60,1,H,512,hil,NULL,NULL,0.902224720029081,NA 
rayol-farm2_2019-04-30_23-16-44.wav,44100,16,60,1,H,512,hil,NULL,NULL,0.902973419177166,NA 
rayol-farm2_2019-04-30_23-18-44.wav,44100,16,60,1,H,512,hil,NULL,NULL,0.894405522568438,NA 
rayol-farm2_2019-04-30_23-20-44.wav,44100,16,60,1,H,512,hil,NULL,NULL,0.889396427952192,NA 
rayol-farm2_2019-04-30_23-22-44.wav,44100,16,60,1,H,512,hil,NULL,NULL,0.897000709180604,NA 
rayol-farm2_2019-04-30_23-24-44.wav,44100,16,60,1,H,512,hil,NULL,NULL,0.900018444496993,NA 
rayol-farm2_2019-04-30_23-26-44.wav,44100,16,60,1,H,512,hil,NULL,NULL,0.896890668062402,NA 
rayol-farm2_2019-04-30_23-28-44.wav,44100,16,60,1,H,512,hil,NULL,NULL,0.902774590857541,NA 
rayol-farm2_2019-04-30_23-30-45.wav,44100,16,60,1,H,512,hil,NULL,NULL,0.9034128173444,NA 
rayol-farm2_2019-04-30_23-32-45.wav,44100,16,60,1,H,512,hil,NULL,NULL,0.90177256922105,NA 
rayol-farm2_2019-04-30_23-34-45.wav,44100,16,60,1,H,512,hil,NULL,NULL,0.902445580740944,NA 
rayol-farm2_2019-04-30_23-38-45.wav,44100,16,60,1,H,512,hil,NULL,NULL,0.899952826094718,NA 
rayol-farm2_2019-04-30_23-42-45.wav,44100,16,60,1,H,512,hil,NULL,NULL,0.894122400550765,NA 
rayol-farm2_2019-04-30_23-44-45.wav,44100,16,60,1,H,512,hil,NULL,NULL,0.901439966980961,NA 
rayol-farm2_2019-04-30_23-46-46.wav,44100,16,60,1,H,512,hil,NULL,NULL,0.901929710646904,NA 
rayol-farm2_2019-04-30_23-48-46.wav,44100,16,60,1,H,512,hil,NULL,NULL,0.902362537299297,NA 
rayol-farm2_2019-04-30_23-52-46.wav,44100,16,60,1,H,512,hil,NULL,NULL,0.89477011547851,NA 
rayol-farm2_2019-04-30_23-54-46.wav,44100,16,60,1,H,512,hil,NULL,NULL,0.900023901026265,NA 
rayol-farm2_2019-04-30_23-56-46.wav,44100,16,60,1,H,512,hil,NULL,NULL,0.901957512602991,NA 
rayol-farm2_2019-04-30_23-58-46.wav,44100,16,60,1,H,512,hil,NULL,NULL,0.893259669850223,NA
