FILENAME,SAMPLINGRATE,BIT,DURATION,CHANNELS,INDEX,WL,ENVT,MSMOOTH,KSMOOTH,LEFT_CHANNEL,RIGHT_CHANNEL
rayol-farm2_2019-04-01_00-01-38.wav,44100,16,60,1,H,512,hil,NULL,NULL,0.896183459727992,NA 
rayol-farm2_2019-04-01_00-03-38.wav,44100,16,60,1,H,512,hil,NULL,NULL,0.895709812699087,NA 
rayol-farm2_2019-04-01_00-05-38.wav,44100,16,60,1,H,512,hil,NULL,NULL,0.894282774131799,NA 
rayol-farm2_2019-04-01_00-07-38.wav,44100,16,60,1,H,512,hil,NULL,NULL,0.891700238520398,NA 
rayol-farm2_2019-04-01_00-09-39.wav,44100,16,60,1,H,512,hil,NULL,NULL,0.893264028308852,NA 
rayol-farm2_2019-04-01_00-11-39.wav,44100,16,60,1,H,512,hil,NULL,NULL,0.896388770214793,NA 
rayol-farm2_2019-04-01_00-13-39.wav,44100,16,60,1,H,512,hil,NULL,NULL,0.89676152349493,NA 
rayol-farm2_2019-04-01_00-15-39.wav,44100,16,60,1,H,512,hil,NULL,NULL,0.896568883507913,NA 
rayol-farm2_2019-04-01_00-17-39.wav,44100,16,60,1,H,512,hil,NULL,NULL,0.894479217545157,NA 
rayol-farm2_2019-04-01_00-19-39.wav,44100,16,60,1,H,512,hil,NULL,NULL,0.894916617775435,NA 
rayol-farm2_2019-04-01_00-21-39.wav,44100,16,60,1,H,512,hil,NULL,NULL,0.89610587928032,NA 
rayol-farm2_2019-04-01_00-23-39.wav,44100,16,60,1,H,512,hil,NULL,NULL,0.892400713874629,NA 
rayol-farm2_2019-04-01_00-25-40.wav,44100,16,60,1,H,512,hil,NULL,NULL,0.897787029109496,NA 
rayol-farm2_2019-04-01_00-27-40.wav,44100,16,60,1,H,512,hil,NULL,NULL,0.895000467199691,NA 
rayol-farm2_2019-04-01_00-29-40.wav,44100,16,60,1,H,512,hil,NULL,NULL,0.894443391255315,NA 
rayol-farm2_2019-04-01_00-31-40.wav,44100,16,60,1,H,512,hil,NULL,NULL,0.895792114751659,NA 
rayol-farm2_2019-04-01_00-33-40.wav,44100,16,60,1,H,512,hil,NULL,NULL,0.896321289271541,NA 
rayol-farm2_2019-04-01_00-35-40.wav,44100,16,60,1,H,512,hil,NULL,NULL,0.89589704452002,NA 
rayol-farm2_2019-04-01_00-37-40.wav,44100,16,60,1,H,512,hil,NULL,NULL,0.896223324647051,NA 
rayol-farm2_2019-04-01_00-39-40.wav,44100,16,60,1,H,512,hil,NULL,NULL,0.895336239156162,NA 
rayol-farm2_2019-04-01_00-41-41.wav,44100,16,60,1,H,512,hil,NULL,NULL,0.895389949716927,NA 
rayol-farm2_2019-04-01_00-43-41.wav,44100,16,60,1,H,512,hil,NULL,NULL,0.895298602546996,NA 
rayol-farm2_2019-04-01_00-45-41.wav,44100,16,60,1,H,512,hil,NULL,NULL,0.895055152305062,NA 
rayol-farm2_2019-04-01_00-47-41.wav,44100,16,60,1,H,512,hil,NULL,NULL,0.895291538297332,NA 
rayol-farm2_2019-04-01_00-49-41.wav,44100,16,60,1,H,512,hil,NULL,NULL,0.893127176953587,NA 
rayol-farm2_2019-04-01_00-51-41.wav,44100,16,60,1,H,512,hil,NULL,NULL,0.890981573824492,NA 
rayol-farm2_2019-04-01_00-53-41.wav,44100,16,60,1,H,512,hil,NULL,NULL,0.895506664453975,NA 
rayol-farm2_2019-04-01_00-55-41.wav,44100,16,60,1,H,512,hil,NULL,NULL,0.896496856576174,NA 
rayol-farm2_2019-04-01_00-57-41.wav,44100,16,60,1,H,512,hil,NULL,NULL,0.895955811483005,NA 
rayol-farm2_2019-04-01_00-59-42.wav,44100,16,60,1,H,512,hil,NULL,NULL,0.896101626098971,NA 
rayol-farm2_2019-04-01_01-01-42.wav,44100,16,60,1,H,512,hil,NULL,NULL,0.896112532320837,NA 
rayol-farm2_2019-04-01_01-03-42.wav,44100,16,60,1,H,512,hil,NULL,NULL,0.896573790058122,NA 
rayol-farm2_2019-04-01_01-05-42.wav,44100,16,60,1,H,512,hil,NULL,NULL,0.895566916831299,NA 
rayol-farm2_2019-04-01_01-07-42.wav,44100,16,60,1,H,512,hil,NULL,NULL,0.895462192038464,NA 
rayol-farm2_2019-04-01_01-09-42.wav,44100,16,60,1,H,512,hil,NULL,NULL,0.891893691159815,NA 
rayol-farm2_2019-04-01_01-11-42.wav,44100,16,60,1,H,512,hil,NULL,NULL,0.889049843089412,NA 
rayol-farm2_2019-04-01_01-13-42.wav,44100,16,60,1,H,512,hil,NULL,NULL,0.891787168862503,NA 
rayol-farm2_2019-04-01_01-15-43.wav,44100,16,60,1,H,512,hil,NULL,NULL,0.895420094843953,NA 
rayol-farm2_2019-04-01_01-17-43.wav,44100,16,60,1,H,512,hil,NULL,NULL,0.89576633513263,NA 
rayol-farm2_2019-04-01_01-19-43.wav,44100,16,60,1,H,512,hil,NULL,NULL,0.896327509369475,NA 
rayol-farm2_2019-04-01_01-21-43.wav,44100,16,60,1,H,512,hil,NULL,NULL,0.894377192294844,NA 
rayol-farm2_2019-04-01_01-23-43.wav,44100,16,60,1,H,512,hil,NULL,NULL,0.896406378775664,NA 
rayol-farm2_2019-04-01_01-25-43.wav,44100,16,60,1,H,512,hil,NULL,NULL,0.897183416156777,NA 
rayol-farm2_2019-04-01_01-27-43.wav,44100,16,60,1,H,512,hil,NULL,NULL,0.896320471790596,NA 
rayol-farm2_2019-04-01_01-29-43.wav,44100,16,60,1,H,512,hil,NULL,NULL,0.896176621907864,NA 
rayol-farm2_2019-04-01_01-31-43.wav,44100,16,60,1,H,512,hil,NULL,NULL,0.890859284489624,NA 
rayol-farm2_2019-04-01_01-33-44.wav,44100,16,60,1,H,512,hil,NULL,NULL,0.892109529527075,NA 
rayol-farm2_2019-04-01_01-35-44.wav,44100,16,60,1,H,512,hil,NULL,NULL,0.894272420010782,NA 
rayol-farm2_2019-04-01_01-37-44.wav,44100,16,60,1,H,512,hil,NULL,NULL,0.894994599902007,NA 
rayol-farm2_2019-04-01_01-39-44.wav,44100,16,60,1,H,512,hil,NULL,NULL,0.895932817030205,NA 
rayol-farm2_2019-04-01_01-41-44.wav,44100,16,60,1,H,512,hil,NULL,NULL,0.896848093852597,NA 
rayol-farm2_2019-04-01_01-43-44.wav,44100,16,60,1,H,512,hil,NULL,NULL,0.896407427937369,NA 
rayol-farm2_2019-04-01_01-45-44.wav,44100,16,60,1,H,512,hil,NULL,NULL,0.895446256931286,NA 
rayol-farm2_2019-04-01_01-47-44.wav,44100,16,60,1,H,512,hil,NULL,NULL,0.896119986108243,NA 
rayol-farm2_2019-04-01_01-49-45.wav,44100,16,60,1,H,512,hil,NULL,NULL,0.89565179856741,NA 
rayol-farm2_2019-04-01_01-51-45.wav,44100,16,60,1,H,512,hil,NULL,NULL,0.896591764693723,NA 
rayol-farm2_2019-04-01_01-53-45.wav,44100,16,60,1,H,512,hil,NULL,NULL,0.894501166366129,NA 
rayol-farm2_2019-04-01_01-55-45.wav,44100,16,60,1,H,512,hil,NULL,NULL,0.893005976215042,NA 
rayol-farm2_2019-04-01_01-57-45.wav,44100,16,60,1,H,512,hil,NULL,NULL,0.894208062237321,NA 
rayol-farm2_2019-04-01_01-59-45.wav,44100,16,60,1,H,512,hil,NULL,NULL,0.89542790869801,NA 
rayol-farm2_2019-04-01_02-01-45.wav,44100,16,60,1,H,512,hil,NULL,NULL,0.894950637144307,NA 
rayol-farm2_2019-04-01_02-03-45.wav,44100,16,60,1,H,512,hil,NULL,NULL,0.895682856756108,NA 
rayol-farm2_2019-04-01_02-05-46.wav,44100,16,60,1,H,512,hil,NULL,NULL,0.896406380461956,NA 
rayol-farm2_2019-04-01_02-07-46.wav,44100,16,60,1,H,512,hil,NULL,NULL,0.897551622252675,NA 
rayol-farm2_2019-04-01_02-09-46.wav,44100,16,60,1,H,512,hil,NULL,NULL,0.897020817168519,NA 
rayol-farm2_2019-04-01_02-11-46.wav,44100,16,60,1,H,512,hil,NULL,NULL,0.897603541903207,NA 
rayol-farm2_2019-04-01_02-13-46.wav,44100,16,60,1,H,512,hil,NULL,NULL,0.898047138399788,NA 
rayol-farm2_2019-04-01_02-15-46.wav,44100,16,60,1,H,512,hil,NULL,NULL,0.897461322910953,NA 
rayol-farm2_2019-04-01_02-17-46.wav,44100,16,60,1,H,512,hil,NULL,NULL,0.894235689516195,NA 
rayol-farm2_2019-04-01_02-19-46.wav,44100,16,60,1,H,512,hil,NULL,NULL,0.894413420286501,NA 
rayol-farm2_2019-04-01_02-21-47.wav,44100,16,60,1,H,512,hil,NULL,NULL,0.896606294379498,NA 
rayol-farm2_2019-04-01_02-23-47.wav,44100,16,60,1,H,512,hil,NULL,NULL,0.897315551364973,NA 
rayol-farm2_2019-04-01_02-25-47.wav,44100,16,60,1,H,512,hil,NULL,NULL,0.896576684149615,NA 
rayol-farm2_2019-04-01_02-27-47.wav,44100,16,60,1,H,512,hil,NULL,NULL,0.897301224887552,NA 
rayol-farm2_2019-04-01_02-29-47.wav,44100,16,60,1,H,512,hil,NULL,NULL,0.897621203481878,NA 
rayol-farm2_2019-04-01_02-31-47.wav,44100,16,60,1,H,512,hil,NULL,NULL,0.897657042927772,NA 
rayol-farm2_2019-04-01_02-33-47.wav,44100,16,60,1,H,512,hil,NULL,NULL,0.898096053816045,NA 
rayol-farm2_2019-04-01_02-35-47.wav,44100,16,60,1,H,512,hil,NULL,NULL,0.898082682006942,NA 
rayol-farm2_2019-04-01_02-37-47.wav,44100,16,60,1,H,512,hil,NULL,NULL,0.898325993545162,NA 
rayol-farm2_2019-04-01_02-39-48.wav,44100,16,60,1,H,512,hil,NULL,NULL,0.897520106479884,NA 
rayol-farm2_2019-04-01_02-41-48.wav,44100,16,60,1,H,512,hil,NULL,NULL,0.895312199437076,NA 
rayol-farm2_2019-04-01_02-43-48.wav,44100,16,60,1,H,512,hil,NULL,NULL,0.895123375407443,NA 
rayol-farm2_2019-04-01_02-45-48.wav,44100,16,60,1,H,512,hil,NULL,NULL,0.896967747963185,NA 
rayol-farm2_2019-04-01_02-47-48.wav,44100,16,60,1,H,512,hil,NULL,NULL,0.897815140201574,NA 
rayol-farm2_2019-04-01_02-49-48.wav,44100,16,60,1,H,512,hil,NULL,NULL,0.896971809392191,NA 
rayol-farm2_2019-04-01_02-51-48.wav,44100,16,60,1,H,512,hil,NULL,NULL,0.894667096085087,NA 
rayol-farm2_2019-04-01_02-53-48.wav,44100,16,60,1,H,512,hil,NULL,NULL,0.893766607966811,NA 
rayol-farm2_2019-04-01_02-55-49.wav,44100,16,60,1,H,512,hil,NULL,NULL,0.89465113059185,NA 
rayol-farm2_2019-04-01_02-57-49.wav,44100,16,60,1,H,512,hil,NULL,NULL,0.895020208578375,NA 
rayol-farm2_2019-04-01_02-59-49.wav,44100,16,60,1,H,512,hil,NULL,NULL,0.896758238024906,NA 
rayol-farm2_2019-04-01_03-01-49.wav,44100,16,60,1,H,512,hil,NULL,NULL,0.89614749077241,NA 
rayol-farm2_2019-04-01_03-03-49.wav,44100,16,60,1,H,512,hil,NULL,NULL,0.893646050437753,NA 
rayol-farm2_2019-04-01_03-05-49.wav,44100,16,60,1,H,512,hil,NULL,NULL,0.889236513418219,NA 
rayol-farm2_2019-04-01_03-07-49.wav,44100,16,60,1,H,512,hil,NULL,NULL,0.892894539689304,NA 
rayol-farm2_2019-04-01_03-09-49.wav,44100,16,60,1,H,512,hil,NULL,NULL,0.896790754843006,NA 
rayol-farm2_2019-04-01_03-11-50.wav,44100,16,60,1,H,512,hil,NULL,NULL,0.896521673144141,NA 
rayol-farm2_2019-04-01_03-13-50.wav,44100,16,60,1,H,512,hil,NULL,NULL,0.89719278865211,NA 
rayol-farm2_2019-04-01_03-15-50.wav,44100,16,60,1,H,512,hil,NULL,NULL,0.897015215890567,NA 
rayol-farm2_2019-04-01_03-17-50.wav,44100,16,60,1,H,512,hil,NULL,NULL,0.897154449857751,NA 
rayol-farm2_2019-04-01_03-19-50.wav,44100,16,60,1,H,512,hil,NULL,NULL,0.896741210421132,NA 
rayol-farm2_2019-04-01_03-21-50.wav,44100,16,60,1,H,512,hil,NULL,NULL,0.895899556418458,NA 
rayol-farm2_2019-04-01_03-23-50.wav,44100,16,60,1,H,512,hil,NULL,NULL,0.895419663808059,NA 
rayol-farm2_2019-04-01_03-25-50.wav,44100,16,60,1,H,512,hil,NULL,NULL,0.897250516704595,NA 
rayol-farm2_2019-04-01_03-27-50.wav,44100,16,60,1,H,512,hil,NULL,NULL,0.895641780176207,NA 
rayol-farm2_2019-04-01_03-29-51.wav,44100,16,60,1,H,512,hil,NULL,NULL,0.892080750065651,NA 
rayol-farm2_2019-04-01_03-31-51.wav,44100,16,60,1,H,512,hil,NULL,NULL,0.887503360431735,NA 
rayol-farm2_2019-04-01_03-33-51.wav,44100,16,60,1,H,512,hil,NULL,NULL,0.894258087143681,NA 
rayol-farm2_2019-04-01_03-35-51.wav,44100,16,60,1,H,512,hil,NULL,NULL,0.89492989931643,NA 
rayol-farm2_2019-04-01_03-37-51.wav,44100,16,60,1,H,512,hil,NULL,NULL,0.895270683331953,NA 
rayol-farm2_2019-04-01_03-39-51.wav,44100,16,60,1,H,512,hil,NULL,NULL,0.89572084886261,NA 
rayol-farm2_2019-04-01_03-41-51.wav,44100,16,60,1,H,512,hil,NULL,NULL,0.896443258926827,NA 
rayol-farm2_2019-04-01_03-43-51.wav,44100,16,60,1,H,512,hil,NULL,NULL,0.896016537741965,NA 
rayol-farm2_2019-04-01_03-45-52.wav,44100,16,60,1,H,512,hil,NULL,NULL,0.895396249539454,NA 
rayol-farm2_2019-04-01_03-47-52.wav,44100,16,60,1,H,512,hil,NULL,NULL,0.896752840663471,NA 
rayol-farm2_2019-04-01_03-49-52.wav,44100,16,60,1,H,512,hil,NULL,NULL,0.895359018163131,NA 
rayol-farm2_2019-04-01_03-51-52.wav,44100,16,60,1,H,512,hil,NULL,NULL,0.896564332076453,NA 
rayol-farm2_2019-04-01_03-53-52.wav,44100,16,60,1,H,512,hil,NULL,NULL,0.892147118899562,NA 
rayol-farm2_2019-04-01_03-55-52.wav,44100,16,60,1,H,512,hil,NULL,NULL,0.890724424770082,NA 
rayol-farm2_2019-04-01_03-57-52.wav,44100,16,60,1,H,512,hil,NULL,NULL,0.895308589640561,NA 
rayol-farm2_2019-04-01_03-59-52.wav,44100,16,60,1,H,512,hil,NULL,NULL,0.895813518204483,NA 
rayol-farm2_2019-04-01_04-01-53.wav,44100,16,60,1,H,512,hil,NULL,NULL,0.894876907282371,NA 
rayol-farm2_2019-04-01_04-03-53.wav,44100,16,60,1,H,512,hil,NULL,NULL,0.896479178234967,NA 
rayol-farm2_2019-04-01_04-05-53.wav,44100,16,60,1,H,512,hil,NULL,NULL,0.894565573583045,NA 
rayol-farm2_2019-04-01_04-07-53.wav,44100,16,60,1,H,512,hil,NULL,NULL,0.89566299684385,NA 
rayol-farm2_2019-04-01_04-09-53.wav,44100,16,60,1,H,512,hil,NULL,NULL,0.894295203589408,NA 
rayol-farm2_2019-04-01_04-11-53.wav,44100,16,60,1,H,512,hil,NULL,NULL,0.894256578624237,NA 
rayol-farm2_2019-04-01_04-13-53.wav,44100,16,60,1,H,512,hil,NULL,NULL,0.895698583864525,NA 
rayol-farm2_2019-04-01_04-15-53.wav,44100,16,60,1,H,512,hil,NULL,NULL,0.895390775292897,NA 
rayol-farm2_2019-04-01_04-17-53.wav,44100,16,60,1,H,512,hil,NULL,NULL,0.889066022789831,NA 
rayol-farm2_2019-04-01_04-19-54.wav,44100,16,60,1,H,512,hil,NULL,NULL,0.888394214822906,NA 
rayol-farm2_2019-04-01_04-21-54.wav,44100,16,60,1,H,512,hil,NULL,NULL,0.891124309634225,NA 
rayol-farm2_2019-04-01_04-23-54.wav,44100,16,60,1,H,512,hil,NULL,NULL,0.893402347907928,NA 
rayol-farm2_2019-04-01_04-25-54.wav,44100,16,60,1,H,512,hil,NULL,NULL,0.894130844854175,NA 
rayol-farm2_2019-04-01_04-27-54.wav,44100,16,60,1,H,512,hil,NULL,NULL,0.89141112010094,NA 
rayol-farm2_2019-04-01_04-29-54.wav,44100,16,60,1,H,512,hil,NULL,NULL,0.896900661439383,NA 
rayol-farm2_2019-04-01_04-31-54.wav,44100,16,60,1,H,512,hil,NULL,NULL,0.895997223525507,NA 
rayol-farm2_2019-04-01_04-33-54.wav,44100,16,60,1,H,512,hil,NULL,NULL,0.895484584160307,NA 
rayol-farm2_2019-04-01_04-35-55.wav,44100,16,60,1,H,512,hil,NULL,NULL,0.894595202725771,NA 
rayol-farm2_2019-04-01_04-37-55.wav,44100,16,60,1,H,512,hil,NULL,NULL,0.894492015536383,NA 
rayol-farm2_2019-04-01_04-39-55.wav,44100,16,60,1,H,512,hil,NULL,NULL,0.894848581701631,NA 
rayol-farm2_2019-04-01_04-41-55.wav,44100,16,60,1,H,512,hil,NULL,NULL,0.893269749137278,NA 
rayol-farm2_2019-04-01_04-43-55.wav,44100,16,60,1,H,512,hil,NULL,NULL,0.891889103282889,NA 
rayol-farm2_2019-04-01_04-45-55.wav,44100,16,60,1,H,512,hil,NULL,NULL,0.893933767049809,NA 
rayol-farm2_2019-04-01_04-47-55.wav,44100,16,60,1,H,512,hil,NULL,NULL,0.894908021882367,NA 
rayol-farm2_2019-04-01_04-49-55.wav,44100,16,60,1,H,512,hil,NULL,NULL,0.894101746001409,NA 
rayol-farm2_2019-04-01_04-51-56.wav,44100,16,60,1,H,512,hil,NULL,NULL,0.896692317916653,NA 
rayol-farm2_2019-04-01_04-53-56.wav,44100,16,60,1,H,512,hil,NULL,NULL,0.895302204714825,NA 
rayol-farm2_2019-04-01_04-55-56.wav,44100,16,60,1,H,512,hil,NULL,NULL,0.892364074193794,NA 
rayol-farm2_2019-04-01_04-57-56.wav,44100,16,60,1,H,512,hil,NULL,NULL,0.89602320950199,NA 
rayol-farm2_2019-04-01_04-59-56.wav,44100,16,60,1,H,512,hil,NULL,NULL,0.895243084918083,NA 
rayol-farm2_2019-04-01_05-01-56.wav,44100,16,60,1,H,512,hil,NULL,NULL,0.896545629860661,NA 
rayol-farm2_2019-04-01_05-03-56.wav,44100,16,60,1,H,512,hil,NULL,NULL,0.896510838231344,NA 
rayol-farm2_2019-04-01_05-05-56.wav,44100,16,60,1,H,512,hil,NULL,NULL,0.893324176815625,NA 
rayol-farm2_2019-04-01_05-07-57.wav,44100,16,60,1,H,512,hil,NULL,NULL,0.89292111412501,NA 
rayol-farm2_2019-04-01_05-09-57.wav,44100,16,60,1,H,512,hil,NULL,NULL,0.891304206730472,NA 
rayol-farm2_2019-04-01_05-11-57.wav,44100,16,60,1,H,512,hil,NULL,NULL,0.893220405492081,NA 
rayol-farm2_2019-04-01_05-13-57.wav,44100,16,60,1,H,512,hil,NULL,NULL,0.895356521025117,NA 
rayol-farm2_2019-04-01_05-15-57.wav,44100,16,60,1,H,512,hil,NULL,NULL,0.894207951668979,NA 
rayol-farm2_2019-04-01_05-17-57.wav,44100,16,60,1,H,512,hil,NULL,NULL,0.896752809507723,NA 
rayol-farm2_2019-04-01_05-19-57.wav,44100,16,60,1,H,512,hil,NULL,NULL,0.894915063399877,NA 
rayol-farm2_2019-04-01_05-21-57.wav,44100,16,60,1,H,512,hil,NULL,NULL,0.895795934309864,NA 
rayol-farm2_2019-04-01_05-23-57.wav,44100,16,60,1,H,512,hil,NULL,NULL,0.896976079396555,NA 
rayol-farm2_2019-04-01_05-25-58.wav,44100,16,60,1,H,512,hil,NULL,NULL,0.891530003169902,NA 
rayol-farm2_2019-04-01_05-27-58.wav,44100,16,60,1,H,512,hil,NULL,NULL,0.89649557132273,NA 
rayol-farm2_2019-04-01_05-29-58.wav,44100,16,60,1,H,512,hil,NULL,NULL,0.895895686174949,NA 
rayol-farm2_2019-04-01_05-31-58.wav,44100,16,60,1,H,512,hil,NULL,NULL,0.890334081413469,NA 
rayol-farm2_2019-04-01_05-33-58.wav,44100,16,60,1,H,512,hil,NULL,NULL,0.89172169406072,NA 
rayol-farm2_2019-04-01_05-35-58.wav,44100,16,60,1,H,512,hil,NULL,NULL,0.892909069843269,NA 
rayol-farm2_2019-04-01_05-37-58.wav,44100,16,60,1,H,512,hil,NULL,NULL,0.891302436852234,NA 
rayol-farm2_2019-04-01_05-39-58.wav,44100,16,60,1,H,512,hil,NULL,NULL,0.895442425038241,NA 
rayol-farm2_2019-04-01_05-41-59.wav,44100,16,60,1,H,512,hil,NULL,NULL,0.894485908185778,NA 
rayol-farm2_2019-04-01_05-43-59.wav,44100,16,60,1,H,512,hil,NULL,NULL,0.894990415975428,NA 
rayol-farm2_2019-04-01_05-45-59.wav,44100,16,60,1,H,512,hil,NULL,NULL,0.895108609299046,NA 
rayol-farm2_2019-04-01_05-47-59.wav,44100,16,60,1,H,512,hil,NULL,NULL,0.891209839250547,NA 
rayol-farm2_2019-04-01_05-49-59.wav,44100,16,60,1,H,512,hil,NULL,NULL,0.886135430641617,NA 
rayol-farm2_2019-04-01_05-51-59.wav,44100,16,60,1,H,512,hil,NULL,NULL,0.895171820646206,NA 
rayol-farm2_2019-04-01_05-53-59.wav,44100,16,60,1,H,512,hil,NULL,NULL,0.894227346795104,NA 
rayol-farm2_2019-04-01_05-55-59.wav,44100,16,60,1,H,512,hil,NULL,NULL,0.891478084578896,NA 
rayol-farm2_2019-04-01_05-57-59.wav,44100,16,60,1,H,512,hil,NULL,NULL,0.891047123853048,NA 
rayol-farm2_2019-04-01_06-00-00.wav,44100,16,60,1,H,512,hil,NULL,NULL,0.896593438511537,NA 
rayol-farm2_2019-04-01_06-02-00.wav,44100,16,60,1,H,512,hil,NULL,NULL,0.896265720494923,NA 
rayol-farm2_2019-04-01_06-04-00.wav,44100,16,60,1,H,512,hil,NULL,NULL,0.892586303148228,NA 
rayol-farm2_2019-04-01_06-06-00.wav,44100,16,60,1,H,512,hil,NULL,NULL,0.893746505649471,NA 
rayol-farm2_2019-04-01_06-08-00.wav,44100,16,60,1,H,512,hil,NULL,NULL,0.89387199101932,NA 
rayol-farm2_2019-04-01_06-10-00.wav,44100,16,60,1,H,512,hil,NULL,NULL,0.893211571933364,NA 
rayol-farm2_2019-04-01_06-12-00.wav,44100,16,60,1,H,512,hil,NULL,NULL,0.896569871049784,NA 
rayol-farm2_2019-04-01_06-14-00.wav,44100,16,60,1,H,512,hil,NULL,NULL,0.895809413544596,NA 
rayol-farm2_2019-04-01_06-16-01.wav,44100,16,60,1,H,512,hil,NULL,NULL,0.895504721620592,NA 
rayol-farm2_2019-04-01_06-18-01.wav,44100,16,60,1,H,512,hil,NULL,NULL,0.896320064134459,NA 
rayol-farm2_2019-04-01_06-20-01.wav,44100,16,60,1,H,512,hil,NULL,NULL,0.836739757830021,NA 
rayol-farm2_2019-04-01_06-22-01.wav,44100,16,60,1,H,512,hil,NULL,NULL,0.884219089807309,NA 
rayol-farm2_2019-04-01_06-24-01.wav,44100,16,60,1,H,512,hil,NULL,NULL,0.847988767602286,NA 
rayol-farm2_2019-04-01_06-26-01.wav,44100,16,60,1,H,512,hil,NULL,NULL,0.89474863678653,NA 
rayol-farm2_2019-04-01_06-28-01.wav,44100,16,60,1,H,512,hil,NULL,NULL,0.895436191721511,NA 
rayol-farm2_2019-04-01_06-30-01.wav,44100,16,60,1,H,512,hil,NULL,NULL,0.894402590708363,NA 
rayol-farm2_2019-04-01_06-32-02.wav,44100,16,60,1,H,512,hil,NULL,NULL,0.897310476171895,NA 
rayol-farm2_2019-04-01_06-34-02.wav,44100,16,60,1,H,512,hil,NULL,NULL,0.90027841152496,NA 
rayol-farm2_2019-04-01_06-36-02.wav,44100,16,60,1,H,512,hil,NULL,NULL,0.897097667841071,NA 
rayol-farm2_2019-04-01_06-38-02.wav,44100,16,60,1,H,512,hil,NULL,NULL,0.901302998522574,NA 
rayol-farm2_2019-04-01_06-40-02.wav,44100,16,60,1,H,512,hil,NULL,NULL,0.904185909418039,NA 
rayol-farm2_2019-04-01_06-42-02.wav,44100,16,60,1,H,512,hil,NULL,NULL,0.904879093571242,NA 
rayol-farm2_2019-04-01_06-44-02.wav,44100,16,60,1,H,512,hil,NULL,NULL,0.903518091111747,NA 
rayol-farm2_2019-04-01_06-46-02.wav,44100,16,60,1,H,512,hil,NULL,NULL,0.903862701124632,NA 
rayol-farm2_2019-04-01_06-48-03.wav,44100,16,60,1,H,512,hil,NULL,NULL,0.90453239257896,NA 
rayol-farm2_2019-04-01_06-50-03.wav,44100,16,60,1,H,512,hil,NULL,NULL,0.904972224119851,NA 
rayol-farm2_2019-04-01_06-52-03.wav,44100,16,60,1,H,512,hil,NULL,NULL,0.904429667570287,NA 
rayol-farm2_2019-04-01_06-54-03.wav,44100,16,60,1,H,512,hil,NULL,NULL,0.904107015123496,NA 
rayol-farm2_2019-04-01_06-56-03.wav,44100,16,60,1,H,512,hil,NULL,NULL,0.899873489381639,NA 
rayol-farm2_2019-04-01_06-58-03.wav,44100,16,60,1,H,512,hil,NULL,NULL,0.901477709794331,NA 
rayol-farm2_2019-04-01_07-00-03.wav,44100,16,60,1,H,512,hil,NULL,NULL,0.899963928353433,NA 
rayol-farm2_2019-04-01_07-02-03.wav,44100,16,60,1,H,512,hil,NULL,NULL,0.898543052776054,NA 
rayol-farm2_2019-04-01_07-04-03.wav,44100,16,60,1,H,512,hil,NULL,NULL,0.895704238844642,NA 
rayol-farm2_2019-04-01_07-06-04.wav,44100,16,60,1,H,512,hil,NULL,NULL,0.898219662196932,NA 
rayol-farm2_2019-04-01_07-08-04.wav,44100,16,60,1,H,512,hil,NULL,NULL,0.899375177458638,NA 
rayol-farm2_2019-04-01_07-10-04.wav,44100,16,60,1,H,512,hil,NULL,NULL,0.894032817512662,NA 
rayol-farm2_2019-04-01_07-12-04.wav,44100,16,60,1,H,512,hil,NULL,NULL,0.893438510491578,NA 
rayol-farm2_2019-04-01_07-14-04.wav,44100,16,60,1,H,512,hil,NULL,NULL,0.898223310544034,NA 
rayol-farm2_2019-04-01_07-16-04.wav,44100,16,60,1,H,512,hil,NULL,NULL,0.897467422262217,NA 
rayol-farm2_2019-04-01_07-18-04.wav,44100,16,60,1,H,512,hil,NULL,NULL,0.896620988622019,NA 
rayol-farm2_2019-04-01_07-20-04.wav,44100,16,60,1,H,512,hil,NULL,NULL,0.894466777269414,NA 
rayol-farm2_2019-04-01_07-22-05.wav,44100,16,60,1,H,512,hil,NULL,NULL,0.889121209511699,NA 
rayol-farm2_2019-04-01_07-24-05.wav,44100,16,60,1,H,512,hil,NULL,NULL,0.896604398532853,NA 
rayol-farm2_2019-04-01_07-26-05.wav,44100,16,60,1,H,512,hil,NULL,NULL,0.897821091193422,NA 
rayol-farm2_2019-04-01_07-28-05.wav,44100,16,60,1,H,512,hil,NULL,NULL,0.896199502617858,NA 
rayol-farm2_2019-04-01_07-30-05.wav,44100,16,60,1,H,512,hil,NULL,NULL,0.898028488207418,NA 
rayol-farm2_2019-04-01_07-32-05.wav,44100,16,60,1,H,512,hil,NULL,NULL,0.898408364563518,NA 
rayol-farm2_2019-04-01_07-34-05.wav,44100,16,60,1,H,512,hil,NULL,NULL,0.893459612978042,NA 
rayol-farm2_2019-04-01_07-36-05.wav,44100,16,60,1,H,512,hil,NULL,NULL,0.892808360224843,NA 
rayol-farm2_2019-04-01_07-38-06.wav,44100,16,60,1,H,512,hil,NULL,NULL,0.89715744094878,NA 
rayol-farm2_2019-04-01_07-40-06.wav,44100,16,60,1,H,512,hil,NULL,NULL,0.889075036924161,NA 
rayol-farm2_2019-04-01_07-42-06.wav,44100,16,60,1,H,512,hil,NULL,NULL,0.882797402747862,NA 
rayol-farm2_2019-04-01_07-44-06.wav,44100,16,60,1,H,512,hil,NULL,NULL,0.885400471688109,NA 
rayol-farm2_2019-04-01_07-46-06.wav,44100,16,60,1,H,512,hil,NULL,NULL,0.882322708171458,NA 
rayol-farm2_2019-04-01_07-48-06.wav,44100,16,60,1,H,512,hil,NULL,NULL,0.89062456045762,NA 
rayol-farm2_2019-04-01_07-50-06.wav,44100,16,60,1,H,512,hil,NULL,NULL,0.892690595286324,NA 
rayol-farm2_2019-04-01_07-52-06.wav,44100,16,60,1,H,512,hil,NULL,NULL,0.894210663451228,NA 
rayol-farm2_2019-04-01_07-54-07.wav,44100,16,60,1,H,512,hil,NULL,NULL,0.889643576252529,NA 
rayol-farm2_2019-04-01_07-56-07.wav,44100,16,60,1,H,512,hil,NULL,NULL,0.893180571674786,NA 
rayol-farm2_2019-04-01_07-58-07.wav,44100,16,60,1,H,512,hil,NULL,NULL,0.88461285776949,NA 
rayol-farm2_2019-04-01_08-00-07.wav,44100,16,60,1,H,512,hil,NULL,NULL,0.897263671768951,NA 
rayol-farm2_2019-04-01_08-02-07.wav,44100,16,60,1,H,512,hil,NULL,NULL,0.882053429817971,NA 
rayol-farm2_2019-04-01_08-04-07.wav,44100,16,60,1,H,512,hil,NULL,NULL,0.889386066453865,NA 
rayol-farm2_2019-04-01_08-06-07.wav,44100,16,60,1,H,512,hil,NULL,NULL,0.889968885281357,NA 
rayol-farm2_2019-04-01_08-08-07.wav,44100,16,60,1,H,512,hil,NULL,NULL,0.89192500626719,NA 
rayol-farm2_2019-04-01_08-10-07.wav,44100,16,60,1,H,512,hil,NULL,NULL,0.891372869896265,NA 
rayol-farm2_2019-04-01_08-12-08.wav,44100,16,60,1,H,512,hil,NULL,NULL,0.892306793985638,NA 
rayol-farm2_2019-04-01_08-14-08.wav,44100,16,60,1,H,512,hil,NULL,NULL,0.894861929819648,NA 
rayol-farm2_2019-04-01_08-16-08.wav,44100,16,60,1,H,512,hil,NULL,NULL,0.892931203883881,NA 
rayol-farm2_2019-04-01_08-18-08.wav,44100,16,60,1,H,512,hil,NULL,NULL,0.882296654092955,NA 
rayol-farm2_2019-04-01_08-20-08.wav,44100,16,60,1,H,512,hil,NULL,NULL,0.878788248297062,NA 
rayol-farm2_2019-04-01_08-22-08.wav,44100,16,60,1,H,512,hil,NULL,NULL,0.897081832457194,NA 
rayol-farm2_2019-04-01_08-24-08.wav,44100,16,60,1,H,512,hil,NULL,NULL,0.891148789898429,NA 
rayol-farm2_2019-04-01_08-26-08.wav,44100,16,60,1,H,512,hil,NULL,NULL,0.875092384731465,NA 
rayol-farm2_2019-04-01_08-28-09.wav,44100,16,60,1,H,512,hil,NULL,NULL,0.892425762338879,NA 
rayol-farm2_2019-04-01_08-30-09.wav,44100,16,60,1,H,512,hil,NULL,NULL,0.892109954352264,NA 
rayol-farm2_2019-04-01_08-32-09.wav,44100,16,60,1,H,512,hil,NULL,NULL,0.8805334154387,NA 
rayol-farm2_2019-04-01_08-34-09.wav,44100,16,60,1,H,512,hil,NULL,NULL,0.891340198599997,NA 
rayol-farm2_2019-04-01_08-36-09.wav,44100,16,60,1,H,512,hil,NULL,NULL,0.879574948241196,NA 
rayol-farm2_2019-04-01_08-38-09.wav,44100,16,60,1,H,512,hil,NULL,NULL,0.893534167731337,NA 
rayol-farm2_2019-04-01_08-40-09.wav,44100,16,60,1,H,512,hil,NULL,NULL,0.89217791632875,NA 
rayol-farm2_2019-04-01_08-42-09.wav,44100,16,60,1,H,512,hil,NULL,NULL,0.891920526836734,NA 
rayol-farm2_2019-04-01_08-44-10.wav,44100,16,60,1,H,512,hil,NULL,NULL,0.890590342688193,NA 
rayol-farm2_2019-04-01_08-46-10.wav,44100,16,60,1,H,512,hil,NULL,NULL,0.891417796533097,NA 
rayol-farm2_2019-04-01_08-48-10.wav,44100,16,60,1,H,512,hil,NULL,NULL,0.892338596850403,NA 
rayol-farm2_2019-04-01_08-50-10.wav,44100,16,60,1,H,512,hil,NULL,NULL,0.889477908101968,NA 
rayol-farm2_2019-04-01_08-52-10.wav,44100,16,60,1,H,512,hil,NULL,NULL,0.844559465265096,NA 
rayol-farm2_2019-04-01_08-54-10.wav,44100,16,60,1,H,512,hil,NULL,NULL,0.839925555319219,NA 
rayol-farm2_2019-04-01_08-56-10.wav,44100,16,60,1,H,512,hil,NULL,NULL,0.837847416072187,NA 
rayol-farm2_2019-04-01_08-58-10.wav,44100,16,60,1,H,512,hil,NULL,NULL,0.829412753567505,NA 
rayol-farm2_2019-04-01_09-00-11.wav,44100,16,60,1,H,512,hil,NULL,NULL,0.882067552690059,NA 
rayol-farm2_2019-04-01_09-02-11.wav,44100,16,60,1,H,512,hil,NULL,NULL,0.869176246361582,NA 
rayol-farm2_2019-04-01_09-04-11.wav,44100,16,60,1,H,512,hil,NULL,NULL,0.888949882688624,NA 
rayol-farm2_2019-04-01_09-06-11.wav,44100,16,60,1,H,512,hil,NULL,NULL,0.892499629190464,NA 
rayol-farm2_2019-04-01_09-08-11.wav,44100,16,60,1,H,512,hil,NULL,NULL,0.89607941148358,NA 
rayol-farm2_2019-04-01_09-10-11.wav,44100,16,60,1,H,512,hil,NULL,NULL,0.899814197955894,NA 
rayol-farm2_2019-04-01_09-12-11.wav,44100,16,60,1,H,512,hil,NULL,NULL,0.867311252582815,NA 
rayol-farm2_2019-04-01_09-14-11.wav,44100,16,60,1,H,512,hil,NULL,NULL,0.856926741464886,NA 
rayol-farm2_2019-04-01_09-16-12.wav,44100,16,60,1,H,512,hil,NULL,NULL,0.864640457676843,NA 
rayol-farm2_2019-04-01_09-18-12.wav,44100,16,60,1,H,512,hil,NULL,NULL,0.888093206094312,NA 
rayol-farm2_2019-04-01_09-20-12.wav,44100,16,60,1,H,512,hil,NULL,NULL,0.897265199550031,NA 
rayol-farm2_2019-04-01_09-22-12.wav,44100,16,60,1,H,512,hil,NULL,NULL,0.894481519128231,NA 
rayol-farm2_2019-04-01_09-24-12.wav,44100,16,60,1,H,512,hil,NULL,NULL,0.827950010065926,NA 
rayol-farm2_2019-04-01_09-26-12.wav,44100,16,60,1,H,512,hil,NULL,NULL,0.853151708420562,NA 
rayol-farm2_2019-04-01_09-28-12.wav,44100,16,60,1,H,512,hil,NULL,NULL,0.891502168722763,NA 
rayol-farm2_2019-04-01_09-30-12.wav,44100,16,60,1,H,512,hil,NULL,NULL,0.896003914650073,NA 
rayol-farm2_2019-04-01_09-32-12.wav,44100,16,60,1,H,512,hil,NULL,NULL,0.858960053728662,NA 
rayol-farm2_2019-04-01_09-34-13.wav,44100,16,60,1,H,512,hil,NULL,NULL,0.87943210078894,NA 
rayol-farm2_2019-04-01_09-36-13.wav,44100,16,60,1,H,512,hil,NULL,NULL,0.891583188229487,NA 
rayol-farm2_2019-04-01_09-38-13.wav,44100,16,60,1,H,512,hil,NULL,NULL,0.891491316892206,NA 
rayol-farm2_2019-04-01_09-40-13.wav,44100,16,60,1,H,512,hil,NULL,NULL,0.887698357979676,NA 
rayol-farm2_2019-04-01_09-42-13.wav,44100,16,60,1,H,512,hil,NULL,NULL,0.883468159752926,NA 
rayol-farm2_2019-04-01_09-44-13.wav,44100,16,60,1,H,512,hil,NULL,NULL,0.885246332197881,NA 
rayol-farm2_2019-04-01_09-46-13.wav,44100,16,60,1,H,512,hil,NULL,NULL,0.871643536710129,NA 
rayol-farm2_2019-04-01_09-48-13.wav,44100,16,60,1,H,512,hil,NULL,NULL,0.887857049460897,NA 
rayol-farm2_2019-04-01_09-50-14.wav,44100,16,60,1,H,512,hil,NULL,NULL,0.891941079130748,NA 
rayol-farm2_2019-04-01_09-52-14.wav,44100,16,60,1,H,512,hil,NULL,NULL,0.881292773793886,NA 
rayol-farm2_2019-04-01_09-54-14.wav,44100,16,60,1,H,512,hil,NULL,NULL,0.876806360823127,NA 
rayol-farm2_2019-04-01_09-56-14.wav,44100,16,60,1,H,512,hil,NULL,NULL,0.889618741085502,NA 
rayol-farm2_2019-04-01_09-58-14.wav,44100,16,60,1,H,512,hil,NULL,NULL,0.862340677135832,NA 
rayol-farm2_2019-04-01_10-00-14.wav,44100,16,60,1,H,512,hil,NULL,NULL,0.88744486197718,NA 
rayol-farm2_2019-04-01_10-02-14.wav,44100,16,60,1,H,512,hil,NULL,NULL,0.890090789675684,NA 
rayol-farm2_2019-04-01_10-04-14.wav,44100,16,60,1,H,512,hil,NULL,NULL,0.891008943903963,NA 
rayol-farm2_2019-04-01_10-06-15.wav,44100,16,60,1,H,512,hil,NULL,NULL,0.890840451457117,NA 
rayol-farm2_2019-04-01_10-08-15.wav,44100,16,60,1,H,512,hil,NULL,NULL,0.888208602422102,NA 
rayol-farm2_2019-04-01_10-10-15.wav,44100,16,60,1,H,512,hil,NULL,NULL,0.803187693045421,NA 
rayol-farm2_2019-04-01_10-12-15.wav,44100,16,60,1,H,512,hil,NULL,NULL,0.81830872599133,NA 
rayol-farm2_2019-04-01_10-14-15.wav,44100,16,60,1,H,512,hil,NULL,NULL,0.892981808601768,NA 
rayol-farm2_2019-04-01_10-16-15.wav,44100,16,60,1,H,512,hil,NULL,NULL,0.896130212455864,NA 
rayol-farm2_2019-04-01_10-18-15.wav,44100,16,60,1,H,512,hil,NULL,NULL,0.876752945952207,NA 
rayol-farm2_2019-04-01_10-20-15.wav,44100,16,60,1,H,512,hil,NULL,NULL,0.879879653571093,NA 
rayol-farm2_2019-04-01_10-22-16.wav,44100,16,60,1,H,512,hil,NULL,NULL,0.811992340687983,NA 
rayol-farm2_2019-04-01_10-24-16.wav,44100,16,60,1,H,512,hil,NULL,NULL,0.786439376465025,NA 
rayol-farm2_2019-04-01_10-26-16.wav,44100,16,60,1,H,512,hil,NULL,NULL,0.790770965582956,NA 
rayol-farm2_2019-04-01_10-28-16.wav,44100,16,60,1,H,512,hil,NULL,NULL,0.794406178584407,NA 
rayol-farm2_2019-04-01_10-30-16.wav,44100,16,60,1,H,512,hil,NULL,NULL,0.79084806787461,NA 
rayol-farm2_2019-04-01_10-32-16.wav,44100,16,60,1,H,512,hil,NULL,NULL,0.801796370492992,NA 
rayol-farm2_2019-04-01_10-34-16.wav,44100,16,60,1,H,512,hil,NULL,NULL,0.795819894495874,NA 
rayol-farm2_2019-04-01_10-36-16.wav,44100,16,60,1,H,512,hil,NULL,NULL,0.801129022091394,NA 
rayol-farm2_2019-04-01_10-38-16.wav,44100,16,60,1,H,512,hil,NULL,NULL,0.81802598872957,NA 
rayol-farm2_2019-04-01_10-40-17.wav,44100,16,60,1,H,512,hil,NULL,NULL,0.893054790357612,NA 
rayol-farm2_2019-04-01_10-42-17.wav,44100,16,60,1,H,512,hil,NULL,NULL,0.883247803489471,NA 
rayol-farm2_2019-04-01_10-44-17.wav,44100,16,60,1,H,512,hil,NULL,NULL,0.849128465648788,NA 
rayol-farm2_2019-04-01_10-46-17.wav,44100,16,60,1,H,512,hil,NULL,NULL,0.875649222746515,NA 
rayol-farm2_2019-04-01_10-48-17.wav,44100,16,60,1,H,512,hil,NULL,NULL,0.881254419732724,NA 
rayol-farm2_2019-04-01_10-50-17.wav,44100,16,60,1,H,512,hil,NULL,NULL,0.876943300966064,NA 
rayol-farm2_2019-04-01_10-52-17.wav,44100,16,60,1,H,512,hil,NULL,NULL,0.880605451775469,NA 
rayol-farm2_2019-04-01_10-54-17.wav,44100,16,60,1,H,512,hil,NULL,NULL,0.880924322735472,NA 
rayol-farm2_2019-04-01_10-56-18.wav,44100,16,60,1,H,512,hil,NULL,NULL,0.877729201956351,NA 
rayol-farm2_2019-04-01_10-58-18.wav,44100,16,60,1,H,512,hil,NULL,NULL,0.872998744219407,NA 
rayol-farm2_2019-04-01_11-00-18.wav,44100,16,60,1,H,512,hil,NULL,NULL,0.874445243476827,NA 
rayol-farm2_2019-04-01_11-02-18.wav,44100,16,60,1,H,512,hil,NULL,NULL,0.879041837669327,NA 
rayol-farm2_2019-04-01_11-04-18.wav,44100,16,60,1,H,512,hil,NULL,NULL,0.867453954938431,NA 
rayol-farm2_2019-04-01_11-06-18.wav,44100,16,60,1,H,512,hil,NULL,NULL,0.876792633726528,NA 
rayol-farm2_2019-04-01_11-08-18.wav,44100,16,60,1,H,512,hil,NULL,NULL,0.876153213122889,NA 
rayol-farm2_2019-04-01_11-10-18.wav,44100,16,60,1,H,512,hil,NULL,NULL,0.85695835440548,NA 
rayol-farm2_2019-04-01_11-12-19.wav,44100,16,60,1,H,512,hil,NULL,NULL,0.877126604506842,NA 
rayol-farm2_2019-04-01_11-14-19.wav,44100,16,60,1,H,512,hil,NULL,NULL,0.872249405018882,NA 
rayol-farm2_2019-04-01_11-16-19.wav,44100,16,60,1,H,512,hil,NULL,NULL,0.870691021788118,NA 
rayol-farm2_2019-04-01_11-18-19.wav,44100,16,60,1,H,512,hil,NULL,NULL,0.873479674625481,NA 
rayol-farm2_2019-04-01_11-20-19.wav,44100,16,60,1,H,512,hil,NULL,NULL,0.873706723887317,NA 
rayol-farm2_2019-04-01_11-22-19.wav,44100,16,60,1,H,512,hil,NULL,NULL,0.87576243767107,NA 
rayol-farm2_2019-04-01_11-24-19.wav,44100,16,60,1,H,512,hil,NULL,NULL,0.868288031184934,NA 
rayol-farm2_2019-04-01_11-26-19.wav,44100,16,60,1,H,512,hil,NULL,NULL,0.859454921865119,NA 
rayol-farm2_2019-04-01_11-28-20.wav,44100,16,60,1,H,512,hil,NULL,NULL,0.871862051805543,NA 
rayol-farm2_2019-04-01_11-30-20.wav,44100,16,60,1,H,512,hil,NULL,NULL,0.882942748820765,NA 
rayol-farm2_2019-04-01_11-32-20.wav,44100,16,60,1,H,512,hil,NULL,NULL,0.875687998001726,NA 
rayol-farm2_2019-04-01_11-34-20.wav,44100,16,60,1,H,512,hil,NULL,NULL,0.874937035531712,NA 
rayol-farm2_2019-04-01_11-36-20.wav,44100,16,60,1,H,512,hil,NULL,NULL,0.870543584050176,NA 
rayol-farm2_2019-04-01_11-38-20.wav,44100,16,60,1,H,512,hil,NULL,NULL,0.869489500095152,NA 
rayol-farm2_2019-04-01_11-40-20.wav,44100,16,60,1,H,512,hil,NULL,NULL,0.855541946986308,NA 
rayol-farm2_2019-04-01_11-42-20.wav,44100,16,60,1,H,512,hil,NULL,NULL,0.851163984820394,NA 
rayol-farm2_2019-04-01_11-44-20.wav,44100,16,60,1,H,512,hil,NULL,NULL,0.771446798159697,NA 
rayol-farm2_2019-04-01_11-46-21.wav,44100,16,60,1,H,512,hil,NULL,NULL,0.755881426010444,NA 
rayol-farm2_2019-04-01_11-48-21.wav,44100,16,60,1,H,512,hil,NULL,NULL,0.784074490487643,NA 
rayol-farm2_2019-04-01_11-50-21.wav,44100,16,60,1,H,512,hil,NULL,NULL,0.769337664832646,NA 
rayol-farm2_2019-04-01_11-52-21.wav,44100,16,60,1,H,512,hil,NULL,NULL,0.76429654095222,NA 
rayol-farm2_2019-04-01_11-54-21.wav,44100,16,60,1,H,512,hil,NULL,NULL,0.765089985774468,NA 
rayol-farm2_2019-04-01_11-56-21.wav,44100,16,60,1,H,512,hil,NULL,NULL,0.75141418550954,NA 
rayol-farm2_2019-04-01_11-58-21.wav,44100,16,60,1,H,512,hil,NULL,NULL,0.761804680535611,NA 
rayol-farm2_2019-04-01_12-00-21.wav,44100,16,60,1,H,512,hil,NULL,NULL,0.782684154278724,NA 
rayol-farm2_2019-04-01_12-02-22.wav,44100,16,60,1,H,512,hil,NULL,NULL,0.881663674535678,NA 
rayol-farm2_2019-04-01_12-04-22.wav,44100,16,60,1,H,512,hil,NULL,NULL,0.888044563660726,NA 
rayol-farm2_2019-04-01_12-06-22.wav,44100,16,60,1,H,512,hil,NULL,NULL,0.870870952609077,NA 
rayol-farm2_2019-04-01_12-08-22.wav,44100,16,60,1,H,512,hil,NULL,NULL,0.873281899535903,NA 
rayol-farm2_2019-04-01_12-10-22.wav,44100,16,60,1,H,512,hil,NULL,NULL,0.855223380503151,NA 
rayol-farm2_2019-04-01_12-12-22.wav,44100,16,60,1,H,512,hil,NULL,NULL,0.874480274851168,NA 
rayol-farm2_2019-04-01_12-14-22.wav,44100,16,60,1,H,512,hil,NULL,NULL,0.874919899505769,NA 
rayol-farm2_2019-04-01_12-16-22.wav,44100,16,60,1,H,512,hil,NULL,NULL,0.881134036046092,NA 
rayol-farm2_2019-04-01_12-18-23.wav,44100,16,60,1,H,512,hil,NULL,NULL,0.876209147524507,NA 
rayol-farm2_2019-04-01_12-20-23.wav,44100,16,60,1,H,512,hil,NULL,NULL,0.87228583040182,NA 
rayol-farm2_2019-04-01_12-22-23.wav,44100,16,60,1,H,512,hil,NULL,NULL,0.870558612540346,NA 
rayol-farm2_2019-04-01_12-24-23.wav,44100,16,60,1,H,512,hil,NULL,NULL,0.855475142172918,NA 
rayol-farm2_2019-04-01_12-26-23.wav,44100,16,60,1,H,512,hil,NULL,NULL,0.871235219332341,NA 
rayol-farm2_2019-04-01_12-28-23.wav,44100,16,60,1,H,512,hil,NULL,NULL,0.887920988343908,NA 
rayol-farm2_2019-04-01_12-30-23.wav,44100,16,60,1,H,512,hil,NULL,NULL,0.873281023088724,NA 
rayol-farm2_2019-04-01_12-32-23.wav,44100,16,60,1,H,512,hil,NULL,NULL,0.877302909220809,NA 
rayol-farm2_2019-04-01_12-34-23.wav,44100,16,60,1,H,512,hil,NULL,NULL,0.874470741745375,NA 
rayol-farm2_2019-04-01_12-36-24.wav,44100,16,60,1,H,512,hil,NULL,NULL,0.863451313418071,NA 
rayol-farm2_2019-04-01_12-38-24.wav,44100,16,60,1,H,512,hil,NULL,NULL,0.877682886116505,NA 
rayol-farm2_2019-04-01_12-40-24.wav,44100,16,60,1,H,512,hil,NULL,NULL,0.884525433210258,NA 
rayol-farm2_2019-04-01_12-42-24.wav,44100,16,60,1,H,512,hil,NULL,NULL,0.88110378949031,NA 
rayol-farm2_2019-04-01_12-44-24.wav,44100,16,60,1,H,512,hil,NULL,NULL,0.887229255519441,NA 
rayol-farm2_2019-04-01_12-46-24.wav,44100,16,60,1,H,512,hil,NULL,NULL,0.888381567131696,NA 
rayol-farm2_2019-04-01_12-48-24.wav,44100,16,60,1,H,512,hil,NULL,NULL,0.860827791876064,NA 
rayol-farm2_2019-04-01_12-50-24.wav,44100,16,60,1,H,512,hil,NULL,NULL,0.868864368063408,NA 
rayol-farm2_2019-04-01_12-52-25.wav,44100,16,60,1,H,512,hil,NULL,NULL,0.871034700448485,NA 
rayol-farm2_2019-04-01_12-54-25.wav,44100,16,60,1,H,512,hil,NULL,NULL,0.868287690557607,NA 
rayol-farm2_2019-04-01_12-56-25.wav,44100,16,60,1,H,512,hil,NULL,NULL,0.875111840023085,NA 
rayol-farm2_2019-04-01_12-58-25.wav,44100,16,60,1,H,512,hil,NULL,NULL,0.819510857456768,NA 
rayol-farm2_2019-04-01_13-00-25.wav,44100,16,60,1,H,512,hil,NULL,NULL,0.861649979976842,NA 
rayol-farm2_2019-04-01_13-02-25.wav,44100,16,60,1,H,512,hil,NULL,NULL,0.874320439642809,NA 
rayol-farm2_2019-04-01_13-04-25.wav,44100,16,60,1,H,512,hil,NULL,NULL,0.880802115528266,NA 
rayol-farm2_2019-04-01_13-06-25.wav,44100,16,60,1,H,512,hil,NULL,NULL,0.884574925365709,NA 
rayol-farm2_2019-04-01_13-08-26.wav,44100,16,60,1,H,512,hil,NULL,NULL,0.885852568376417,NA 
rayol-farm2_2019-04-01_13-10-26.wav,44100,16,60,1,H,512,hil,NULL,NULL,0.882708736655463,NA 
rayol-farm2_2019-04-01_13-12-26.wav,44100,16,60,1,H,512,hil,NULL,NULL,0.878039134690379,NA 
rayol-farm2_2019-04-01_13-14-26.wav,44100,16,60,1,H,512,hil,NULL,NULL,0.880712058297321,NA 
rayol-farm2_2019-04-01_13-16-26.wav,44100,16,60,1,H,512,hil,NULL,NULL,0.875860015109027,NA 
rayol-farm2_2019-04-01_13-18-26.wav,44100,16,60,1,H,512,hil,NULL,NULL,0.88358470717854,NA 
rayol-farm2_2019-04-01_13-20-26.wav,44100,16,60,1,H,512,hil,NULL,NULL,0.881121090968066,NA 
rayol-farm2_2019-04-01_13-22-26.wav,44100,16,60,1,H,512,hil,NULL,NULL,0.870268403624689,NA 
rayol-farm2_2019-04-01_13-24-27.wav,44100,16,60,1,H,512,hil,NULL,NULL,0.878822424918166,NA 
rayol-farm2_2019-04-01_13-26-27.wav,44100,16,60,1,H,512,hil,NULL,NULL,0.88484416618726,NA 
rayol-farm2_2019-04-01_13-28-27.wav,44100,16,60,1,H,512,hil,NULL,NULL,0.877236378757555,NA 
rayol-farm2_2019-04-01_13-30-27.wav,44100,16,60,1,H,512,hil,NULL,NULL,0.880315201453625,NA 
rayol-farm2_2019-04-01_13-32-27.wav,44100,16,60,1,H,512,hil,NULL,NULL,0.8857692457571,NA 
rayol-farm2_2019-04-01_13-34-27.wav,44100,16,60,1,H,512,hil,NULL,NULL,0.893987799334192,NA 
rayol-farm2_2019-04-01_13-36-27.wav,44100,16,60,1,H,512,hil,NULL,NULL,0.890125781122768,NA 
rayol-farm2_2019-04-01_13-38-27.wav,44100,16,60,1,H,512,hil,NULL,NULL,0.872511719077413,NA 
rayol-farm2_2019-04-01_13-40-27.wav,44100,16,60,1,H,512,hil,NULL,NULL,0.877025973504903,NA 
rayol-farm2_2019-04-01_13-42-28.wav,44100,16,60,1,H,512,hil,NULL,NULL,0.875503922113965,NA 
rayol-farm2_2019-04-01_13-44-28.wav,44100,16,60,1,H,512,hil,NULL,NULL,0.885186795357107,NA 
rayol-farm2_2019-04-01_13-46-28.wav,44100,16,60,1,H,512,hil,NULL,NULL,0.886658315020249,NA 
rayol-farm2_2019-04-01_13-48-28.wav,44100,16,60,1,H,512,hil,NULL,NULL,0.878208932917114,NA 
rayol-farm2_2019-04-01_13-50-28.wav,44100,16,60,1,H,512,hil,NULL,NULL,0.810540300241914,NA 
rayol-farm2_2019-04-01_13-52-28.wav,44100,16,60,1,H,512,hil,NULL,NULL,0.775756257955201,NA 
rayol-farm2_2019-04-01_13-54-28.wav,44100,16,60,1,H,512,hil,NULL,NULL,0.779737178203316,NA 
rayol-farm2_2019-04-01_13-56-28.wav,44100,16,60,1,H,512,hil,NULL,NULL,0.767653117648928,NA 
rayol-farm2_2019-04-01_13-58-29.wav,44100,16,60,1,H,512,hil,NULL,NULL,0.765853964522046,NA 
rayol-farm2_2019-04-01_14-00-29.wav,44100,16,60,1,H,512,hil,NULL,NULL,0.776028386529488,NA 
rayol-farm2_2019-04-01_14-02-29.wav,44100,16,60,1,H,512,hil,NULL,NULL,0.769433340440962,NA 
rayol-farm2_2019-04-01_14-04-29.wav,44100,16,60,1,H,512,hil,NULL,NULL,0.768957112436514,NA 
rayol-farm2_2019-04-01_14-06-29.wav,44100,16,60,1,H,512,hil,NULL,NULL,0.763291147193094,NA 
rayol-farm2_2019-04-01_14-08-29.wav,44100,16,60,1,H,512,hil,NULL,NULL,0.774597565631245,NA 
rayol-farm2_2019-04-01_14-10-29.wav,44100,16,60,1,H,512,hil,NULL,NULL,0.882442706503428,NA 
rayol-farm2_2019-04-01_14-12-29.wav,44100,16,60,1,H,512,hil,NULL,NULL,0.877877290640652,NA 
rayol-farm2_2019-04-01_14-14-30.wav,44100,16,60,1,H,512,hil,NULL,NULL,0.873838637354738,NA 
rayol-farm2_2019-04-01_14-16-30.wav,44100,16,60,1,H,512,hil,NULL,NULL,0.875292176636404,NA 
rayol-farm2_2019-04-01_14-18-30.wav,44100,16,60,1,H,512,hil,NULL,NULL,0.87040648736473,NA 
rayol-farm2_2019-04-01_14-20-30.wav,44100,16,60,1,H,512,hil,NULL,NULL,0.867054664897869,NA 
rayol-farm2_2019-04-01_14-22-30.wav,44100,16,60,1,H,512,hil,NULL,NULL,0.863890816151761,NA 
rayol-farm2_2019-04-01_14-24-30.wav,44100,16,60,1,H,512,hil,NULL,NULL,0.781324366463946,NA 
rayol-farm2_2019-04-01_14-26-30.wav,44100,16,60,1,H,512,hil,NULL,NULL,0.765537037665939,NA 
rayol-farm2_2019-04-01_14-28-30.wav,44100,16,60,1,H,512,hil,NULL,NULL,0.768611702661335,NA 
rayol-farm2_2019-04-01_14-30-30.wav,44100,16,60,1,H,512,hil,NULL,NULL,0.780984801080512,NA 
rayol-farm2_2019-04-01_14-32-31.wav,44100,16,60,1,H,512,hil,NULL,NULL,0.779860696894018,NA 
rayol-farm2_2019-04-01_14-34-31.wav,44100,16,60,1,H,512,hil,NULL,NULL,0.775727115017924,NA 
rayol-farm2_2019-04-01_14-36-31.wav,44100,16,60,1,H,512,hil,NULL,NULL,0.774035784135253,NA 
rayol-farm2_2019-04-01_14-38-31.wav,44100,16,60,1,H,512,hil,NULL,NULL,0.779482515881253,NA 
rayol-farm2_2019-04-01_14-40-31.wav,44100,16,60,1,H,512,hil,NULL,NULL,0.777054151067169,NA 
rayol-farm2_2019-04-01_14-42-31.wav,44100,16,60,1,H,512,hil,NULL,NULL,0.789700830932711,NA 
rayol-farm2_2019-04-01_14-44-31.wav,44100,16,60,1,H,512,hil,NULL,NULL,0.810562570934612,NA 
rayol-farm2_2019-04-01_14-46-31.wav,44100,16,60,1,H,512,hil,NULL,NULL,0.874571570709928,NA 
rayol-farm2_2019-04-01_14-48-32.wav,44100,16,60,1,H,512,hil,NULL,NULL,0.860412415021515,NA 
rayol-farm2_2019-04-01_14-50-32.wav,44100,16,60,1,H,512,hil,NULL,NULL,0.866869797167891,NA 
rayol-farm2_2019-04-01_14-52-32.wav,44100,16,60,1,H,512,hil,NULL,NULL,0.888732873652253,NA 
rayol-farm2_2019-04-01_14-54-32.wav,44100,16,60,1,H,512,hil,NULL,NULL,0.88570022806463,NA 
rayol-farm2_2019-04-01_14-56-32.wav,44100,16,60,1,H,512,hil,NULL,NULL,0.88770615107956,NA 
rayol-farm2_2019-04-01_14-58-32.wav,44100,16,60,1,H,512,hil,NULL,NULL,0.876171472176528,NA 
rayol-farm2_2019-04-01_15-00-32.wav,44100,16,60,1,H,512,hil,NULL,NULL,0.878384264478558,NA 
rayol-farm2_2019-04-01_15-02-32.wav,44100,16,60,1,H,512,hil,NULL,NULL,0.878848666489348,NA 
rayol-farm2_2019-04-01_15-04-33.wav,44100,16,60,1,H,512,hil,NULL,NULL,0.877729630183822,NA 
rayol-farm2_2019-04-01_15-06-33.wav,44100,16,60,1,H,512,hil,NULL,NULL,0.86963906198105,NA 
rayol-farm2_2019-04-01_15-08-33.wav,44100,16,60,1,H,512,hil,NULL,NULL,0.85723962104295,NA 
rayol-farm2_2019-04-01_15-10-33.wav,44100,16,60,1,H,512,hil,NULL,NULL,0.790002047737153,NA 
rayol-farm2_2019-04-01_15-12-33.wav,44100,16,60,1,H,512,hil,NULL,NULL,0.793590444276177,NA 
rayol-farm2_2019-04-01_15-14-33.wav,44100,16,60,1,H,512,hil,NULL,NULL,0.799088427680016,NA 
rayol-farm2_2019-04-01_15-16-33.wav,44100,16,60,1,H,512,hil,NULL,NULL,0.799323947667597,NA 
rayol-farm2_2019-04-01_15-18-33.wav,44100,16,60,1,H,512,hil,NULL,NULL,0.785911327598583,NA 
rayol-farm2_2019-04-01_15-20-34.wav,44100,16,60,1,H,512,hil,NULL,NULL,0.896766362214847,NA 
rayol-farm2_2019-04-01_15-22-34.wav,44100,16,60,1,H,512,hil,NULL,NULL,0.895069349594972,NA 
rayol-farm2_2019-04-01_15-24-34.wav,44100,16,60,1,H,512,hil,NULL,NULL,0.891228193539503,NA 
rayol-farm2_2019-04-01_15-26-34.wav,44100,16,60,1,H,512,hil,NULL,NULL,0.829361739957055,NA 
rayol-farm2_2019-04-01_15-28-34.wav,44100,16,60,1,H,512,hil,NULL,NULL,0.88715055394554,NA 
rayol-farm2_2019-04-01_15-30-34.wav,44100,16,60,1,H,512,hil,NULL,NULL,0.896028266385871,NA 
rayol-farm2_2019-04-01_15-32-34.wav,44100,16,60,1,H,512,hil,NULL,NULL,0.884426589105389,NA 
rayol-farm2_2019-04-01_15-34-34.wav,44100,16,60,1,H,512,hil,NULL,NULL,0.894658002663893,NA 
rayol-farm2_2019-04-01_15-36-34.wav,44100,16,60,1,H,512,hil,NULL,NULL,0.890408004447549,NA 
rayol-farm2_2019-04-01_15-38-35.wav,44100,16,60,1,H,512,hil,NULL,NULL,0.89342442490326,NA 
rayol-farm2_2019-04-01_15-40-35.wav,44100,16,60,1,H,512,hil,NULL,NULL,0.888513294457006,NA 
rayol-farm2_2019-04-01_15-42-35.wav,44100,16,60,1,H,512,hil,NULL,NULL,0.894691716459573,NA 
rayol-farm2_2019-04-01_15-44-35.wav,44100,16,60,1,H,512,hil,NULL,NULL,0.83283789695377,NA 
rayol-farm2_2019-04-01_15-46-35.wav,44100,16,60,1,H,512,hil,NULL,NULL,0.895494846438125,NA 
rayol-farm2_2019-04-01_15-48-35.wav,44100,16,60,1,H,512,hil,NULL,NULL,0.895115307394431,NA 
rayol-farm2_2019-04-01_15-50-35.wav,44100,16,60,1,H,512,hil,NULL,NULL,0.884976432733657,NA 
rayol-farm2_2019-04-01_15-52-35.wav,44100,16,60,1,H,512,hil,NULL,NULL,0.888779152211984,NA 
rayol-farm2_2019-04-01_15-54-36.wav,44100,16,60,1,H,512,hil,NULL,NULL,0.898974645621969,NA 
rayol-farm2_2019-04-01_15-56-36.wav,44100,16,60,1,H,512,hil,NULL,NULL,0.898886450130671,NA 
rayol-farm2_2019-04-01_15-58-36.wav,44100,16,60,1,H,512,hil,NULL,NULL,0.895715813227934,NA 
rayol-farm2_2019-04-01_16-00-36.wav,44100,16,60,1,H,512,hil,NULL,NULL,0.893993798782691,NA 
rayol-farm2_2019-04-01_16-02-36.wav,44100,16,60,1,H,512,hil,NULL,NULL,0.886705916646221,NA 
rayol-farm2_2019-04-01_16-04-36.wav,44100,16,60,1,H,512,hil,NULL,NULL,0.887480168787434,NA 
rayol-farm2_2019-04-01_16-06-36.wav,44100,16,60,1,H,512,hil,NULL,NULL,0.886940754186836,NA 
rayol-farm2_2019-04-01_16-08-36.wav,44100,16,60,1,H,512,hil,NULL,NULL,0.862549272055311,NA 
rayol-farm2_2019-04-01_16-10-37.wav,44100,16,60,1,H,512,hil,NULL,NULL,0.894319386036222,NA 
rayol-farm2_2019-04-01_16-12-37.wav,44100,16,60,1,H,512,hil,NULL,NULL,0.856011255720573,NA 
rayol-farm2_2019-04-01_16-14-37.wav,44100,16,60,1,H,512,hil,NULL,NULL,0.870379289915032,NA 
rayol-farm2_2019-04-01_16-16-37.wav,44100,16,60,1,H,512,hil,NULL,NULL,0.88169631842206,NA 
rayol-farm2_2019-04-01_16-18-37.wav,44100,16,60,1,H,512,hil,NULL,NULL,0.873318785943814,NA 
rayol-farm2_2019-04-01_16-20-37.wav,44100,16,60,1,H,512,hil,NULL,NULL,0.884213352057359,NA 
rayol-farm2_2019-04-01_16-22-37.wav,44100,16,60,1,H,512,hil,NULL,NULL,0.878681407584446,NA 
rayol-farm2_2019-04-01_16-24-37.wav,44100,16,60,1,H,512,hil,NULL,NULL,0.87550486421894,NA 
rayol-farm2_2019-04-01_16-26-38.wav,44100,16,60,1,H,512,hil,NULL,NULL,0.885630631027737,NA 
rayol-farm2_2019-04-01_16-28-38.wav,44100,16,60,1,H,512,hil,NULL,NULL,0.890971864972611,NA 
rayol-farm2_2019-04-01_16-30-38.wav,44100,16,60,1,H,512,hil,NULL,NULL,0.88426969826204,NA 
rayol-farm2_2019-04-01_16-32-38.wav,44100,16,60,1,H,512,hil,NULL,NULL,0.883006763857893,NA 
rayol-farm2_2019-04-01_16-34-38.wav,44100,16,60,1,H,512,hil,NULL,NULL,0.890240277862865,NA 
rayol-farm2_2019-04-01_16-36-38.wav,44100,16,60,1,H,512,hil,NULL,NULL,0.880611734348692,NA 
rayol-farm2_2019-04-01_16-38-38.wav,44100,16,60,1,H,512,hil,NULL,NULL,0.887016130540333,NA 
rayol-farm2_2019-04-01_16-40-38.wav,44100,16,60,1,H,512,hil,NULL,NULL,0.850283967293117,NA 
rayol-farm2_2019-04-01_16-42-39.wav,44100,16,60,1,H,512,hil,NULL,NULL,0.884192079301645,NA 
rayol-farm2_2019-04-01_16-44-39.wav,44100,16,60,1,H,512,hil,NULL,NULL,0.884814483022349,NA 
rayol-farm2_2019-04-01_16-46-39.wav,44100,16,60,1,H,512,hil,NULL,NULL,0.890708220309495,NA 
rayol-farm2_2019-04-01_16-48-39.wav,44100,16,60,1,H,512,hil,NULL,NULL,0.895294656098385,NA 
rayol-farm2_2019-04-01_16-50-39.wav,44100,16,60,1,H,512,hil,NULL,NULL,0.891748563200262,NA 
rayol-farm2_2019-04-01_16-52-39.wav,44100,16,60,1,H,512,hil,NULL,NULL,0.886764007471692,NA 
rayol-farm2_2019-04-01_16-54-39.wav,44100,16,60,1,H,512,hil,NULL,NULL,0.892162018386512,NA 
rayol-farm2_2019-04-01_16-56-39.wav,44100,16,60,1,H,512,hil,NULL,NULL,0.89468556014111,NA 
rayol-farm2_2019-04-01_16-58-39.wav,44100,16,60,1,H,512,hil,NULL,NULL,0.876846865725796,NA 
rayol-farm2_2019-04-01_17-00-40.wav,44100,16,60,1,H,512,hil,NULL,NULL,0.892297199271238,NA 
rayol-farm2_2019-04-01_17-02-40.wav,44100,16,60,1,H,512,hil,NULL,NULL,0.884417004280034,NA 
rayol-farm2_2019-04-01_17-04-40.wav,44100,16,60,1,H,512,hil,NULL,NULL,0.891058706702386,NA 
rayol-farm2_2019-04-01_17-06-40.wav,44100,16,60,1,H,512,hil,NULL,NULL,0.88136770969359,NA 
rayol-farm2_2019-04-01_17-08-40.wav,44100,16,60,1,H,512,hil,NULL,NULL,0.871100723286601,NA 
rayol-farm2_2019-04-01_17-10-40.wav,44100,16,60,1,H,512,hil,NULL,NULL,0.878960379401497,NA 
rayol-farm2_2019-04-01_17-12-40.wav,44100,16,60,1,H,512,hil,NULL,NULL,0.882664504680842,NA 
rayol-farm2_2019-04-01_17-14-40.wav,44100,16,60,1,H,512,hil,NULL,NULL,0.874393526660828,NA 
rayol-farm2_2019-04-01_17-16-41.wav,44100,16,60,1,H,512,hil,NULL,NULL,0.882571309300846,NA 
rayol-farm2_2019-04-01_17-18-41.wav,44100,16,60,1,H,512,hil,NULL,NULL,0.890134724161825,NA 
rayol-farm2_2019-04-01_17-20-41.wav,44100,16,60,1,H,512,hil,NULL,NULL,0.89286538499731,NA 
rayol-farm2_2019-04-01_17-22-41.wav,44100,16,60,1,H,512,hil,NULL,NULL,0.898410846694846,NA 
rayol-farm2_2019-04-01_17-24-41.wav,44100,16,60,1,H,512,hil,NULL,NULL,0.897132146297491,NA 
rayol-farm2_2019-04-01_17-26-41.wav,44100,16,60,1,H,512,hil,NULL,NULL,0.894084798777927,NA 
rayol-farm2_2019-04-01_17-28-41.wav,44100,16,60,1,H,512,hil,NULL,NULL,0.897495662257264,NA 
rayol-farm2_2019-04-01_17-30-41.wav,44100,16,60,1,H,512,hil,NULL,NULL,0.8944092724296,NA 
rayol-farm2_2019-04-01_17-32-42.wav,44100,16,60,1,H,512,hil,NULL,NULL,0.894291179751866,NA 
rayol-farm2_2019-04-01_17-34-42.wav,44100,16,60,1,H,512,hil,NULL,NULL,0.892919453727145,NA 
rayol-farm2_2019-04-01_17-36-42.wav,44100,16,60,1,H,512,hil,NULL,NULL,0.89502534631984,NA 
rayol-farm2_2019-04-01_17-38-42.wav,44100,16,60,1,H,512,hil,NULL,NULL,0.899357096020845,NA 
rayol-farm2_2019-04-01_17-40-42.wav,44100,16,60,1,H,512,hil,NULL,NULL,0.8912780118775,NA 
rayol-farm2_2019-04-01_17-42-42.wav,44100,16,60,1,H,512,hil,NULL,NULL,0.888642857838872,NA 
rayol-farm2_2019-04-01_17-44-42.wav,44100,16,60,1,H,512,hil,NULL,NULL,0.890399947132503,NA 
rayol-farm2_2019-04-01_17-46-42.wav,44100,16,60,1,H,512,hil,NULL,NULL,0.896897922186426,NA 
rayol-farm2_2019-04-01_17-48-43.wav,44100,16,60,1,H,512,hil,NULL,NULL,0.899306236557012,NA 
rayol-farm2_2019-04-01_17-50-43.wav,44100,16,60,1,H,512,hil,NULL,NULL,0.89839670063883,NA 
rayol-farm2_2019-04-01_17-52-43.wav,44100,16,60,1,H,512,hil,NULL,NULL,0.899535926156404,NA 
rayol-farm2_2019-04-01_17-54-43.wav,44100,16,60,1,H,512,hil,NULL,NULL,0.899340775926858,NA 
rayol-farm2_2019-04-01_17-56-43.wav,44100,16,60,1,H,512,hil,NULL,NULL,0.899723042849413,NA 
rayol-farm2_2019-04-01_17-58-43.wav,44100,16,60,1,H,512,hil,NULL,NULL,0.845171549785638,NA 
rayol-farm2_2019-04-01_18-00-43.wav,44100,16,60,1,H,512,hil,NULL,NULL,0.894652466899823,NA 
rayol-farm2_2019-04-01_18-02-43.wav,44100,16,60,1,H,512,hil,NULL,NULL,0.895831064366128,NA 
rayol-farm2_2019-04-01_18-04-43.wav,44100,16,60,1,H,512,hil,NULL,NULL,0.89389783975799,NA 
rayol-farm2_2019-04-01_18-06-44.wav,44100,16,60,1,H,512,hil,NULL,NULL,0.892937034683527,NA 
rayol-farm2_2019-04-01_18-08-44.wav,44100,16,60,1,H,512,hil,NULL,NULL,0.890342193208128,NA 
rayol-farm2_2019-04-01_18-10-44.wav,44100,16,60,1,H,512,hil,NULL,NULL,0.886050906835016,NA 
rayol-farm2_2019-04-01_18-12-44.wav,44100,16,60,1,H,512,hil,NULL,NULL,0.889893264129627,NA 
rayol-farm2_2019-04-01_18-14-44.wav,44100,16,60,1,H,512,hil,NULL,NULL,0.896261900368909,NA 
rayol-farm2_2019-04-01_18-16-44.wav,44100,16,60,1,H,512,hil,NULL,NULL,0.896595876453709,NA 
rayol-farm2_2019-04-01_18-18-44.wav,44100,16,60,1,H,512,hil,NULL,NULL,0.892504875688868,NA 
rayol-farm2_2019-04-01_18-20-44.wav,44100,16,60,1,H,512,hil,NULL,NULL,0.897262367767491,NA 
rayol-farm2_2019-04-01_18-22-45.wav,44100,16,60,1,H,512,hil,NULL,NULL,0.898968551620049,NA 
rayol-farm2_2019-04-01_18-24-45.wav,44100,16,60,1,H,512,hil,NULL,NULL,0.895843209958436,NA 
rayol-farm2_2019-04-01_18-26-45.wav,44100,16,60,1,H,512,hil,NULL,NULL,0.893821969851059,NA 
rayol-farm2_2019-04-01_18-28-45.wav,44100,16,60,1,H,512,hil,NULL,NULL,0.897602544303877,NA 
rayol-farm2_2019-04-01_18-30-45.wav,44100,16,60,1,H,512,hil,NULL,NULL,0.897884264206749,NA 
rayol-farm2_2019-04-01_18-32-45.wav,44100,16,60,1,H,512,hil,NULL,NULL,0.897062981451675,NA 
rayol-farm2_2019-04-01_18-34-45.wav,44100,16,60,1,H,512,hil,NULL,NULL,0.893254104672999,NA 
rayol-farm2_2019-04-01_18-36-45.wav,44100,16,60,1,H,512,hil,NULL,NULL,0.894529929223965,NA 
rayol-farm2_2019-04-01_18-38-45.wav,44100,16,60,1,H,512,hil,NULL,NULL,0.893796253670549,NA 
rayol-farm2_2019-04-01_18-40-46.wav,44100,16,60,1,H,512,hil,NULL,NULL,0.89565108589904,NA 
rayol-farm2_2019-04-01_18-42-46.wav,44100,16,60,1,H,512,hil,NULL,NULL,0.898826705117141,NA 
rayol-farm2_2019-04-01_18-44-46.wav,44100,16,60,1,H,512,hil,NULL,NULL,0.900420401956779,NA 
rayol-farm2_2019-04-01_18-46-46.wav,44100,16,60,1,H,512,hil,NULL,NULL,0.897021135509565,NA 
rayol-farm2_2019-04-01_18-48-46.wav,44100,16,60,1,H,512,hil,NULL,NULL,0.898168794493377,NA 
rayol-farm2_2019-04-01_18-50-46.wav,44100,16,60,1,H,512,hil,NULL,NULL,0.894913737080425,NA 
rayol-farm2_2019-04-01_18-52-46.wav,44100,16,60,1,H,512,hil,NULL,NULL,0.891472768684432,NA 
rayol-farm2_2019-04-01_18-54-46.wav,44100,16,60,1,H,512,hil,NULL,NULL,0.895014284791636,NA 
rayol-farm2_2019-04-01_18-56-47.wav,44100,16,60,1,H,512,hil,NULL,NULL,0.89678770441445,NA 
rayol-farm2_2019-04-01_18-58-47.wav,44100,16,60,1,H,512,hil,NULL,NULL,0.895827338857562,NA 
rayol-farm2_2019-04-01_19-00-47.wav,44100,16,60,1,H,512,hil,NULL,NULL,0.899893586092783,NA 
rayol-farm2_2019-04-01_19-02-47.wav,44100,16,60,1,H,512,hil,NULL,NULL,0.900122982660943,NA 
rayol-farm2_2019-04-01_19-04-47.wav,44100,16,60,1,H,512,hil,NULL,NULL,0.894810024263239,NA 
rayol-farm2_2019-04-01_19-06-47.wav,44100,16,60,1,H,512,hil,NULL,NULL,0.8941244723382,NA 
rayol-farm2_2019-04-01_19-08-47.wav,44100,16,60,1,H,512,hil,NULL,NULL,0.898263617190076,NA 
rayol-farm2_2019-04-01_19-10-47.wav,44100,16,60,1,H,512,hil,NULL,NULL,0.895558997764909,NA 
rayol-farm2_2019-04-01_19-12-48.wav,44100,16,60,1,H,512,hil,NULL,NULL,0.898579959951128,NA 
rayol-farm2_2019-04-01_19-14-48.wav,44100,16,60,1,H,512,hil,NULL,NULL,0.884996390511407,NA 
rayol-farm2_2019-04-01_19-16-48.wav,44100,16,60,1,H,512,hil,NULL,NULL,0.898636698451724,NA 
rayol-farm2_2019-04-01_19-18-48.wav,44100,16,60,1,H,512,hil,NULL,NULL,0.89786792119321,NA 
rayol-farm2_2019-04-01_19-20-48.wav,44100,16,60,1,H,512,hil,NULL,NULL,0.893086659621984,NA 
rayol-farm2_2019-04-01_19-22-48.wav,44100,16,60,1,H,512,hil,NULL,NULL,0.895794453509976,NA 
rayol-farm2_2019-04-01_19-24-48.wav,44100,16,60,1,H,512,hil,NULL,NULL,0.899143920360136,NA 
rayol-farm2_2019-04-01_19-26-48.wav,44100,16,60,1,H,512,hil,NULL,NULL,0.897417775296557,NA 
rayol-farm2_2019-04-01_19-28-48.wav,44100,16,60,1,H,512,hil,NULL,NULL,0.897953516143891,NA 
rayol-farm2_2019-04-01_19-30-49.wav,44100,16,60,1,H,512,hil,NULL,NULL,0.89599435846441,NA 
rayol-farm2_2019-04-01_19-32-49.wav,44100,16,60,1,H,512,hil,NULL,NULL,0.895261710668056,NA 
rayol-farm2_2019-04-01_19-34-49.wav,44100,16,60,1,H,512,hil,NULL,NULL,0.895417701387678,NA 
rayol-farm2_2019-04-01_19-36-49.wav,44100,16,60,1,H,512,hil,NULL,NULL,0.895572079147935,NA 
rayol-farm2_2019-04-01_19-38-49.wav,44100,16,60,1,H,512,hil,NULL,NULL,0.89332196178801,NA 
rayol-farm2_2019-04-01_19-40-49.wav,44100,16,60,1,H,512,hil,NULL,NULL,0.898645228256714,NA 
rayol-farm2_2019-04-01_19-42-49.wav,44100,16,60,1,H,512,hil,NULL,NULL,0.898262084900931,NA 
rayol-farm2_2019-04-01_19-44-49.wav,44100,16,60,1,H,512,hil,NULL,NULL,0.894215016345081,NA 
rayol-farm2_2019-04-01_19-46-50.wav,44100,16,60,1,H,512,hil,NULL,NULL,0.891341157089736,NA 
rayol-farm2_2019-04-01_19-48-50.wav,44100,16,60,1,H,512,hil,NULL,NULL,0.896125303567936,NA 
rayol-farm2_2019-04-01_19-50-50.wav,44100,16,60,1,H,512,hil,NULL,NULL,0.900078384024592,NA 
rayol-farm2_2019-04-01_19-52-50.wav,44100,16,60,1,H,512,hil,NULL,NULL,0.899469710609152,NA 
rayol-farm2_2019-04-01_19-54-50.wav,44100,16,60,1,H,512,hil,NULL,NULL,0.899787142399876,NA 
rayol-farm2_2019-04-01_19-56-50.wav,44100,16,60,1,H,512,hil,NULL,NULL,0.896942572568826,NA 
rayol-farm2_2019-04-01_19-58-50.wav,44100,16,60,1,H,512,hil,NULL,NULL,0.896210600997271,NA 
rayol-farm2_2019-04-01_20-00-50.wav,44100,16,60,1,H,512,hil,NULL,NULL,0.897456237239532,NA 
rayol-farm2_2019-04-01_20-02-51.wav,44100,16,60,1,H,512,hil,NULL,NULL,0.89974277228103,NA 
rayol-farm2_2019-04-01_20-04-51.wav,44100,16,60,1,H,512,hil,NULL,NULL,0.899837728877285,NA 
rayol-farm2_2019-04-01_20-06-51.wav,44100,16,60,1,H,512,hil,NULL,NULL,0.898834980784883,NA 
rayol-farm2_2019-04-01_20-08-51.wav,44100,16,60,1,H,512,hil,NULL,NULL,0.89941488223038,NA 
rayol-farm2_2019-04-01_20-10-51.wav,44100,16,60,1,H,512,hil,NULL,NULL,0.898466550056288,NA 
rayol-farm2_2019-04-01_20-12-51.wav,44100,16,60,1,H,512,hil,NULL,NULL,0.896196830977566,NA 
rayol-farm2_2019-04-01_20-14-51.wav,44100,16,60,1,H,512,hil,NULL,NULL,0.897359499171307,NA 
rayol-farm2_2019-04-01_20-16-51.wav,44100,16,60,1,H,512,hil,NULL,NULL,0.90040220612507,NA 
rayol-farm2_2019-04-01_20-18-51.wav,44100,16,60,1,H,512,hil,NULL,NULL,0.898540021483671,NA 
rayol-farm2_2019-04-01_20-20-52.wav,44100,16,60,1,H,512,hil,NULL,NULL,0.897923419314121,NA 
rayol-farm2_2019-04-01_20-22-52.wav,44100,16,60,1,H,512,hil,NULL,NULL,0.899261731362452,NA 
rayol-farm2_2019-04-01_20-24-52.wav,44100,16,60,1,H,512,hil,NULL,NULL,0.89800756749954,NA 
rayol-farm2_2019-04-01_20-26-52.wav,44100,16,60,1,H,512,hil,NULL,NULL,0.900857419957104,NA 
rayol-farm2_2019-04-01_20-28-52.wav,44100,16,60,1,H,512,hil,NULL,NULL,0.901808778711017,NA 
rayol-farm2_2019-04-01_20-30-52.wav,44100,16,60,1,H,512,hil,NULL,NULL,0.900173285340417,NA 
rayol-farm2_2019-04-01_20-32-52.wav,44100,16,60,1,H,512,hil,NULL,NULL,0.898686747970309,NA 
rayol-farm2_2019-04-01_20-34-52.wav,44100,16,60,1,H,512,hil,NULL,NULL,0.898323575357672,NA 
rayol-farm2_2019-04-01_20-36-53.wav,44100,16,60,1,H,512,hil,NULL,NULL,0.898281811000527,NA 
rayol-farm2_2019-04-01_20-38-53.wav,44100,16,60,1,H,512,hil,NULL,NULL,0.895499052596345,NA 
rayol-farm2_2019-04-01_20-40-53.wav,44100,16,60,1,H,512,hil,NULL,NULL,0.895098231192259,NA 
rayol-farm2_2019-04-01_20-42-53.wav,44100,16,60,1,H,512,hil,NULL,NULL,0.897305908598649,NA 
rayol-farm2_2019-04-01_20-44-53.wav,44100,16,60,1,H,512,hil,NULL,NULL,0.897299616213575,NA 
rayol-farm2_2019-04-01_20-46-53.wav,44100,16,60,1,H,512,hil,NULL,NULL,0.897921033451606,NA 
rayol-farm2_2019-04-01_20-48-53.wav,44100,16,60,1,H,512,hil,NULL,NULL,0.896320933866252,NA 
rayol-farm2_2019-04-01_20-50-53.wav,44100,16,60,1,H,512,hil,NULL,NULL,0.894710420565933,NA 
rayol-farm2_2019-04-01_20-52-54.wav,44100,16,60,1,H,512,hil,NULL,NULL,0.894793170502607,NA 
rayol-farm2_2019-04-01_20-54-54.wav,44100,16,60,1,H,512,hil,NULL,NULL,0.89531799418575,NA 
rayol-farm2_2019-04-01_20-56-54.wav,44100,16,60,1,H,512,hil,NULL,NULL,0.894415918153823,NA 
rayol-farm2_2019-04-01_20-58-54.wav,44100,16,60,1,H,512,hil,NULL,NULL,0.894332349276415,NA 
rayol-farm2_2019-04-01_21-00-54.wav,44100,16,60,1,H,512,hil,NULL,NULL,0.89716391244775,NA 
rayol-farm2_2019-04-01_21-02-54.wav,44100,16,60,1,H,512,hil,NULL,NULL,0.89906917020297,NA 
rayol-farm2_2019-04-01_21-04-54.wav,44100,16,60,1,H,512,hil,NULL,NULL,0.897216582319244,NA 
rayol-farm2_2019-04-01_21-06-54.wav,44100,16,60,1,H,512,hil,NULL,NULL,0.894366472911994,NA 
rayol-farm2_2019-04-01_21-08-54.wav,44100,16,60,1,H,512,hil,NULL,NULL,0.892161308564111,NA 
rayol-farm2_2019-04-01_21-10-55.wav,44100,16,60,1,H,512,hil,NULL,NULL,0.896750137731663,NA 
rayol-farm2_2019-04-01_21-12-55.wav,44100,16,60,1,H,512,hil,NULL,NULL,0.898080772986867,NA 
rayol-farm2_2019-04-01_21-14-55.wav,44100,16,60,1,H,512,hil,NULL,NULL,0.897842763113841,NA 
rayol-farm2_2019-04-01_21-16-55.wav,44100,16,60,1,H,512,hil,NULL,NULL,0.896928521550168,NA 
rayol-farm2_2019-04-01_21-18-55.wav,44100,16,60,1,H,512,hil,NULL,NULL,0.898434121072508,NA 
rayol-farm2_2019-04-01_21-20-55.wav,44100,16,60,1,H,512,hil,NULL,NULL,0.895850467408935,NA 
rayol-farm2_2019-04-01_21-22-55.wav,44100,16,60,1,H,512,hil,NULL,NULL,0.897002849603925,NA 
rayol-farm2_2019-04-01_21-24-55.wav,44100,16,60,1,H,512,hil,NULL,NULL,0.898847006691527,NA 
rayol-farm2_2019-04-01_21-26-56.wav,44100,16,60,1,H,512,hil,NULL,NULL,0.898776528805657,NA 
rayol-farm2_2019-04-01_21-28-56.wav,44100,16,60,1,H,512,hil,NULL,NULL,0.899118216085267,NA 
rayol-farm2_2019-04-01_21-30-56.wav,44100,16,60,1,H,512,hil,NULL,NULL,0.897429803690517,NA 
rayol-farm2_2019-04-01_21-32-56.wav,44100,16,60,1,H,512,hil,NULL,NULL,0.894559684013928,NA 
rayol-farm2_2019-04-01_21-34-56.wav,44100,16,60,1,H,512,hil,NULL,NULL,0.895040780780845,NA 
rayol-farm2_2019-04-01_21-36-56.wav,44100,16,60,1,H,512,hil,NULL,NULL,0.895822213207111,NA 
rayol-farm2_2019-04-01_21-38-56.wav,44100,16,60,1,H,512,hil,NULL,NULL,0.89753418729303,NA 
rayol-farm2_2019-04-01_21-40-56.wav,44100,16,60,1,H,512,hil,NULL,NULL,0.89678578887303,NA 
rayol-farm2_2019-04-01_21-42-57.wav,44100,16,60,1,H,512,hil,NULL,NULL,0.89711224825222,NA 
rayol-farm2_2019-04-01_21-44-57.wav,44100,16,60,1,H,512,hil,NULL,NULL,0.897845534006649,NA 
rayol-farm2_2019-04-01_21-46-57.wav,44100,16,60,1,H,512,hil,NULL,NULL,0.89761326534037,NA 
rayol-farm2_2019-04-01_21-48-57.wav,44100,16,60,1,H,512,hil,NULL,NULL,0.894562044568275,NA 
rayol-farm2_2019-04-01_21-50-57.wav,44100,16,60,1,H,512,hil,NULL,NULL,0.886636763752357,NA 
rayol-farm2_2019-04-01_21-52-57.wav,44100,16,60,1,H,512,hil,NULL,NULL,0.896690113947073,NA 
rayol-farm2_2019-04-01_21-54-57.wav,44100,16,60,1,H,512,hil,NULL,NULL,0.898065246131311,NA 
rayol-farm2_2019-04-01_21-56-57.wav,44100,16,60,1,H,512,hil,NULL,NULL,0.897253328123411,NA 
rayol-farm2_2019-04-01_21-58-58.wav,44100,16,60,1,H,512,hil,NULL,NULL,0.896600238001754,NA 
rayol-farm2_2019-04-01_22-00-58.wav,44100,16,60,1,H,512,hil,NULL,NULL,0.897594835656455,NA 
rayol-farm2_2019-04-01_22-02-58.wav,44100,16,60,1,H,512,hil,NULL,NULL,0.894636456152282,NA 
rayol-farm2_2019-04-01_22-04-58.wav,44100,16,60,1,H,512,hil,NULL,NULL,0.894525693577461,NA 
rayol-farm2_2019-04-01_22-06-58.wav,44100,16,60,1,H,512,hil,NULL,NULL,0.89426121175665,NA 
rayol-farm2_2019-04-01_22-08-58.wav,44100,16,60,1,H,512,hil,NULL,NULL,0.897385425272227,NA 
rayol-farm2_2019-04-01_22-10-58.wav,44100,16,60,1,H,512,hil,NULL,NULL,0.895946853382704,NA 
rayol-farm2_2019-04-01_22-12-58.wav,44100,16,60,1,H,512,hil,NULL,NULL,0.892213025071682,NA 
rayol-farm2_2019-04-01_22-14-59.wav,44100,16,60,1,H,512,hil,NULL,NULL,0.896650564079548,NA 
rayol-farm2_2019-04-01_22-16-59.wav,44100,16,60,1,H,512,hil,NULL,NULL,0.893963719383252,NA 
rayol-farm2_2019-04-01_22-18-59.wav,44100,16,60,1,H,512,hil,NULL,NULL,0.892584476631103,NA 
rayol-farm2_2019-04-01_22-20-59.wav,44100,16,60,1,H,512,hil,NULL,NULL,0.897173236388697,NA 
rayol-farm2_2019-04-01_22-22-59.wav,44100,16,60,1,H,512,hil,NULL,NULL,0.897200740879941,NA 
rayol-farm2_2019-04-01_22-24-59.wav,44100,16,60,1,H,512,hil,NULL,NULL,0.894770280682978,NA 
rayol-farm2_2019-04-01_22-26-59.wav,44100,16,60,1,H,512,hil,NULL,NULL,0.887925728275279,NA 
rayol-farm2_2019-04-01_22-28-59.wav,44100,16,60,1,H,512,hil,NULL,NULL,0.890551428541871,NA 
rayol-farm2_2019-04-01_22-31-00.wav,44100,16,60,1,H,512,hil,NULL,NULL,0.888752471252864,NA 
rayol-farm2_2019-04-01_22-33-00.wav,44100,16,60,1,H,512,hil,NULL,NULL,0.892624868948733,NA 
rayol-farm2_2019-04-01_22-35-00.wav,44100,16,60,1,H,512,hil,NULL,NULL,0.897901952644215,NA 
rayol-farm2_2019-04-01_22-37-00.wav,44100,16,60,1,H,512,hil,NULL,NULL,0.884152067001942,NA 
rayol-farm2_2019-04-01_22-39-00.wav,44100,16,60,1,H,512,hil,NULL,NULL,0.891828122799568,NA 
rayol-farm2_2019-04-01_22-41-00.wav,44100,16,60,1,H,512,hil,NULL,NULL,0.897437907972691,NA 
rayol-farm2_2019-04-01_22-43-00.wav,44100,16,60,1,H,512,hil,NULL,NULL,0.894181285739888,NA 
rayol-farm2_2019-04-01_22-45-00.wav,44100,16,60,1,H,512,hil,NULL,NULL,0.893681244296436,NA 
rayol-farm2_2019-04-01_22-47-00.wav,44100,16,60,1,H,512,hil,NULL,NULL,0.893004565926781,NA 
rayol-farm2_2019-04-01_22-49-01.wav,44100,16,60,1,H,512,hil,NULL,NULL,0.894817425176867,NA 
rayol-farm2_2019-04-01_22-51-01.wav,44100,16,60,1,H,512,hil,NULL,NULL,0.897078349227073,NA 
rayol-farm2_2019-04-01_22-53-01.wav,44100,16,60,1,H,512,hil,NULL,NULL,0.897590789368925,NA 
rayol-farm2_2019-04-01_22-55-01.wav,44100,16,60,1,H,512,hil,NULL,NULL,0.895687777620119,NA 
rayol-farm2_2019-04-01_22-57-01.wav,44100,16,60,1,H,512,hil,NULL,NULL,0.878470192440193,NA 
rayol-farm2_2019-04-01_22-59-01.wav,44100,16,60,1,H,512,hil,NULL,NULL,0.884421129723002,NA 
rayol-farm2_2019-04-01_23-01-01.wav,44100,16,60,1,H,512,hil,NULL,NULL,0.894181554677926,NA 
rayol-farm2_2019-04-01_23-03-01.wav,44100,16,60,1,H,512,hil,NULL,NULL,0.894978969640765,NA 
rayol-farm2_2019-04-01_23-05-02.wav,44100,16,60,1,H,512,hil,NULL,NULL,0.894681643026624,NA 
rayol-farm2_2019-04-01_23-07-02.wav,44100,16,60,1,H,512,hil,NULL,NULL,0.895342658861392,NA 
rayol-farm2_2019-04-01_23-09-02.wav,44100,16,60,1,H,512,hil,NULL,NULL,0.894553657240738,NA 
rayol-farm2_2019-04-01_23-11-02.wav,44100,16,60,1,H,512,hil,NULL,NULL,0.894777083457326,NA 
rayol-farm2_2019-04-01_23-13-02.wav,44100,16,60,1,H,512,hil,NULL,NULL,0.895538378366334,NA 
rayol-farm2_2019-04-01_23-15-02.wav,44100,16,60,1,H,512,hil,NULL,NULL,0.892976340212983,NA 
rayol-farm2_2019-04-01_23-17-02.wav,44100,16,60,1,H,512,hil,NULL,NULL,0.890839028120109,NA 
rayol-farm2_2019-04-01_23-19-02.wav,44100,16,60,1,H,512,hil,NULL,NULL,0.897140436631927,NA 
rayol-farm2_2019-04-01_23-21-03.wav,44100,16,60,1,H,512,hil,NULL,NULL,0.897696026550546,NA 
rayol-farm2_2019-04-01_23-23-03.wav,44100,16,60,1,H,512,hil,NULL,NULL,0.898092680825861,NA 
rayol-farm2_2019-04-01_23-25-03.wav,44100,16,60,1,H,512,hil,NULL,NULL,0.895018449265951,NA 
rayol-farm2_2019-04-01_23-27-03.wav,44100,16,60,1,H,512,hil,NULL,NULL,0.897122433881061,NA 
rayol-farm2_2019-04-01_23-29-03.wav,44100,16,60,1,H,512,hil,NULL,NULL,0.89089583730994,NA 
rayol-farm2_2019-04-01_23-31-03.wav,44100,16,60,1,H,512,hil,NULL,NULL,0.878322071090128,NA 
rayol-farm2_2019-04-01_23-33-03.wav,44100,16,60,1,H,512,hil,NULL,NULL,0.893469364530844,NA 
rayol-farm2_2019-04-01_23-35-03.wav,44100,16,60,1,H,512,hil,NULL,NULL,0.89534391472633,NA 
rayol-farm2_2019-04-01_23-37-03.wav,44100,16,60,1,H,512,hil,NULL,NULL,0.895429748081418,NA 
rayol-farm2_2019-04-01_23-39-04.wav,44100,16,60,1,H,512,hil,NULL,NULL,0.896518983629586,NA 
rayol-farm2_2019-04-01_23-41-04.wav,44100,16,60,1,H,512,hil,NULL,NULL,0.889379380451266,NA 
rayol-farm2_2019-04-01_23-43-04.wav,44100,16,60,1,H,512,hil,NULL,NULL,0.895002607002567,NA 
rayol-farm2_2019-04-01_23-45-04.wav,44100,16,60,1,H,512,hil,NULL,NULL,0.893255533458779,NA 
rayol-farm2_2019-04-01_23-47-04.wav,44100,16,60,1,H,512,hil,NULL,NULL,0.897155203635929,NA 
rayol-farm2_2019-04-01_23-49-04.wav,44100,16,60,1,H,512,hil,NULL,NULL,0.897599343775439,NA 
rayol-farm2_2019-04-01_23-51-04.wav,44100,16,60,1,H,512,hil,NULL,NULL,0.896785322830683,NA 
rayol-farm2_2019-04-01_23-53-04.wav,44100,16,60,1,H,512,hil,NULL,NULL,0.891310501531372,NA 
rayol-farm2_2019-04-01_23-55-05.wav,44100,16,60,1,H,512,hil,NULL,NULL,0.894738369354359,NA 
rayol-farm2_2019-04-01_23-57-05.wav,44100,16,60,1,H,512,hil,NULL,NULL,0.895990501196011,NA 
rayol-farm2_2019-04-01_23-59-05.wav,44100,16,60,1,H,512,hil,NULL,NULL,0.893389527312225,NA
