FILENAME,SAMPLINGRATE,BIT,DURATION,CHANNELS,INDEX,FFT_W,MIN_FREQ,MAX_FREQ,LEFT_CHANNEL,RIGHT_CHANNEL
rayol-farm2_2019-05-22_11-02-11.wav,44100,16,60,1,bioacoustic_index,512,2000,8000,2.64704523940094,NA 
rayol-farm2_2019-05-22_11-04-11.wav,44100,16,60,1,bioacoustic_index,512,2000,8000,2.41507646457714,NA 
rayol-farm2_2019-05-22_11-16-12.wav,44100,16,60,1,bioacoustic_index,512,2000,8000,3.10173284946186,NA 
rayol-farm2_2019-05-22_11-18-12.wav,44100,16,60,1,bioacoustic_index,512,2000,8000,2.25838906806853,NA 
rayol-farm2_2019-05-22_11-20-12.wav,44100,16,60,1,bioacoustic_index,512,2000,8000,2.15509951245189,NA 
rayol-farm2_2019-05-22_11-22-12.wav,44100,16,60,1,bioacoustic_index,512,2000,8000,2.30456200604832,NA 
rayol-farm2_2019-05-22_11-24-13.wav,44100,16,60,1,bioacoustic_index,512,2000,8000,2.57406075795535,NA 
rayol-farm2_2019-05-22_11-26-13.wav,44100,16,59.87,1,bioacoustic_index,512,2000,8000,3.50409935620196,NA 
rayol-farm2_2019-05-22_11-28-13.wav,44100,16,60,1,bioacoustic_index,512,2000,8000,2.31463985481575,NA 
rayol-farm2_2019-05-22_11-30-13.wav,44100,16,60,1,bioacoustic_index,512,2000,8000,1.65345442460264,NA 
rayol-farm2_2019-05-22_11-34-13.wav,44100,16,60,1,bioacoustic_index,512,2000,8000,1.74397546253761,NA 
rayol-farm2_2019-05-22_11-36-13.wav,44100,16,60,1,bioacoustic_index,512,2000,8000,2.12469017579796,NA 
rayol-farm2_2019-05-22_11-38-13.wav,44100,16,60,1,bioacoustic_index,512,2000,8000,1.86098839119085,NA 
rayol-farm2_2019-05-22_11-40-14.wav,44100,16,60,1,bioacoustic_index,512,2000,8000,2.3418664978476,NA 
rayol-farm2_2019-05-22_11-42-14.wav,44100,16,60,1,bioacoustic_index,512,2000,8000,2.08833994640585,NA 
rayol-farm2_2019-05-22_11-44-14.wav,44100,16,60,1,bioacoustic_index,512,2000,8000,2.31255702121243,NA 
rayol-farm2_2019-05-22_11-46-14.wav,44100,16,60,1,bioacoustic_index,512,2000,8000,1.6930457350961,NA 
rayol-farm2_2019-05-22_11-48-15.wav,44100,16,60,1,bioacoustic_index,512,2000,8000,2.63133997047749,NA 
rayol-farm2_2019-05-22_11-50-15.wav,44100,16,60,1,bioacoustic_index,512,2000,8000,2.43611861213688,NA 
rayol-farm2_2019-05-22_11-52-15.wav,44100,16,60,1,bioacoustic_index,512,2000,8000,2.4074800932803,NA 
rayol-farm2_2019-05-22_11-54-15.wav,44100,16,60,1,bioacoustic_index,512,2000,8000,2.11117503041765,NA 
rayol-farm2_2019-05-22_11-56-15.wav,44100,16,60,1,bioacoustic_index,512,2000,8000,2.90955288764585,NA 
rayol-farm2_2019-05-22_11-58-15.wav,44100,16,60,1,bioacoustic_index,512,2000,8000,2.72952569178425,NA 
rayol-farm2_2019-05-22_12-00-16.wav,44100,16,60,1,bioacoustic_index,512,2000,8000,1.96104824981469,NA 
rayol-farm2_2019-05-22_12-03-42.wav,44100,16,60,1,bioacoustic_index,512,2000,8000,2.7906450529372,NA 
rayol-farm2_2019-05-22_12-05-42.wav,44100,16,60,1,bioacoustic_index,512,2000,8000,3.26014899647075,NA 
rayol-farm2_2019-05-22_12-07-42.wav,44100,16,60,1,bioacoustic_index,512,2000,8000,5.05215585257007,NA 
rayol-farm2_2019-05-22_12-09-42.wav,44100,16,60,1,bioacoustic_index,512,2000,8000,2.40472502172493,NA 
rayol-farm2_2019-05-22_12-11-42.wav,44100,16,60,1,bioacoustic_index,512,2000,8000,2.90412515130122,NA 
rayol-farm2_2019-05-22_12-13-43.wav,44100,16,60,1,bioacoustic_index,512,2000,8000,3.18460014983081,NA 
rayol-farm2_2019-05-22_12-15-43.wav,44100,16,60,1,bioacoustic_index,512,2000,8000,2.16543734659651,NA 
rayol-farm2_2019-05-22_12-17-43.wav,44100,16,60,1,bioacoustic_index,512,2000,8000,2.55021331485359,NA 
rayol-farm2_2019-05-22_12-19-43.wav,44100,16,60,1,bioacoustic_index,512,2000,8000,3.0605845990244,NA 
rayol-farm2_2019-05-22_12-21-43.wav,44100,16,60,1,bioacoustic_index,512,2000,8000,3.49863175438315,NA 
rayol-farm2_2019-05-22_12-23-43.wav,44100,16,60,1,bioacoustic_index,512,2000,8000,1.77310087524228,NA 
rayol-farm2_2019-05-22_12-25-43.wav,44100,16,60,1,bioacoustic_index,512,2000,8000,1.81192084960931,NA 
rayol-farm2_2019-05-22_12-27-43.wav,44100,16,60,1,bioacoustic_index,512,2000,8000,2.1791803873387,NA 
rayol-farm2_2019-05-22_12-29-44.wav,44100,16,60,1,bioacoustic_index,512,2000,8000,2.80078283139642,NA 
rayol-farm2_2019-05-22_12-31-44.wav,44100,16,60,1,bioacoustic_index,512,2000,8000,1.75014041978385,NA 
rayol-farm2_2019-05-22_12-33-44.wav,44100,16,60,1,bioacoustic_index,512,2000,8000,1.93107915308654,NA 
rayol-farm2_2019-05-22_12-35-44.wav,44100,16,60,1,bioacoustic_index,512,2000,8000,2.4130282334041,NA 
rayol-farm2_2019-05-22_12-37-44.wav,44100,16,60,1,bioacoustic_index,512,2000,8000,2.7963246922799,NA 
rayol-farm2_2019-05-22_12-39-44.wav,44100,16,60,1,bioacoustic_index,512,2000,8000,2.15140260022849,NA 
rayol-farm2_2019-05-22_12-49-45.wav,44100,16,60,1,bioacoustic_index,512,2000,8000,2.42025806679176,NA 
rayol-farm2_2019-05-22_12-51-45.wav,44100,16,60,1,bioacoustic_index,512,2000,8000,2.00740521047212,NA 
rayol-farm2_2019-05-22_12-55-45.wav,44100,16,60,1,bioacoustic_index,512,2000,8000,2.22819076597567,NA 
rayol-farm2_2019-05-22_13-01-46.wav,44100,16,60,1,bioacoustic_index,512,2000,8000,3.27315090137414,NA 
rayol-farm2_2019-05-22_13-03-46.wav,44100,16,60,1,bioacoustic_index,512,2000,8000,3.82048609904968,NA 
rayol-farm2_2019-05-22_13-05-46.wav,44100,16,60,1,bioacoustic_index,512,2000,8000,2.57618831847834,NA 
rayol-farm2_2019-05-22_13-09-46.wav,44100,16,60,1,bioacoustic_index,512,2000,8000,3.3829669701183,NA 
rayol-farm2_2019-05-22_13-11-46.wav,44100,16,60,1,bioacoustic_index,512,2000,8000,2.15956408262034,NA 
rayol-farm2_2019-05-22_13-13-46.wav,44100,16,60,1,bioacoustic_index,512,2000,8000,2.64408174831915,NA 
rayol-farm2_2019-05-22_13-15-46.wav,44100,16,60,1,bioacoustic_index,512,2000,8000,1.98299609885473,NA 
rayol-farm2_2019-05-22_13-17-47.wav,44100,16,60,1,bioacoustic_index,512,2000,8000,3.35081288283431,NA 
rayol-farm2_2019-05-22_13-19-47.wav,44100,16,60,1,bioacoustic_index,512,2000,8000,2.13785195351611,NA 
rayol-farm2_2019-05-22_13-21-47.wav,44100,16,60,1,bioacoustic_index,512,2000,8000,3.15684191158359,NA 
rayol-farm2_2019-05-22_13-23-47.wav,44100,16,60,1,bioacoustic_index,512,2000,8000,2.18641941361684,NA 
rayol-farm2_2019-05-22_13-25-47.wav,44100,16,60,1,bioacoustic_index,512,2000,8000,3.25256720512094,NA 
rayol-farm2_2019-05-22_13-27-47.wav,44100,16,60,1,bioacoustic_index,512,2000,8000,3.39138045038991,NA 
rayol-farm2_2019-05-22_13-29-47.wav,44100,16,60,1,bioacoustic_index,512,2000,8000,2.86297034458823,NA 
rayol-farm2_2019-05-22_13-31-47.wav,44100,16,60,1,bioacoustic_index,512,2000,8000,2.41023145418962,NA 
rayol-farm2_2019-05-22_13-33-48.wav,44100,16,60,1,bioacoustic_index,512,2000,8000,2.07233227548314,NA 
rayol-farm2_2019-05-22_13-35-48.wav,44100,16,60,1,bioacoustic_index,512,2000,8000,2.42734701105425,NA 
rayol-farm2_2019-05-22_13-37-48.wav,44100,16,60,1,bioacoustic_index,512,2000,8000,2.95095223237824,NA 
rayol-farm2_2019-05-22_13-39-48.wav,44100,16,60,1,bioacoustic_index,512,2000,8000,2.3131220374527,NA 
rayol-farm2_2019-05-22_13-41-48.wav,44100,16,60,1,bioacoustic_index,512,2000,8000,3.15873608589442,NA 
rayol-farm2_2019-05-22_13-43-48.wav,44100,16,60,1,bioacoustic_index,512,2000,8000,2.72728426316198,NA 
rayol-farm2_2019-05-22_13-45-48.wav,44100,16,60,1,bioacoustic_index,512,2000,8000,3.52453465086452,NA 
rayol-farm2_2019-05-22_13-47-48.wav,44100,16,60,1,bioacoustic_index,512,2000,8000,2.59853649489428,NA 
rayol-farm2_2019-05-22_13-49-49.wav,44100,16,60,1,bioacoustic_index,512,2000,8000,2.61013409670111,NA 
rayol-farm2_2019-05-22_13-51-49.wav,44100,16,60,1,bioacoustic_index,512,2000,8000,2.01275581061621,NA 
rayol-farm2_2019-05-22_13-53-49.wav,44100,16,60,1,bioacoustic_index,512,2000,8000,2.82272528715022,NA 
rayol-farm2_2019-05-22_13-55-49.wav,44100,16,60,1,bioacoustic_index,512,2000,8000,2.00584274900564,NA 
rayol-farm2_2019-05-22_13-57-49.wav,44100,16,60,1,bioacoustic_index,512,2000,8000,1.90735913935179,NA 
rayol-farm2_2019-05-22_13-59-49.wav,44100,16,60,1,bioacoustic_index,512,2000,8000,1.84957351298415,NA 
rayol-farm2_2019-05-22_14-01-49.wav,44100,16,60,1,bioacoustic_index,512,2000,8000,2.34028183043083,NA 
rayol-farm2_2019-05-22_14-03-49.wav,44100,16,60,1,bioacoustic_index,512,2000,8000,4.12102267955036,NA 
rayol-farm2_2019-05-22_14-05-50.wav,44100,16,60,1,bioacoustic_index,512,2000,8000,1.91440838866204,NA 
rayol-farm2_2019-05-22_14-07-50.wav,44100,16,60,1,bioacoustic_index,512,2000,8000,1.71496504498345,NA 
rayol-farm2_2019-05-22_14-09-50.wav,44100,16,60,1,bioacoustic_index,512,2000,8000,3.47895289748666,NA 
rayol-farm2_2019-05-22_14-11-50.wav,44100,16,60,1,bioacoustic_index,512,2000,8000,2.35433916521266,NA 
rayol-farm2_2019-05-22_14-13-50.wav,44100,16,60,1,bioacoustic_index,512,2000,8000,2.03696852980875,NA 
rayol-farm2_2019-05-22_14-15-50.wav,44100,16,60,1,bioacoustic_index,512,2000,8000,1.8666949988201,NA 
rayol-farm2_2019-05-22_14-17-50.wav,44100,16,60,1,bioacoustic_index,512,2000,8000,1.69692921044002,NA 
rayol-farm2_2019-05-22_14-19-50.wav,44100,16,60,1,bioacoustic_index,512,2000,8000,2.76529823565317,NA 
rayol-farm2_2019-05-22_14-21-51.wav,44100,16,60,1,bioacoustic_index,512,2000,8000,2.03862825289214,NA 
rayol-farm2_2019-05-22_14-23-51.wav,44100,16,60,1,bioacoustic_index,512,2000,8000,3.03780686820935,NA 
rayol-farm2_2019-05-22_14-25-51.wav,44100,16,60,1,bioacoustic_index,512,2000,8000,2.37956157007906,NA 
rayol-farm2_2019-05-22_14-27-51.wav,44100,16,60,1,bioacoustic_index,512,2000,8000,2.1948939467826,NA 
rayol-farm2_2019-05-22_14-29-51.wav,44100,16,60,1,bioacoustic_index,512,2000,8000,2.44286017380179,NA 
rayol-farm2_2019-05-22_14-31-51.wav,44100,16,60,1,bioacoustic_index,512,2000,8000,2.50532809879792,NA 
rayol-farm2_2019-05-22_14-33-51.wav,44100,16,60,1,bioacoustic_index,512,2000,8000,2.22448856388481,NA 
rayol-farm2_2019-05-22_14-55-53.wav,44100,16,60,1,bioacoustic_index,512,2000,8000,1.62510384824499,NA 
rayol-farm2_2019-05-22_14-59-53.wav,44100,16,60,1,bioacoustic_index,512,2000,8000,1.57291269154741,NA 
rayol-farm2_2019-05-22_15-01-53.wav,44100,16,60,1,bioacoustic_index,512,2000,8000,1.88098074718211,NA 
rayol-farm2_2019-05-22_15-03-53.wav,44100,16,60,1,bioacoustic_index,512,2000,8000,2.12318912471551,NA 
rayol-farm2_2019-05-22_15-07-53.wav,44100,16,60,1,bioacoustic_index,512,2000,8000,1.76101318551426,NA 
rayol-farm2_2019-05-22_15-09-53.wav,44100,16,60,1,bioacoustic_index,512,2000,8000,1.66536521238129,NA 
rayol-farm2_2019-05-22_15-13-54.wav,44100,16,60,1,bioacoustic_index,512,2000,8000,2.49313082163413,NA 
rayol-farm2_2019-05-22_15-15-54.wav,44100,16,60,1,bioacoustic_index,512,2000,8000,1.6354422235459,NA 
rayol-farm2_2019-05-22_15-17-54.wav,44100,16,60,1,bioacoustic_index,512,2000,8000,1.60133020482954,NA 
rayol-farm2_2019-05-22_15-19-54.wav,44100,16,60,1,bioacoustic_index,512,2000,8000,2.13263518496813,NA 
rayol-farm2_2019-05-22_15-21-54.wav,44100,16,60,1,bioacoustic_index,512,2000,8000,1.91874149685362,NA 
rayol-farm2_2019-05-22_15-23-54.wav,44100,16,60,1,bioacoustic_index,512,2000,8000,2.42119082679526,NA 
rayol-farm2_2019-05-22_15-25-54.wav,44100,16,60,1,bioacoustic_index,512,2000,8000,1.90369279911607,NA 
rayol-farm2_2019-05-22_15-27-55.wav,44100,16,60,1,bioacoustic_index,512,2000,8000,1.81682761752064,NA 
rayol-farm2_2019-05-22_15-29-55.wav,44100,16,60,1,bioacoustic_index,512,2000,8000,1.76256660615881,NA 
rayol-farm2_2019-05-22_15-31-55.wav,44100,16,60,1,bioacoustic_index,512,2000,8000,1.64373860194318,NA 
rayol-farm2_2019-05-22_15-33-55.wav,44100,16,60,1,bioacoustic_index,512,2000,8000,1.6452473851625,NA 
rayol-farm2_2019-05-22_15-35-55.wav,44100,16,60,1,bioacoustic_index,512,2000,8000,1.72045526887153,NA 
rayol-farm2_2019-05-22_15-37-55.wav,44100,16,60,1,bioacoustic_index,512,2000,8000,1.87615761900381,NA 
rayol-farm2_2019-05-22_15-39-55.wav,44100,16,60,1,bioacoustic_index,512,2000,8000,2.548330131201,NA 
rayol-farm2_2019-05-22_15-41-55.wav,44100,16,60,1,bioacoustic_index,512,2000,8000,3.40955682530932,NA 
rayol-farm2_2019-05-22_15-43-56.wav,44100,16,60,1,bioacoustic_index,512,2000,8000,3.68030118833425,NA 
rayol-farm2_2019-05-22_15-45-56.wav,44100,16,60,1,bioacoustic_index,512,2000,8000,3.1853107892553,NA 
rayol-farm2_2019-05-22_15-47-56.wav,44100,16,60,1,bioacoustic_index,512,2000,8000,1.95493987217389,NA 
rayol-farm2_2019-05-22_15-49-56.wav,44100,16,60,1,bioacoustic_index,512,2000,8000,2.84816306206444,NA 
rayol-farm2_2019-05-22_15-51-56.wav,44100,16,60,1,bioacoustic_index,512,2000,8000,2.14756103316332,NA 
rayol-farm2_2019-05-22_15-53-56.wav,44100,16,60,1,bioacoustic_index,512,2000,8000,2.98097335970512,NA 
rayol-farm2_2019-05-22_15-55-56.wav,44100,16,60,1,bioacoustic_index,512,2000,8000,2.78066178974295,NA 
rayol-farm2_2019-05-22_15-57-56.wav,44100,16,60,1,bioacoustic_index,512,2000,8000,3.0781575956506,NA 
rayol-farm2_2019-05-22_15-59-56.wav,44100,16,60,1,bioacoustic_index,512,2000,8000,4.04163662664356,NA 
rayol-farm2_2019-05-22_16-01-57.wav,44100,16,60,1,bioacoustic_index,512,2000,8000,2.51537910819761,NA 
rayol-farm2_2019-05-22_16-03-57.wav,44100,16,60,1,bioacoustic_index,512,2000,8000,1.83499544311862,NA 
rayol-farm2_2019-05-22_16-05-57.wav,44100,16,60,1,bioacoustic_index,512,2000,8000,1.66813872080729,NA 
rayol-farm2_2019-05-22_16-07-57.wav,44100,16,60,1,bioacoustic_index,512,2000,8000,2.02260549566225,NA 
rayol-farm2_2019-05-22_16-09-57.wav,44100,16,60,1,bioacoustic_index,512,2000,8000,1.67749864055822,NA 
rayol-farm2_2019-05-22_16-11-57.wav,44100,16,60,1,bioacoustic_index,512,2000,8000,1.80964502287266,NA 
rayol-farm2_2019-05-22_16-13-57.wav,44100,16,60,1,bioacoustic_index,512,2000,8000,1.52036033260459,NA 
rayol-farm2_2019-05-22_16-15-57.wav,44100,16,60,1,bioacoustic_index,512,2000,8000,3.45347050066583,NA 
rayol-farm2_2019-05-22_16-17-58.wav,44100,16,60,1,bioacoustic_index,512,2000,8000,1.52378995875784,NA 
rayol-farm2_2019-05-22_16-19-58.wav,44100,16,60,1,bioacoustic_index,512,2000,8000,1.63425095617787,NA 
rayol-farm2_2019-05-22_16-21-58.wav,44100,16,60,1,bioacoustic_index,512,2000,8000,1.69145309281757,NA 
rayol-farm2_2019-05-22_16-23-58.wav,44100,16,60,1,bioacoustic_index,512,2000,8000,1.69315983199494,NA 
rayol-farm2_2019-05-22_16-25-58.wav,44100,16,60,1,bioacoustic_index,512,2000,8000,1.73810083586352,NA 
rayol-farm2_2019-05-22_16-27-58.wav,44100,16,60,1,bioacoustic_index,512,2000,8000,1.84515225192102,NA 
rayol-farm2_2019-05-22_16-29-58.wav,44100,16,60,1,bioacoustic_index,512,2000,8000,1.70437658540031,NA 
rayol-farm2_2019-05-22_16-31-58.wav,44100,16,60,1,bioacoustic_index,512,2000,8000,1.65133524285401,NA 
rayol-farm2_2019-05-22_16-33-59.wav,44100,16,60,1,bioacoustic_index,512,2000,8000,1.76698448938006,NA 
rayol-farm2_2019-05-22_16-35-59.wav,44100,16,60,1,bioacoustic_index,512,2000,8000,1.75886558251782,NA 
rayol-farm2_2019-05-22_16-37-59.wav,44100,16,60,1,bioacoustic_index,512,2000,8000,1.91966463491367,NA 
rayol-farm2_2019-05-22_16-39-59.wav,44100,16,60,1,bioacoustic_index,512,2000,8000,1.87331048955246,NA 
rayol-farm2_2019-05-22_16-41-59.wav,44100,16,60,1,bioacoustic_index,512,2000,8000,1.66207305761186,NA 
rayol-farm2_2019-05-22_16-43-59.wav,44100,16,60,1,bioacoustic_index,512,2000,8000,1.66214537649822,NA 
rayol-farm2_2019-05-22_16-45-59.wav,44100,16,60,1,bioacoustic_index,512,2000,8000,1.6712480403035,NA 
rayol-farm2_2019-05-22_16-47-59.wav,44100,16,60,1,bioacoustic_index,512,2000,8000,1.86553750430734,NA 
rayol-farm2_2019-05-22_16-50-00.wav,44100,16,60,1,bioacoustic_index,512,2000,8000,1.86255816945841,NA 
rayol-farm2_2019-05-22_16-52-00.wav,44100,16,60,1,bioacoustic_index,512,2000,8000,1.85789904898909,NA 
rayol-farm2_2019-05-22_16-54-00.wav,44100,16,60,1,bioacoustic_index,512,2000,8000,1.77540666905692,NA 
rayol-farm2_2019-05-22_16-56-00.wav,44100,16,60,1,bioacoustic_index,512,2000,8000,2.20781819097876,NA 
rayol-farm2_2019-05-22_16-58-00.wav,44100,16,60,1,bioacoustic_index,512,2000,8000,1.67467108757924,NA 
rayol-farm2_2019-05-22_17-00-00.wav,44100,16,60,1,bioacoustic_index,512,2000,8000,1.5825897588641,NA 
rayol-farm2_2019-05-22_17-02-00.wav,44100,16,60,1,bioacoustic_index,512,2000,8000,2.74775663502597,NA 
rayol-farm2_2019-05-22_17-04-00.wav,44100,16,60,1,bioacoustic_index,512,2000,8000,2.32790257734896,NA 
rayol-farm2_2019-05-22_17-06-01.wav,44100,16,60,1,bioacoustic_index,512,2000,8000,1.49338571227883,NA 
rayol-farm2_2019-05-22_17-08-01.wav,44100,16,60,1,bioacoustic_index,512,2000,8000,1.78339268714868,NA 
rayol-farm2_2019-05-22_17-10-01.wav,44100,16,60,1,bioacoustic_index,512,2000,8000,1.9359612768812,NA 
rayol-farm2_2019-05-22_17-12-01.wav,44100,16,60,1,bioacoustic_index,512,2000,8000,2.21500628351493,NA 
rayol-farm2_2019-05-22_17-14-01.wav,44100,16,60,1,bioacoustic_index,512,2000,8000,1.97578322982458,NA 
rayol-farm2_2019-05-22_17-16-01.wav,44100,16,60,1,bioacoustic_index,512,2000,8000,2.45982447290719,NA 
rayol-farm2_2019-05-22_17-18-01.wav,44100,16,60,1,bioacoustic_index,512,2000,8000,2.67749391449017,NA 
rayol-farm2_2019-05-22_17-20-01.wav,44100,16,60,1,bioacoustic_index,512,2000,8000,2.16300631442359,NA 
rayol-farm2_2019-05-22_17-22-01.wav,44100,16,60,1,bioacoustic_index,512,2000,8000,1.970216546055,NA 
rayol-farm2_2019-05-22_17-24-02.wav,44100,16,60,1,bioacoustic_index,512,2000,8000,1.51281953444965,NA 
rayol-farm2_2019-05-22_17-26-02.wav,44100,16,60,1,bioacoustic_index,512,2000,8000,1.85528960570957,NA 
rayol-farm2_2019-05-22_17-28-02.wav,44100,16,60,1,bioacoustic_index,512,2000,8000,2.18119424902287,NA 
rayol-farm2_2019-05-22_17-30-02.wav,44100,16,60,1,bioacoustic_index,512,2000,8000,1.76440645140202,NA 
rayol-farm2_2019-05-22_17-32-02.wav,44100,16,60,1,bioacoustic_index,512,2000,8000,2.37732508618558,NA 
rayol-farm2_2019-05-22_17-34-02.wav,44100,16,60,1,bioacoustic_index,512,2000,8000,2.99343238098225,NA 
rayol-farm2_2019-05-22_17-36-02.wav,44100,16,60,1,bioacoustic_index,512,2000,8000,2.25207760584197,NA 
rayol-farm2_2019-05-22_17-38-02.wav,44100,16,60,1,bioacoustic_index,512,2000,8000,2.9733551351607,NA 
rayol-farm2_2019-05-22_17-40-03.wav,44100,16,60,1,bioacoustic_index,512,2000,8000,1.77504697902533,NA 
rayol-farm2_2019-05-22_17-42-03.wav,44100,16,60,1,bioacoustic_index,512,2000,8000,1.73656109819002,NA 
rayol-farm2_2019-05-22_17-44-03.wav,44100,16,60,1,bioacoustic_index,512,2000,8000,3.33717265129115,NA 
rayol-farm2_2019-05-22_17-46-03.wav,44100,16,60,1,bioacoustic_index,512,2000,8000,2.26413045603888,NA 
rayol-farm2_2019-05-22_17-48-03.wav,44100,16,60,1,bioacoustic_index,512,2000,8000,1.49132110983047,NA 
rayol-farm2_2019-05-22_17-50-03.wav,44100,16,60,1,bioacoustic_index,512,2000,8000,1.39237294499683,NA 
rayol-farm2_2019-05-22_17-52-03.wav,44100,16,60,1,bioacoustic_index,512,2000,8000,1.52465850530786,NA 
rayol-farm2_2019-05-22_17-54-03.wav,44100,16,60,1,bioacoustic_index,512,2000,8000,2.44087301916239,NA 
rayol-farm2_2019-05-22_17-56-04.wav,44100,16,60,1,bioacoustic_index,512,2000,8000,1.50346244986975,NA 
rayol-farm2_2019-05-22_17-58-04.wav,44100,16,60,1,bioacoustic_index,512,2000,8000,1.35388429712807,NA 
rayol-farm2_2019-05-22_18-00-04.wav,44100,16,60,1,bioacoustic_index,512,2000,8000,1.8288707103774,NA 
rayol-farm2_2019-05-22_18-02-04.wav,44100,16,60,1,bioacoustic_index,512,2000,8000,1.7153993979322,NA 
rayol-farm2_2019-05-22_18-04-04.wav,44100,16,60,1,bioacoustic_index,512,2000,8000,1.71612881504369,NA 
rayol-farm2_2019-05-22_18-06-04.wav,44100,16,60,1,bioacoustic_index,512,2000,8000,1.58739990696873,NA 
rayol-farm2_2019-05-22_18-08-04.wav,44100,16,60,1,bioacoustic_index,512,2000,8000,3.05305198258672,NA 
rayol-farm2_2019-05-22_18-10-04.wav,44100,16,60,1,bioacoustic_index,512,2000,8000,2.97301608634528,NA 
rayol-farm2_2019-05-22_18-12-05.wav,44100,16,60,1,bioacoustic_index,512,2000,8000,2.71582467897769,NA 
rayol-farm2_2019-05-22_18-14-05.wav,44100,16,60,1,bioacoustic_index,512,2000,8000,3.48373465913435,NA 
rayol-farm2_2019-05-22_18-16-05.wav,44100,16,60,1,bioacoustic_index,512,2000,8000,2.39828417235011,NA 
rayol-farm2_2019-05-22_18-18-05.wav,44100,16,60,1,bioacoustic_index,512,2000,8000,2.70605494601822,NA 
rayol-farm2_2019-05-22_18-20-05.wav,44100,16,60,1,bioacoustic_index,512,2000,8000,2.18157268622763,NA 
rayol-farm2_2019-05-22_18-22-05.wav,44100,16,60,1,bioacoustic_index,512,2000,8000,2.73179105819243,NA 
rayol-farm2_2019-05-22_18-24-05.wav,44100,16,60,1,bioacoustic_index,512,2000,8000,1.77023622055901,NA 
rayol-farm2_2019-05-22_18-26-05.wav,44100,16,60,1,bioacoustic_index,512,2000,8000,2.50099570388031,NA 
rayol-farm2_2019-05-22_18-28-05.wav,44100,16,60,1,bioacoustic_index,512,2000,8000,2.75151465111975,NA 
rayol-farm2_2019-05-22_18-30-06.wav,44100,16,60,1,bioacoustic_index,512,2000,8000,1.70867652256064,NA 
rayol-farm2_2019-05-22_18-32-06.wav,44100,16,60,1,bioacoustic_index,512,2000,8000,2.03968536041418,NA 
rayol-farm2_2019-05-22_18-34-06.wav,44100,16,60,1,bioacoustic_index,512,2000,8000,1.83540088116278,NA 
rayol-farm2_2019-05-22_18-36-06.wav,44100,16,60,1,bioacoustic_index,512,2000,8000,2.45108193169105,NA 
rayol-farm2_2019-05-22_18-38-06.wav,44100,16,60,1,bioacoustic_index,512,2000,8000,1.78164813377125,NA 
rayol-farm2_2019-05-22_18-40-06.wav,44100,16,60,1,bioacoustic_index,512,2000,8000,2.72046917263449,NA 
rayol-farm2_2019-05-22_18-42-06.wav,44100,16,60,1,bioacoustic_index,512,2000,8000,3.18923375468821,NA 
rayol-farm2_2019-05-22_18-44-06.wav,44100,16,60,1,bioacoustic_index,512,2000,8000,2.54555804888128,NA 
rayol-farm2_2019-05-22_18-46-07.wav,44100,16,60,1,bioacoustic_index,512,2000,8000,3.06776991377329,NA 
rayol-farm2_2019-05-22_18-48-07.wav,44100,16,60,1,bioacoustic_index,512,2000,8000,1.7705461933703,NA 
rayol-farm2_2019-05-22_18-50-07.wav,44100,16,60,1,bioacoustic_index,512,2000,8000,1.65547965412181,NA 
rayol-farm2_2019-05-22_18-52-07.wav,44100,16,60,1,bioacoustic_index,512,2000,8000,1.8678878836709,NA 
rayol-farm2_2019-05-22_18-54-07.wav,44100,16,60,1,bioacoustic_index,512,2000,8000,1.9884687509194,NA 
rayol-farm2_2019-05-22_18-56-07.wav,44100,16,60,1,bioacoustic_index,512,2000,8000,1.88979482304673,NA 
rayol-farm2_2019-05-22_18-58-07.wav,44100,16,60,1,bioacoustic_index,512,2000,8000,2.19716470149557,NA 
rayol-farm2_2019-05-22_19-00-07.wav,44100,16,60,1,bioacoustic_index,512,2000,8000,2.64574790323418,NA 
rayol-farm2_2019-05-22_19-02-08.wav,44100,16,60,1,bioacoustic_index,512,2000,8000,3.5942954149578,NA 
rayol-farm2_2019-05-22_19-04-08.wav,44100,16,60,1,bioacoustic_index,512,2000,8000,1.30276844337768,NA 
rayol-farm2_2019-05-22_19-06-08.wav,44100,16,60,1,bioacoustic_index,512,2000,8000,1.81133342805006,NA 
rayol-farm2_2019-05-22_19-08-08.wav,44100,16,60,1,bioacoustic_index,512,2000,8000,3.06729556581067,NA 
rayol-farm2_2019-05-22_19-10-08.wav,44100,16,60,1,bioacoustic_index,512,2000,8000,2.89053572407947,NA 
rayol-farm2_2019-05-22_19-12-08.wav,44100,16,60,1,bioacoustic_index,512,2000,8000,3.51791038362974,NA 
rayol-farm2_2019-05-22_19-14-08.wav,44100,16,60,1,bioacoustic_index,512,2000,8000,3.55015981820951,NA 
rayol-farm2_2019-05-22_19-16-08.wav,44100,16,60,1,bioacoustic_index,512,2000,8000,3.26340621430426,NA 
rayol-farm2_2019-05-22_19-18-09.wav,44100,16,60,1,bioacoustic_index,512,2000,8000,1.97929602666291,NA 
rayol-farm2_2019-05-22_19-20-09.wav,44100,16,60,1,bioacoustic_index,512,2000,8000,3.54481729893871,NA 
rayol-farm2_2019-05-22_19-22-09.wav,44100,16,60,1,bioacoustic_index,512,2000,8000,2.12674311490045,NA 
rayol-farm2_2019-05-22_19-24-09.wav,44100,16,60,1,bioacoustic_index,512,2000,8000,1.76532428938709,NA 
rayol-farm2_2019-05-22_19-26-09.wav,44100,16,60,1,bioacoustic_index,512,2000,8000,1.43947383128189,NA 
rayol-farm2_2019-05-22_19-28-09.wav,44100,16,60,1,bioacoustic_index,512,2000,8000,1.57254992418448,NA 
rayol-farm2_2019-05-22_19-30-09.wav,44100,16,60,1,bioacoustic_index,512,2000,8000,2.4230203414379,NA 
rayol-farm2_2019-05-22_19-32-09.wav,44100,16,60,1,bioacoustic_index,512,2000,8000,2.2401508234578,NA 
rayol-farm2_2019-05-22_19-34-09.wav,44100,16,60,1,bioacoustic_index,512,2000,8000,2.7494638104625,NA 
rayol-farm2_2019-05-22_19-36-10.wav,44100,16,60,1,bioacoustic_index,512,2000,8000,2.06023403653314,NA 
rayol-farm2_2019-05-22_19-38-10.wav,44100,16,60,1,bioacoustic_index,512,2000,8000,1.83767965191709,NA 
rayol-farm2_2019-05-22_19-40-10.wav,44100,16,60,1,bioacoustic_index,512,2000,8000,2.00735568139601,NA 
rayol-farm2_2019-05-22_19-42-10.wav,44100,16,60,1,bioacoustic_index,512,2000,8000,2.98170465417807,NA 
rayol-farm2_2019-05-22_19-44-10.wav,44100,16,60,1,bioacoustic_index,512,2000,8000,1.84678708305799,NA 
rayol-farm2_2019-05-22_19-46-10.wav,44100,16,60,1,bioacoustic_index,512,2000,8000,2.95257554220099,NA 
rayol-farm2_2019-05-22_19-48-10.wav,44100,16,60,1,bioacoustic_index,512,2000,8000,2.17322451459058,NA 
rayol-farm2_2019-05-22_19-50-10.wav,44100,16,60,1,bioacoustic_index,512,2000,8000,2.00666270927331,NA 
rayol-farm2_2019-05-22_19-52-11.wav,44100,16,60,1,bioacoustic_index,512,2000,8000,1.62836883592312,NA 
rayol-farm2_2019-05-22_19-54-11.wav,44100,16,60,1,bioacoustic_index,512,2000,8000,3.39167242027193,NA 
rayol-farm2_2019-05-22_19-56-11.wav,44100,16,60,1,bioacoustic_index,512,2000,8000,1.63198982238337,NA 
rayol-farm2_2019-05-22_19-58-11.wav,44100,16,60,1,bioacoustic_index,512,2000,8000,1.60309394979431,NA 
rayol-farm2_2019-05-22_20-00-11.wav,44100,16,60,1,bioacoustic_index,512,2000,8000,2.01998036540761,NA 
rayol-farm2_2019-05-22_20-02-11.wav,44100,16,60,1,bioacoustic_index,512,2000,8000,1.95923268770233,NA 
rayol-farm2_2019-05-22_20-04-11.wav,44100,16,60,1,bioacoustic_index,512,2000,8000,2.49109131217767,NA 
rayol-farm2_2019-05-22_20-06-11.wav,44100,16,60,1,bioacoustic_index,512,2000,8000,3.57750958661565,NA 
rayol-farm2_2019-05-22_20-08-12.wav,44100,16,60,1,bioacoustic_index,512,2000,8000,2.66362507447317,NA 
rayol-farm2_2019-05-22_20-10-12.wav,44100,16,60,1,bioacoustic_index,512,2000,8000,1.53460381432565,NA 
rayol-farm2_2019-05-22_20-12-12.wav,44100,16,60,1,bioacoustic_index,512,2000,8000,1.68093726587901,NA 
rayol-farm2_2019-05-22_20-14-12.wav,44100,16,60,1,bioacoustic_index,512,2000,8000,2.06680601508158,NA 
rayol-farm2_2019-05-22_20-16-12.wav,44100,16,60,1,bioacoustic_index,512,2000,8000,2.64101540159,NA 
rayol-farm2_2019-05-22_20-18-12.wav,44100,16,60,1,bioacoustic_index,512,2000,8000,2.63397515715733,NA 
rayol-farm2_2019-05-22_20-20-12.wav,44100,16,60,1,bioacoustic_index,512,2000,8000,2.75288208374177,NA 
rayol-farm2_2019-05-22_20-22-12.wav,44100,16,60,1,bioacoustic_index,512,2000,8000,2.66838965294929,NA 
rayol-farm2_2019-05-22_20-24-13.wav,44100,16,60,1,bioacoustic_index,512,2000,8000,2.59627047790871,NA 
rayol-farm2_2019-05-22_20-26-13.wav,44100,16,60,1,bioacoustic_index,512,2000,8000,1.55847337707464,NA 
rayol-farm2_2019-05-22_20-28-13.wav,44100,16,60,1,bioacoustic_index,512,2000,8000,1.50529474425678,NA 
rayol-farm2_2019-05-22_20-30-13.wav,44100,16,60,1,bioacoustic_index,512,2000,8000,1.6904351963833,NA 
rayol-farm2_2019-05-22_20-32-13.wav,44100,16,60,1,bioacoustic_index,512,2000,8000,2.62901432879822,NA 
rayol-farm2_2019-05-22_20-34-13.wav,44100,16,60,1,bioacoustic_index,512,2000,8000,3.76858824325086,NA 
rayol-farm2_2019-05-22_20-36-13.wav,44100,16,60,1,bioacoustic_index,512,2000,8000,3.14825286735921,NA 
rayol-farm2_2019-05-22_20-38-13.wav,44100,16,60,1,bioacoustic_index,512,2000,8000,2.00191587557759,NA 
rayol-farm2_2019-05-22_20-40-13.wav,44100,16,60,1,bioacoustic_index,512,2000,8000,2.9773463864735,NA 
rayol-farm2_2019-05-22_20-42-14.wav,44100,16,60,1,bioacoustic_index,512,2000,8000,2.55499917547345,NA 
rayol-farm2_2019-05-22_20-44-14.wav,44100,16,60,1,bioacoustic_index,512,2000,8000,2.0708317460156,NA 
rayol-farm2_2019-05-22_20-46-14.wav,44100,16,60,1,bioacoustic_index,512,2000,8000,4.1313811744008,NA 
rayol-farm2_2019-05-22_20-48-14.wav,44100,16,60,1,bioacoustic_index,512,2000,8000,3.63638202838459,NA 
rayol-farm2_2019-05-22_20-50-14.wav,44100,16,60,1,bioacoustic_index,512,2000,8000,2.61250343861658,NA 
rayol-farm2_2019-05-22_20-52-14.wav,44100,16,60,1,bioacoustic_index,512,2000,8000,1.65013498439851,NA 
rayol-farm2_2019-05-22_20-54-14.wav,44100,16,60,1,bioacoustic_index,512,2000,8000,3.851414602553,NA 
rayol-farm2_2019-05-22_20-56-14.wav,44100,16,60,1,bioacoustic_index,512,2000,8000,4.24348321519914,NA 
rayol-farm2_2019-05-22_20-58-15.wav,44100,16,60,1,bioacoustic_index,512,2000,8000,2.56630848519335,NA 
rayol-farm2_2019-05-22_21-00-15.wav,44100,16,60,1,bioacoustic_index,512,2000,8000,2.81753339014112,NA 
rayol-farm2_2019-05-22_21-02-15.wav,44100,16,60,1,bioacoustic_index,512,2000,8000,1.56531132416877,NA 
rayol-farm2_2019-05-22_21-04-15.wav,44100,16,60,1,bioacoustic_index,512,2000,8000,1.82388106939362,NA 
rayol-farm2_2019-05-22_21-06-15.wav,44100,16,60,1,bioacoustic_index,512,2000,8000,1.68819820419784,NA 
rayol-farm2_2019-05-22_21-08-15.wav,44100,16,60,1,bioacoustic_index,512,2000,8000,2.69062488595362,NA 
rayol-farm2_2019-05-22_21-10-15.wav,44100,16,60,1,bioacoustic_index,512,2000,8000,2.34743184368405,NA 
rayol-farm2_2019-05-22_21-12-15.wav,44100,16,60,1,bioacoustic_index,512,2000,8000,2.51416760577643,NA 
rayol-farm2_2019-05-22_21-14-16.wav,44100,16,60,1,bioacoustic_index,512,2000,8000,2.47976545987812,NA 
rayol-farm2_2019-05-22_21-16-16.wav,44100,16,60,1,bioacoustic_index,512,2000,8000,1.8298593745557,NA 
rayol-farm2_2019-05-22_21-18-16.wav,44100,16,60,1,bioacoustic_index,512,2000,8000,2.61178754661919,NA 
rayol-farm2_2019-05-22_21-20-16.wav,44100,16,60,1,bioacoustic_index,512,2000,8000,1.80796390309177,NA 
rayol-farm2_2019-05-22_21-22-16.wav,44100,16,60,1,bioacoustic_index,512,2000,8000,2.45947518792448,NA 
rayol-farm2_2019-05-22_21-24-16.wav,44100,16,60,1,bioacoustic_index,512,2000,8000,1.88496184435715,NA 
rayol-farm2_2019-05-22_21-26-16.wav,44100,16,60,1,bioacoustic_index,512,2000,8000,2.00247087912764,NA 
rayol-farm2_2019-05-22_21-28-16.wav,44100,16,60,1,bioacoustic_index,512,2000,8000,2.52899765407681,NA 
rayol-farm2_2019-05-22_21-30-17.wav,44100,16,60,1,bioacoustic_index,512,2000,8000,1.92963019033558,NA 
rayol-farm2_2019-05-22_21-32-17.wav,44100,16,60,1,bioacoustic_index,512,2000,8000,1.59656252649519,NA 
rayol-farm2_2019-05-22_21-34-17.wav,44100,16,60,1,bioacoustic_index,512,2000,8000,1.397717949568,NA 
rayol-farm2_2019-05-22_21-36-17.wav,44100,16,60,1,bioacoustic_index,512,2000,8000,1.47659803733239,NA 
rayol-farm2_2019-05-22_21-38-17.wav,44100,16,60,1,bioacoustic_index,512,2000,8000,1.41453757913941,NA 
rayol-farm2_2019-05-22_21-40-17.wav,44100,16,60,1,bioacoustic_index,512,2000,8000,1.51434785565938,NA 
rayol-farm2_2019-05-22_21-42-17.wav,44100,16,60,1,bioacoustic_index,512,2000,8000,1.44104841439571,NA 
rayol-farm2_2019-05-22_21-44-17.wav,44100,16,60,1,bioacoustic_index,512,2000,8000,1.42677227071793,NA 
rayol-farm2_2019-05-22_21-46-17.wav,44100,16,60,1,bioacoustic_index,512,2000,8000,1.39343846857586,NA 
rayol-farm2_2019-05-22_21-48-18.wav,44100,16,60,1,bioacoustic_index,512,2000,8000,1.40510113967066,NA 
rayol-farm2_2019-05-22_21-50-18.wav,44100,16,60,1,bioacoustic_index,512,2000,8000,1.48794561792913,NA 
rayol-farm2_2019-05-22_21-52-18.wav,44100,16,60,1,bioacoustic_index,512,2000,8000,1.48278692699064,NA 
rayol-farm2_2019-05-22_21-54-18.wav,44100,16,60,1,bioacoustic_index,512,2000,8000,1.46092447952024,NA 
rayol-farm2_2019-05-22_21-56-18.wav,44100,16,60,1,bioacoustic_index,512,2000,8000,1.46958532143065,NA 
rayol-farm2_2019-05-22_21-58-18.wav,44100,16,60,1,bioacoustic_index,512,2000,8000,1.41738181118839,NA 
rayol-farm2_2019-05-22_22-00-18.wav,44100,16,60,1,bioacoustic_index,512,2000,8000,1.49584712177973,NA 
rayol-farm2_2019-05-22_22-02-18.wav,44100,16,60,1,bioacoustic_index,512,2000,8000,1.49235497000508,NA 
rayol-farm2_2019-05-22_22-04-19.wav,44100,16,60,1,bioacoustic_index,512,2000,8000,1.45840250440685,NA 
rayol-farm2_2019-05-22_22-06-19.wav,44100,16,60,1,bioacoustic_index,512,2000,8000,1.46002250955511,NA 
rayol-farm2_2019-05-22_22-08-19.wav,44100,16,60,1,bioacoustic_index,512,2000,8000,1.48994637919846,NA 
rayol-farm2_2019-05-22_22-10-19.wav,44100,16,60,1,bioacoustic_index,512,2000,8000,1.43447601730249,NA 
rayol-farm2_2019-05-22_22-12-19.wav,44100,16,60,1,bioacoustic_index,512,2000,8000,1.45180360292171,NA 
rayol-farm2_2019-05-22_22-14-19.wav,44100,16,60,1,bioacoustic_index,512,2000,8000,1.45511693498597,NA 
rayol-farm2_2019-05-22_22-16-19.wav,44100,16,60,1,bioacoustic_index,512,2000,8000,1.36374100695864,NA 
rayol-farm2_2019-05-22_22-18-19.wav,44100,16,60,1,bioacoustic_index,512,2000,8000,1.47728803011247,NA 
rayol-farm2_2019-05-22_22-20-20.wav,44100,16,60,1,bioacoustic_index,512,2000,8000,1.40984030448679,NA 
rayol-farm2_2019-05-22_22-22-20.wav,44100,16,60,1,bioacoustic_index,512,2000,8000,1.37923153449065,NA 
rayol-farm2_2019-05-22_22-24-20.wav,44100,16,60,1,bioacoustic_index,512,2000,8000,1.38320371048197,NA 
rayol-farm2_2019-05-22_22-26-20.wav,44100,16,60,1,bioacoustic_index,512,2000,8000,1.47531952746365,NA 
rayol-farm2_2019-05-22_22-28-20.wav,44100,16,60,1,bioacoustic_index,512,2000,8000,1.41494606250294,NA 
rayol-farm2_2019-05-22_22-30-20.wav,44100,16,60,1,bioacoustic_index,512,2000,8000,1.38447169308275,NA 
rayol-farm2_2019-05-22_22-32-20.wav,44100,16,60,1,bioacoustic_index,512,2000,8000,1.42495743089847,NA 
rayol-farm2_2019-05-22_22-34-20.wav,44100,16,60,1,bioacoustic_index,512,2000,8000,1.46529260819037,NA 
rayol-farm2_2019-05-22_22-36-21.wav,44100,16,60,1,bioacoustic_index,512,2000,8000,1.47951096284501,NA 
rayol-farm2_2019-05-22_22-38-21.wav,44100,16,60,1,bioacoustic_index,512,2000,8000,1.46677563872187,NA 
rayol-farm2_2019-05-22_22-40-21.wav,44100,16,60,1,bioacoustic_index,512,2000,8000,1.43617972991505,NA 
rayol-farm2_2019-05-22_22-42-21.wav,44100,16,60,1,bioacoustic_index,512,2000,8000,1.43898519245444,NA 
rayol-farm2_2019-05-22_22-44-21.wav,44100,16,60,1,bioacoustic_index,512,2000,8000,1.41442311485137,NA 
rayol-farm2_2019-05-22_22-46-21.wav,44100,16,60,1,bioacoustic_index,512,2000,8000,1.47237294108129,NA 
rayol-farm2_2019-05-22_22-48-21.wav,44100,16,60,1,bioacoustic_index,512,2000,8000,1.42311463456598,NA 
rayol-farm2_2019-05-22_22-50-21.wav,44100,16,60,1,bioacoustic_index,512,2000,8000,1.43753293408142,NA 
rayol-farm2_2019-05-22_22-52-22.wav,44100,16,60,1,bioacoustic_index,512,2000,8000,1.36633462308193,NA 
rayol-farm2_2019-05-22_22-54-22.wav,44100,16,60,1,bioacoustic_index,512,2000,8000,1.37203447647445,NA 
rayol-farm2_2019-05-22_22-56-22.wav,44100,16,60,1,bioacoustic_index,512,2000,8000,1.45075743112285,NA 
rayol-farm2_2019-05-22_22-58-22.wav,44100,16,60,1,bioacoustic_index,512,2000,8000,1.34464451520791,NA 
rayol-farm2_2019-05-22_23-00-22.wav,44100,16,60,1,bioacoustic_index,512,2000,8000,1.38609423163023,NA 
rayol-farm2_2019-05-22_23-02-22.wav,44100,16,60,1,bioacoustic_index,512,2000,8000,1.72239808641969,NA 
rayol-farm2_2019-05-22_23-04-22.wav,44100,16,60,1,bioacoustic_index,512,2000,8000,1.4423591627462,NA 
rayol-farm2_2019-05-22_23-06-22.wav,44100,16,60,1,bioacoustic_index,512,2000,8000,1.41599897008356,NA 
rayol-farm2_2019-05-22_23-08-22.wav,44100,16,60,1,bioacoustic_index,512,2000,8000,1.40057557886602,NA 
rayol-farm2_2019-05-22_23-10-23.wav,44100,16,60,1,bioacoustic_index,512,2000,8000,1.47023321453277,NA 
rayol-farm2_2019-05-22_23-12-23.wav,44100,16,60,1,bioacoustic_index,512,2000,8000,1.41529971551146,NA 
rayol-farm2_2019-05-22_23-14-23.wav,44100,16,60,1,bioacoustic_index,512,2000,8000,1.53945208147674,NA 
rayol-farm2_2019-05-22_23-16-23.wav,44100,16,60,1,bioacoustic_index,512,2000,8000,1.40553681999558,NA 
rayol-farm2_2019-05-22_23-18-23.wav,44100,16,60,1,bioacoustic_index,512,2000,8000,1.43701727210363,NA 
rayol-farm2_2019-05-22_23-20-23.wav,44100,16,60,1,bioacoustic_index,512,2000,8000,1.38316302095708,NA 
rayol-farm2_2019-05-22_23-22-23.wav,44100,16,60,1,bioacoustic_index,512,2000,8000,1.34188320499219,NA 
rayol-farm2_2019-05-22_23-24-23.wav,44100,16,60,1,bioacoustic_index,512,2000,8000,1.43260303815429,NA 
rayol-farm2_2019-05-22_23-26-24.wav,44100,16,60,1,bioacoustic_index,512,2000,8000,1.43892895241978,NA 
rayol-farm2_2019-05-22_23-28-24.wav,44100,16,60,1,bioacoustic_index,512,2000,8000,1.33615479158207,NA 
rayol-farm2_2019-05-22_23-30-24.wav,44100,16,60,1,bioacoustic_index,512,2000,8000,1.37645133078485,NA 
rayol-farm2_2019-05-22_23-32-24.wav,44100,16,60,1,bioacoustic_index,512,2000,8000,1.37129406909066,NA 
rayol-farm2_2019-05-22_23-34-24.wav,44100,16,60,1,bioacoustic_index,512,2000,8000,1.3937239141917,NA 
rayol-farm2_2019-05-22_23-36-24.wav,44100,16,60,1,bioacoustic_index,512,2000,8000,1.44073824521614,NA 
rayol-farm2_2019-05-22_23-38-24.wav,44100,16,60,1,bioacoustic_index,512,2000,8000,1.3796925562949,NA 
rayol-farm2_2019-05-22_23-40-24.wav,44100,16,60,1,bioacoustic_index,512,2000,8000,1.37768078096241,NA 
rayol-farm2_2019-05-22_23-42-25.wav,44100,16,60,1,bioacoustic_index,512,2000,8000,1.36800808181007,NA 
rayol-farm2_2019-05-22_23-44-25.wav,44100,16,60,1,bioacoustic_index,512,2000,8000,1.3796825508716,NA 
rayol-farm2_2019-05-22_23-46-25.wav,44100,16,60,1,bioacoustic_index,512,2000,8000,1.36497062170655,NA 
rayol-farm2_2019-05-22_23-48-25.wav,44100,16,60,1,bioacoustic_index,512,2000,8000,1.37303318690249,NA 
rayol-farm2_2019-05-22_23-50-25.wav,44100,16,60,1,bioacoustic_index,512,2000,8000,1.3738402097201,NA 
rayol-farm2_2019-05-22_23-52-25.wav,44100,16,60,1,bioacoustic_index,512,2000,8000,1.37171075832215,NA 
rayol-farm2_2019-05-22_23-54-25.wav,44100,16,60,1,bioacoustic_index,512,2000,8000,1.62949791612406,NA 
rayol-farm2_2019-05-22_23-56-25.wav,44100,16,60,1,bioacoustic_index,512,2000,8000,1.32487882396092,NA 
rayol-farm2_2019-05-22_23-58-26.wav,44100,16,60,1,bioacoustic_index,512,2000,8000,1.30194369776028,NA
