FILENAME,SAMPLINGRATE,BIT,DURATION,CHANNELS,INDEX,FFT_W,ANTHRO_MIN,ANTHRO_MAX,BIO_MIN,BIO_MAX,LEFT_CHANNEL,RIGHT_CHANNEL
rayol-farm2_2019-05-05_00-00-46.wav,44100,16,60,1,ndsi,1024,1000,2000,2000,11000,0.912475912334566,NA 
rayol-farm2_2019-05-05_00-02-46.wav,44100,16,60,1,ndsi,1024,1000,2000,2000,11000,0.903329748985633,NA 
rayol-farm2_2019-05-05_00-04-47.wav,44100,16,60,1,ndsi,1024,1000,2000,2000,11000,0.880877789520381,NA 
rayol-farm2_2019-05-05_00-06-47.wav,44100,16,60,1,ndsi,1024,1000,2000,2000,11000,0.924319522569874,NA 
rayol-farm2_2019-05-05_00-08-47.wav,44100,16,60,1,ndsi,1024,1000,2000,2000,11000,0.921305326326665,NA 
rayol-farm2_2019-05-05_00-10-47.wav,44100,16,60,1,ndsi,1024,1000,2000,2000,11000,0.932898831099724,NA 
rayol-farm2_2019-05-05_00-12-47.wav,44100,16,60,1,ndsi,1024,1000,2000,2000,11000,0.930351272148381,NA 
rayol-farm2_2019-05-05_00-14-47.wav,44100,16,60,1,ndsi,1024,1000,2000,2000,11000,0.919028629388231,NA 
rayol-farm2_2019-05-05_00-16-47.wav,44100,16,60,1,ndsi,1024,1000,2000,2000,11000,0.925499018212411,NA 
rayol-farm2_2019-05-05_00-18-47.wav,44100,16,60,1,ndsi,1024,1000,2000,2000,11000,0.924878961301753,NA 
rayol-farm2_2019-05-05_00-20-48.wav,44100,16,60,1,ndsi,1024,1000,2000,2000,11000,0.931590787814397,NA 
rayol-farm2_2019-05-05_00-22-48.wav,44100,16,60,1,ndsi,1024,1000,2000,2000,11000,0.924399628408545,NA 
rayol-farm2_2019-05-05_00-24-48.wav,44100,16,60,1,ndsi,1024,1000,2000,2000,11000,0.921243901567103,NA 
rayol-farm2_2019-05-05_00-26-48.wav,44100,16,60,1,ndsi,1024,1000,2000,2000,11000,0.926977287212897,NA 
rayol-farm2_2019-05-05_00-28-48.wav,44100,16,60,1,ndsi,1024,1000,2000,2000,11000,0.927081921107144,NA 
rayol-farm2_2019-05-05_00-30-48.wav,44100,16,60,1,ndsi,1024,1000,2000,2000,11000,0.924734822482693,NA 
rayol-farm2_2019-05-05_00-32-48.wav,44100,16,60,1,ndsi,1024,1000,2000,2000,11000,0.916521477837818,NA 
rayol-farm2_2019-05-05_00-34-48.wav,44100,16,60,1,ndsi,1024,1000,2000,2000,11000,0.918464861518641,NA 
rayol-farm2_2019-05-05_00-36-48.wav,44100,16,60,1,ndsi,1024,1000,2000,2000,11000,0.93131888335175,NA 
rayol-farm2_2019-05-05_00-38-49.wav,44100,16,60,1,ndsi,1024,1000,2000,2000,11000,0.898785397939726,NA 
rayol-farm2_2019-05-05_00-40-49.wav,44100,16,60,1,ndsi,1024,1000,2000,2000,11000,0.91410703040019,NA 
rayol-farm2_2019-05-05_00-42-49.wav,44100,16,60,1,ndsi,1024,1000,2000,2000,11000,0.893491816541968,NA 
rayol-farm2_2019-05-05_00-44-49.wav,44100,16,60,1,ndsi,1024,1000,2000,2000,11000,0.872675420687775,NA 
rayol-farm2_2019-05-05_00-46-49.wav,44100,16,60,1,ndsi,1024,1000,2000,2000,11000,0.860736878563598,NA 
rayol-farm2_2019-05-05_00-48-49.wav,44100,16,60,1,ndsi,1024,1000,2000,2000,11000,0.903543753357693,NA 
rayol-farm2_2019-05-05_00-50-49.wav,44100,16,60,1,ndsi,1024,1000,2000,2000,11000,0.893154437231544,NA 
rayol-farm2_2019-05-05_00-52-49.wav,44100,16,60,1,ndsi,1024,1000,2000,2000,11000,0.910169340294939,NA 
rayol-farm2_2019-05-05_00-54-50.wav,44100,16,60,1,ndsi,1024,1000,2000,2000,11000,0.928289830143137,NA 
rayol-farm2_2019-05-05_00-56-50.wav,44100,16,60,1,ndsi,1024,1000,2000,2000,11000,0.889872622867084,NA 
rayol-farm2_2019-05-05_00-58-50.wav,44100,16,60,1,ndsi,1024,1000,2000,2000,11000,0.911080287439093,NA 
rayol-farm2_2019-05-05_01-00-50.wav,44100,16,60,1,ndsi,1024,1000,2000,2000,11000,0.909856022758168,NA 
rayol-farm2_2019-05-05_01-02-50.wav,44100,16,60,1,ndsi,1024,1000,2000,2000,11000,0.785664801880702,NA 
rayol-farm2_2019-05-05_01-04-50.wav,44100,16,60,1,ndsi,1024,1000,2000,2000,11000,0.897938161720429,NA 
rayol-farm2_2019-05-05_01-06-50.wav,44100,16,60,1,ndsi,1024,1000,2000,2000,11000,0.808416531591889,NA 
rayol-farm2_2019-05-05_01-08-50.wav,44100,16,60,1,ndsi,1024,1000,2000,2000,11000,0.879034932181769,NA 
rayol-farm2_2019-05-05_01-10-51.wav,44100,16,60,1,ndsi,1024,1000,2000,2000,11000,0.839621070382085,NA 
rayol-farm2_2019-05-05_01-12-51.wav,44100,16,60,1,ndsi,1024,1000,2000,2000,11000,0.845096233420705,NA 
rayol-farm2_2019-05-05_01-14-51.wav,44100,16,60,1,ndsi,1024,1000,2000,2000,11000,0.864938506433354,NA 
rayol-farm2_2019-05-05_01-16-51.wav,44100,16,60,1,ndsi,1024,1000,2000,2000,11000,0.890315729564189,NA 
rayol-farm2_2019-05-05_01-18-51.wav,44100,16,60,1,ndsi,1024,1000,2000,2000,11000,0.879099457232547,NA 
rayol-farm2_2019-05-05_01-20-51.wav,44100,16,60,1,ndsi,1024,1000,2000,2000,11000,0.911739420520056,NA 
rayol-farm2_2019-05-05_01-22-51.wav,44100,16,60,1,ndsi,1024,1000,2000,2000,11000,0.908765780299778,NA 
rayol-farm2_2019-05-05_01-24-51.wav,44100,16,60,1,ndsi,1024,1000,2000,2000,11000,0.895568118466016,NA 
rayol-farm2_2019-05-05_01-26-52.wav,44100,16,60,1,ndsi,1024,1000,2000,2000,11000,0.837347931934941,NA 
rayol-farm2_2019-05-05_01-28-52.wav,44100,16,60,1,ndsi,1024,1000,2000,2000,11000,0.849883289310447,NA 
rayol-farm2_2019-05-05_01-30-52.wav,44100,16,60,1,ndsi,1024,1000,2000,2000,11000,0.781068799301707,NA 
rayol-farm2_2019-05-05_01-32-52.wav,44100,16,60,1,ndsi,1024,1000,2000,2000,11000,0.906951282644217,NA 
rayol-farm2_2019-05-05_01-34-52.wav,44100,16,60,1,ndsi,1024,1000,2000,2000,11000,0.885072651425212,NA 
rayol-farm2_2019-05-05_01-36-52.wav,44100,16,60,1,ndsi,1024,1000,2000,2000,11000,0.893028409164057,NA 
rayol-farm2_2019-05-05_01-38-52.wav,44100,16,60,1,ndsi,1024,1000,2000,2000,11000,0.897933193371321,NA 
rayol-farm2_2019-05-05_01-40-52.wav,44100,16,60,1,ndsi,1024,1000,2000,2000,11000,0.912555841174645,NA 
rayol-farm2_2019-05-05_01-42-52.wav,44100,16,60,1,ndsi,1024,1000,2000,2000,11000,0.88184061577331,NA 
rayol-farm2_2019-05-05_01-44-53.wav,44100,16,60,1,ndsi,1024,1000,2000,2000,11000,0.895467487017985,NA 
rayol-farm2_2019-05-05_01-46-53.wav,44100,16,60,1,ndsi,1024,1000,2000,2000,11000,0.90748696674366,NA 
rayol-farm2_2019-05-05_01-48-53.wav,44100,16,60,1,ndsi,1024,1000,2000,2000,11000,0.897621785895802,NA 
rayol-farm2_2019-05-05_01-50-53.wav,44100,16,60,1,ndsi,1024,1000,2000,2000,11000,0.81328605492867,NA 
rayol-farm2_2019-05-05_01-52-53.wav,44100,16,60,1,ndsi,1024,1000,2000,2000,11000,0.720021916024287,NA 
rayol-farm2_2019-05-05_01-54-53.wav,44100,16,60,1,ndsi,1024,1000,2000,2000,11000,0.891149335381368,NA 
rayol-farm2_2019-05-05_01-56-53.wav,44100,16,60,1,ndsi,1024,1000,2000,2000,11000,0.886353714395994,NA 
rayol-farm2_2019-05-05_01-58-53.wav,44100,16,60,1,ndsi,1024,1000,2000,2000,11000,0.895657669383091,NA 
rayol-farm2_2019-05-05_02-00-54.wav,44100,16,60,1,ndsi,1024,1000,2000,2000,11000,0.880364150560977,NA 
rayol-farm2_2019-05-05_02-02-54.wav,44100,16,60,1,ndsi,1024,1000,2000,2000,11000,0.899529382051533,NA 
rayol-farm2_2019-05-05_02-04-54.wav,44100,16,60,1,ndsi,1024,1000,2000,2000,11000,0.867602717168025,NA 
rayol-farm2_2019-05-05_02-06-54.wav,44100,16,60,1,ndsi,1024,1000,2000,2000,11000,0.847711786089937,NA 
rayol-farm2_2019-05-05_02-08-54.wav,44100,16,60,1,ndsi,1024,1000,2000,2000,11000,0.88460059495567,NA 
rayol-farm2_2019-05-05_02-10-54.wav,44100,16,60,1,ndsi,1024,1000,2000,2000,11000,0.869178025274957,NA 
rayol-farm2_2019-05-05_02-12-54.wav,44100,16,60,1,ndsi,1024,1000,2000,2000,11000,0.893343528738065,NA 
rayol-farm2_2019-05-05_02-14-54.wav,44100,16,60,1,ndsi,1024,1000,2000,2000,11000,0.898090331025337,NA 
rayol-farm2_2019-05-05_02-16-55.wav,44100,16,60,1,ndsi,1024,1000,2000,2000,11000,0.889583152230596,NA 
rayol-farm2_2019-05-05_02-18-55.wav,44100,16,60,1,ndsi,1024,1000,2000,2000,11000,0.89844346603095,NA 
rayol-farm2_2019-05-05_02-20-55.wav,44100,16,60,1,ndsi,1024,1000,2000,2000,11000,0.919435344286453,NA 
rayol-farm2_2019-05-05_02-22-55.wav,44100,16,60,1,ndsi,1024,1000,2000,2000,11000,0.900556297284239,NA 
rayol-farm2_2019-05-05_02-24-55.wav,44100,16,60,1,ndsi,1024,1000,2000,2000,11000,0.608918786571078,NA 
rayol-farm2_2019-05-05_02-26-55.wav,44100,16,60,1,ndsi,1024,1000,2000,2000,11000,0.746381537824223,NA 
rayol-farm2_2019-05-05_02-28-55.wav,44100,16,60,1,ndsi,1024,1000,2000,2000,11000,0.52444175711211,NA 
rayol-farm2_2019-05-05_02-30-55.wav,44100,16,60,1,ndsi,1024,1000,2000,2000,11000,0.792545754489502,NA 
rayol-farm2_2019-05-05_02-32-55.wav,44100,16,60,1,ndsi,1024,1000,2000,2000,11000,0.755124067889499,NA 
rayol-farm2_2019-05-05_02-34-56.wav,44100,16,60,1,ndsi,1024,1000,2000,2000,11000,0.798182492465872,NA 
rayol-farm2_2019-05-05_02-36-56.wav,44100,16,60,1,ndsi,1024,1000,2000,2000,11000,0.671829223366942,NA 
rayol-farm2_2019-05-05_02-38-56.wav,44100,16,60,1,ndsi,1024,1000,2000,2000,11000,0.589007836702742,NA 
rayol-farm2_2019-05-05_02-40-56.wav,44100,16,60,1,ndsi,1024,1000,2000,2000,11000,0.711876859954197,NA 
rayol-farm2_2019-05-05_02-42-56.wav,44100,16,60,1,ndsi,1024,1000,2000,2000,11000,0.664763501238659,NA 
rayol-farm2_2019-05-05_02-44-56.wav,44100,16,60,1,ndsi,1024,1000,2000,2000,11000,0.656239374069035,NA 
rayol-farm2_2019-05-05_02-46-56.wav,44100,16,60,1,ndsi,1024,1000,2000,2000,11000,0.452089497153622,NA 
rayol-farm2_2019-05-05_02-48-56.wav,44100,16,60,1,ndsi,1024,1000,2000,2000,11000,0.489513600100383,NA 
rayol-farm2_2019-05-05_02-50-57.wav,44100,16,60,1,ndsi,1024,1000,2000,2000,11000,0.662215824858586,NA 
rayol-farm2_2019-05-05_02-52-57.wav,44100,16,60,1,ndsi,1024,1000,2000,2000,11000,0.524712056566799,NA 
rayol-farm2_2019-05-05_02-54-57.wav,44100,16,60,1,ndsi,1024,1000,2000,2000,11000,0.415821048784558,NA 
rayol-farm2_2019-05-05_02-56-57.wav,44100,16,60,1,ndsi,1024,1000,2000,2000,11000,0.567800242433406,NA 
rayol-farm2_2019-05-05_02-58-57.wav,44100,16,60,1,ndsi,1024,1000,2000,2000,11000,0.45666584281012,NA 
rayol-farm2_2019-05-05_03-00-57.wav,44100,16,60,1,ndsi,1024,1000,2000,2000,11000,0.461755024652688,NA 
rayol-farm2_2019-05-05_03-02-57.wav,44100,16,60,1,ndsi,1024,1000,2000,2000,11000,0.419859298489198,NA 
rayol-farm2_2019-05-05_03-04-57.wav,44100,16,60,1,ndsi,1024,1000,2000,2000,11000,0.490286101234593,NA 
rayol-farm2_2019-05-05_03-06-58.wav,44100,16,60,1,ndsi,1024,1000,2000,2000,11000,0.325627265460557,NA 
rayol-farm2_2019-05-05_03-08-58.wav,44100,16,60,1,ndsi,1024,1000,2000,2000,11000,0.341127808895874,NA 
rayol-farm2_2019-05-05_03-10-58.wav,44100,16,60,1,ndsi,1024,1000,2000,2000,11000,0.330504287549766,NA 
rayol-farm2_2019-05-05_03-12-58.wav,44100,16,60,1,ndsi,1024,1000,2000,2000,11000,0.202185994211697,NA 
rayol-farm2_2019-05-05_03-14-58.wav,44100,16,60,1,ndsi,1024,1000,2000,2000,11000,0.293921881155703,NA 
rayol-farm2_2019-05-05_03-16-58.wav,44100,16,60,1,ndsi,1024,1000,2000,2000,11000,0.307202947209971,NA 
rayol-farm2_2019-05-05_03-18-58.wav,44100,16,60,1,ndsi,1024,1000,2000,2000,11000,0.25654296029272,NA 
rayol-farm2_2019-05-05_03-20-58.wav,44100,16,60,1,ndsi,1024,1000,2000,2000,11000,0.389321967046973,NA 
rayol-farm2_2019-05-05_03-22-58.wav,44100,16,60,1,ndsi,1024,1000,2000,2000,11000,0.258920355053393,NA 
rayol-farm2_2019-05-05_03-24-59.wav,44100,16,60,1,ndsi,1024,1000,2000,2000,11000,0.139201470125575,NA 
rayol-farm2_2019-05-05_03-26-59.wav,44100,16,60,1,ndsi,1024,1000,2000,2000,11000,0.178275894542551,NA 
rayol-farm2_2019-05-05_03-28-59.wav,44100,16,60,1,ndsi,1024,1000,2000,2000,11000,0.183171456155539,NA 
rayol-farm2_2019-05-05_03-30-59.wav,44100,16,60,1,ndsi,1024,1000,2000,2000,11000,0.273484972564866,NA 
rayol-farm2_2019-05-05_03-32-59.wav,44100,16,60,1,ndsi,1024,1000,2000,2000,11000,0.334327069029962,NA 
rayol-farm2_2019-05-05_03-34-59.wav,44100,16,60,1,ndsi,1024,1000,2000,2000,11000,0.332482656541473,NA 
rayol-farm2_2019-05-05_03-36-59.wav,44100,16,60,1,ndsi,1024,1000,2000,2000,11000,0.540959883211249,NA 
rayol-farm2_2019-05-05_03-38-59.wav,44100,16,60,1,ndsi,1024,1000,2000,2000,11000,0.315627901096723,NA 
rayol-farm2_2019-05-05_03-41-00.wav,44100,16,60,1,ndsi,1024,1000,2000,2000,11000,0.220098848986074,NA 
rayol-farm2_2019-05-05_03-43-00.wav,44100,16,60,1,ndsi,1024,1000,2000,2000,11000,0.139102295983345,NA 
rayol-farm2_2019-05-05_03-45-00.wav,44100,16,60,1,ndsi,1024,1000,2000,2000,11000,0.206218038905219,NA 
rayol-farm2_2019-05-05_03-47-00.wav,44100,16,60,1,ndsi,1024,1000,2000,2000,11000,0.290451606682659,NA 
rayol-farm2_2019-05-05_03-49-00.wav,44100,16,60,1,ndsi,1024,1000,2000,2000,11000,0.307504807832835,NA 
rayol-farm2_2019-05-05_03-51-00.wav,44100,16,60,1,ndsi,1024,1000,2000,2000,11000,-0.0873353782901162,NA 
rayol-farm2_2019-05-05_03-53-00.wav,44100,16,60,1,ndsi,1024,1000,2000,2000,11000,0.256647964870918,NA 
rayol-farm2_2019-05-05_03-55-00.wav,44100,16,60,1,ndsi,1024,1000,2000,2000,11000,0.217443758345563,NA 
rayol-farm2_2019-05-05_03-57-01.wav,44100,16,60,1,ndsi,1024,1000,2000,2000,11000,0.141147223919582,NA 
rayol-farm2_2019-05-05_03-59-01.wav,44100,16,60,1,ndsi,1024,1000,2000,2000,11000,0.213465219550468,NA 
rayol-farm2_2019-05-05_04-01-01.wav,44100,16,60,1,ndsi,1024,1000,2000,2000,11000,0.368812369443344,NA 
rayol-farm2_2019-05-05_04-03-01.wav,44100,16,60,1,ndsi,1024,1000,2000,2000,11000,-0.0166678626569253,NA 
rayol-farm2_2019-05-05_04-05-01.wav,44100,16,60,1,ndsi,1024,1000,2000,2000,11000,0.314318478025723,NA 
rayol-farm2_2019-05-05_04-07-01.wav,44100,16,60,1,ndsi,1024,1000,2000,2000,11000,0.305068460806675,NA 
rayol-farm2_2019-05-05_04-09-01.wav,44100,16,60,1,ndsi,1024,1000,2000,2000,11000,0.281579458703601,NA 
rayol-farm2_2019-05-05_04-11-01.wav,44100,16,60,1,ndsi,1024,1000,2000,2000,11000,0.40660855544732,NA 
rayol-farm2_2019-05-05_04-13-01.wav,44100,16,60,1,ndsi,1024,1000,2000,2000,11000,0.172618969308967,NA 
rayol-farm2_2019-05-05_04-15-02.wav,44100,16,60,1,ndsi,1024,1000,2000,2000,11000,0.359133327016126,NA 
rayol-farm2_2019-05-05_04-17-02.wav,44100,16,60,1,ndsi,1024,1000,2000,2000,11000,0.21334962484561,NA 
rayol-farm2_2019-05-05_04-19-02.wav,44100,16,60,1,ndsi,1024,1000,2000,2000,11000,0.183913019114335,NA 
rayol-farm2_2019-05-05_04-21-02.wav,44100,16,60,1,ndsi,1024,1000,2000,2000,11000,0.20676352323463,NA 
rayol-farm2_2019-05-05_04-23-02.wav,44100,16,60,1,ndsi,1024,1000,2000,2000,11000,0.411233372779683,NA 
rayol-farm2_2019-05-05_04-25-02.wav,44100,16,60,1,ndsi,1024,1000,2000,2000,11000,0.264516161105764,NA 
rayol-farm2_2019-05-05_04-27-02.wav,44100,16,60,1,ndsi,1024,1000,2000,2000,11000,0.346195807228274,NA 
rayol-farm2_2019-05-05_04-29-02.wav,44100,16,60,1,ndsi,1024,1000,2000,2000,11000,0.220082405165123,NA 
rayol-farm2_2019-05-05_04-31-03.wav,44100,16,60,1,ndsi,1024,1000,2000,2000,11000,0.119086189615083,NA 
rayol-farm2_2019-05-05_04-33-03.wav,44100,16,60,1,ndsi,1024,1000,2000,2000,11000,0.327188407432059,NA 
rayol-farm2_2019-05-05_04-35-03.wav,44100,16,60,1,ndsi,1024,1000,2000,2000,11000,0.372361689606557,NA 
rayol-farm2_2019-05-05_04-37-03.wav,44100,16,60,1,ndsi,1024,1000,2000,2000,11000,0.290237018473125,NA 
rayol-farm2_2019-05-05_04-39-03.wav,44100,16,60,1,ndsi,1024,1000,2000,2000,11000,0.373892896490546,NA 
rayol-farm2_2019-05-05_04-41-03.wav,44100,16,60,1,ndsi,1024,1000,2000,2000,11000,0.204546821179377,NA 
rayol-farm2_2019-05-05_04-43-03.wav,44100,16,60,1,ndsi,1024,1000,2000,2000,11000,0.352605176885769,NA 
rayol-farm2_2019-05-05_04-45-03.wav,44100,16,60,1,ndsi,1024,1000,2000,2000,11000,0.509580525408942,NA 
rayol-farm2_2019-05-05_04-47-04.wav,44100,16,60,1,ndsi,1024,1000,2000,2000,11000,0.203590243973288,NA 
rayol-farm2_2019-05-05_04-49-04.wav,44100,16,60,1,ndsi,1024,1000,2000,2000,11000,0.321640454187257,NA 
rayol-farm2_2019-05-05_04-51-04.wav,44100,16,60,1,ndsi,1024,1000,2000,2000,11000,0.469853399000689,NA 
rayol-farm2_2019-05-05_04-53-04.wav,44100,16,60,1,ndsi,1024,1000,2000,2000,11000,0.432788016345246,NA 
rayol-farm2_2019-05-05_04-55-04.wav,44100,16,60,1,ndsi,1024,1000,2000,2000,11000,0.181754809603747,NA 
rayol-farm2_2019-05-05_04-57-04.wav,44100,16,60,1,ndsi,1024,1000,2000,2000,11000,0.301929004303443,NA 
rayol-farm2_2019-05-05_04-59-04.wav,44100,16,60,1,ndsi,1024,1000,2000,2000,11000,0.348099571103573,NA 
rayol-farm2_2019-05-05_05-01-04.wav,44100,16,60,1,ndsi,1024,1000,2000,2000,11000,0.299060416026421,NA 
rayol-farm2_2019-05-05_05-03-04.wav,44100,16,60,1,ndsi,1024,1000,2000,2000,11000,0.362451698893353,NA 
rayol-farm2_2019-05-05_05-05-05.wav,44100,16,60,1,ndsi,1024,1000,2000,2000,11000,0.417478028682374,NA 
rayol-farm2_2019-05-05_05-07-05.wav,44100,16,60,1,ndsi,1024,1000,2000,2000,11000,0.314637118174726,NA 
rayol-farm2_2019-05-05_05-09-05.wav,44100,16,60,1,ndsi,1024,1000,2000,2000,11000,0.597865225659662,NA 
rayol-farm2_2019-05-05_05-11-05.wav,44100,16,60,1,ndsi,1024,1000,2000,2000,11000,0.462924787446984,NA 
rayol-farm2_2019-05-05_05-13-05.wav,44100,16,60,1,ndsi,1024,1000,2000,2000,11000,0.572416056336593,NA 
rayol-farm2_2019-05-05_05-15-05.wav,44100,16,60,1,ndsi,1024,1000,2000,2000,11000,0.522099938411136,NA 
rayol-farm2_2019-05-05_05-17-05.wav,44100,16,60,1,ndsi,1024,1000,2000,2000,11000,0.650279688129975,NA 
rayol-farm2_2019-05-05_05-19-05.wav,44100,16,60,1,ndsi,1024,1000,2000,2000,11000,0.573743300357347,NA 
rayol-farm2_2019-05-05_05-21-06.wav,44100,16,60,1,ndsi,1024,1000,2000,2000,11000,0.584630062015184,NA 
rayol-farm2_2019-05-05_05-23-06.wav,44100,16,60,1,ndsi,1024,1000,2000,2000,11000,0.717088119818704,NA 
rayol-farm2_2019-05-05_05-25-06.wav,44100,16,60,1,ndsi,1024,1000,2000,2000,11000,0.657012753227079,NA 
rayol-farm2_2019-05-05_05-27-06.wav,44100,16,60,1,ndsi,1024,1000,2000,2000,11000,0.522653705770633,NA 
rayol-farm2_2019-05-05_05-29-06.wav,44100,16,60,1,ndsi,1024,1000,2000,2000,11000,0.571638323497112,NA 
rayol-farm2_2019-05-05_05-31-06.wav,44100,16,60,1,ndsi,1024,1000,2000,2000,11000,0.530802585697876,NA 
rayol-farm2_2019-05-05_05-33-06.wav,44100,16,60,1,ndsi,1024,1000,2000,2000,11000,0.583837206655223,NA 
rayol-farm2_2019-05-05_05-35-06.wav,44100,16,60,1,ndsi,1024,1000,2000,2000,11000,0.586285663099113,NA 
rayol-farm2_2019-05-05_05-37-07.wav,44100,16,60,1,ndsi,1024,1000,2000,2000,11000,0.680883106336632,NA 
rayol-farm2_2019-05-05_05-39-07.wav,44100,16,60,1,ndsi,1024,1000,2000,2000,11000,0.554825072747637,NA 
rayol-farm2_2019-05-05_05-41-07.wav,44100,16,60,1,ndsi,1024,1000,2000,2000,11000,0.374481843326425,NA 
rayol-farm2_2019-05-05_05-43-07.wav,44100,16,60,1,ndsi,1024,1000,2000,2000,11000,0.528769749924587,NA 
rayol-farm2_2019-05-05_05-45-07.wav,44100,16,60,1,ndsi,1024,1000,2000,2000,11000,0.507632917685874,NA 
rayol-farm2_2019-05-05_05-47-07.wav,44100,16,60,1,ndsi,1024,1000,2000,2000,11000,0.709321111030839,NA 
rayol-farm2_2019-05-05_05-49-07.wav,44100,16,60,1,ndsi,1024,1000,2000,2000,11000,0.645917621873774,NA 
rayol-farm2_2019-05-05_05-51-07.wav,44100,16,60,1,ndsi,1024,1000,2000,2000,11000,0.322117902507187,NA 
rayol-farm2_2019-05-05_05-53-08.wav,44100,16,60,1,ndsi,1024,1000,2000,2000,11000,0.275155455211133,NA 
rayol-farm2_2019-05-05_05-55-08.wav,44100,16,60,1,ndsi,1024,1000,2000,2000,11000,0.396901586435861,NA 
rayol-farm2_2019-05-05_05-57-08.wav,44100,16,60,1,ndsi,1024,1000,2000,2000,11000,0.345797010177645,NA 
rayol-farm2_2019-05-05_05-59-08.wav,44100,16,60,1,ndsi,1024,1000,2000,2000,11000,0.236477459532235,NA 
rayol-farm2_2019-05-05_06-01-08.wav,44100,16,60,1,ndsi,1024,1000,2000,2000,11000,0.153411448479285,NA 
rayol-farm2_2019-05-05_06-03-08.wav,44100,16,60,1,ndsi,1024,1000,2000,2000,11000,-0.0463343643579793,NA 
rayol-farm2_2019-05-05_06-05-08.wav,44100,16,60,1,ndsi,1024,1000,2000,2000,11000,0.32988824171391,NA 
rayol-farm2_2019-05-05_06-07-08.wav,44100,16,60,1,ndsi,1024,1000,2000,2000,11000,0.158454139088389,NA 
rayol-farm2_2019-05-05_06-09-09.wav,44100,16,60,1,ndsi,1024,1000,2000,2000,11000,0.261042960462466,NA 
rayol-farm2_2019-05-05_06-11-09.wav,44100,16,60,1,ndsi,1024,1000,2000,2000,11000,0.166595651368807,NA 
rayol-farm2_2019-05-05_06-13-09.wav,44100,16,60,1,ndsi,1024,1000,2000,2000,11000,0.292405625350697,NA 
rayol-farm2_2019-05-05_06-15-09.wav,44100,16,60,1,ndsi,1024,1000,2000,2000,11000,-0.0169868372683993,NA 
rayol-farm2_2019-05-05_06-17-09.wav,44100,16,60,1,ndsi,1024,1000,2000,2000,11000,0.0134519954079114,NA 
rayol-farm2_2019-05-05_06-19-09.wav,44100,16,60,1,ndsi,1024,1000,2000,2000,11000,0.0691080409630401,NA 
rayol-farm2_2019-05-05_06-21-09.wav,44100,16,60,1,ndsi,1024,1000,2000,2000,11000,0.181075450148812,NA 
rayol-farm2_2019-05-05_06-23-09.wav,44100,16,60,1,ndsi,1024,1000,2000,2000,11000,0.396476568209292,NA 
rayol-farm2_2019-05-05_06-25-10.wav,44100,16,60,1,ndsi,1024,1000,2000,2000,11000,0.281808927637861,NA 
rayol-farm2_2019-05-05_06-27-10.wav,44100,16,60,1,ndsi,1024,1000,2000,2000,11000,0.0251631311208615,NA 
rayol-farm2_2019-05-05_06-29-10.wav,44100,16,60,1,ndsi,1024,1000,2000,2000,11000,0.206242385045951,NA 
rayol-farm2_2019-05-05_06-31-10.wav,44100,16,60,1,ndsi,1024,1000,2000,2000,11000,0.263016850847747,NA 
rayol-farm2_2019-05-05_06-33-10.wav,44100,16,60,1,ndsi,1024,1000,2000,2000,11000,0.268982406628099,NA 
rayol-farm2_2019-05-05_06-35-10.wav,44100,16,60,1,ndsi,1024,1000,2000,2000,11000,0.358870881100152,NA 
rayol-farm2_2019-05-05_06-37-10.wav,44100,16,60,1,ndsi,1024,1000,2000,2000,11000,0.439041524943271,NA 
rayol-farm2_2019-05-05_06-39-10.wav,44100,16,60,1,ndsi,1024,1000,2000,2000,11000,-0.0316161645316719,NA 
rayol-farm2_2019-05-05_06-41-10.wav,44100,16,60,1,ndsi,1024,1000,2000,2000,11000,0.202726730522377,NA 
rayol-farm2_2019-05-05_06-43-11.wav,44100,16,60,1,ndsi,1024,1000,2000,2000,11000,0.433081182616356,NA 
rayol-farm2_2019-05-05_06-45-11.wav,44100,16,60,1,ndsi,1024,1000,2000,2000,11000,0.39401664287827,NA 
rayol-farm2_2019-05-05_06-47-11.wav,44100,16,60,1,ndsi,1024,1000,2000,2000,11000,0.60890155499365,NA 
rayol-farm2_2019-05-05_06-49-11.wav,44100,16,60,1,ndsi,1024,1000,2000,2000,11000,0.332720277920025,NA 
rayol-farm2_2019-05-05_06-51-11.wav,44100,16,60,1,ndsi,1024,1000,2000,2000,11000,0.371875716537963,NA 
rayol-farm2_2019-05-05_06-53-11.wav,44100,16,60,1,ndsi,1024,1000,2000,2000,11000,0.314135442276787,NA 
rayol-farm2_2019-05-05_06-55-11.wav,44100,16,60,1,ndsi,1024,1000,2000,2000,11000,0.41454166835829,NA 
rayol-farm2_2019-05-05_06-57-11.wav,44100,16,60,1,ndsi,1024,1000,2000,2000,11000,0.466743918166267,NA 
rayol-farm2_2019-05-05_06-59-12.wav,44100,16,60,1,ndsi,1024,1000,2000,2000,11000,0.0777536286416359,NA 
rayol-farm2_2019-05-05_07-01-12.wav,44100,16,60,1,ndsi,1024,1000,2000,2000,11000,0.366262943277811,NA 
rayol-farm2_2019-05-05_07-03-12.wav,44100,16,60,1,ndsi,1024,1000,2000,2000,11000,0.241624051966986,NA 
rayol-farm2_2019-05-05_07-05-12.wav,44100,16,60,1,ndsi,1024,1000,2000,2000,11000,0.536498438236238,NA 
rayol-farm2_2019-05-05_07-07-12.wav,44100,16,60,1,ndsi,1024,1000,2000,2000,11000,0.697525346137049,NA 
rayol-farm2_2019-05-05_07-09-12.wav,44100,16,60,1,ndsi,1024,1000,2000,2000,11000,0.55576227304532,NA 
rayol-farm2_2019-05-05_07-11-12.wav,44100,16,60,1,ndsi,1024,1000,2000,2000,11000,0.809533600977925,NA 
rayol-farm2_2019-05-05_07-13-12.wav,44100,16,60,1,ndsi,1024,1000,2000,2000,11000,0.765316558982691,NA 
rayol-farm2_2019-05-05_07-15-13.wav,44100,16,60,1,ndsi,1024,1000,2000,2000,11000,0.731237934144295,NA 
rayol-farm2_2019-05-05_07-17-13.wav,44100,16,60,1,ndsi,1024,1000,2000,2000,11000,0.823487205405301,NA 
rayol-farm2_2019-05-05_07-19-13.wav,44100,16,60,1,ndsi,1024,1000,2000,2000,11000,0.865463006582472,NA 
rayol-farm2_2019-05-05_07-21-13.wav,44100,16,60,1,ndsi,1024,1000,2000,2000,11000,0.825316912902976,NA 
rayol-farm2_2019-05-05_07-23-13.wav,44100,16,60,1,ndsi,1024,1000,2000,2000,11000,0.667152194005157,NA 
rayol-farm2_2019-05-05_07-25-13.wav,44100,16,60,1,ndsi,1024,1000,2000,2000,11000,0.358841887367039,NA 
rayol-farm2_2019-05-05_07-27-13.wav,44100,16,60,1,ndsi,1024,1000,2000,2000,11000,0.351777615313627,NA 
rayol-farm2_2019-05-05_07-29-13.wav,44100,16,60,1,ndsi,1024,1000,2000,2000,11000,0.386297198863939,NA 
rayol-farm2_2019-05-05_07-31-13.wav,44100,16,60,1,ndsi,1024,1000,2000,2000,11000,0.759633763451239,NA 
rayol-farm2_2019-05-05_07-33-14.wav,44100,16,60,1,ndsi,1024,1000,2000,2000,11000,0.683291759549849,NA 
rayol-farm2_2019-05-05_07-35-14.wav,44100,16,60,1,ndsi,1024,1000,2000,2000,11000,0.787255571104575,NA 
rayol-farm2_2019-05-05_07-37-14.wav,44100,16,60,1,ndsi,1024,1000,2000,2000,11000,0.775353237534937,NA 
rayol-farm2_2019-05-05_07-39-14.wav,44100,16,60,1,ndsi,1024,1000,2000,2000,11000,-0.0408890482854987,NA 
rayol-farm2_2019-05-05_07-41-14.wav,44100,16,60,1,ndsi,1024,1000,2000,2000,11000,0.433580867525199,NA 
rayol-farm2_2019-05-05_07-43-14.wav,44100,16,60,1,ndsi,1024,1000,2000,2000,11000,0.620825349027305,NA 
rayol-farm2_2019-05-05_07-45-14.wav,44100,16,60,1,ndsi,1024,1000,2000,2000,11000,0.584208790786154,NA 
rayol-farm2_2019-05-05_07-47-14.wav,44100,16,60,1,ndsi,1024,1000,2000,2000,11000,0.802133825219048,NA 
rayol-farm2_2019-05-05_07-49-15.wav,44100,16,60,1,ndsi,1024,1000,2000,2000,11000,0.815569661116004,NA 
rayol-farm2_2019-05-05_07-51-15.wav,44100,16,60,1,ndsi,1024,1000,2000,2000,11000,0.774004326174275,NA 
rayol-farm2_2019-05-05_07-53-15.wav,44100,16,60,1,ndsi,1024,1000,2000,2000,11000,0.846733718390936,NA 
rayol-farm2_2019-05-05_07-55-15.wav,44100,16,60,1,ndsi,1024,1000,2000,2000,11000,0.84664819865889,NA 
rayol-farm2_2019-05-05_07-57-15.wav,44100,16,60,1,ndsi,1024,1000,2000,2000,11000,0.843421289890344,NA 
rayol-farm2_2019-05-05_07-59-15.wav,44100,16,60,1,ndsi,1024,1000,2000,2000,11000,0.788369869469502,NA 
rayol-farm2_2019-05-05_08-01-15.wav,44100,16,60,1,ndsi,1024,1000,2000,2000,11000,0.843596357674707,NA 
rayol-farm2_2019-05-05_08-03-15.wav,44100,16,60,1,ndsi,1024,1000,2000,2000,11000,0.840074997907776,NA 
rayol-farm2_2019-05-05_08-05-16.wav,44100,16,60,1,ndsi,1024,1000,2000,2000,11000,0.774873355733031,NA 
rayol-farm2_2019-05-05_08-07-16.wav,44100,16,60,1,ndsi,1024,1000,2000,2000,11000,0.702680351722857,NA 
rayol-farm2_2019-05-05_08-09-16.wav,44100,16,60,1,ndsi,1024,1000,2000,2000,11000,0.504184706103336,NA 
rayol-farm2_2019-05-05_08-11-16.wav,44100,16,60,1,ndsi,1024,1000,2000,2000,11000,0.828681333498013,NA 
rayol-farm2_2019-05-05_08-13-16.wav,44100,16,60,1,ndsi,1024,1000,2000,2000,11000,0.821235709211505,NA 
rayol-farm2_2019-05-05_08-15-16.wav,44100,16,60,1,ndsi,1024,1000,2000,2000,11000,0.814818181874135,NA 
rayol-farm2_2019-05-05_08-17-16.wav,44100,16,60,1,ndsi,1024,1000,2000,2000,11000,0.619854121793613,NA 
rayol-farm2_2019-05-05_08-19-16.wav,44100,16,60,1,ndsi,1024,1000,2000,2000,11000,0.501304844787955,NA 
rayol-farm2_2019-05-05_08-21-16.wav,44100,16,60,1,ndsi,1024,1000,2000,2000,11000,0.791279284341094,NA 
rayol-farm2_2019-05-05_08-23-17.wav,44100,16,60,1,ndsi,1024,1000,2000,2000,11000,0.806350236748145,NA 
rayol-farm2_2019-05-05_08-25-17.wav,44100,16,60,1,ndsi,1024,1000,2000,2000,11000,0.837756039785808,NA 
rayol-farm2_2019-05-05_08-27-17.wav,44100,16,60,1,ndsi,1024,1000,2000,2000,11000,0.795580951531674,NA 
rayol-farm2_2019-05-05_08-29-17.wav,44100,16,60,1,ndsi,1024,1000,2000,2000,11000,0.859590978645065,NA 
rayol-farm2_2019-05-05_08-31-17.wav,44100,16,60,1,ndsi,1024,1000,2000,2000,11000,0.901470098424154,NA 
rayol-farm2_2019-05-05_08-33-17.wav,44100,16,60,1,ndsi,1024,1000,2000,2000,11000,0.898660244134497,NA 
rayol-farm2_2019-05-05_08-35-17.wav,44100,16,60,1,ndsi,1024,1000,2000,2000,11000,0.938195938784961,NA 
rayol-farm2_2019-05-05_08-37-17.wav,44100,16,60,1,ndsi,1024,1000,2000,2000,11000,0.865704090689787,NA 
rayol-farm2_2019-05-05_08-39-18.wav,44100,16,60,1,ndsi,1024,1000,2000,2000,11000,0.712288453245555,NA 
rayol-farm2_2019-05-05_08-41-18.wav,44100,16,60,1,ndsi,1024,1000,2000,2000,11000,0.819138899874393,NA 
rayol-farm2_2019-05-05_08-43-18.wav,44100,16,60,1,ndsi,1024,1000,2000,2000,11000,0.756793513188712,NA 
rayol-farm2_2019-05-05_08-45-18.wav,44100,16,60,1,ndsi,1024,1000,2000,2000,11000,0.686930569120166,NA 
rayol-farm2_2019-05-05_08-47-18.wav,44100,16,60,1,ndsi,1024,1000,2000,2000,11000,0.863112357938455,NA 
rayol-farm2_2019-05-05_08-49-18.wav,44100,16,60,1,ndsi,1024,1000,2000,2000,11000,0.827147840904549,NA 
rayol-farm2_2019-05-05_08-51-18.wav,44100,16,60,1,ndsi,1024,1000,2000,2000,11000,0.873156201974183,NA 
rayol-farm2_2019-05-05_08-53-18.wav,44100,16,60,1,ndsi,1024,1000,2000,2000,11000,0.639326730476407,NA 
rayol-farm2_2019-05-05_08-55-19.wav,44100,16,60,1,ndsi,1024,1000,2000,2000,11000,0.753806623497257,NA 
rayol-farm2_2019-05-05_08-57-19.wav,44100,16,60,1,ndsi,1024,1000,2000,2000,11000,0.869587421406568,NA 
rayol-farm2_2019-05-05_08-59-19.wav,44100,16,60,1,ndsi,1024,1000,2000,2000,11000,0.798323612296822,NA 
rayol-farm2_2019-05-05_09-01-19.wav,44100,16,60,1,ndsi,1024,1000,2000,2000,11000,0.518530343633528,NA 
rayol-farm2_2019-05-05_09-03-19.wav,44100,16,60,1,ndsi,1024,1000,2000,2000,11000,0.436335625843144,NA 
rayol-farm2_2019-05-05_09-05-19.wav,44100,16,60,1,ndsi,1024,1000,2000,2000,11000,0.827894482875036,NA 
rayol-farm2_2019-05-05_09-07-19.wav,44100,16,60,1,ndsi,1024,1000,2000,2000,11000,0.153001321795049,NA 
rayol-farm2_2019-05-05_09-09-19.wav,44100,16,60,1,ndsi,1024,1000,2000,2000,11000,0.0930851709429607,NA 
rayol-farm2_2019-05-05_09-11-20.wav,44100,16,60,1,ndsi,1024,1000,2000,2000,11000,0.403456965450085,NA 
rayol-farm2_2019-05-05_09-13-20.wav,44100,16,60,1,ndsi,1024,1000,2000,2000,11000,0.782913682241867,NA 
rayol-farm2_2019-05-05_09-15-20.wav,44100,16,60,1,ndsi,1024,1000,2000,2000,11000,0.87985959772095,NA 
rayol-farm2_2019-05-05_09-17-20.wav,44100,16,60,1,ndsi,1024,1000,2000,2000,11000,0.827950682020348,NA 
rayol-farm2_2019-05-05_09-19-20.wav,44100,16,60,1,ndsi,1024,1000,2000,2000,11000,0.786088021214541,NA 
rayol-farm2_2019-05-05_09-21-20.wav,44100,16,60,1,ndsi,1024,1000,2000,2000,11000,0.658848625895625,NA 
rayol-farm2_2019-05-05_09-23-20.wav,44100,16,60,1,ndsi,1024,1000,2000,2000,11000,0.518745125998731,NA 
rayol-farm2_2019-05-05_09-25-20.wav,44100,16,60,1,ndsi,1024,1000,2000,2000,11000,0.475082216068694,NA 
rayol-farm2_2019-05-05_09-27-20.wav,44100,16,60,1,ndsi,1024,1000,2000,2000,11000,0.761504258461798,NA 
rayol-farm2_2019-05-05_09-29-21.wav,44100,16,60,1,ndsi,1024,1000,2000,2000,11000,0.757188799254554,NA 
rayol-farm2_2019-05-05_09-31-21.wav,44100,16,60,1,ndsi,1024,1000,2000,2000,11000,0.568455641978296,NA 
rayol-farm2_2019-05-05_09-33-21.wav,44100,16,60,1,ndsi,1024,1000,2000,2000,11000,0.885175892943976,NA 
rayol-farm2_2019-05-05_09-35-21.wav,44100,16,60,1,ndsi,1024,1000,2000,2000,11000,0.79778677054105,NA 
rayol-farm2_2019-05-05_09-37-21.wav,44100,16,60,1,ndsi,1024,1000,2000,2000,11000,0.645364042522625,NA 
rayol-farm2_2019-05-05_09-39-21.wav,44100,16,60,1,ndsi,1024,1000,2000,2000,11000,0.675012448862755,NA 
rayol-farm2_2019-05-05_09-41-21.wav,44100,16,60,1,ndsi,1024,1000,2000,2000,11000,0.626571696453287,NA 
rayol-farm2_2019-05-05_09-43-21.wav,44100,16,60,1,ndsi,1024,1000,2000,2000,11000,0.53908765802747,NA 
rayol-farm2_2019-05-05_09-45-22.wav,44100,16,60,1,ndsi,1024,1000,2000,2000,11000,0.65469779273074,NA 
rayol-farm2_2019-05-05_09-47-22.wav,44100,16,60,1,ndsi,1024,1000,2000,2000,11000,0.697124846216905,NA 
rayol-farm2_2019-05-05_09-49-22.wav,44100,16,60,1,ndsi,1024,1000,2000,2000,11000,0.773160155551231,NA 
rayol-farm2_2019-05-05_09-51-22.wav,44100,16,60,1,ndsi,1024,1000,2000,2000,11000,0.143835289194332,NA 
rayol-farm2_2019-05-05_09-53-22.wav,44100,16,60,1,ndsi,1024,1000,2000,2000,11000,0.591495903346461,NA 
rayol-farm2_2019-05-05_09-55-22.wav,44100,16,60,1,ndsi,1024,1000,2000,2000,11000,0.770578131010236,NA 
rayol-farm2_2019-05-05_09-57-22.wav,44100,16,60,1,ndsi,1024,1000,2000,2000,11000,0.569327148699561,NA 
rayol-farm2_2019-05-05_09-59-22.wav,44100,16,60,1,ndsi,1024,1000,2000,2000,11000,0.768963905367725,NA 
rayol-farm2_2019-05-05_10-01-23.wav,44100,16,60,1,ndsi,1024,1000,2000,2000,11000,0.834451340761788,NA 
rayol-farm2_2019-05-05_10-03-23.wav,44100,16,60,1,ndsi,1024,1000,2000,2000,11000,0.778313190477801,NA 
rayol-farm2_2019-05-05_10-05-23.wav,44100,16,60,1,ndsi,1024,1000,2000,2000,11000,0.629315185146616,NA 
rayol-farm2_2019-05-05_10-07-23.wav,44100,16,60,1,ndsi,1024,1000,2000,2000,11000,0.708054362615764,NA 
rayol-farm2_2019-05-05_10-09-23.wav,44100,16,60,1,ndsi,1024,1000,2000,2000,11000,0.324418592421036,NA 
rayol-farm2_2019-05-05_10-11-23.wav,44100,16,60,1,ndsi,1024,1000,2000,2000,11000,0.865012405870396,NA 
rayol-farm2_2019-05-05_10-13-23.wav,44100,16,60,1,ndsi,1024,1000,2000,2000,11000,0.903769737401106,NA 
rayol-farm2_2019-05-05_10-15-23.wav,44100,16,60,1,ndsi,1024,1000,2000,2000,11000,0.826438533915318,NA 
rayol-farm2_2019-05-05_10-17-24.wav,44100,16,60,1,ndsi,1024,1000,2000,2000,11000,0.530051816162582,NA 
rayol-farm2_2019-05-05_10-19-24.wav,44100,16,60,1,ndsi,1024,1000,2000,2000,11000,0.76792115900955,NA 
rayol-farm2_2019-05-05_10-21-24.wav,44100,16,60,1,ndsi,1024,1000,2000,2000,11000,0.429980815924019,NA 
rayol-farm2_2019-05-05_10-23-24.wav,44100,16,60,1,ndsi,1024,1000,2000,2000,11000,0.82292444328172,NA 
rayol-farm2_2019-05-05_10-25-24.wav,44100,16,60,1,ndsi,1024,1000,2000,2000,11000,0.672999241920245,NA 
rayol-farm2_2019-05-05_10-27-24.wav,44100,16,60,1,ndsi,1024,1000,2000,2000,11000,0.632202512321957,NA 
rayol-farm2_2019-05-05_10-29-24.wav,44100,16,60,1,ndsi,1024,1000,2000,2000,11000,0.349030050745827,NA 
rayol-farm2_2019-05-05_10-31-24.wav,44100,16,60,1,ndsi,1024,1000,2000,2000,11000,0.279702043725829,NA 
rayol-farm2_2019-05-05_10-33-24.wav,44100,16,60,1,ndsi,1024,1000,2000,2000,11000,0.527673516220155,NA 
rayol-farm2_2019-05-05_10-35-25.wav,44100,16,60,1,ndsi,1024,1000,2000,2000,11000,0.846487985526429,NA 
rayol-farm2_2019-05-05_10-37-25.wav,44100,16,60,1,ndsi,1024,1000,2000,2000,11000,0.773796007891838,NA 
rayol-farm2_2019-05-05_10-39-25.wav,44100,16,60,1,ndsi,1024,1000,2000,2000,11000,0.0652372276504966,NA 
rayol-farm2_2019-05-05_10-41-25.wav,44100,16,60,1,ndsi,1024,1000,2000,2000,11000,0.747245622356703,NA 
rayol-farm2_2019-05-05_10-43-25.wav,44100,16,60,1,ndsi,1024,1000,2000,2000,11000,0.761015458813613,NA 
rayol-farm2_2019-05-05_10-45-25.wav,44100,16,60,1,ndsi,1024,1000,2000,2000,11000,0.70322920808588,NA 
rayol-farm2_2019-05-05_10-47-25.wav,44100,16,60,1,ndsi,1024,1000,2000,2000,11000,0.828360869744944,NA 
rayol-farm2_2019-05-05_10-49-25.wav,44100,16,60,1,ndsi,1024,1000,2000,2000,11000,0.696870216785196,NA 
rayol-farm2_2019-05-05_10-51-26.wav,44100,16,60,1,ndsi,1024,1000,2000,2000,11000,0.813656134308969,NA 
rayol-farm2_2019-05-05_10-53-26.wav,44100,16,60,1,ndsi,1024,1000,2000,2000,11000,0.390247518765187,NA 
rayol-farm2_2019-05-05_10-55-26.wav,44100,16,60,1,ndsi,1024,1000,2000,2000,11000,0.832427684101072,NA 
rayol-farm2_2019-05-05_10-57-26.wav,44100,16,60,1,ndsi,1024,1000,2000,2000,11000,0.722575057309734,NA 
rayol-farm2_2019-05-05_10-59-26.wav,44100,16,60,1,ndsi,1024,1000,2000,2000,11000,0.716735214606195,NA 
rayol-farm2_2019-05-05_11-01-26.wav,44100,16,60,1,ndsi,1024,1000,2000,2000,11000,0.82586667977932,NA 
rayol-farm2_2019-05-05_11-03-26.wav,44100,16,60,1,ndsi,1024,1000,2000,2000,11000,0.373433540002022,NA 
rayol-farm2_2019-05-05_11-05-26.wav,44100,16,60,1,ndsi,1024,1000,2000,2000,11000,0.257644543556011,NA 
rayol-farm2_2019-05-05_11-07-27.wav,44100,16,60,1,ndsi,1024,1000,2000,2000,11000,0.530357132547442,NA 
rayol-farm2_2019-05-05_11-09-27.wav,44100,16,60,1,ndsi,1024,1000,2000,2000,11000,0.847748085062575,NA 
rayol-farm2_2019-05-05_11-11-27.wav,44100,16,60,1,ndsi,1024,1000,2000,2000,11000,0.816468814576366,NA 
rayol-farm2_2019-05-05_11-13-27.wav,44100,16,60,1,ndsi,1024,1000,2000,2000,11000,0.814575417820537,NA 
rayol-farm2_2019-05-05_11-15-27.wav,44100,16,60,1,ndsi,1024,1000,2000,2000,11000,0.418195798069773,NA 
rayol-farm2_2019-05-05_11-17-27.wav,44100,16,60,1,ndsi,1024,1000,2000,2000,11000,0.905591899293153,NA 
rayol-farm2_2019-05-05_11-19-27.wav,44100,16,60,1,ndsi,1024,1000,2000,2000,11000,0.877842367539979,NA 
rayol-farm2_2019-05-05_11-21-27.wav,44100,16,60,1,ndsi,1024,1000,2000,2000,11000,0.895921119211462,NA 
rayol-farm2_2019-05-05_11-23-27.wav,44100,16,60,1,ndsi,1024,1000,2000,2000,11000,0.882477208505102,NA 
rayol-farm2_2019-05-05_11-25-28.wav,44100,16,60,1,ndsi,1024,1000,2000,2000,11000,0.727746791377716,NA 
rayol-farm2_2019-05-05_11-27-28.wav,44100,16,60,1,ndsi,1024,1000,2000,2000,11000,0.80614608181779,NA 
rayol-farm2_2019-05-05_11-29-28.wav,44100,16,60,1,ndsi,1024,1000,2000,2000,11000,0.812091969111257,NA 
rayol-farm2_2019-05-05_11-31-28.wav,44100,16,60,1,ndsi,1024,1000,2000,2000,11000,0.841128175208204,NA 
rayol-farm2_2019-05-05_11-33-28.wav,44100,16,60,1,ndsi,1024,1000,2000,2000,11000,0.888354947108986,NA 
rayol-farm2_2019-05-05_11-35-28.wav,44100,16,60,1,ndsi,1024,1000,2000,2000,11000,0.826810714821476,NA 
rayol-farm2_2019-05-05_11-37-28.wav,44100,16,60,1,ndsi,1024,1000,2000,2000,11000,0.679516356117536,NA 
rayol-farm2_2019-05-05_11-39-28.wav,44100,16,60,1,ndsi,1024,1000,2000,2000,11000,0.742694443656721,NA 
rayol-farm2_2019-05-05_11-41-29.wav,44100,16,60,1,ndsi,1024,1000,2000,2000,11000,0.661723250368738,NA 
rayol-farm2_2019-05-05_11-43-29.wav,44100,16,60,1,ndsi,1024,1000,2000,2000,11000,0.761348138138081,NA 
rayol-farm2_2019-05-05_11-45-29.wav,44100,16,60,1,ndsi,1024,1000,2000,2000,11000,0.709220704515464,NA 
rayol-farm2_2019-05-05_11-47-29.wav,44100,16,60,1,ndsi,1024,1000,2000,2000,11000,0.745482788883663,NA 
rayol-farm2_2019-05-05_11-49-29.wav,44100,16,60,1,ndsi,1024,1000,2000,2000,11000,0.86164811025946,NA 
rayol-farm2_2019-05-05_11-51-29.wav,44100,16,60,1,ndsi,1024,1000,2000,2000,11000,0.465131671987844,NA 
rayol-farm2_2019-05-05_11-53-29.wav,44100,16,60,1,ndsi,1024,1000,2000,2000,11000,0.778340974474255,NA 
rayol-farm2_2019-05-05_11-55-29.wav,44100,16,60,1,ndsi,1024,1000,2000,2000,11000,0.832377236454425,NA 
rayol-farm2_2019-05-05_11-57-30.wav,44100,16,60,1,ndsi,1024,1000,2000,2000,11000,0.884334032172457,NA 
rayol-farm2_2019-05-05_11-59-30.wav,44100,16,60,1,ndsi,1024,1000,2000,2000,11000,0.807083521936581,NA 
rayol-farm2_2019-05-05_12-01-30.wav,44100,16,60,1,ndsi,1024,1000,2000,2000,11000,0.728838413680127,NA 
rayol-farm2_2019-05-05_12-03-30.wav,44100,16,60,1,ndsi,1024,1000,2000,2000,11000,0.543374976412285,NA 
rayol-farm2_2019-05-05_12-05-30.wav,44100,16,60,1,ndsi,1024,1000,2000,2000,11000,0.61604688511994,NA 
rayol-farm2_2019-05-05_12-07-30.wav,44100,16,60,1,ndsi,1024,1000,2000,2000,11000,0.834473374943064,NA 
rayol-farm2_2019-05-05_12-09-30.wav,44100,16,60,1,ndsi,1024,1000,2000,2000,11000,0.8862042874597,NA 
rayol-farm2_2019-05-05_12-11-30.wav,44100,16,60,1,ndsi,1024,1000,2000,2000,11000,0.876502777435381,NA 
rayol-farm2_2019-05-05_12-13-31.wav,44100,16,60,1,ndsi,1024,1000,2000,2000,11000,0.816899044344683,NA 
rayol-farm2_2019-05-05_12-15-31.wav,44100,16,60,1,ndsi,1024,1000,2000,2000,11000,0.829788383307509,NA 
rayol-farm2_2019-05-05_12-17-31.wav,44100,16,60,1,ndsi,1024,1000,2000,2000,11000,0.846678069628836,NA 
rayol-farm2_2019-05-05_12-19-31.wav,44100,16,60,1,ndsi,1024,1000,2000,2000,11000,0.528058429628156,NA 
rayol-farm2_2019-05-05_12-21-31.wav,44100,16,60,1,ndsi,1024,1000,2000,2000,11000,0.770533022903552,NA 
rayol-farm2_2019-05-05_12-23-31.wav,44100,16,60,1,ndsi,1024,1000,2000,2000,11000,0.363262608832137,NA 
rayol-farm2_2019-05-05_12-25-31.wav,44100,16,60,1,ndsi,1024,1000,2000,2000,11000,0.62786582079659,NA 
rayol-farm2_2019-05-05_12-27-31.wav,44100,16,60,1,ndsi,1024,1000,2000,2000,11000,0.792716662259452,NA 
rayol-farm2_2019-05-05_12-29-31.wav,44100,16,60,1,ndsi,1024,1000,2000,2000,11000,0.792471884007761,NA 
rayol-farm2_2019-05-05_12-31-32.wav,44100,16,60,1,ndsi,1024,1000,2000,2000,11000,0.793768252077077,NA 
rayol-farm2_2019-05-05_12-33-32.wav,44100,16,60,1,ndsi,1024,1000,2000,2000,11000,0.831998633297416,NA 
rayol-farm2_2019-05-05_12-35-32.wav,44100,16,60,1,ndsi,1024,1000,2000,2000,11000,0.794185420054168,NA 
rayol-farm2_2019-05-05_12-37-32.wav,44100,16,60,1,ndsi,1024,1000,2000,2000,11000,0.329909769008659,NA 
rayol-farm2_2019-05-05_12-39-32.wav,44100,16,60,1,ndsi,1024,1000,2000,2000,11000,0.719814236613909,NA 
rayol-farm2_2019-05-05_12-41-32.wav,44100,16,60,1,ndsi,1024,1000,2000,2000,11000,0.753171831653949,NA 
rayol-farm2_2019-05-05_12-43-32.wav,44100,16,60,1,ndsi,1024,1000,2000,2000,11000,0.645374519239832,NA 
rayol-farm2_2019-05-05_12-45-32.wav,44100,16,60,1,ndsi,1024,1000,2000,2000,11000,0.563588758970749,NA 
rayol-farm2_2019-05-05_12-47-33.wav,44100,16,60,1,ndsi,1024,1000,2000,2000,11000,0.493654335519328,NA 
rayol-farm2_2019-05-05_12-49-33.wav,44100,16,60,1,ndsi,1024,1000,2000,2000,11000,0.651970694881164,NA 
rayol-farm2_2019-05-05_12-51-33.wav,44100,16,60,1,ndsi,1024,1000,2000,2000,11000,0.483976415491186,NA 
rayol-farm2_2019-05-05_12-53-33.wav,44100,16,60,1,ndsi,1024,1000,2000,2000,11000,0.44053200003675,NA 
rayol-farm2_2019-05-05_12-55-33.wav,44100,16,60,1,ndsi,1024,1000,2000,2000,11000,0.682217427382123,NA 
rayol-farm2_2019-05-05_12-57-33.wav,44100,16,60,1,ndsi,1024,1000,2000,2000,11000,0.537935681093425,NA 
rayol-farm2_2019-05-05_12-59-33.wav,44100,16,60,1,ndsi,1024,1000,2000,2000,11000,0.404038226368549,NA 
rayol-farm2_2019-05-05_13-01-33.wav,44100,16,60,1,ndsi,1024,1000,2000,2000,11000,0.623107407482406,NA 
rayol-farm2_2019-05-05_13-03-33.wav,44100,16,60,1,ndsi,1024,1000,2000,2000,11000,0.89313994414888,NA 
rayol-farm2_2019-05-05_13-05-34.wav,44100,16,60,1,ndsi,1024,1000,2000,2000,11000,0.672260716924916,NA 
rayol-farm2_2019-05-05_13-07-34.wav,44100,16,60,1,ndsi,1024,1000,2000,2000,11000,0.797557955937928,NA 
rayol-farm2_2019-05-05_13-09-34.wav,44100,16,60,1,ndsi,1024,1000,2000,2000,11000,0.803268747410677,NA 
rayol-farm2_2019-05-05_13-11-34.wav,44100,16,60,1,ndsi,1024,1000,2000,2000,11000,0.819560570483225,NA 
rayol-farm2_2019-05-05_13-13-34.wav,44100,16,60,1,ndsi,1024,1000,2000,2000,11000,0.83423664953659,NA 
rayol-farm2_2019-05-05_13-15-34.wav,44100,16,60,1,ndsi,1024,1000,2000,2000,11000,0.893762678889692,NA 
rayol-farm2_2019-05-05_13-17-34.wav,44100,16,60,1,ndsi,1024,1000,2000,2000,11000,0.863564246150838,NA 
rayol-farm2_2019-05-05_13-19-34.wav,44100,16,60,1,ndsi,1024,1000,2000,2000,11000,0.863045173866696,NA 
rayol-farm2_2019-05-05_13-21-35.wav,44100,16,60,1,ndsi,1024,1000,2000,2000,11000,0.801023988941261,NA 
rayol-farm2_2019-05-05_13-23-35.wav,44100,16,60,1,ndsi,1024,1000,2000,2000,11000,0.847696228202011,NA 
rayol-farm2_2019-05-05_13-25-35.wav,44100,16,60,1,ndsi,1024,1000,2000,2000,11000,0.899830618965232,NA 
rayol-farm2_2019-05-05_13-27-35.wav,44100,16,60,1,ndsi,1024,1000,2000,2000,11000,0.781196209807162,NA 
rayol-farm2_2019-05-05_13-29-35.wav,44100,16,60,1,ndsi,1024,1000,2000,2000,11000,0.345595185605808,NA 
rayol-farm2_2019-05-05_13-31-35.wav,44100,16,60,1,ndsi,1024,1000,2000,2000,11000,0.777576349667232,NA 
rayol-farm2_2019-05-05_13-33-35.wav,44100,16,60,1,ndsi,1024,1000,2000,2000,11000,0.711331660204879,NA 
rayol-farm2_2019-05-05_13-35-35.wav,44100,16,60,1,ndsi,1024,1000,2000,2000,11000,0.17923429951789,NA 
rayol-farm2_2019-05-05_13-37-36.wav,44100,16,60,1,ndsi,1024,1000,2000,2000,11000,0.402041350115376,NA 
rayol-farm2_2019-05-05_13-39-36.wav,44100,16,60,1,ndsi,1024,1000,2000,2000,11000,0.608028180195092,NA 
rayol-farm2_2019-05-05_13-41-36.wav,44100,16,60,1,ndsi,1024,1000,2000,2000,11000,0.485154822556953,NA 
rayol-farm2_2019-05-05_13-43-36.wav,44100,16,60,1,ndsi,1024,1000,2000,2000,11000,0.27070297977162,NA 
rayol-farm2_2019-05-05_13-45-36.wav,44100,16,60,1,ndsi,1024,1000,2000,2000,11000,-0.271939126927736,NA 
rayol-farm2_2019-05-05_13-47-36.wav,44100,16,60,1,ndsi,1024,1000,2000,2000,11000,-0.385386639260493,NA 
rayol-farm2_2019-05-05_13-49-36.wav,44100,16,60,1,ndsi,1024,1000,2000,2000,11000,0.454998771238391,NA 
rayol-farm2_2019-05-05_13-51-36.wav,44100,16,60,1,ndsi,1024,1000,2000,2000,11000,0.14256573424644,NA 
rayol-farm2_2019-05-05_13-53-36.wav,44100,16,60,1,ndsi,1024,1000,2000,2000,11000,0.310133818736651,NA 
rayol-farm2_2019-05-05_13-55-37.wav,44100,16,60,1,ndsi,1024,1000,2000,2000,11000,0.661146768618088,NA 
rayol-farm2_2019-05-05_13-57-37.wav,44100,16,60,1,ndsi,1024,1000,2000,2000,11000,0.752733813039855,NA 
rayol-farm2_2019-05-05_13-59-37.wav,44100,16,60,1,ndsi,1024,1000,2000,2000,11000,0.709949038659949,NA 
rayol-farm2_2019-05-05_14-01-37.wav,44100,16,60,1,ndsi,1024,1000,2000,2000,11000,0.776187353053967,NA 
rayol-farm2_2019-05-05_14-03-37.wav,44100,16,60,1,ndsi,1024,1000,2000,2000,11000,0.157617571827247,NA 
rayol-farm2_2019-05-05_14-05-37.wav,44100,16,60,1,ndsi,1024,1000,2000,2000,11000,0.773678425634345,NA 
rayol-farm2_2019-05-05_14-07-37.wav,44100,16,60,1,ndsi,1024,1000,2000,2000,11000,0.619418302556319,NA 
rayol-farm2_2019-05-05_14-09-37.wav,44100,16,60,1,ndsi,1024,1000,2000,2000,11000,0.721651396767435,NA 
rayol-farm2_2019-05-05_14-11-38.wav,44100,16,60,1,ndsi,1024,1000,2000,2000,11000,0.858671946190149,NA 
rayol-farm2_2019-05-05_14-13-38.wav,44100,16,60,1,ndsi,1024,1000,2000,2000,11000,0.891164924603041,NA 
rayol-farm2_2019-05-05_14-15-38.wav,44100,16,60,1,ndsi,1024,1000,2000,2000,11000,0.859589123368451,NA 
rayol-farm2_2019-05-05_14-17-38.wav,44100,16,60,1,ndsi,1024,1000,2000,2000,11000,0.902640036868037,NA 
rayol-farm2_2019-05-05_14-19-38.wav,44100,16,60,1,ndsi,1024,1000,2000,2000,11000,0.878049091843681,NA 
rayol-farm2_2019-05-05_14-21-38.wav,44100,16,60,1,ndsi,1024,1000,2000,2000,11000,0.892683714763427,NA 
rayol-farm2_2019-05-05_14-23-38.wav,44100,16,60,1,ndsi,1024,1000,2000,2000,11000,0.541838490358901,NA 
rayol-farm2_2019-05-05_14-25-38.wav,44100,16,60,1,ndsi,1024,1000,2000,2000,11000,0.824309047218204,NA 
rayol-farm2_2019-05-05_14-27-38.wav,44100,16,60,1,ndsi,1024,1000,2000,2000,11000,0.90231380357037,NA 
rayol-farm2_2019-05-05_14-29-39.wav,44100,16,60,1,ndsi,1024,1000,2000,2000,11000,0.883000980967948,NA 
rayol-farm2_2019-05-05_14-31-39.wav,44100,16,60,1,ndsi,1024,1000,2000,2000,11000,0.798346939696882,NA 
rayol-farm2_2019-05-05_14-33-39.wav,44100,16,60,1,ndsi,1024,1000,2000,2000,11000,0.656925878453696,NA 
rayol-farm2_2019-05-05_14-35-39.wav,44100,16,60,1,ndsi,1024,1000,2000,2000,11000,0.889600290044828,NA 
rayol-farm2_2019-05-05_14-37-39.wav,44100,16,60,1,ndsi,1024,1000,2000,2000,11000,0.388651045669176,NA 
rayol-farm2_2019-05-05_14-39-39.wav,44100,16,60,1,ndsi,1024,1000,2000,2000,11000,0.0814898909405161,NA 
rayol-farm2_2019-05-05_14-41-39.wav,44100,16,60,1,ndsi,1024,1000,2000,2000,11000,0.893346707927251,NA 
rayol-farm2_2019-05-05_14-43-39.wav,44100,16,60,1,ndsi,1024,1000,2000,2000,11000,0.895989745068941,NA 
rayol-farm2_2019-05-05_14-45-40.wav,44100,16,60,1,ndsi,1024,1000,2000,2000,11000,0.888750857889321,NA 
rayol-farm2_2019-05-05_14-47-40.wav,44100,16,60,1,ndsi,1024,1000,2000,2000,11000,0.87759086242131,NA 
rayol-farm2_2019-05-05_14-49-40.wav,44100,16,60,1,ndsi,1024,1000,2000,2000,11000,0.884758158307709,NA 
rayol-farm2_2019-05-05_14-51-40.wav,44100,16,60,1,ndsi,1024,1000,2000,2000,11000,0.831852491637644,NA 
rayol-farm2_2019-05-05_14-53-40.wav,44100,16,60,1,ndsi,1024,1000,2000,2000,11000,0.871137044677108,NA 
rayol-farm2_2019-05-05_14-55-40.wav,44100,16,60,1,ndsi,1024,1000,2000,2000,11000,0.834287648416811,NA 
rayol-farm2_2019-05-05_14-57-40.wav,44100,16,60,1,ndsi,1024,1000,2000,2000,11000,0.601577812058781,NA 
rayol-farm2_2019-05-05_14-59-40.wav,44100,16,60,1,ndsi,1024,1000,2000,2000,11000,0.789275619203554,NA 
rayol-farm2_2019-05-05_15-01-41.wav,44100,16,60,1,ndsi,1024,1000,2000,2000,11000,0.841639078328188,NA 
rayol-farm2_2019-05-05_15-03-41.wav,44100,16,60,1,ndsi,1024,1000,2000,2000,11000,0.917021150791337,NA 
rayol-farm2_2019-05-05_15-05-41.wav,44100,16,60,1,ndsi,1024,1000,2000,2000,11000,0.879508985923301,NA 
rayol-farm2_2019-05-05_15-07-41.wav,44100,16,60,1,ndsi,1024,1000,2000,2000,11000,0.480394598756516,NA 
rayol-farm2_2019-05-05_15-09-41.wav,44100,16,60,1,ndsi,1024,1000,2000,2000,11000,0.924677150669411,NA 
rayol-farm2_2019-05-05_15-11-41.wav,44100,16,60,1,ndsi,1024,1000,2000,2000,11000,0.897907473335745,NA 
rayol-farm2_2019-05-05_15-13-41.wav,44100,16,60,1,ndsi,1024,1000,2000,2000,11000,0.889262621755003,NA 
rayol-farm2_2019-05-05_15-15-41.wav,44100,16,60,1,ndsi,1024,1000,2000,2000,11000,0.929323694894609,NA 
rayol-farm2_2019-05-05_15-17-41.wav,44100,16,60,1,ndsi,1024,1000,2000,2000,11000,0.931535874325063,NA 
rayol-farm2_2019-05-05_15-19-42.wav,44100,16,60,1,ndsi,1024,1000,2000,2000,11000,0.82058938651613,NA 
rayol-farm2_2019-05-05_15-21-42.wav,44100,16,60,1,ndsi,1024,1000,2000,2000,11000,0.788805897143992,NA 
rayol-farm2_2019-05-05_15-23-42.wav,44100,16,60,1,ndsi,1024,1000,2000,2000,11000,0.75219217813295,NA 
rayol-farm2_2019-05-05_15-25-42.wav,44100,16,60,1,ndsi,1024,1000,2000,2000,11000,0.841869322560801,NA 
rayol-farm2_2019-05-05_15-27-42.wav,44100,16,60,1,ndsi,1024,1000,2000,2000,11000,0.53803611813259,NA 
rayol-farm2_2019-05-05_15-29-42.wav,44100,16,60,1,ndsi,1024,1000,2000,2000,11000,0.824326256927429,NA 
rayol-farm2_2019-05-05_15-31-42.wav,44100,16,60,1,ndsi,1024,1000,2000,2000,11000,0.860393839915287,NA 
rayol-farm2_2019-05-05_15-33-42.wav,44100,16,60,1,ndsi,1024,1000,2000,2000,11000,0.881410911490368,NA 
rayol-farm2_2019-05-05_15-35-43.wav,44100,16,60,1,ndsi,1024,1000,2000,2000,11000,0.879804910406514,NA 
rayol-farm2_2019-05-05_15-37-43.wav,44100,16,60,1,ndsi,1024,1000,2000,2000,11000,0.884561755367616,NA 
rayol-farm2_2019-05-05_15-39-43.wav,44100,16,60,1,ndsi,1024,1000,2000,2000,11000,0.904615877304695,NA 
rayol-farm2_2019-05-05_15-41-43.wav,44100,16,60,1,ndsi,1024,1000,2000,2000,11000,0.901977309088222,NA 
rayol-farm2_2019-05-05_15-43-43.wav,44100,16,60,1,ndsi,1024,1000,2000,2000,11000,0.947486943741015,NA 
rayol-farm2_2019-05-05_15-45-43.wav,44100,16,60,1,ndsi,1024,1000,2000,2000,11000,0.922168669570683,NA 
rayol-farm2_2019-05-05_15-47-43.wav,44100,16,60,1,ndsi,1024,1000,2000,2000,11000,0.822417475664348,NA 
rayol-farm2_2019-05-05_15-49-43.wav,44100,16,60,1,ndsi,1024,1000,2000,2000,11000,0.480779886622299,NA 
rayol-farm2_2019-05-05_15-51-44.wav,44100,16,60,1,ndsi,1024,1000,2000,2000,11000,0.929993435993854,NA 
rayol-farm2_2019-05-05_15-53-44.wav,44100,16,60,1,ndsi,1024,1000,2000,2000,11000,0.930299006992089,NA 
rayol-farm2_2019-05-05_15-55-44.wav,44100,16,60,1,ndsi,1024,1000,2000,2000,11000,0.938978473957747,NA 
rayol-farm2_2019-05-05_15-57-44.wav,44100,16,60,1,ndsi,1024,1000,2000,2000,11000,0.92813491136556,NA 
rayol-farm2_2019-05-05_15-59-44.wav,44100,16,60,1,ndsi,1024,1000,2000,2000,11000,0.878303039217828,NA 
rayol-farm2_2019-05-05_16-01-44.wav,44100,16,60,1,ndsi,1024,1000,2000,2000,11000,0.876102993687627,NA 
rayol-farm2_2019-05-05_16-03-44.wav,44100,16,60,1,ndsi,1024,1000,2000,2000,11000,0.915088000411447,NA 
rayol-farm2_2019-05-05_16-05-44.wav,44100,16,60,1,ndsi,1024,1000,2000,2000,11000,0.85433948641145,NA 
rayol-farm2_2019-05-05_16-07-45.wav,44100,16,60,1,ndsi,1024,1000,2000,2000,11000,0.719751326202938,NA 
rayol-farm2_2019-05-05_16-09-45.wav,44100,16,60,1,ndsi,1024,1000,2000,2000,11000,0.797794768629201,NA 
rayol-farm2_2019-05-05_16-11-45.wav,44100,16,60,1,ndsi,1024,1000,2000,2000,11000,0.35693162179701,NA 
rayol-farm2_2019-05-05_16-13-45.wav,44100,16,60,1,ndsi,1024,1000,2000,2000,11000,0.601031129196491,NA 
rayol-farm2_2019-05-05_16-15-45.wav,44100,16,60,1,ndsi,1024,1000,2000,2000,11000,0.77616647610441,NA 
rayol-farm2_2019-05-05_16-17-45.wav,44100,16,60,1,ndsi,1024,1000,2000,2000,11000,0.406302683541436,NA 
rayol-farm2_2019-05-05_16-19-45.wav,44100,16,60,1,ndsi,1024,1000,2000,2000,11000,0.629553147991028,NA 
rayol-farm2_2019-05-05_16-21-45.wav,44100,16,60,1,ndsi,1024,1000,2000,2000,11000,0.715144656979073,NA 
rayol-farm2_2019-05-05_16-23-45.wav,44100,16,60,1,ndsi,1024,1000,2000,2000,11000,0.822688280532267,NA 
rayol-farm2_2019-05-05_16-25-46.wav,44100,16,60,1,ndsi,1024,1000,2000,2000,11000,0.474188065113302,NA 
rayol-farm2_2019-05-05_16-27-46.wav,44100,16,60,1,ndsi,1024,1000,2000,2000,11000,0.849857140108417,NA 
rayol-farm2_2019-05-05_16-29-46.wav,44100,16,60,1,ndsi,1024,1000,2000,2000,11000,0.880981338821948,NA 
rayol-farm2_2019-05-05_16-31-46.wav,44100,16,60,1,ndsi,1024,1000,2000,2000,11000,0.817670326465636,NA 
rayol-farm2_2019-05-05_16-33-46.wav,44100,16,60,1,ndsi,1024,1000,2000,2000,11000,0.747003975520762,NA 
rayol-farm2_2019-05-05_16-35-46.wav,44100,16,60,1,ndsi,1024,1000,2000,2000,11000,0.663185698592426,NA 
rayol-farm2_2019-05-05_16-37-46.wav,44100,16,60,1,ndsi,1024,1000,2000,2000,11000,0.355685430015024,NA 
rayol-farm2_2019-05-05_16-39-46.wav,44100,16,60,1,ndsi,1024,1000,2000,2000,11000,0.604342934622552,NA 
rayol-farm2_2019-05-05_16-41-47.wav,44100,16,60,1,ndsi,1024,1000,2000,2000,11000,0.862747776042298,NA 
rayol-farm2_2019-05-05_16-43-47.wav,44100,16,60,1,ndsi,1024,1000,2000,2000,11000,0.770788648491359,NA 
rayol-farm2_2019-05-05_16-45-47.wav,44100,16,60,1,ndsi,1024,1000,2000,2000,11000,0.852809085092693,NA 
rayol-farm2_2019-05-05_16-47-47.wav,44100,16,60,1,ndsi,1024,1000,2000,2000,11000,0.896508437852826,NA 
rayol-farm2_2019-05-05_16-49-47.wav,44100,16,60,1,ndsi,1024,1000,2000,2000,11000,0.893764953241011,NA 
rayol-farm2_2019-05-05_16-51-47.wav,44100,16,60,1,ndsi,1024,1000,2000,2000,11000,0.838877008934299,NA 
rayol-farm2_2019-05-05_16-53-47.wav,44100,16,60,1,ndsi,1024,1000,2000,2000,11000,0.846730842469922,NA 
rayol-farm2_2019-05-05_16-55-47.wav,44100,16,60,1,ndsi,1024,1000,2000,2000,11000,0.881060566720526,NA 
rayol-farm2_2019-05-05_16-57-48.wav,44100,16,60,1,ndsi,1024,1000,2000,2000,11000,0.348278967481997,NA 
rayol-farm2_2019-05-05_16-59-48.wav,44100,16,60,1,ndsi,1024,1000,2000,2000,11000,0.880042865115334,NA 
rayol-farm2_2019-05-05_17-01-48.wav,44100,16,60,1,ndsi,1024,1000,2000,2000,11000,0.894348787843581,NA 
rayol-farm2_2019-05-05_17-03-48.wav,44100,16,60,1,ndsi,1024,1000,2000,2000,11000,0.878816587681826,NA 
rayol-farm2_2019-05-05_17-05-48.wav,44100,16,60,1,ndsi,1024,1000,2000,2000,11000,0.838064981729628,NA 
rayol-farm2_2019-05-05_17-07-48.wav,44100,16,60,1,ndsi,1024,1000,2000,2000,11000,0.768700625101968,NA 
rayol-farm2_2019-05-05_17-09-48.wav,44100,16,60,1,ndsi,1024,1000,2000,2000,11000,0.59415692613516,NA 
rayol-farm2_2019-05-05_17-11-48.wav,44100,16,60,1,ndsi,1024,1000,2000,2000,11000,0.813588711422904,NA 
rayol-farm2_2019-05-05_17-13-49.wav,44100,16,60,1,ndsi,1024,1000,2000,2000,11000,0.894681774466716,NA 
rayol-farm2_2019-05-05_17-15-49.wav,44100,16,60,1,ndsi,1024,1000,2000,2000,11000,0.2906881027447,NA 
rayol-farm2_2019-05-05_17-17-49.wav,44100,16,60,1,ndsi,1024,1000,2000,2000,11000,0.88907066413919,NA 
rayol-farm2_2019-05-05_17-19-49.wav,44100,16,60,1,ndsi,1024,1000,2000,2000,11000,0.844113073972299,NA 
rayol-farm2_2019-05-05_17-21-49.wav,44100,16,60,1,ndsi,1024,1000,2000,2000,11000,0.765313223802729,NA 
rayol-farm2_2019-05-05_17-23-49.wav,44100,16,60,1,ndsi,1024,1000,2000,2000,11000,0.798628128000262,NA 
rayol-farm2_2019-05-05_17-25-49.wav,44100,16,60,1,ndsi,1024,1000,2000,2000,11000,0.900320170675715,NA 
rayol-farm2_2019-05-05_17-27-49.wav,44100,16,60,1,ndsi,1024,1000,2000,2000,11000,-0.179106568170275,NA 
rayol-farm2_2019-05-05_17-29-50.wav,44100,16,60,1,ndsi,1024,1000,2000,2000,11000,0.893003329913924,NA 
rayol-farm2_2019-05-05_17-31-50.wav,44100,16,60,1,ndsi,1024,1000,2000,2000,11000,0.846956880093548,NA 
rayol-farm2_2019-05-05_17-33-50.wav,44100,16,60,1,ndsi,1024,1000,2000,2000,11000,0.893028193989032,NA 
rayol-farm2_2019-05-05_17-35-50.wav,44100,16,60,1,ndsi,1024,1000,2000,2000,11000,0.900086117359375,NA 
rayol-farm2_2019-05-05_17-37-50.wav,44100,16,60,1,ndsi,1024,1000,2000,2000,11000,0.859440487546652,NA 
rayol-farm2_2019-05-05_17-39-50.wav,44100,16,60,1,ndsi,1024,1000,2000,2000,11000,0.897208780034051,NA 
rayol-farm2_2019-05-05_17-41-50.wav,44100,16,60,1,ndsi,1024,1000,2000,2000,11000,0.91537156341971,NA 
rayol-farm2_2019-05-05_17-43-50.wav,44100,16,60,1,ndsi,1024,1000,2000,2000,11000,0.885864207178998,NA 
rayol-farm2_2019-05-05_17-45-50.wav,44100,16,60,1,ndsi,1024,1000,2000,2000,11000,0.0800748993367858,NA 
rayol-farm2_2019-05-05_17-47-51.wav,44100,16,60,1,ndsi,1024,1000,2000,2000,11000,0.898443455832367,NA 
rayol-farm2_2019-05-05_17-49-51.wav,44100,16,60,1,ndsi,1024,1000,2000,2000,11000,0.970961911363765,NA 
rayol-farm2_2019-05-05_17-51-51.wav,44100,16,60,1,ndsi,1024,1000,2000,2000,11000,0.965407526867274,NA 
rayol-farm2_2019-05-05_17-53-51.wav,44100,16,60,1,ndsi,1024,1000,2000,2000,11000,0.621928038754287,NA 
rayol-farm2_2019-05-05_17-55-51.wav,44100,16,60,1,ndsi,1024,1000,2000,2000,11000,0.818807292149586,NA 
rayol-farm2_2019-05-05_17-57-51.wav,44100,16,60,1,ndsi,1024,1000,2000,2000,11000,0.861867553743285,NA 
rayol-farm2_2019-05-05_17-59-51.wav,44100,16,60,1,ndsi,1024,1000,2000,2000,11000,0.333992139829891,NA 
rayol-farm2_2019-05-05_18-01-51.wav,44100,16,60,1,ndsi,1024,1000,2000,2000,11000,0.460435310284752,NA 
rayol-farm2_2019-05-05_18-03-52.wav,44100,16,60,1,ndsi,1024,1000,2000,2000,11000,0.878218449127949,NA 
rayol-farm2_2019-05-05_18-05-52.wav,44100,16,60,1,ndsi,1024,1000,2000,2000,11000,0.919146539132273,NA 
rayol-farm2_2019-05-05_18-07-52.wav,44100,16,60,1,ndsi,1024,1000,2000,2000,11000,0.893576083000637,NA 
rayol-farm2_2019-05-05_18-09-52.wav,44100,16,60,1,ndsi,1024,1000,2000,2000,11000,0.734235186287131,NA 
rayol-farm2_2019-05-05_18-11-52.wav,44100,16,60,1,ndsi,1024,1000,2000,2000,11000,0.926697950359003,NA 
rayol-farm2_2019-05-05_18-13-52.wav,44100,16,60,1,ndsi,1024,1000,2000,2000,11000,0.92941714482159,NA 
rayol-farm2_2019-05-05_18-15-52.wav,44100,16,60,1,ndsi,1024,1000,2000,2000,11000,0.969875089685876,NA 
rayol-farm2_2019-05-05_18-17-52.wav,44100,16,60,1,ndsi,1024,1000,2000,2000,11000,0.952461764405925,NA 
rayol-farm2_2019-05-05_18-19-53.wav,44100,16,60,1,ndsi,1024,1000,2000,2000,11000,0.914485870856813,NA 
rayol-farm2_2019-05-05_18-21-53.wav,44100,16,60,1,ndsi,1024,1000,2000,2000,11000,0.915831975299913,NA 
rayol-farm2_2019-05-05_18-23-53.wav,44100,16,60,1,ndsi,1024,1000,2000,2000,11000,0.917706302700026,NA 
rayol-farm2_2019-05-05_18-25-53.wav,44100,16,60,1,ndsi,1024,1000,2000,2000,11000,0.912603594602656,NA 
rayol-farm2_2019-05-05_18-27-53.wav,44100,16,60,1,ndsi,1024,1000,2000,2000,11000,0.912048106015266,NA 
rayol-farm2_2019-05-05_18-29-53.wav,44100,16,60,1,ndsi,1024,1000,2000,2000,11000,0.914677723792742,NA 
rayol-farm2_2019-05-05_18-31-53.wav,44100,16,60,1,ndsi,1024,1000,2000,2000,11000,0.914336546266856,NA 
rayol-farm2_2019-05-05_18-33-53.wav,44100,16,60,1,ndsi,1024,1000,2000,2000,11000,0.913738882110117,NA 
rayol-farm2_2019-05-05_18-35-54.wav,44100,16,60,1,ndsi,1024,1000,2000,2000,11000,0.910374149787931,NA 
rayol-farm2_2019-05-05_18-37-54.wav,44100,16,60,1,ndsi,1024,1000,2000,2000,11000,0.923365454975116,NA 
rayol-farm2_2019-05-05_18-39-54.wav,44100,16,60,1,ndsi,1024,1000,2000,2000,11000,0.91516716179919,NA 
rayol-farm2_2019-05-05_18-41-54.wav,44100,16,60,1,ndsi,1024,1000,2000,2000,11000,0.910217388389378,NA 
rayol-farm2_2019-05-05_18-43-54.wav,44100,16,60,1,ndsi,1024,1000,2000,2000,11000,0.920471873639101,NA 
rayol-farm2_2019-05-05_18-45-54.wav,44100,16,60,1,ndsi,1024,1000,2000,2000,11000,0.912406784588564,NA 
rayol-farm2_2019-05-05_18-47-54.wav,44100,16,60,1,ndsi,1024,1000,2000,2000,11000,0.914608412048714,NA 
rayol-farm2_2019-05-05_18-49-54.wav,44100,16,60,1,ndsi,1024,1000,2000,2000,11000,0.918655807398878,NA 
rayol-farm2_2019-05-05_18-51-54.wav,44100,16,60,1,ndsi,1024,1000,2000,2000,11000,0.917337277206277,NA 
rayol-farm2_2019-05-05_18-53-55.wav,44100,16,60,1,ndsi,1024,1000,2000,2000,11000,0.916170959438778,NA 
rayol-farm2_2019-05-05_18-55-55.wav,44100,16,60,1,ndsi,1024,1000,2000,2000,11000,0.911609223203527,NA 
rayol-farm2_2019-05-05_18-57-55.wav,44100,16,60,1,ndsi,1024,1000,2000,2000,11000,0.920706811021506,NA 
rayol-farm2_2019-05-05_18-59-55.wav,44100,16,60,1,ndsi,1024,1000,2000,2000,11000,0.914360340032105,NA 
rayol-farm2_2019-05-05_19-01-55.wav,44100,16,60,1,ndsi,1024,1000,2000,2000,11000,0.911411638819458,NA 
rayol-farm2_2019-05-05_19-03-55.wav,44100,16,60,1,ndsi,1024,1000,2000,2000,11000,0.929618662147621,NA 
rayol-farm2_2019-05-05_19-05-55.wav,44100,16,60,1,ndsi,1024,1000,2000,2000,11000,0.914529862925719,NA 
rayol-farm2_2019-05-05_19-07-55.wav,44100,16,60,1,ndsi,1024,1000,2000,2000,11000,0.915789159659415,NA 
rayol-farm2_2019-05-05_19-09-56.wav,44100,16,60,1,ndsi,1024,1000,2000,2000,11000,0.915230364452956,NA 
rayol-farm2_2019-05-05_19-11-56.wav,44100,16,60,1,ndsi,1024,1000,2000,2000,11000,0.949528104867506,NA 
rayol-farm2_2019-05-05_19-13-56.wav,44100,16,60,1,ndsi,1024,1000,2000,2000,11000,0.91607033837158,NA 
rayol-farm2_2019-05-05_19-15-56.wav,44100,16,60,1,ndsi,1024,1000,2000,2000,11000,0.919754640925028,NA 
rayol-farm2_2019-05-05_19-17-56.wav,44100,16,60,1,ndsi,1024,1000,2000,2000,11000,0.911813130429798,NA 
rayol-farm2_2019-05-05_19-19-56.wav,44100,16,60,1,ndsi,1024,1000,2000,2000,11000,0.919406179967279,NA 
rayol-farm2_2019-05-05_19-21-56.wav,44100,16,60,1,ndsi,1024,1000,2000,2000,11000,0.9127512308159,NA 
rayol-farm2_2019-05-05_19-23-56.wav,44100,16,60,1,ndsi,1024,1000,2000,2000,11000,0.904641537665994,NA 
rayol-farm2_2019-05-05_19-25-57.wav,44100,16,60,1,ndsi,1024,1000,2000,2000,11000,0.900352325839258,NA 
rayol-farm2_2019-05-05_19-27-57.wav,44100,16,60,1,ndsi,1024,1000,2000,2000,11000,0.888128811907457,NA 
rayol-farm2_2019-05-05_19-29-57.wav,44100,16,60,1,ndsi,1024,1000,2000,2000,11000,0.899283744743119,NA 
rayol-farm2_2019-05-05_19-31-57.wav,44100,16,60,1,ndsi,1024,1000,2000,2000,11000,0.883734153124899,NA 
rayol-farm2_2019-05-05_19-33-57.wav,44100,16,60,1,ndsi,1024,1000,2000,2000,11000,0.889019890679971,NA 
rayol-farm2_2019-05-05_19-35-57.wav,44100,16,60,1,ndsi,1024,1000,2000,2000,11000,0.891999266942908,NA 
rayol-farm2_2019-05-05_19-37-57.wav,44100,16,60,1,ndsi,1024,1000,2000,2000,11000,0.925872428632633,NA 
rayol-farm2_2019-05-05_19-39-57.wav,44100,16,60,1,ndsi,1024,1000,2000,2000,11000,0.914243785262615,NA 
rayol-farm2_2019-05-05_19-41-57.wav,44100,16,60,1,ndsi,1024,1000,2000,2000,11000,0.901945850845271,NA 
rayol-farm2_2019-05-05_19-43-58.wav,44100,16,60,1,ndsi,1024,1000,2000,2000,11000,0.883642174808606,NA 
rayol-farm2_2019-05-05_19-45-58.wav,44100,16,60,1,ndsi,1024,1000,2000,2000,11000,0.901769822868669,NA 
rayol-farm2_2019-05-05_19-47-58.wav,44100,16,60,1,ndsi,1024,1000,2000,2000,11000,0.879206276580145,NA 
rayol-farm2_2019-05-05_19-49-58.wav,44100,16,60,1,ndsi,1024,1000,2000,2000,11000,0.885158269629512,NA 
rayol-farm2_2019-05-05_19-51-58.wav,44100,16,60,1,ndsi,1024,1000,2000,2000,11000,0.870035775647637,NA 
rayol-farm2_2019-05-05_19-53-58.wav,44100,16,60,1,ndsi,1024,1000,2000,2000,11000,0.876234286881243,NA 
rayol-farm2_2019-05-05_19-55-58.wav,44100,16,60,1,ndsi,1024,1000,2000,2000,11000,0.902751459435748,NA 
rayol-farm2_2019-05-05_19-57-58.wav,44100,16,60,1,ndsi,1024,1000,2000,2000,11000,0.89077146936732,NA 
rayol-farm2_2019-05-05_19-59-59.wav,44100,16,60,1,ndsi,1024,1000,2000,2000,11000,0.935720813026283,NA 
rayol-farm2_2019-05-05_20-01-59.wav,44100,16,60,1,ndsi,1024,1000,2000,2000,11000,0.928138524701797,NA 
rayol-farm2_2019-05-05_20-03-59.wav,44100,16,60,1,ndsi,1024,1000,2000,2000,11000,0.89683416392011,NA 
rayol-farm2_2019-05-05_20-05-59.wav,44100,16,60,1,ndsi,1024,1000,2000,2000,11000,0.884343380240065,NA 
rayol-farm2_2019-05-05_20-07-59.wav,44100,16,60,1,ndsi,1024,1000,2000,2000,11000,0.893645959727054,NA 
rayol-farm2_2019-05-05_20-09-59.wav,44100,16,60,1,ndsi,1024,1000,2000,2000,11000,0.953399815578509,NA 
rayol-farm2_2019-05-05_20-11-59.wav,44100,16,60,1,ndsi,1024,1000,2000,2000,11000,0.911788241234818,NA 
rayol-farm2_2019-05-05_20-13-59.wav,44100,16,60,1,ndsi,1024,1000,2000,2000,11000,0.911705963372132,NA 
rayol-farm2_2019-05-05_20-15-59.wav,44100,16,60,1,ndsi,1024,1000,2000,2000,11000,0.89623531024982,NA 
rayol-farm2_2019-05-05_20-18-00.wav,44100,16,60,1,ndsi,1024,1000,2000,2000,11000,0.869950518278662,NA 
rayol-farm2_2019-05-05_20-20-00.wav,44100,16,60,1,ndsi,1024,1000,2000,2000,11000,0.886889738032246,NA 
rayol-farm2_2019-05-05_20-22-00.wav,44100,16,60,1,ndsi,1024,1000,2000,2000,11000,0.860819064225597,NA 
rayol-farm2_2019-05-05_20-24-00.wav,44100,16,60,1,ndsi,1024,1000,2000,2000,11000,0.893368357805787,NA 
rayol-farm2_2019-05-05_20-26-00.wav,44100,16,60,1,ndsi,1024,1000,2000,2000,11000,0.886241437886903,NA 
rayol-farm2_2019-05-05_20-28-00.wav,44100,16,60,1,ndsi,1024,1000,2000,2000,11000,0.89208351028204,NA 
rayol-farm2_2019-05-05_20-30-00.wav,44100,16,60,1,ndsi,1024,1000,2000,2000,11000,0.899405602999996,NA 
rayol-farm2_2019-05-05_20-32-00.wav,44100,16,60,1,ndsi,1024,1000,2000,2000,11000,0.884760448163753,NA 
rayol-farm2_2019-05-05_20-34-01.wav,44100,16,60,1,ndsi,1024,1000,2000,2000,11000,0.871129326348698,NA 
rayol-farm2_2019-05-05_20-36-01.wav,44100,16,60,1,ndsi,1024,1000,2000,2000,11000,0.89763981650459,NA 
rayol-farm2_2019-05-05_20-38-01.wav,44100,16,60,1,ndsi,1024,1000,2000,2000,11000,0.881803031274882,NA 
rayol-farm2_2019-05-05_20-40-01.wav,44100,16,60,1,ndsi,1024,1000,2000,2000,11000,0.896853257831707,NA 
rayol-farm2_2019-05-05_20-42-01.wav,44100,16,60,1,ndsi,1024,1000,2000,2000,11000,0.896613347374747,NA 
rayol-farm2_2019-05-05_20-44-01.wav,44100,16,60,1,ndsi,1024,1000,2000,2000,11000,0.905905070563054,NA 
rayol-farm2_2019-05-05_20-46-01.wav,44100,16,60,1,ndsi,1024,1000,2000,2000,11000,0.86411086890466,NA 
rayol-farm2_2019-05-05_20-48-01.wav,44100,16,60,1,ndsi,1024,1000,2000,2000,11000,0.89537463786431,NA 
rayol-farm2_2019-05-05_20-50-01.wav,44100,16,60,1,ndsi,1024,1000,2000,2000,11000,0.900390717706614,NA 
rayol-farm2_2019-05-05_20-52-02.wav,44100,16,60,1,ndsi,1024,1000,2000,2000,11000,0.856998970033742,NA 
rayol-farm2_2019-05-05_20-54-02.wav,44100,16,60,1,ndsi,1024,1000,2000,2000,11000,0.858338373974456,NA 
rayol-farm2_2019-05-05_20-56-02.wav,44100,16,60,1,ndsi,1024,1000,2000,2000,11000,0.89923993897894,NA 
rayol-farm2_2019-05-05_20-58-02.wav,44100,16,60,1,ndsi,1024,1000,2000,2000,11000,0.880878833536181,NA 
rayol-farm2_2019-05-05_21-00-02.wav,44100,16,60,1,ndsi,1024,1000,2000,2000,11000,0.8588159261118,NA 
rayol-farm2_2019-05-05_21-02-02.wav,44100,16,60,1,ndsi,1024,1000,2000,2000,11000,0.814955757720861,NA 
rayol-farm2_2019-05-05_21-04-02.wav,44100,16,60,1,ndsi,1024,1000,2000,2000,11000,0.86878225816129,NA 
rayol-farm2_2019-05-05_21-06-02.wav,44100,16,60,1,ndsi,1024,1000,2000,2000,11000,0.784417181122363,NA 
rayol-farm2_2019-05-05_21-08-03.wav,44100,16,60,1,ndsi,1024,1000,2000,2000,11000,0.775136592293642,NA 
rayol-farm2_2019-05-05_21-10-03.wav,44100,16,60,1,ndsi,1024,1000,2000,2000,11000,0.863182718483271,NA 
rayol-farm2_2019-05-05_21-12-03.wav,44100,16,60,1,ndsi,1024,1000,2000,2000,11000,0.819153015772968,NA 
rayol-farm2_2019-05-05_21-14-03.wav,44100,16,60,1,ndsi,1024,1000,2000,2000,11000,0.852744840066572,NA 
rayol-farm2_2019-05-05_21-16-03.wav,44100,16,60,1,ndsi,1024,1000,2000,2000,11000,0.817976637598728,NA 
rayol-farm2_2019-05-05_21-18-03.wav,44100,16,60,1,ndsi,1024,1000,2000,2000,11000,0.815777759829906,NA 
rayol-farm2_2019-05-05_21-20-03.wav,44100,16,60,1,ndsi,1024,1000,2000,2000,11000,0.853084033496524,NA 
rayol-farm2_2019-05-05_21-22-03.wav,44100,16,60,1,ndsi,1024,1000,2000,2000,11000,0.832116560265418,NA 
rayol-farm2_2019-05-05_21-24-04.wav,44100,16,60,1,ndsi,1024,1000,2000,2000,11000,0.786266014227789,NA 
rayol-farm2_2019-05-05_21-26-04.wav,44100,16,60,1,ndsi,1024,1000,2000,2000,11000,0.74888602651562,NA 
rayol-farm2_2019-05-05_21-28-04.wav,44100,16,60,1,ndsi,1024,1000,2000,2000,11000,0.800139275948576,NA 
rayol-farm2_2019-05-05_21-30-04.wav,44100,16,60,1,ndsi,1024,1000,2000,2000,11000,0.780233348788998,NA 
rayol-farm2_2019-05-05_21-32-04.wav,44100,16,60,1,ndsi,1024,1000,2000,2000,11000,0.862218694859884,NA 
rayol-farm2_2019-05-05_21-34-04.wav,44100,16,60,1,ndsi,1024,1000,2000,2000,11000,0.786728141445017,NA 
rayol-farm2_2019-05-05_21-36-04.wav,44100,16,60,1,ndsi,1024,1000,2000,2000,11000,0.770616679396102,NA 
rayol-farm2_2019-05-05_21-38-04.wav,44100,16,60,1,ndsi,1024,1000,2000,2000,11000,0.81722645177418,NA 
rayol-farm2_2019-05-05_21-40-04.wav,44100,16,60,1,ndsi,1024,1000,2000,2000,11000,0.811627108968541,NA 
rayol-farm2_2019-05-05_21-42-05.wav,44100,16,60,1,ndsi,1024,1000,2000,2000,11000,0.87076853008235,NA 
rayol-farm2_2019-05-05_21-44-05.wav,44100,16,60,1,ndsi,1024,1000,2000,2000,11000,0.880663905223545,NA 
rayol-farm2_2019-05-05_21-46-05.wav,44100,16,60,1,ndsi,1024,1000,2000,2000,11000,0.891086637415934,NA 
rayol-farm2_2019-05-05_21-48-05.wav,44100,16,60,1,ndsi,1024,1000,2000,2000,11000,0.883109708711255,NA 
rayol-farm2_2019-05-05_21-50-05.wav,44100,16,60,1,ndsi,1024,1000,2000,2000,11000,0.845093282992266,NA 
rayol-farm2_2019-05-05_21-52-05.wav,44100,16,60,1,ndsi,1024,1000,2000,2000,11000,0.86695453140635,NA 
rayol-farm2_2019-05-05_21-54-05.wav,44100,16,60,1,ndsi,1024,1000,2000,2000,11000,0.854678537921321,NA 
rayol-farm2_2019-05-05_21-56-05.wav,44100,16,60,1,ndsi,1024,1000,2000,2000,11000,0.800798273133496,NA 
rayol-farm2_2019-05-05_21-58-06.wav,44100,16,60,1,ndsi,1024,1000,2000,2000,11000,0.838725239790279,NA 
rayol-farm2_2019-05-05_22-00-06.wav,44100,16,60,1,ndsi,1024,1000,2000,2000,11000,0.841080092018284,NA 
rayol-farm2_2019-05-05_22-02-06.wav,44100,16,60,1,ndsi,1024,1000,2000,2000,11000,0.838449625501569,NA 
rayol-farm2_2019-05-05_22-04-06.wav,44100,16,60,1,ndsi,1024,1000,2000,2000,11000,0.734500091022135,NA 
rayol-farm2_2019-05-05_22-06-06.wav,44100,16,60,1,ndsi,1024,1000,2000,2000,11000,0.800095211814207,NA 
rayol-farm2_2019-05-05_22-08-06.wav,44100,16,60,1,ndsi,1024,1000,2000,2000,11000,0.828320917329676,NA 
rayol-farm2_2019-05-05_22-10-06.wav,44100,16,60,1,ndsi,1024,1000,2000,2000,11000,0.765066849538441,NA 
rayol-farm2_2019-05-05_22-12-06.wav,44100,16,60,1,ndsi,1024,1000,2000,2000,11000,0.855081164412858,NA 
rayol-farm2_2019-05-05_22-14-07.wav,44100,16,60,1,ndsi,1024,1000,2000,2000,11000,0.805555898841153,NA 
rayol-farm2_2019-05-05_22-16-07.wav,44100,16,60,1,ndsi,1024,1000,2000,2000,11000,0.811562750938493,NA 
rayol-farm2_2019-05-05_22-18-07.wav,44100,16,60,1,ndsi,1024,1000,2000,2000,11000,0.856014151738041,NA 
rayol-farm2_2019-05-05_22-20-07.wav,44100,16,60,1,ndsi,1024,1000,2000,2000,11000,0.799106185252709,NA 
rayol-farm2_2019-05-05_22-22-07.wav,44100,16,60,1,ndsi,1024,1000,2000,2000,11000,0.761419283011869,NA 
rayol-farm2_2019-05-05_22-24-07.wav,44100,16,60,1,ndsi,1024,1000,2000,2000,11000,0.84057994344415,NA 
rayol-farm2_2019-05-05_22-26-07.wav,44100,16,60,1,ndsi,1024,1000,2000,2000,11000,0.788904774234315,NA 
rayol-farm2_2019-05-05_22-28-07.wav,44100,16,60,1,ndsi,1024,1000,2000,2000,11000,0.83740784836723,NA 
rayol-farm2_2019-05-05_22-30-08.wav,44100,16,60,1,ndsi,1024,1000,2000,2000,11000,0.802662890362315,NA 
rayol-farm2_2019-05-05_22-32-08.wav,44100,16,60,1,ndsi,1024,1000,2000,2000,11000,0.822346613402355,NA 
rayol-farm2_2019-05-05_22-34-08.wav,44100,16,60,1,ndsi,1024,1000,2000,2000,11000,0.804330473371214,NA 
rayol-farm2_2019-05-05_22-36-08.wav,44100,16,60,1,ndsi,1024,1000,2000,2000,11000,0.820949063132706,NA 
rayol-farm2_2019-05-05_22-38-08.wav,44100,16,60,1,ndsi,1024,1000,2000,2000,11000,0.786020763086456,NA 
rayol-farm2_2019-05-05_22-40-08.wav,44100,16,60,1,ndsi,1024,1000,2000,2000,11000,0.839059988472395,NA 
rayol-farm2_2019-05-05_22-42-08.wav,44100,16,60,1,ndsi,1024,1000,2000,2000,11000,0.816861025217189,NA 
rayol-farm2_2019-05-05_22-44-08.wav,44100,16,60,1,ndsi,1024,1000,2000,2000,11000,0.748382199010779,NA 
rayol-farm2_2019-05-05_22-46-09.wav,44100,16,60,1,ndsi,1024,1000,2000,2000,11000,0.751335026053945,NA 
rayol-farm2_2019-05-05_22-48-09.wav,44100,16,60,1,ndsi,1024,1000,2000,2000,11000,0.747371254090373,NA 
rayol-farm2_2019-05-05_22-50-09.wav,44100,16,60,1,ndsi,1024,1000,2000,2000,11000,0.68299391959891,NA 
rayol-farm2_2019-05-05_22-52-09.wav,44100,16,60,1,ndsi,1024,1000,2000,2000,11000,0.753504493219299,NA 
rayol-farm2_2019-05-05_22-54-09.wav,44100,16,60,1,ndsi,1024,1000,2000,2000,11000,0.724477716809787,NA 
rayol-farm2_2019-05-05_22-56-09.wav,44100,16,60,1,ndsi,1024,1000,2000,2000,11000,0.783519059305119,NA 
rayol-farm2_2019-05-05_22-58-09.wav,44100,16,60,1,ndsi,1024,1000,2000,2000,11000,0.782680579335125,NA 
rayol-farm2_2019-05-05_23-00-09.wav,44100,16,60,1,ndsi,1024,1000,2000,2000,11000,0.809150459289682,NA 
rayol-farm2_2019-05-05_23-02-09.wav,44100,16,60,1,ndsi,1024,1000,2000,2000,11000,0.794436068621151,NA 
rayol-farm2_2019-05-05_23-04-10.wav,44100,16,60,1,ndsi,1024,1000,2000,2000,11000,0.758138652496758,NA 
rayol-farm2_2019-05-05_23-06-10.wav,44100,16,60,1,ndsi,1024,1000,2000,2000,11000,0.756952644701758,NA 
rayol-farm2_2019-05-05_23-08-10.wav,44100,16,60,1,ndsi,1024,1000,2000,2000,11000,0.765400861905154,NA 
rayol-farm2_2019-05-05_23-10-10.wav,44100,16,60,1,ndsi,1024,1000,2000,2000,11000,0.812811433565786,NA 
rayol-farm2_2019-05-05_23-12-10.wav,44100,16,60,1,ndsi,1024,1000,2000,2000,11000,0.671126261327935,NA 
rayol-farm2_2019-05-05_23-14-10.wav,44100,16,60,1,ndsi,1024,1000,2000,2000,11000,0.801846077186622,NA 
rayol-farm2_2019-05-05_23-16-10.wav,44100,16,60,1,ndsi,1024,1000,2000,2000,11000,0.819709247031131,NA 
rayol-farm2_2019-05-05_23-18-10.wav,44100,16,60,1,ndsi,1024,1000,2000,2000,11000,0.680102923272889,NA 
rayol-farm2_2019-05-05_23-20-11.wav,44100,16,60,1,ndsi,1024,1000,2000,2000,11000,0.630142049707674,NA 
rayol-farm2_2019-05-05_23-22-11.wav,44100,16,60,1,ndsi,1024,1000,2000,2000,11000,0.83577526457686,NA 
rayol-farm2_2019-05-05_23-24-11.wav,44100,16,60,1,ndsi,1024,1000,2000,2000,11000,0.823550997845936,NA 
rayol-farm2_2019-05-05_23-26-11.wav,44100,16,60,1,ndsi,1024,1000,2000,2000,11000,0.733206333831778,NA 
rayol-farm2_2019-05-05_23-28-11.wav,44100,16,60,1,ndsi,1024,1000,2000,2000,11000,0.751125773229276,NA 
rayol-farm2_2019-05-05_23-30-11.wav,44100,16,60,1,ndsi,1024,1000,2000,2000,11000,0.666110238876714,NA 
rayol-farm2_2019-05-05_23-32-11.wav,44100,16,60,1,ndsi,1024,1000,2000,2000,11000,0.807421542940786,NA 
rayol-farm2_2019-05-05_23-34-11.wav,44100,16,60,1,ndsi,1024,1000,2000,2000,11000,0.799528177164454,NA 
rayol-farm2_2019-05-05_23-36-12.wav,44100,16,60,1,ndsi,1024,1000,2000,2000,11000,0.824719543894197,NA 
rayol-farm2_2019-05-05_23-38-12.wav,44100,16,60,1,ndsi,1024,1000,2000,2000,11000,0.821502338267841,NA 
rayol-farm2_2019-05-05_23-40-12.wav,44100,16,60,1,ndsi,1024,1000,2000,2000,11000,0.808052371279494,NA 
rayol-farm2_2019-05-05_23-42-12.wav,44100,16,60,1,ndsi,1024,1000,2000,2000,11000,0.770920965840756,NA 
rayol-farm2_2019-05-05_23-44-12.wav,44100,16,60,1,ndsi,1024,1000,2000,2000,11000,0.780562057830233,NA 
rayol-farm2_2019-05-05_23-46-12.wav,44100,16,60,1,ndsi,1024,1000,2000,2000,11000,0.74324626062961,NA 
rayol-farm2_2019-05-05_23-48-12.wav,44100,16,60,1,ndsi,1024,1000,2000,2000,11000,0.643842931886193,NA 
rayol-farm2_2019-05-05_23-50-12.wav,44100,16,60,1,ndsi,1024,1000,2000,2000,11000,0.850135493226183,NA 
rayol-farm2_2019-05-05_23-52-13.wav,44100,16,60,1,ndsi,1024,1000,2000,2000,11000,0.782773300373935,NA 
rayol-farm2_2019-05-05_23-54-13.wav,44100,16,60,1,ndsi,1024,1000,2000,2000,11000,0.825235195148761,NA 
rayol-farm2_2019-05-05_23-56-13.wav,44100,16,60,1,ndsi,1024,1000,2000,2000,11000,0.733912342864269,NA 
rayol-farm2_2019-05-05_23-58-13.wav,44100,16,60,1,ndsi,1024,1000,2000,2000,11000,0.791187912246287,NA
