HOUR,ENTR,RAYONNEMENT,MOON_VISIBILITY,B_INDEX
0.0,0.0,0.0,99.0,1.0031067887389875
1.0,0.0,0.0,99.0,1.0111566155990146
2.0,0.0,0.0,99.0,1.0016296560322222
3.0,0.0,0.0,99.0,0.9873827719733198
4.0,0.0,0.0,99.0,0.9942203350582682
5.0,0.0,0.0,99.0,1.2943328069422433
6.0,0.0,0.0,99.0,2.368441572534824
7.0,0.0,16.0,99.0,1.579231222847766
8.0,0.0,105.0,99.0,1.9572158360067
9.0,3.0,239.0,99.0,1.9235998435591133
10.0,7.0,403.0,99.0,1.6061308650227952
11.0,12.0,522.0,99.0,2.091400924046472
12.0,15.0,603.0,99.0,1.4389896023106654
13.0,16.0,687.0,99.0,1.3709389337716544
14.0,18.0,448.0,99.0,1.7816784881265209
15.0,19.0,615.0,99.0,1.5397868919823101
16.0,15.0,346.0,99.0,1.3527385978465412
17.0,9.0,183.0,99.0,1.3991436248089315
18.0,3.0,42.0,99.0,1.5986371531576058
19.0,0.0,42.0,99.0,1.2907748050707235
20.0,0.0,0.0,99.0,1.0050351128027002
21.0,0.0,0.0,99.0,1.003606243475781
22.0,0.0,0.0,99.0,1.0027654303194733
23.0,0.0,0.0,99.0,1.0045938951103421
0.0,0.0,0.0,95.0,0.9967320504392908
1.0,0.0,0.0,95.0,1.006157414980798
2.0,0.0,0.0,95.0,1.0009749686335252
3.0,0.0,0.0,95.0,1.0038257362190959
4.0,0.0,0.0,95.0,1.006079689023738
5.0,0.0,0.0,95.0,1.4352521215396412
6.0,0.0,0.0,95.0,1.9881272292615881
7.0,0.0,0.0,95.0,1.6049072138574048
8.0,0.0,7.0,95.0,1.4332278936522167
9.0,2.0,46.0,95.0,1.3578535985290978
10.0,8.0,56.0,95.0,1.5336542417751913
11.0,16.0,132.0,95.0,1.7262435802400389
12.0,23.0,84.0,95.0,1.3023106429130458
13.0,25.0,62.0,95.0,1.7247413516851848
14.0,26.0,65.0,95.0,1.343820578148896
15.0,25.0,116.0,95.0,1.4679258694491242
16.0,20.0,70.0,95.0,1.6253140084722628
17.0,12.0,174.0,95.0,2.089263355591356
18.0,5.0,67.0,95.0,2.024806758749299
19.0,0.0,46.0,95.0,1.391003244488192
20.0,0.0,19.0,95.0,1.0035467254195511
21.0,0.0,0.0,95.0,1.0521220446928423
22.0,0.0,0.0,95.0,1.0511654472657417
23.0,0.0,0.0,95.0,1.018025336546379
0.0,0.0,0.0,88.0,0.9715151285384168
1.0,0.0,0.0,88.0,0.9806082084357808
2.0,0.0,0.0,88.0,1.0209640214453446
3.0,0.0,0.0,88.0,0.983944400504176
4.0,0.0,0.0,88.0,1.0312437236565464
5.0,0.0,0.0,88.0,1.6787694239532494
6.0,0.0,0.0,88.0,2.355518564498193
7.0,0.0,0.0,88.0,1.5902475575660249
8.0,0.0,9.0,88.0,1.676986221574724
9.0,5.0,32.0,88.0,2.168166640653653
10.0,18.0,14.0,88.0,1.8931773901375208
11.0,39.0,54.0,88.0,2.1110535139574784
12.0,57.0,46.0,88.0,2.3595435542779257
13.0,58.0,98.0,88.0,2.2887766806873837
14.0,58.0,116.0,88.0,2.5593649621842216
15.0,66.0,244.0,88.0,2.3123823189330093
16.0,60.0,195.0,88.0,1.9914856496770716
17.0,31.0,134.0,88.0,2.3756866603233884
18.0,9.0,84.0,88.0,1.6614825942106162
19.0,0.0,42.0,88.0,1.4371432394835184
20.0,0.0,19.0,88.0,1.0209929869714185
21.0,0.0,0.0,88.0,1.0152901780812116
22.0,0.0,0.0,88.0,0.9803066610398304
23.0,0.0,0.0,88.0,0.97696697969016
0.0,0.0,0.0,81.0,0.9874285830370776
1.0,0.0,0.0,81.0,0.9849538337021292
2.0,0.0,0.0,81.0,0.9837487550196592
3.0,0.0,0.0,81.0,0.9731524336937096
4.0,0.0,0.0,81.0,0.9748882217122022
5.0,0.0,0.0,81.0,1.8267258687253125
6.0,0.0,0.0,81.0,2.157313426678388
7.0,0.0,11.0,81.0,1.661744263237264
8.0,0.0,104.0,81.0,1.6914910599537356
9.0,3.0,113.0,81.0,1.9294748598442335
10.0,7.0,91.0,81.0,2.432013910690443
11.0,10.0,128.0,81.0,2.3962387220762453
12.0,9.0,234.0,81.0,1.7367102714656009
13.0,7.0,338.0,81.0,1.7463793262523857
14.0,9.0,186.0,81.0,1.6801595609380018
15.0,14.0,269.0,81.0,1.8693457459044982
16.0,14.0,299.0,81.0,1.7547878229176292
17.0,6.0,429.0,81.0,1.2249947800564265
18.0,2.0,172.0,81.0,1.4698950367643004
19.0,0.0,90.0,81.0,1.2349029012777448
20.0,0.0,19.0,81.0,0.9680987098389324
21.0,0.0,0.0,81.0,0.933748683022463
22.0,0.0,0.0,81.0,0.9248669723952628
23.0,0.0,0.0,81.0,1.0849041407619884
0.0,0.0,0.0,71.0,0.9942772167213222
1.0,0.0,0.0,71.0,1.1644846606657715
2.0,0.0,0.0,71.0,1.0835654985663763
3.0,0.0,0.0,71.0,1.0842423477292928
4.0,0.0,0.0,71.0,1.5529687192323418
5.0,0.0,0.0,71.0,2.1197567200815817
6.0,0.0,0.0,71.0,2.81870507156056
7.0,0.0,16.0,71.0,1.5005414839188986
8.0,0.0,162.0,71.0,2.1175798801682237
9.0,4.0,425.0,71.0,2.5084419829552096
10.0,6.0,550.0,71.0,1.6842280997155448
11.0,10.0,125.0,71.0,2.5264346943620755
12.0,14.0,867.0,71.0,2.2108738543740896
13.0,18.0,526.0,71.0,2.1614432022815366
14.0,24.0,916.0,71.0,1.830297523748932
15.0,30.0,877.0,71.0,1.6648958420550242
16.0,22.0,826.0,71.0,1.4658117434746916
17.0,10.0,677.0,71.0,1.39055929396961
18.0,4.0,130.0,71.0,1.2833261083150234
19.0,0.0,70.0,71.0,1.2945707445029315
20.0,0.0,21.0,71.0,0.9160208668148268
21.0,0.0,0.0,71.0,0.9038978081112109
22.0,0.0,0.0,71.0,1.0392279084937013
23.0,0.0,0.0,71.0,0.8947705684508283
0.0,0.0,0.0,62.0,0.8982242056464212
1.0,0.0,0.0,62.0,0.9146501574402246
2.0,0.0,0.0,62.0,0.9071572691591158
3.0,0.0,0.0,62.0,0.9081793797483636
4.0,0.0,0.0,62.0,1.0850876075711728
5.0,0.0,0.0,62.0,1.2750407054237556
6.0,0.0,0.0,62.0,1.7011993783082242
7.0,0.0,23.0,62.0,1.694383291737118
8.0,0.0,95.0,62.0,1.7979857242817272
9.0,5.0,315.0,62.0,2.6166563211004257
10.0,8.0,656.0,62.0,1.7074302741502219
11.0,13.0,705.0,62.0,2.0234140594203582
12.0,15.0,803.0,62.0,1.7319621333384323
13.0,17.0,870.0,62.0,1.5238481034376743
14.0,22.0,884.0,62.0,2.029961422681238
15.0,23.0,842.0,62.0,2.0739666520863604
16.0,17.0,712.0,62.0,1.6757726503050683
17.0,8.0,584.0,62.0,1.4219683506379712
18.0,2.0,241.0,62.0,1.393703951040161
19.0,0.0,113.0,62.0,1.227339510677927
20.0,0.0,21.0,62.0,0.9231151010696136
21.0,0.0,0.0,62.0,0.918545341857838
22.0,0.0,0.0,62.0,0.9074714588812072
23.0,0.0,0.0,62.0,0.9064302028168392
0.0,0.0,0.0,52.0,0.9053187572163588
1.0,0.0,0.0,52.0,0.9099567736634471
2.0,0.0,0.0,52.0,0.9154202325733056
3.0,0.0,0.0,52.0,0.9083861738820348
4.0,0.0,0.0,52.0,0.9261143057050352
5.0,0.0,0.0,52.0,1.8778800804243296
6.0,0.0,0.0,52.0,2.3052859854900967
7.0,0.0,21.0,52.0,1.8441097778046
8.0,0.0,93.0,52.0,1.7060241046134377
9.0,5.0,255.0,52.0,1.6172006915809505
10.0,15.0,490.0,52.0,1.7772535569249308
11.0,23.0,492.0,52.0,1.5584142615293526
12.0,27.0,272.0,52.0,1.4817243395437967
13.0,25.0,438.0,52.0,2.9307538218629907
14.0,29.0,564.0,52.0,1.6610976558300885
15.0,35.0,710.0,52.0,1.3426846182325425
16.0,30.0,468.0,52.0,1.229327674123767
17.0,16.0,679.0,52.0,1.327014288910796
18.0,6.0,309.0,52.0,1.4259040757782668
19.0,0.0,146.0,52.0,1.4484759542792645
20.0,0.0,25.0,52.0,1.039338500532967
21.0,0.0,0.0,52.0,1.031649788063233
22.0,0.0,0.0,52.0,1.0377692589230665
23.0,0.0,0.0,52.0,1.0285241201236093
0.0,0.0,0.0,42.0,1.0433457730978744
1.0,0.0,0.0,42.0,1.0289888540792451
2.0,0.0,0.0,42.0,1.0564883083968921
3.0,0.0,0.0,42.0,1.0323814384863714
4.0,0.0,0.0,42.0,1.250877375646943
5.0,0.0,0.0,42.0,1.6039405313628519
6.0,0.0,0.0,42.0,2.008513391634672
7.0,0.0,14.0,42.0,2.0528691772498378
8.0,0.0,186.0,42.0,2.1719183799326016
9.0,3.0,373.0,42.0,1.8266240446884217
10.0,8.0,552.0,42.0,1.9847280509248568
11.0,13.0,708.0,42.0,2.553139454709504
12.0,16.0,823.0,42.0,2.9558153981491126
13.0,17.0,891.0,42.0,2.7794524123018856
14.0,20.0,900.0,42.0,1.702113891331214
15.0,20.0,851.0,42.0,1.6080346181231469
16.0,16.0,752.0,42.0,1.7025257325382734
17.0,9.0,613.0,42.0,1.5981233604495635
18.0,3.0,436.0,42.0,1.6069167883993951
19.0,0.0,60.0,42.0,1.346088311071311
20.0,0.0,18.0,42.0,1.045802358840529
21.0,0.0,0.0,42.0,1.0372800802058793
22.0,0.0,0.0,42.0,1.041949968905834
23.0,0.0,0.0,42.0,1.0405882367832802
0.0,0.0,0.0,33.0,1.0440429807321343
1.0,0.0,0.0,33.0,1.0256903262548875
2.0,0.0,0.0,33.0,1.0272194482095531
3.0,0.0,0.0,33.0,1.0406287116775288
4.0,0.0,0.0,33.0,1.027101445421128
5.0,0.0,0.0,33.0,1.9414921388246569
6.0,0.0,0.0,33.0,2.2737154894178024
7.0,0.0,18.0,33.0,2.0121515087432744
8.0,0.0,183.0,33.0,1.7849073509735518
9.0,2.0,366.0,33.0,1.811863497927804
10.0,8.0,541.0,33.0,1.7096651366710662
11.0,16.0,700.0,33.0,1.6739532327630706
12.0,23.0,812.0,33.0,1.3522636905454362
13.0,26.0,875.0,33.0,1.7562816301645363
14.0,27.0,891.0,33.0,1.6136045017210203
15.0,26.0,847.0,33.0,1.6661733320128016
16.0,21.0,754.0,33.0,1.7278586778795526
17.0,13.0,605.0,33.0,1.8217195111228532
18.0,5.0,429.0,33.0,1.8183390089624407
19.0,0.0,84.0,33.0,1.7530554795872575
20.0,0.0,19.0,33.0,1.0495636812905849
21.0,0.0,0.0,33.0,1.050787553483563
22.0,0.0,0.0,33.0,1.0429972481743588
23.0,0.0,0.0,33.0,1.0452997016358816
0.0,0.0,0.0,24.0,1.0465603311452794
1.0,0.0,0.0,24.0,1.0461448400674755
2.0,0.0,0.0,24.0,1.0449040854700042
3.0,0.0,0.0,24.0,1.043663330872533
4.0,0.0,0.0,24.0,1.0404678860016765
5.0,0.0,0.0,24.0,1.0630202679653036
6.0,0.0,0.0,24.0,1.8146253741345464
7.0,0.0,19.0,24.0,1.7966589786839953
8.0,0.0,186.0,24.0,1.7915516201126087
9.0,3.0,274.0,24.0,1.9193971324970391
10.0,13.0,271.0,24.0,1.684997158725725
11.0,28.0,476.0,24.0,1.6072498867995315
12.0,40.0,802.0,24.0,1.5236223670860596
13.0,41.0,863.0,24.0,1.6806248065201124
14.0,41.0,875.0,24.0,1.6639697086277272
15.0,47.0,833.0,24.0,1.700561559199376
16.0,43.0,738.0,24.0,1.9707535591920111
17.0,22.0,617.0,24.0,1.4983616402032351
18.0,7.0,413.0,24.0,2.6947305718607946
19.0,0.0,54.0,24.0,1.932577187177544
20.0,0.0,19.0,24.0,1.4394659634963891
21.0,0.0,0.0,24.0,1.0472141206203254
22.0,0.0,0.0,24.0,1.0517410428373128
23.0,0.0,0.0,24.0,1.0598263324691537
0.0,0.0,0.0,17.0,1.0251410291077343
1.0,0.0,0.0,17.0,1.02221147776628
2.0,0.0,0.0,17.0,1.0271701573485452
3.0,0.0,0.0,17.0,1.0238800997152209
4.0,0.0,0.0,17.0,1.0676281257632825
5.0,0.0,0.0,17.0,1.0544589692032136
6.0,0.0,0.0,17.0,1.831070320937056
7.0,0.0,19.0,17.0,2.150461108202038
8.0,0.0,186.0,17.0,1.913596367330956
9.0,3.0,274.0,17.0,1.9409539788074808
10.0,8.0,271.0,17.0,2.3843899227767342
11.0,12.0,476.0,17.0,2.0115312376613264
12.0,11.0,802.0,17.0,1.8674286554306028
13.0,8.0,863.0,17.0,1.8610189021954608
14.0,10.0,875.0,17.0,2.4622362753753464
15.0,17.0,833.0,17.0,1.8401279972236224
16.0,16.0,738.0,17.0,1.4114802237839723
17.0,7.0,617.0,17.0,1.8472237279646957
18.0,2.0,413.0,17.0,1.8838588367656195
19.0,0.0,54.0,17.0,2.5577428827193973
20.0,0.0,19.0,17.0,1.5734249688418502
21.0,0.0,0.0,17.0,1.0522565295538813
22.0,0.0,0.0,17.0,1.0369817323366377
23.0,0.0,0.0,17.0,1.033354889734872
0.0,0.0,0.0,10.0,1.1386376504934683
1.0,0.0,0.0,10.0,1.0328826565155067
2.0,0.0,0.0,10.0,1.0318685430504455
3.0,0.0,0.0,10.0,1.1091234339051208
4.0,0.0,0.0,10.0,1.0553183864878632
5.0,0.0,0.0,10.0,1.236174283394497
6.0,0.0,0.0,10.0,1.8183308137662744
7.0,0.0,21.0,10.0,2.1504826624808446
8.0,0.0,202.0,10.0,1.6283110815011523
9.0,4.0,390.0,10.0,1.8465044120734575
10.0,6.0,557.0,10.0,1.7438283502836185
11.0,10.0,691.0,10.0,1.737221792875446
12.0,14.0,810.0,10.0,1.823393180676004
13.0,18.0,455.0,10.0,1.696267641424304
14.0,25.0,186.0,10.0,1.4825538017850457
15.0,31.0,404.0,10.0,1.4779761473509652
16.0,22.0,294.0,10.0,1.8348564634742208
17.0,10.0,599.0,10.0,1.6896514386781725
18.0,4.0,417.0,10.0,2.033745342294304
19.0,0.0,100.0,10.0,2.5702698351950284
20.0,0.0,19.0,10.0,1.5113021553496837
21.0,0.0,0.0,10.0,1.0472558151675937
22.0,0.0,0.0,10.0,1.0429987296309495
23.0,0.0,0.0,10.0,1.1592340700102557
0.0,0.0,0.0,5.0,1.1675094305810134
1.0,0.0,0.0,5.0,1.018989825258862
2.0,0.0,0.0,5.0,1.0404620820036752
3.0,0.0,0.0,5.0,1.0480072355986554
4.0,0.0,0.0,5.0,1.0848793004399775
5.0,0.0,0.0,5.0,1.6208614529458782
6.0,0.0,0.0,5.0,1.6777295502002592
7.0,0.0,40.0,5.0,2.2390573827967613
8.0,0.0,74.0,5.0,1.7358750496088236
9.0,1.0,190.0,5.0,2.845853863598035
10.0,2.0,483.0,5.0,2.037586774232156
11.0,3.0,619.0,5.0,2.7693230594710414
12.0,3.0,659.0,5.0,1.9780813349565272
13.0,4.0,605.0,5.0,2.3509580178782983
14.0,5.0,984.0,5.0,3.1514809444028318
15.0,5.0,302.0,5.0,2.3537859086294324
16.0,4.0,290.0,5.0,2.0341096288644387
17.0,2.0,413.0,5.0,2.0799325952536667
18.0,1.0,190.0,5.0,2.5491159407508794
19.0,0.0,132.0,5.0,2.0375371293944218
20.0,0.0,30.0,5.0,1.953404114246084
21.0,0.0,0.0,5.0,2.7824012411665646
22.0,0.0,0.0,5.0,2.39672221904934
23.0,0.0,0.0,5.0,1.4767174695113126
0.0,0.0,0.0,2.0,2.4593408403438093
1.0,0.0,0.0,2.0,2.272491518660399
2.0,0.0,0.0,2.0,1.6274406554509178
3.0,0.0,0.0,2.0,1.4294371669487052
4.0,0.0,0.0,2.0,1.3221664580528836
5.0,0.0,0.0,2.0,1.545385836237664
6.0,0.0,0.0,2.0,2.0281915836663407
7.0,0.0,23.0,2.0,1.5696484618581696
8.0,0.0,181.0,2.0,2.1878045969885034
9.0,3.0,401.0,2.0,2.3642329262134028
10.0,10.0,564.0,2.0,2.033536374137684
11.0,15.0,281.0,2.0,2.0794749759488838
12.0,18.0,807.0,2.0,1.671887121090186
13.0,17.0,898.0,2.0,2.026698057254015
14.0,19.0,740.0,2.0,2.1630121567713423
15.0,23.0,835.0,2.0,2.199349834542084
16.0,20.0,742.0,2.0,1.8582808044420311
17.0,11.0,598.0,2.0,1.5689367353178931
18.0,4.0,438.0,2.0,1.9173936319616596
19.0,0.0,44.0,2.0,1.6608171331969486
20.0,0.0,21.0,2.0,1.5243277206724242
21.0,0.0,0.0,2.0,1.2944261024179218
22.0,0.0,0.0,2.0,1.3580291911189677
23.0,0.0,0.0,2.0,1.221200351533661
0.0,0.0,0.0,0.0,1.2494875829832637
1.0,0.0,0.0,0.0,1.2339725468682632
2.0,0.0,0.0,0.0,1.3044124826343098
3.0,0.0,0.0,0.0,1.2117339133660117
4.0,0.0,0.0,0.0,1.19560002033001
5.0,0.0,0.0,0.0,1.3298373260241594
6.0,0.0,0.0,0.0,2.135677225269877
7.0,0.0,16.0,0.0,1.4124486482315506
8.0,0.0,58.0,0.0,1.841616657151416
9.0,5.0,397.0,0.0,1.962837751216031
10.0,11.0,570.0,0.0,1.8105916717721808
11.0,18.0,608.0,0.0,1.6333928662039543
12.0,22.0,831.0,0.0,1.9972244210616261
13.0,23.0,900.0,0.0,2.283404230943032
14.0,26.0,907.0,0.0,2.2977987718943496
15.0,27.0,882.0,0.0,1.9391066805368116
16.0,22.0,998.0,0.0,2.0243724113035144
17.0,12.0,199.0,0.0,2.1649203008190767
18.0,5.0,425.0,0.0,1.9842220826854804
19.0,0.0,47.0,0.0,2.210559426782661
20.0,0.0,19.0,0.0,1.4849304490898416
21.0,0.0,0.0,0.0,1.2815640170987952
22.0,0.0,0.0,0.0,1.3040456748511309
23.0,0.0,0.0,0.0,1.276433523820678
0.0,0.0,0.0,1.0,1.2663846307808209
1.0,0.0,0.0,1.0,1.2707042771913353
2.0,0.0,0.0,1.0,1.2785890581247137
3.0,0.0,0.0,1.0,1.2808895615007654
4.0,0.0,0.0,1.0,1.368569528951231
5.0,0.0,0.0,1.0,1.4513047455219823
6.0,0.0,0.0,1.0,2.4401539399630106
7.0,0.0,21.0,1.0,2.0661097004995805
8.0,0.0,195.0,1.0,2.1373401925544284
9.0,0.0,380.0,1.0,2.7349037983923425
10.0,1.0,554.0,1.0,2.349073373964961
11.0,1.0,710.0,1.0,2.1510709996315094
12.0,2.0,824.0,1.0,2.4349069002111863
13.0,2.0,893.0,1.0,2.7641878659868713
14.0,2.0,900.0,1.0,2.7266234466458186
15.0,2.0,858.0,1.0,2.8293398951903663
16.0,2.0,761.0,1.0,2.721401120461012
17.0,1.0,626.0,1.0,2.8865362422177285
18.0,0.0,452.0,1.0,2.8778312850679835
15.0,42.0,860.0,13.0,2.6877460345246087
16.0,31.0,766.0,13.0,1.7261172387417718
17.0,14.0,612.0,13.0,1.5664999252874203
18.0,6.0,424.0,13.0,1.5205560892010428
19.0,0.0,74.0,13.0,1.6576990203607669
20.0,0.0,19.0,13.0,1.3038888381847535
21.0,0.0,0.0,13.0,0.962552661616874
22.0,0.0,0.0,13.0,0.9566406611167484
23.0,0.0,0.0,13.0,1.0644350438392054
0.0,0.0,0.0,21.0,0.8971128468751978
1.0,0.0,0.0,21.0,0.8929314943653919
2.0,0.0,0.0,21.0,0.9017282416696912
3.0,0.0,0.0,21.0,0.900663022850609
4.0,0.0,0.0,21.0,0.9025601407230516
5.0,0.0,0.0,21.0,1.0548903667589455
6.0,0.0,0.0,21.0,3.2752054070052434
7.0,0.0,44.0,21.0,2.5362690690364493
8.0,0.0,213.0,21.0,2.6855396421787545
9.0,5.0,378.0,21.0,3.16503961736383
10.0,8.0,554.0,21.0,2.523236296180939
11.0,13.0,701.0,21.0,3.710041590646591
12.0,14.0,810.0,21.0,2.0850871868322214
13.0,16.0,905.0,21.0,2.2198694352419865
14.0,21.0,879.0,21.0,2.195757968406699
15.0,22.0,809.0,21.0,3.0618608527707187
16.0,16.0,712.0,21.0,1.3595654255865592
17.0,7.0,508.0,21.0,1.3983356119337864
18.0,2.0,413.0,21.0,1.3894033272192456
19.0,0.0,151.0,21.0,1.573442208166759
20.0,0.0,23.0,21.0,1.2960524835383525
21.0,0.0,0.0,21.0,0.9403545157084716
22.0,0.0,0.0,21.0,0.9154081178835964
23.0,0.0,0.0,21.0,0.914125864043465
0.0,0.0,0.0,31.0,0.9071789277307948
1.0,0.0,0.0,31.0,0.9058010991135024
2.0,0.0,0.0,31.0,0.9036571126921144
3.0,0.0,0.0,31.0,0.9056694715253316
4.0,0.0,0.0,31.0,0.898452682154976
5.0,0.0,0.0,31.0,0.8869652070277283
6.0,0.0,0.0,31.0,3.0486611391663945
7.0,0.0,19.0,31.0,2.4638224224051397
8.0,0.0,91.0,31.0,2.0540321494030334
9.0,4.0,424.0,31.0,2.5009752458715524
10.0,13.0,529.0,31.0,2.256965195875355
11.0,20.0,664.0,31.0,2.3800714118275517
12.0,23.0,394.0,31.0,2.1793144682452343
13.0,22.0,905.0,31.0,2.3592120931367075
14.0,25.0,253.0,31.0,1.82158594889368
15.0,30.0,287.0,31.0,1.8669532578450343
16.0,26.0,322.0,31.0,1.5724984353072633
17.0,14.0,195.0,31.0,1.5087938694133485
18.0,5.0,462.0,31.0,1.6597849188388651
19.0,0.0,67.0,31.0,1.5826120301431659
20.0,0.0,19.0,31.0,1.2105607786966552
21.0,0.0,0.0,31.0,0.9383999475327529
22.0,0.0,0.0,31.0,0.9121913307889976
23.0,0.0,0.0,31.0,0.9040840120083886
0.0,0.0,0.0,41.5,0.9098799162981984
1.0,0.0,0.0,41.5,0.9026514137723028
2.0,0.0,0.0,41.5,0.904198003795856
3.0,0.0,0.0,41.5,0.902701770846012
4.0,0.0,0.0,41.5,0.9008921185637128
5.0,0.0,0.0,41.5,1.1263191244054858
6.0,0.0,0.0,41.5,2.4085297424244287
7.0,0.0,19.0,41.5,2.8640523154505355
8.0,0.0,227.0,41.5,3.441175439790292
9.0,4.0,408.0,41.5,2.705275288685326
10.0,10.0,582.0,41.5,2.6575571058971
11.0,17.0,728.0,41.5,2.037381530241712
12.0,20.0,838.0,41.5,2.1614995485724617
13.0,22.0,902.0,41.5,2.1025457287043783
14.0,25.0,905.0,41.5,2.2154814376375955
15.0,26.0,858.0,41.5,1.5783209371994935
16.0,20.0,766.0,41.5,1.4306203115350868
17.0,12.0,733.0,41.5,1.0897654395141363
18.0,4.0,272.0,41.5,1.1193048745669478
19.0,0.0,54.0,41.5,1.52225961018196
20.0,0.0,23.0,41.5,1.5081656541723032
21.0,0.0,0.0,41.5,0.9475045343339878
22.0,0.0,0.0,41.5,0.9311376513922676
23.0,0.0,0.0,41.5,0.9127903211468756
0.0,0.0,0.0,52.0,0.9003778036211767
1.0,0.0,0.0,52.0,0.9225245547656659
2.0,0.0,0.0,52.0,0.9062988924519304
3.0,0.0,0.0,52.0,0.9066387982982944
4.0,0.0,0.0,52.0,0.9032504752159088
5.0,0.0,0.0,52.0,1.1087368066353676
6.0,0.0,0.0,52.0,3.2026342075891585
7.0,0.0,18.0,52.0,2.570309864124476
8.0,0.0,223.0,52.0,2.7569875032429696
9.0,4.0,408.0,52.0,2.4875450107254284
10.0,14.0,580.0,52.0,2.0336261080654583
11.0,28.0,737.0,52.0,2.468531387224756
12.0,41.0,833.0,52.0,2.0477109747810633
13.0,45.0,918.0,52.0,1.840216730310219
14.0,48.0,909.0,52.0,1.6061349173385768
15.0,45.0,849.0,52.0,1.8071915673870265
16.0,37.0,772.0,52.0,1.6239067862361207
17.0,23.0,250.0,52.0,1.4041907164535512
18.0,9.0,454.0,52.0,1.7896834616047377
19.0,0.0,267.0,52.0,1.374053326401785
20.0,0.0,21.0,52.0,1.3042866324765023
21.0,0.0,0.0,52.0,0.9517202371931428
22.0,0.0,0.0,52.0,0.9366445335906564
23.0,0.0,0.0,52.0,0.9387850923050184
0.0,0.0,0.0,64.0,0.9171860441424896
1.0,0.0,0.0,64.0,0.9250908910706316
2.0,0.0,0.0,64.0,0.9123263613683352
3.0,0.0,0.0,64.0,0.8837347819603353
4.0,0.0,0.0,64.0,0.8921041510360797
5.0,0.0,0.0,64.0,0.9187974271109683
6.0,0.0,0.0,64.0,2.3502629899514433
7.0,0.0,21.0,64.0,1.7956137099100666
8.0,0.0,220.0,64.0,1.6470675916046391
9.0,6.0,394.0,64.0,1.6692770761636906
10.0,22.0,570.0,64.0,1.4599918870435145
11.0,49.0,717.0,64.0,1.6771436499490282
12.0,71.0,826.0,64.0,2.0071310855674267
13.0,73.0,889.0,64.0,2.144829029380184
14.0,73.0,907.0,64.0,1.815391158427522
15.0,83.0,860.0,64.0,1.6851055941693691
16.0,76.0,765.0,64.0,1.6384925070610037
17.0,39.0,638.0,64.0,1.464644007565633
18.0,12.0,274.0,64.0,1.1227279073018337
19.0,0.0,86.0,64.0,1.4595823074943726
20.0,0.0,26.0,64.0,1.6566510683642044
21.0,0.0,0.0,64.0,0.9302415712160222
22.0,0.0,0.0,64.0,0.9157126871642338
23.0,0.0,0.0,64.0,0.8990338862712672
0.0,0.0,0.0,74.0,0.8887750670502704
1.0,0.0,0.0,74.0,0.8780370025116555
2.0,0.0,0.0,74.0,0.8731693432061719
3.0,0.0,0.0,74.0,0.8802374926439203
4.0,0.0,0.0,74.0,0.8880198897700139
5.0,0.0,0.0,74.0,1.154264157685477
6.0,0.0,0.0,74.0,3.0383720179626517
7.0,0.0,0.0,74.0,2.940787290174092
8.0,0.0,16.0,74.0,2.468824241447304
9.0,19.0,169.0,74.0,2.424379912674121
10.0,47.0,90.0,74.0,2.6544807725384283
11.0,71.0,281.0,74.0,2.2495719327443577
12.0,68.0,434.0,74.0,2.196140105484176
13.0,50.0,905.0,74.0,2.2743793182923038
14.0,62.0,1002.0,74.0,1.9573309635355143
15.0,100.0,1004.0,74.0,1.978099515641788
16.0,97.0,773.0,74.0,2.3876264486515746
17.0,41.0,677.0,74.0,1.3036322157925482
18.0,12.0,490.0,74.0,1.2296156363856523
19.0,0.0,271.0,74.0,1.6344822162391253
20.0,0.0,30.0,74.0,1.7770969242358143
21.0,0.0,0.0,74.0,0.9554993502071448
22.0,0.0,0.0,74.0,0.9464759701112346
23.0,0.0,0.0,74.0,0.9362973062906148
0.0,0.0,0.0,84.0,1.0832704736384298
1.0,0.0,0.0,84.0,0.9307758249002216
2.0,0.0,0.0,84.0,0.9173386602972023
3.0,0.0,0.0,84.0,1.052691935118211
4.0,0.0,0.0,84.0,0.9170771162007536
5.0,0.0,0.0,84.0,1.0565530738906002
6.0,0.0,0.0,84.0,3.309334990705957
7.0,0.0,23.0,84.0,2.868693968883728
8.0,0.0,223.0,84.0,2.6388501280204237
9.0,5.0,403.0,84.0,2.5598439059979494
10.0,8.0,573.0,84.0,2.370894558765618
11.0,13.0,722.0,84.0,2.0758888706421272
12.0,19.0,809.0,84.0,2.2358712877305496
13.0,24.0,647.0,84.0,1.9522873251579584
14.0,32.0,789.0,84.0,1.8108599084928612
15.0,40.0,765.0,84.0,1.4304867030622128
16.0,29.0,772.0,84.0,1.7740816910182855
17.0,13.0,643.0,84.0,1.3932816128014542
18.0,5.0,207.0,84.0,1.4684734237787591
19.0,0.0,260.0,84.0,1.3952617844279884
20.0,0.0,35.0,84.0,1.3767033416786012
21.0,0.0,0.0,84.0,0.9682723226849084
22.0,0.0,0.0,84.0,0.9516124223539816
23.0,0.0,0.0,84.0,1.0655099883510617
0.0,0.0,0.0,92.0,0.9163350612045688
1.0,0.0,0.0,92.0,0.8855253913043499
2.0,0.0,0.0,92.0,0.8686380035931892
3.0,0.0,0.0,92.0,0.858484364475396
4.0,0.0,0.0,92.0,0.8600492248427565
5.0,0.0,0.0,92.0,1.1794852195324408
6.0,0.0,0.0,92.0,3.730777137387319
7.0,0.0,58.0,92.0,3.2412000929368245
8.0,0.0,72.0,92.0,3.2057730206825767
9.0,21.0,109.0,92.0,2.648318695534627
10.0,35.0,265.0,92.0,2.303007721256317
11.0,57.0,244.0,92.0,2.5083179815194336
12.0,64.0,213.0,92.0,2.44158268520592
13.0,71.0,86.0,92.0,2.2437794170002925
14.0,92.0,267.0,92.0,1.9702409907837424
15.0,99.0,118.0,92.0,1.912259795614904
16.0,71.0,120.0,92.0,1.7817987410474116
17.0,32.0,69.0,92.0,1.555120525768236
18.0,11.0,21.0,92.0,1.185186068336794
19.0,0.0,32.0,92.0,1.251980069614553
20.0,0.0,16.0,92.0,1.4106349278726826
21.0,0.0,0.0,92.0,1.0035313799786172
22.0,0.0,0.0,92.0,1.0079906568069503
23.0,0.0,0.0,92.0,0.9437691630184404
0.0,0.0,0.0,97.0,0.9758115493300772
1.0,0.0,0.0,97.0,0.9083536827915222
2.0,0.0,0.0,97.0,0.8832816705571473
3.0,0.0,0.0,97.0,0.8866120619100761
4.0,0.0,0.0,97.0,0.8939746077952472
5.0,0.0,0.0,97.0,0.960106947598098
6.0,0.0,0.0,97.0,3.0964058787526327
7.0,0.0,18.0,97.0,2.602100984572455
8.0,0.0,77.0,97.0,3.276149980454198
9.0,16.0,276.0,97.0,2.99526952954468
10.0,51.0,297.0,97.0,2.5019228814444787
11.0,78.0,371.0,97.0,2.9740611794600658
12.0,89.0,468.0,97.0,3.4618611413389213
13.0,85.0,388.0,97.0,3.3977528619207478
14.0,97.0,243.0,97.0,2.813906365421881
15.0,117.0,404.0,97.0,2.9185459422692124
16.0,101.0,84.0,97.0,2.4009105845369283
17.0,54.0,47.0,97.0,2.4664813664047207
18.0,19.0,62.0,97.0,1.547416377010015
19.0,0.0,67.0,97.0,1.3579336703268632
20.0,0.0,9.0,97.0,1.7111626580789892
21.0,0.0,0.0,97.0,1.7552954504112617
22.0,0.0,0.0,97.0,1.9125980389947197
23.0,0.0,0.0,97.0,1.4135675799672152
0.0,0.0,0.0,100.0,1.4393277886464833
1.0,0.0,0.0,100.0,1.3694669416473386
2.0,0.0,0.0,100.0,1.4176614227889142
3.0,0.0,0.0,100.0,1.477755341378496
4.0,0.0,0.0,100.0,1.5860693934113148
5.0,0.0,0.0,100.0,2.1739997650609064
6.0,0.0,0.0,100.0,3.7571216001171046
7.0,0.0,47.0,100.0,3.620076731201915
8.0,0.0,181.0,100.0,3.6737866127379113
9.0,15.0,244.0,100.0,2.8906763368080046
10.0,36.0,253.0,100.0,3.3458270378724366
11.0,59.0,137.0,100.0,3.666103247196397
12.0,72.0,360.0,100.0,3.3681296765461366
13.0,77.0,842.0,100.0,3.5025393923215598
14.0,87.0,492.0,100.0,3.3088527596563937
15.0,90.0,197.0,100.0,2.8409534685223576
16.0,72.0,23.0,100.0,2.3221121821740693
17.0,41.0,109.0,100.0,1.94582466980358
18.0,15.0,204.0,100.0,1.5794728674286138
19.0,0.0,113.0,100.0,1.252166484891904
20.0,0.0,18.0,100.0,1.354275728538484
21.0,0.0,0.0,100.0,1.037737454571544
22.0,0.0,0.0,100.0,0.960632908094438
23.0,0.0,0.0,100.0,1.019157367300524
0.0,0.0,0.0,99.0,1.2125899716321593
1.0,0.0,0.0,99.0,1.4697631479990083
2.0,0.0,0.0,99.0,1.4465900756976104
3.0,0.0,0.0,99.0,1.2921519016388063
4.0,0.0,0.0,99.0,1.3227653269772188
5.0,0.0,0.0,99.0,1.3726606896718367
6.0,0.0,0.0,99.0,3.9864865005634
7.0,0.0,28.0,99.0,3.845221921563784
8.0,0.0,183.0,99.0,3.286869872731617
9.0,6.0,320.0,99.0,2.5212203661143566
10.0,19.0,174.0,99.0,2.5022995572736564
11.0,39.0,302.0,99.0,2.294215266228767
12.0,56.0,200.0,99.0,2.644010195501234
13.0,62.0,613.0,99.0,3.57015182900306
14.0,66.0,202.0,99.0,3.4708502789211977
15.0,62.0,200.0,99.0,3.1410068237819524
16.0,51.0,267.0,99.0,2.8711572334876765
17.0,31.0,206.0,99.0,2.073998784760289
18.0,12.0,171.0,99.0,1.772082965247943
19.0,0.0,70.0,99.0,1.8077922599971097
20.0,0.0,54.0,99.0,2.058504309819209
21.0,0.0,0.0,99.0,1.7318580832093982
22.0,0.0,0.0,99.0,1.4129336930782492
23.0,0.0,0.0,99.0,1.2379164382905576
0.0,0.0,0.0,97.0,1.4013098912028807
1.0,0.0,0.0,97.0,1.5452108692704307
2.0,0.0,0.0,97.0,1.8214644894097465
3.0,0.0,0.0,97.0,1.7562077251142607
4.0,0.0,0.0,97.0,2.5843245775250736
5.0,0.0,0.0,97.0,2.8562211432607136
6.0,0.0,0.0,97.0,3.348890872084089
7.0,0.0,47.0,97.0,3.2199562288719354
8.0,0.0,248.0,97.0,3.3762456251457627
9.0,5.0,425.0,97.0,3.246542377741565
10.0,20.0,582.0,97.0,3.323593870042851
11.0,44.0,724.0,97.0,2.5797782767316706
12.0,64.0,860.0,97.0,2.8115131766621637
13.0,66.0,958.0,97.0,3.095650850193137
14.0,66.0,902.0,97.0,2.692891886373032
15.0,75.0,884.0,97.0,2.546013227813619
16.0,68.0,759.0,97.0,2.3336852086956994
17.0,36.0,612.0,97.0,2.270976450601586
18.0,11.0,455.0,97.0,2.2055877647414834
19.0,0.0,272.0,97.0,2.1700395688551137
20.0,0.0,49.0,97.0,2.267027743609623
21.0,0.0,0.0,97.0,2.618768377765164
22.0,0.0,0.0,97.0,2.9347973697655965
23.0,0.0,0.0,97.0,3.5268943009699734
0.0,0.0,0.0,92.0,3.47054496511769
1.0,0.0,0.0,92.0,2.4927522987776167
2.0,0.0,0.0,92.0,2.5086165350365714
3.0,0.0,0.0,92.0,2.2597916951646435
4.0,0.0,0.0,92.0,3.04998070390035
5.0,0.0,0.0,92.0,4.1367504452189525
6.0,0.0,0.0,92.0,4.110532937357841
7.0,0.0,81.0,92.0,3.0656622859261784
8.0,0.0,269.0,92.0,3.123985167872062
9.0,18.0,232.0,92.0,3.4550071819774595
10.0,43.0,287.0,92.0,3.5831760029295108
11.0,64.0,327.0,92.0,4.38093935188984
12.0,61.0,297.0,92.0,4.354640629379008
13.0,45.0,529.0,92.0,4.180441522304597
14.0,56.0,536.0,92.0,3.445452469777805
15.0,90.0,550.0,92.0,3.9822757060006295
16.0,88.0,853.0,92.0,3.797987781013112
17.0,37.0,622.0,92.0,4.050896882121998
18.0,11.0,462.0,92.0,3.823583291530988
19.0,0.0,294.0,92.0,4.003201066598718
20.0,0.0,19.0,92.0,3.717139777971003
21.0,0.0,9.0,92.0,3.1292848507955173
22.0,0.0,0.0,92.0,2.8430404281195822
23.0,0.0,0.0,92.0,2.79200013806514
0.0,0.0,0.0,85.0,3.0967967172915936
1.0,0.0,0.0,85.0,2.8172316010736287
2.0,0.0,0.0,85.0,1.4418983278659847
3.0,0.0,0.0,85.0,1.7380528626297624
4.0,0.0,0.0,85.0,2.097843039706344
5.0,0.0,0.0,85.0,2.5460317642957797
6.0,0.0,0.0,85.0,3.593619454096863
7.0,0.0,37.0,85.0,2.3965150693560067
8.0,0.0,237.0,85.0,2.556043113638699
9.0,3.0,415.0,85.0,2.424454437993413
10.0,5.0,288.0,85.0,3.077028457493669
11.0,8.0,292.0,85.0,2.067708390101719
12.0,12.0,1062.0,85.0,2.1306102184800086
13.0,15.0,891.0,85.0,2.4949776003782933
14.0,20.0,905.0,85.0,2.4211137007428216
15.0,25.0,925.0,85.0,2.5230133584851577
16.0,18.0,761.0,85.0,2.525078292488641
17.0,8.0,628.0,85.0,2.096527955209019
18.0,3.0,459.0,85.0,1.5886132671318665
19.0,0.0,271.0,85.0,1.683566474136226
20.0,0.0,35.0,85.0,1.4727063414303647
21.0,0.0,0.0,85.0,0.8880611857023305
22.0,0.0,0.0,85.0,0.8848614708085805
23.0,0.0,0.0,85.0,1.0280897122697223
0.0,0.0,0.0,77.0,0.911627556073354
1.0,0.0,0.0,77.0,0.9027701354415992
2.0,0.0,0.0,77.0,0.8896480469201469
3.0,0.0,0.0,77.0,0.9128783709471912
4.0,0.0,0.0,77.0,0.9761392674652472
5.0,0.0,0.0,77.0,1.1742527362019473
6.0,0.0,0.0,77.0,3.318696021007558
7.0,0.0,40.0,77.0,2.4590454907855825
8.0,0.0,207.0,77.0,2.6590589513782974
9.0,9.0,418.0,77.0,1.8923981640215628
10.0,15.0,295.0,77.0,2.9417478361277296
11.0,24.0,744.0,77.0,3.107641808633594
12.0,27.0,833.0,77.0,2.9399149701033758
13.0,30.0,867.0,77.0,2.8125099055096245
14.0,39.0,877.0,77.0,2.7064561248937284
15.0,41.0,896.0,77.0,2.4207392749947867
16.0,30.0,707.0,77.0,1.779805239050845
17.0,13.0,580.0,77.0,1.951428305953299
18.0,4.0,287.0,77.0,1.5046120123047393
19.0,0.0,121.0,77.0,1.5471437528124896
20.0,0.0,70.0,77.0,1.4730834327427165
21.0,0.0,0.0,77.0,0.9150981694206382
22.0,0.0,0.0,77.0,0.9137262582978162
23.0,0.0,0.0,77.0,0.9106496034875337
0.0,0.0,0.0,66.0,0.9736855403013672
1.0,0.0,0.0,66.0,0.9139625399930528
2.0,0.0,0.0,66.0,0.9332512372979208
3.0,0.0,0.0,66.0,0.9583337037647156
4.0,0.0,0.0,66.0,0.9735292266436798
5.0,0.0,0.0,66.0,1.266127682127957
6.0,0.0,5.0,66.0,3.154274146989752
7.0,0.0,32.0,66.0,2.162915418735524
8.0,0.0,121.0,66.0,2.296671163755117
9.0,15.0,105.0,66.0,2.0773569483515617
10.0,48.0,174.0,66.0,2.0693128621181454
11.0,74.0,100.0,66.0,1.9417397411553736
12.0,85.0,229.0,66.0,2.0894548097542702
13.0,81.0,396.0,66.0,2.7216662363233524
14.0,92.0,536.0,66.0,1.9540048523354319
15.0,110.0,1011.0,66.0,1.7536571559169418
16.0,96.0,605.0,66.0,1.9783394485840764
17.0,51.0,204.0,66.0,1.8294147400249368
18.0,18.0,464.0,66.0,1.35633861793415
19.0,0.0,114.0,66.0,1.2549211563589169
20.0,0.0,23.0,66.0,1.4302219040748254
21.0,0.0,0.0,66.0,0.9619843495090722
22.0,0.0,0.0,66.0,0.9301724580065699
23.0,0.0,0.0,66.0,1.058738702479347
0.0,0.0,0.0,59.0,1.159688434319027
1.0,0.0,0.0,59.0,1.1762913316606698
2.0,0.0,0.0,59.0,1.0213636853125219
3.0,0.0,0.0,59.0,1.0836456402180341
4.0,0.0,0.0,59.0,1.1254836575248863
5.0,0.0,0.0,59.0,1.6628591620002386
6.0,0.0,0.0,59.0,3.5679910313955987
7.0,0.0,35.0,59.0,2.21748761631259
8.0,0.0,95.0,59.0,2.1656893682857614
9.0,11.0,448.0,59.0,2.0624794754499147
10.0,27.0,297.0,59.0,1.8550853100292488
11.0,44.0,350.0,59.0,2.0671224926158045
12.0,53.0,320.0,59.0,1.9756310304093083
13.0,57.0,756.0,59.0,2.414271263951266
14.0,65.0,566.0,59.0,2.1260718485399765
15.0,66.0,861.0,59.0,2.1690974123763755
16.0,53.0,508.0,59.0,2.3076365886694155
17.0,30.0,123.0,59.0,1.8045442690181541
18.0,11.0,107.0,59.0,1.8852125759431493
19.0,0.0,47.0,59.0,1.332210121722318
20.0,0.0,33.0,59.0,1.4760151450247994
21.0,0.0,7.0,59.0,1.0496782932137911
22.0,0.0,0.0,59.0,1.0285618742828584
23.0,0.0,0.0,59.0,1.0103323639894797
0.0,0.0,0.0,49.5,1.0670186216305078
1.0,0.0,0.0,49.5,1.1331887053279035
2.0,0.0,0.0,49.5,1.8936158331223203
3.0,0.0,0.0,49.5,1.8669473492630388
4.0,0.0,0.0,49.5,3.1144881297560447
5.0,0.0,0.0,49.5,3.3397648932462562
6.0,0.0,0.0,49.5,4.006925006964232
7.0,0.0,70.0,49.5,3.744145178262457
8.0,0.0,116.0,49.5,2.7422933571187067
9.0,6.0,111.0,49.5,2.5707260421847082
10.0,19.0,301.0,49.5,2.432007217325355
11.0,38.0,269.0,49.5,2.8041867001602734
12.0,56.0,489.0,49.5,2.331947348582848
13.0,62.0,761.0,49.5,2.6693760120348755
14.0,65.0,366.0,49.5,2.1207825240238742
15.0,62.0,454.0,49.5,2.430196337658475
16.0,50.0,251.0,49.5,2.7791360008336894
17.0,31.0,193.0,49.5,3.1452033079985204
18.0,12.0,118.0,49.5,2.9675611428588886
19.0,0.0,30.0,49.5,2.794655321796696
20.0,0.0,12.0,49.5,2.4093648341005816
21.0,0.0,0.0,49.5,1.2789629475310598
22.0,0.0,0.0,49.5,1.0452951571240503
23.0,0.0,0.0,49.5,1.0742598034141226
0.0,0.0,0.0,40.0,1.2962659585094367
1.0,0.0,0.0,40.0,1.7860318253674818
2.0,0.0,0.0,40.0,2.0925088994599403
3.0,0.0,0.0,40.0,1.0923219656409484
4.0,0.0,0.0,40.0,1.0156082880496613
5.0,0.0,0.0,40.0,1.5779980431176992
6.0,0.0,0.0,40.0,3.2894989464257454
7.0,0.0,63.0,40.0,2.836273245927171
8.0,0.0,139.0,40.0,2.3503082469129537
9.0,6.0,179.0,40.0,2.514899518073186
10.0,21.0,431.0,40.0,2.210798916622992
11.0,47.0,475.0,40.0,2.444434027355568
12.0,68.0,559.0,40.0,2.06751578984002
13.0,70.0,631.0,40.0,2.2752021490504197
14.0,70.0,719.0,40.0,1.8552273320047965
15.0,80.0,722.0,40.0,1.7943746268746898
16.0,73.0,633.0,40.0,2.0052483510880714
17.0,38.0,227.0,40.0,1.9443930742895537
18.0,11.0,98.0,40.0,2.0593246340704483
19.0,0.0,127.0,40.0,1.581330542478566
20.0,0.0,30.0,40.0,1.8443235300012213
21.0,0.0,5.0,40.0,1.2656627832550198
22.0,0.0,0.0,40.0,1.243367335273497
23.0,0.0,0.0,40.0,3.145412554686034
0.0,0.0,0.0,31.0,3.163814552482078
1.0,0.0,0.0,31.0,1.8319162853870001
2.0,0.0,0.0,31.0,1.6980965220441508
3.0,0.0,0.0,31.0,1.692625320107421
4.0,0.0,0.0,31.0,2.3476468718364747
5.0,0.0,0.0,31.0,2.961166204027412
6.0,0.0,0.0,31.0,3.7087272995244263
7.0,0.0,23.0,31.0,2.9972533062692848
8.0,0.0,250.0,31.0,2.377056873996397
9.0,15.0,429.0,31.0,2.4772417291687483
10.0,37.0,596.0,31.0,2.4520048482874257
11.0,56.0,740.0,31.0,1.9631997780823167
12.0,53.0,853.0,31.0,2.364804465452396
13.0,40.0,916.0,31.0,2.255501181257493
14.0,49.0,926.0,31.0,2.134078921508788
15.0,79.0,884.0,31.0,1.8889416029705008
16.0,77.0,795.0,31.0,1.862570444882548
17.0,33.0,612.0,31.0,1.61248528879229
18.0,9.0,322.0,31.0,1.7401008508975602
19.0,0.0,281.0,31.0,1.96242776969874
20.0,0.0,26.0,31.0,1.919575317793728
21.0,0.0,7.0,31.0,1.1814853503524567
22.0,0.0,0.0,31.0,1.121664902734807
23.0,0.0,0.0,31.0,1.0213917890292878
0.0,0.0,0.0,23.0,1.180758320043209
1.0,0.0,0.0,23.0,1.4501282646527633
2.0,0.0,0.0,23.0,1.4736396004568766
3.0,0.0,0.0,23.0,1.4618965099884695
4.0,0.0,0.0,23.0,1.1248901327064702
5.0,0.0,0.0,23.0,2.4138941285616298
6.0,0.0,0.0,23.0,3.407678696733858
7.0,0.0,23.0,23.0,2.6023842059022013
8.0,0.0,246.0,23.0,2.706661429283914
9.0,14.0,424.0,23.0,2.291541864304637
10.0,21.0,594.0,23.0,2.3796013134527074
11.0,35.0,738.0,23.0,2.3377788471950134
12.0,49.0,849.0,23.0,2.435398972106776
13.0,64.0,912.0,23.0,2.556201497253782
14.0,85.0,923.0,23.0,1.9532417904367037
15.0,106.0,877.0,23.0,2.044918960579144
16.0,78.0,782.0,23.0,1.7738262783726766
17.0,35.0,654.0,23.0,1.5464632030922398
18.0,14.0,485.0,23.0,1.44368349423468
19.0,0.0,306.0,23.0,3.1446321888803457
20.0,0.0,32.0,23.0,2.9767719863150166
21.0,0.0,7.0,23.0,2.374445402009521
22.0,0.0,0.0,23.0,2.0570794425840404
23.0,0.0,0.0,23.0,1.6609268731569176
0.0,0.0,0.0,15.0,1.0743351776415828
1.0,0.0,0.0,15.0,1.584597790913787
2.0,0.0,0.0,15.0,1.7347521726018431
3.0,0.0,0.0,15.0,1.13949876913378
4.0,0.0,0.0,15.0,1.3657966087896196
5.0,0.0,0.0,15.0,2.6988441905656577
6.0,0.0,5.0,15.0,4.06641627402132
7.0,0.0,26.0,15.0,2.7483120904222598
8.0,0.0,246.0,15.0,2.4473715505986338
9.0,26.0,417.0,15.0,2.497170515516811
10.0,43.0,582.0,15.0,2.433703768263403
11.0,69.0,722.0,15.0,2.526120918507612
12.0,77.0,833.0,15.0,2.5028579093761705
13.0,86.0,900.0,15.0,2.3439855298485583
14.0,112.0,911.0,15.0,2.0390520396267373
15.0,120.0,865.0,15.0,2.134257239546136
16.0,86.0,775.0,15.0,2.191186012839192
17.0,39.0,647.0,15.0,2.040243113070184
18.0,13.0,482.0,15.0,1.7501345763117118
19.0,0.0,301.0,15.0,1.9424410914053991
20.0,0.0,28.0,15.0,1.9294415914983931
21.0,0.0,7.0,15.0,1.8532048726800163
22.0,0.0,0.0,15.0,2.3293055563334786
23.0,0.0,0.0,15.0,1.9917653332409555
0.0,0.0,0.0,9.0,1.8501476588793755
1.0,0.0,0.0,9.0,2.418225406201927
2.0,0.0,0.0,9.0,2.4428222833843183
3.0,0.0,0.0,9.0,2.291923003579307
4.0,0.0,0.0,9.0,2.120580281029529
5.0,0.0,0.0,9.0,2.900717489310273
6.0,0.0,5.0,9.0,3.1861102033967703
7.0,0.0,26.0,9.0,2.5705898482863017
8.0,0.0,241.0,9.0,2.4641781888823524
9.0,10.0,415.0,9.0,2.7207043672469533
10.0,31.0,584.0,9.0,2.6844151361812547
11.0,48.0,724.0,9.0,2.896722036715188
12.0,55.0,830.0,9.0,2.287826196474204
13.0,52.0,895.0,9.0,2.7261508692140115
14.0,59.0,904.0,9.0,2.9816760903296022
15.0,71.0,867.0,9.0,2.292339106093669
16.0,62.0,777.0,9.0,2.195830666374705
17.0,33.0,647.0,9.0,1.7385112263924356
18.0,12.0,490.0,9.0,1.6832432563956077
19.0,0.0,315.0,9.0,1.8099533296422396
20.0,0.0,25.0,9.0,1.7682825902432209
21.0,0.0,7.0,9.0,1.409019357236304
22.0,0.0,0.0,9.0,1.3260467720501126
23.0,0.0,0.0,9.0,1.3753442358908856
0.0,0.0,0.0,4.0,1.6815778151303502
1.0,0.0,0.0,4.0,2.344541231477613
2.0,0.0,0.0,4.0,2.2379879287165814
3.0,0.0,0.0,4.0,2.5300719901731346
4.0,0.0,0.0,4.0,2.570413347079906
5.0,0.0,0.0,4.0,2.788324432010545
6.0,0.0,5.0,4.0,2.782464034900109
7.0,0.0,26.0,4.0,2.4563200791225834
8.0,0.0,250.0,4.0,2.5509385855552607
9.0,13.0,424.0,4.0,3.00933229833515
10.0,31.0,592.0,4.0,2.748969745303912
11.0,51.0,737.0,4.0,2.34718139909982
12.0,62.0,847.0,4.0,2.6821125503949035
13.0,67.0,909.0,4.0,2.5283889211607087
14.0,76.0,926.0,4.0,1.9920300799349329
15.0,78.0,884.0,4.0,2.163206860554195
16.0,62.0,788.0,4.0,2.0334836060878074
17.0,36.0,649.0,4.0,2.1959904841573774
18.0,13.0,432.0,4.0,1.787611040663507
19.0,0.0,287.0,4.0,1.7622742085296073
20.0,0.0,53.0,4.0,2.0431154150930904
21.0,0.0,11.0,4.0,1.5653901044934548
22.0,0.0,0.0,4.0,1.4021329019203999
23.0,0.0,0.0,4.0,2.381926989358896
0.0,0.0,0.0,1.0,2.5468781023029603
1.0,0.0,0.0,1.0,2.18104477270469
2.0,0.0,0.0,1.0,2.3671247286438044
3.0,0.0,0.0,1.0,1.946889327954216
4.0,0.0,0.0,1.0,1.6710207274094708
5.0,0.0,0.0,1.0,2.8197841289829086
6.0,0.0,5.0,1.0,2.91965664467466
7.0,0.0,42.0,1.0,2.6888112934878543
8.0,0.0,234.0,1.0,2.3928245067688363
9.0,6.0,396.0,1.0,2.330662550712206
10.0,21.0,570.0,1.0,2.124961393207276
11.0,43.0,715.0,1.0,2.3726372056787555
12.0,62.0,821.0,1.0,2.593413361800702
13.0,68.0,886.0,1.0,2.2457003900823973
14.0,72.0,898.0,1.0,2.28966160781416
15.0,68.0,856.0,1.0,1.960959653650556
16.0,55.0,772.0,1.0,1.9311391144413668
17.0,34.0,645.0,1.0,1.8354419727466775
18.0,13.0,366.0,1.0,1.7119647506306437
19.0,0.0,267.0,1.0,1.5549389696964786
20.0,0.0,47.0,1.0,1.87146006117094
21.0,0.0,18.0,1.0,1.631569552786298
22.0,0.0,0.0,1.0,1.4871330848135778
23.0,0.0,0.0,1.0,1.4562891677956806
0.0,0.0,0.0,0.0,1.4644716023846742
1.0,0.0,0.0,0.0,1.6498059159541871
2.0,0.0,0.0,0.0,1.9395049864129896
3.0,0.0,0.0,0.0,3.0097349080449836
4.0,0.0,0.0,0.0,2.924088786033753
5.0,0.0,0.0,0.0,2.6661633118413253
6.0,0.0,5.0,0.0,3.2427494321143846
7.0,0.0,32.0,0.0,2.161782962827834
8.0,0.0,236.0,0.0,1.9819251913915847
9.0,3.0,403.0,0.0,2.45556403483674
10.0,13.0,575.0,0.0,2.6617781544809906
11.0,29.0,717.0,0.0,2.090568002911475
12.0,42.0,830.0,0.0,2.2603519470931923
13.0,43.0,882.0,0.0,2.1640906291787467
14.0,43.0,898.0,0.0,1.8957880537497465
15.0,49.0,870.0,0.0,1.829078628702844
16.0,45.0,784.0,0.0,1.9439485636391924
17.0,23.0,673.0,0.0,2.441173307522782
18.0,7.0,475.0,0.0,2.0085866649569586
19.0,0.0,290.0,0.0,1.6524963897578335
20.0,0.0,86.0,0.0,1.6748283352931852
21.0,0.0,7.0,0.0,1.4441136458687982
22.0,0.0,0.0,0.0,1.4574551193125187
23.0,0.0,0.0,0.0,1.4820208448014391
0.0,0.0,0.0,1.0,1.4563636005524194
1.0,0.0,0.0,1.0,1.3678019737325302
2.0,0.0,0.0,1.0,1.303558718674196
3.0,0.0,0.0,1.0,1.3103737685450112
4.0,0.0,0.0,1.0,1.3557764190094186
5.0,0.0,0.0,1.0,2.330090717346786
6.0,0.0,5.0,1.0,2.223569612969072
7.0,0.0,26.0,1.0,2.1995575641631007
8.0,0.0,229.0,1.0,2.0426691361647955
9.0,11.0,404.0,1.0,2.0768123582903995
10.0,27.0,570.0,1.0,2.251563493309581
11.0,40.0,717.0,1.0,2.040883464676288
12.0,38.0,830.0,1.0,2.1696254499990912
13.0,28.0,896.0,1.0,2.0813276928745803
14.0,35.0,909.0,1.0,1.932148422551872
15.0,56.0,867.0,1.0,1.982986709965367
16.0,55.0,777.0,1.0,1.7466427114756862
17.0,23.0,643.0,1.0,1.696725420844995
18.0,7.0,478.0,1.0,1.6940945346202132
19.0,0.0,306.0,1.0,1.6024962946500612
20.0,0.0,70.0,1.0,1.7895550624589067
21.0,0.0,9.0,1.0,1.4959543268463074
22.0,0.0,0.0,1.0,1.3430686466006558
23.0,0.0,0.0,1.0,1.3035097544403242
0.0,0.0,0.0,5.0,1.2791372801796927
1.0,0.0,0.0,5.0,1.3142493355411802
2.0,0.0,0.0,5.0,1.3249884967305143
3.0,0.0,0.0,5.0,1.2691229154914878
4.0,0.0,0.0,5.0,1.2922378370933782
5.0,0.0,0.0,5.0,3.1287270559649496
6.0,0.0,5.0,5.0,2.641658099959059
7.0,0.0,26.0,5.0,2.421860705750193
8.0,0.0,292.0,5.0,2.4774192312414134
9.0,9.0,410.0,5.0,2.4950698691000786
10.0,13.0,596.0,5.0,2.1320669166329367
11.0,21.0,633.0,5.0,2.0812161744686395
12.0,30.0,830.0,5.0,2.53668367263429
13.0,39.0,854.0,5.0,2.005834826160439
14.0,51.0,749.0,5.0,1.7356986726397674
15.0,64.0,313.0,5.0,2.06782652483291
16.0,47.0,754.0,5.0,1.7701979426755108
17.0,21.0,552.0,5.0,1.700967307452626
18.0,9.0,476.0,5.0,1.5135664505634552
19.0,0.0,272.0,5.0,1.5442633634426408
20.0,0.0,83.0,5.0,1.6211885539471158
21.0,0.0,9.0,5.0,1.5353702132788034
22.0,0.0,0.0,5.0,1.3334886547927474
23.0,0.0,0.0,5.0,1.3430061998863312
0.0,0.0,0.0,10.0,1.3055609262646897
1.0,0.0,0.0,10.0,1.3299367680180438
2.0,0.0,0.0,10.0,1.3959187022434023
3.0,0.0,0.0,10.0,1.3214415460339988
4.0,0.0,0.0,10.0,1.431021661999481
5.0,0.0,0.0,10.0,2.889332002361716
6.0,0.0,7.0,10.0,2.4266722393931053
7.0,0.0,32.0,10.0,2.1421385173785907
8.0,0.0,241.0,10.0,1.9249477677619984
9.0,8.0,413.0,10.0,1.9757672144539542
10.0,13.0,589.0,10.0,2.1736812647339274
11.0,20.0,742.0,10.0,1.9616268480143848
12.0,23.0,496.0,10.0,1.8798166817311253
13.0,25.0,805.0,10.0,2.0032817831355545
14.0,33.0,828.0,10.0,1.7951520347159922
15.0,35.0,737.0,10.0,2.156104755559116
16.0,25.0,450.0,10.0,2.1164825067497883
17.0,11.0,661.0,10.0,2.2061345373874945
18.0,4.0,503.0,10.0,1.7476741269766096
19.0,0.0,316.0,10.0,1.7729116670487837
20.0,0.0,113.0,10.0,1.8803421135966683
21.0,0.0,11.0,10.0,1.4722999076065229
22.0,0.0,0.0,10.0,1.5188672309006706
23.0,0.0,0.0,10.0,1.4664200757524697
0.0,0.0,0.0,18.0,1.5347754317398932
1.0,0.0,0.0,18.0,1.4707566076274192
2.0,0.0,0.0,18.0,1.3770624126263478
3.0,0.0,0.0,18.0,1.3218492762094451
4.0,0.0,0.0,18.0,1.3162478565408908
5.0,0.0,0.0,18.0,2.225199633355795
6.0,0.0,5.0,18.0,2.3149361885178608
7.0,0.0,67.0,18.0,2.0911979943227617
8.0,0.0,123.0,18.0,2.1543561802471576
9.0,6.0,283.0,18.0,2.2672638806793217
10.0,21.0,439.0,18.0,1.7877009293360009
11.0,32.0,636.0,18.0,1.9967269975290696
12.0,37.0,355.0,18.0,2.190751225180189
13.0,35.0,239.0,18.0,2.3101586726373364
14.0,40.0,677.0,18.0,2.0612143571562385
15.0,48.0,888.0,18.0,1.9554317828864916
16.0,42.0,557.0,18.0,1.816987910302753
17.0,23.0,320.0,18.0,2.0243185651805717
18.0,8.0,239.0,18.0,1.8431184931765376
19.0,0.0,169.0,18.0,1.7677964098074028
20.0,0.0,56.0,18.0,2.09676736750898
21.0,0.0,7.0,18.0,1.543622969135836
22.0,0.0,0.0,18.0,1.4458258595015168
23.0,0.0,0.0,18.0,1.475349976927999
0.0,0.0,0.0,28.0,1.3193697261238777
1.0,0.0,0.0,28.0,1.3168265482091437
2.0,0.0,0.0,28.0,1.3469882324661302
3.0,0.0,0.0,28.0,1.358747491967656
4.0,0.0,0.0,28.0,1.3417113365417384
5.0,0.0,0.0,28.0,2.542281106419964
6.0,0.0,0.0,28.0,2.2338083400578763
7.0,0.0,46.0,28.0,1.925577064273071
8.0,0.0,237.0,28.0,2.2183065505282307
9.0,11.0,248.0,28.0,2.6973927759726104
10.0,25.0,443.0,28.0,2.5277127534490726
11.0,42.0,79.0,28.0,2.3367459597138334
12.0,51.0,882.0,28.0,2.1462976659635484
13.0,54.0,814.0,28.0,2.0584969880417296
14.0,61.0,833.0,28.0,2.0698257014418693
15.0,63.0,809.0,28.0,2.14977991402547
16.0,51.0,464.0,28.0,1.8662989911771557
17.0,29.0,396.0,28.0,1.7254795857107068
18.0,11.0,97.0,28.0,1.7970245134661609
19.0,0.0,26.0,28.0,1.799588166556915
20.0,0.0,44.0,28.0,1.837079617414189
21.0,0.0,5.0,28.0,1.568840547807749
22.0,0.0,0.0,28.0,1.3980705795504131
23.0,0.0,0.0,28.0,1.3067675472359956
0.0,0.0,0.0,36.0,1.3033342001162886
1.0,0.0,0.0,36.0,1.2804061981132155
2.0,0.0,0.0,36.0,1.2623147385920566
3.0,0.0,0.0,36.0,1.3431172581506494
4.0,0.0,0.0,36.0,1.5996516403518215
5.0,0.0,0.0,36.0,2.6826944325526774
6.0,0.0,5.0,36.0,2.4652722558046345
7.0,0.0,53.0,36.0,2.5678878766432702
8.0,0.0,118.0,36.0,2.2279241305751047
9.0,4.0,490.0,36.0,2.2912590128856505
10.0,13.0,475.0,36.0,2.385824118855667
11.0,26.0,626.0,36.0,2.4158732917423635
12.0,38.0,833.0,36.0,2.1120104372315307
13.0,42.0,868.0,36.0,2.2028247212454057
14.0,45.0,499.0,36.0,2.1383138034655387
15.0,42.0,366.0,36.0,2.0889552862903
16.0,34.0,223.0,36.0,2.0912538186386254
17.0,21.0,355.0,36.0,2.198458911863839
18.0,8.0,181.0,36.0,1.9584815005418903
19.0,0.0,97.0,36.0,2.189004806314791
20.0,0.0,35.0,36.0,2.4398112414631243
21.0,0.0,0.0,36.0,2.2377356582634236
22.0,0.0,0.0,36.0,1.8617106384668385
23.0,0.0,0.0,36.0,1.6082598454838206
0.0,0.0,0.0,48.5,2.515018763689227
1.0,0.0,0.0,48.5,2.326814230484441
2.0,0.0,0.0,48.5,1.6329626480375186
3.0,0.0,0.0,48.5,1.7636661530311386
4.0,0.0,0.0,48.5,1.6772546142440985
5.0,0.0,0.0,48.5,2.790230028064121
6.0,0.0,5.0,48.5,2.3746082897445766
7.0,0.0,23.0,48.5,2.297365384180463
8.0,0.0,258.0,48.5,2.370127018473691
9.0,4.0,431.0,48.5,2.411867423545082
10.0,17.0,596.0,48.5,2.1476814019433825
