FILENAME,SAMPLINGRATE,BIT,DURATION,CHANNELS,INDEX,FFT_W,MIN_FREQ,MAX_FREQ,J,LEFT_CHANNEL,RIGHT_CHANNEL
rayol-farm2_2019-05-02_00-00-25.wav,44100,16,60,1,acoustic_complexity,512,1,NA,5,1813.67971337654,NA 
rayol-farm2_2019-05-02_00-02-25.wav,44100,16,60,1,acoustic_complexity,512,1,NA,5,1811.23716878679,NA 
rayol-farm2_2019-05-02_00-04-26.wav,44100,16,60,1,acoustic_complexity,512,1,NA,5,1794.14690992834,NA 
rayol-farm2_2019-05-02_00-06-26.wav,44100,16,60,1,acoustic_complexity,512,1,NA,5,1816.1839331263,NA 
rayol-farm2_2019-05-02_00-08-26.wav,44100,16,60,1,acoustic_complexity,512,1,NA,5,1799.67946005468,NA 
rayol-farm2_2019-05-02_00-10-26.wav,44100,16,60,1,acoustic_complexity,512,1,NA,5,1813.09242480607,NA 
rayol-farm2_2019-05-02_00-12-26.wav,44100,16,60,1,acoustic_complexity,512,1,NA,5,1796.32510801192,NA 
rayol-farm2_2019-05-02_00-14-26.wav,44100,16,60,1,acoustic_complexity,512,1,NA,5,1804.55379650709,NA 
rayol-farm2_2019-05-02_00-16-26.wav,44100,16,60,1,acoustic_complexity,512,1,NA,5,1811.67705790416,NA 
rayol-farm2_2019-05-02_00-18-26.wav,44100,16,60,1,acoustic_complexity,512,1,NA,5,1809.03434124801,NA 
rayol-farm2_2019-05-02_00-20-27.wav,44100,16,60,1,acoustic_complexity,512,1,NA,5,1796.19855527862,NA 
rayol-farm2_2019-05-02_00-22-27.wav,44100,16,60,1,acoustic_complexity,512,1,NA,5,1796.68568050306,NA 
rayol-farm2_2019-05-02_00-24-27.wav,44100,16,60,1,acoustic_complexity,512,1,NA,5,1813.16966019897,NA 
rayol-farm2_2019-05-02_00-26-27.wav,44100,16,60,1,acoustic_complexity,512,1,NA,5,1800.90305495124,NA 
rayol-farm2_2019-05-02_00-28-27.wav,44100,16,60,1,acoustic_complexity,512,1,NA,5,1824.19071616707,NA 
rayol-farm2_2019-05-02_00-30-27.wav,44100,16,60,1,acoustic_complexity,512,1,NA,5,1797.33758933453,NA 
rayol-farm2_2019-05-02_00-32-27.wav,44100,16,60,1,acoustic_complexity,512,1,NA,5,1797.91366208469,NA 
rayol-farm2_2019-05-02_00-34-27.wav,44100,16,60,1,acoustic_complexity,512,1,NA,5,1805.26150474398,NA 
rayol-farm2_2019-05-02_00-36-27.wav,44100,16,60,1,acoustic_complexity,512,1,NA,5,1811.23317028056,NA 
rayol-farm2_2019-05-02_00-38-28.wav,44100,16,60,1,acoustic_complexity,512,1,NA,5,1814.03734137498,NA 
rayol-farm2_2019-05-02_00-40-28.wav,44100,16,60,1,acoustic_complexity,512,1,NA,5,1809.57312598644,NA 
rayol-farm2_2019-05-02_00-42-28.wav,44100,16,60,1,acoustic_complexity,512,1,NA,5,1803.46617016158,NA 
rayol-farm2_2019-05-02_00-44-28.wav,44100,16,60,1,acoustic_complexity,512,1,NA,5,1809.15245093557,NA 
rayol-farm2_2019-05-02_00-46-28.wav,44100,16,60,1,acoustic_complexity,512,1,NA,5,1815.84326607078,NA 
rayol-farm2_2019-05-02_00-48-28.wav,44100,16,60,1,acoustic_complexity,512,1,NA,5,1811.65425110157,NA 
rayol-farm2_2019-05-02_00-50-28.wav,44100,16,60,1,acoustic_complexity,512,1,NA,5,1807.05800270083,NA 
rayol-farm2_2019-05-02_00-52-28.wav,44100,16,60,1,acoustic_complexity,512,1,NA,5,1825.8094095044,NA 
rayol-farm2_2019-05-02_00-54-29.wav,44100,16,60,1,acoustic_complexity,512,1,NA,5,1821.22618478102,NA 
rayol-farm2_2019-05-02_00-56-29.wav,44100,16,60,1,acoustic_complexity,512,1,NA,5,1815.38991240372,NA 
rayol-farm2_2019-05-02_00-58-29.wav,44100,16,60,1,acoustic_complexity,512,1,NA,5,1813.52336140469,NA 
rayol-farm2_2019-05-02_01-00-29.wav,44100,16,60,1,acoustic_complexity,512,1,NA,5,1806.98800968727,NA 
rayol-farm2_2019-05-02_01-02-29.wav,44100,16,60,1,acoustic_complexity,512,1,NA,5,1818.3296499258,NA 
rayol-farm2_2019-05-02_01-04-29.wav,44100,16,60,1,acoustic_complexity,512,1,NA,5,1816.17481482228,NA 
rayol-farm2_2019-05-02_01-06-29.wav,44100,16,60,1,acoustic_complexity,512,1,NA,5,1817.64480084961,NA 
rayol-farm2_2019-05-02_01-08-29.wav,44100,16,60,1,acoustic_complexity,512,1,NA,5,1807.43176717162,NA 
rayol-farm2_2019-05-02_01-10-30.wav,44100,16,60,1,acoustic_complexity,512,1,NA,5,1819.07521340825,NA 
rayol-farm2_2019-05-02_01-12-30.wav,44100,16,60,1,acoustic_complexity,512,1,NA,5,1819.2360457442,NA 
rayol-farm2_2019-05-02_01-14-30.wav,44100,16,60,1,acoustic_complexity,512,1,NA,5,1808.37583871502,NA 
rayol-farm2_2019-05-02_01-16-30.wav,44100,16,60,1,acoustic_complexity,512,1,NA,5,1819.57234728128,NA 
rayol-farm2_2019-05-02_01-18-30.wav,44100,16,60,1,acoustic_complexity,512,1,NA,5,1805.69376631727,NA 
rayol-farm2_2019-05-02_01-20-30.wav,44100,16,60,1,acoustic_complexity,512,1,NA,5,1808.73396203747,NA 
rayol-farm2_2019-05-02_01-22-30.wav,44100,16,60,1,acoustic_complexity,512,1,NA,5,1810.15276673306,NA 
rayol-farm2_2019-05-02_01-24-30.wav,44100,16,60,1,acoustic_complexity,512,1,NA,5,1811.90990829831,NA 
rayol-farm2_2019-05-02_01-26-31.wav,44100,16,60,1,acoustic_complexity,512,1,NA,5,1803.3113188001,NA 
rayol-farm2_2019-05-02_01-28-31.wav,44100,16,60,1,acoustic_complexity,512,1,NA,5,1822.45777794959,NA 
rayol-farm2_2019-05-02_01-30-31.wav,44100,16,60,1,acoustic_complexity,512,1,NA,5,1810.85116275907,NA 
rayol-farm2_2019-05-02_01-32-31.wav,44100,16,60,1,acoustic_complexity,512,1,NA,5,1805.4930559707,NA 
rayol-farm2_2019-05-02_01-34-31.wav,44100,16,60,1,acoustic_complexity,512,1,NA,5,1820.08135795891,NA 
rayol-farm2_2019-05-02_01-36-31.wav,44100,16,60,1,acoustic_complexity,512,1,NA,5,1822.35380325806,NA 
rayol-farm2_2019-05-02_01-38-31.wav,44100,16,60,1,acoustic_complexity,512,1,NA,5,1805.16015557587,NA 
rayol-farm2_2019-05-02_01-40-31.wav,44100,16,60,1,acoustic_complexity,512,1,NA,5,1812.07706611032,NA 
rayol-farm2_2019-05-02_01-42-31.wav,44100,16,60,1,acoustic_complexity,512,1,NA,5,1816.38293912208,NA 
rayol-farm2_2019-05-02_01-44-32.wav,44100,16,60,1,acoustic_complexity,512,1,NA,5,1819.81801962062,NA 
rayol-farm2_2019-05-02_01-46-32.wav,44100,16,60,1,acoustic_complexity,512,1,NA,5,1812.03593206719,NA 
rayol-farm2_2019-05-02_01-48-32.wav,44100,16,60,1,acoustic_complexity,512,1,NA,5,1814.27558595195,NA 
rayol-farm2_2019-05-02_01-50-32.wav,44100,16,60,1,acoustic_complexity,512,1,NA,5,1810.48678220955,NA 
rayol-farm2_2019-05-02_01-52-32.wav,44100,16,60,1,acoustic_complexity,512,1,NA,5,1815.85567295408,NA 
rayol-farm2_2019-05-02_01-54-32.wav,44100,16,60,1,acoustic_complexity,512,1,NA,5,1818.62095635227,NA 
rayol-farm2_2019-05-02_01-56-32.wav,44100,16,60,1,acoustic_complexity,512,1,NA,5,1802.53734140646,NA 
rayol-farm2_2019-05-02_01-58-32.wav,44100,16,60,1,acoustic_complexity,512,1,NA,5,1823.09017335655,NA 
rayol-farm2_2019-05-02_02-00-33.wav,44100,16,60,1,acoustic_complexity,512,1,NA,5,1805.88277301524,NA 
rayol-farm2_2019-05-02_02-02-33.wav,44100,16,60,1,acoustic_complexity,512,1,NA,5,1818.20441411262,NA 
rayol-farm2_2019-05-02_02-04-33.wav,44100,16,60,1,acoustic_complexity,512,1,NA,5,1820.06450063426,NA 
rayol-farm2_2019-05-02_02-06-33.wav,44100,16,60,1,acoustic_complexity,512,1,NA,5,1823.38295802555,NA 
rayol-farm2_2019-05-02_02-08-33.wav,44100,16,60,1,acoustic_complexity,512,1,NA,5,1823.82939077516,NA 
rayol-farm2_2019-05-02_02-10-33.wav,44100,16,60,1,acoustic_complexity,512,1,NA,5,1816.06011789416,NA 
rayol-farm2_2019-05-02_02-12-33.wav,44100,16,60,1,acoustic_complexity,512,1,NA,5,1808.3530576177,NA 
rayol-farm2_2019-05-02_02-14-33.wav,44100,16,60,1,acoustic_complexity,512,1,NA,5,1818.77089248,NA 
rayol-farm2_2019-05-02_02-16-34.wav,44100,16,60,1,acoustic_complexity,512,1,NA,5,1812.54003501312,NA 
rayol-farm2_2019-05-02_02-18-34.wav,44100,16,60,1,acoustic_complexity,512,1,NA,5,1815.9893224529,NA 
rayol-farm2_2019-05-02_02-20-34.wav,44100,16,60,1,acoustic_complexity,512,1,NA,5,1816.79358970155,NA 
rayol-farm2_2019-05-02_02-22-34.wav,44100,16,60,1,acoustic_complexity,512,1,NA,5,1799.69861869502,NA 
rayol-farm2_2019-05-02_02-24-34.wav,44100,16,60,1,acoustic_complexity,512,1,NA,5,1810.60061958433,NA 
rayol-farm2_2019-05-02_02-26-34.wav,44100,16,60,1,acoustic_complexity,512,1,NA,5,1811.77139693448,NA 
rayol-farm2_2019-05-02_02-28-34.wav,44100,16,60,1,acoustic_complexity,512,1,NA,5,1822.06478873635,NA 
rayol-farm2_2019-05-02_02-30-34.wav,44100,16,60,1,acoustic_complexity,512,1,NA,5,1808.70934418503,NA 
rayol-farm2_2019-05-02_02-32-35.wav,44100,16,60,1,acoustic_complexity,512,1,NA,5,1812.20563922754,NA 
rayol-farm2_2019-05-02_02-34-35.wav,44100,16,60,1,acoustic_complexity,512,1,NA,5,1814.21125664757,NA 
rayol-farm2_2019-05-02_02-36-35.wav,44100,16,60,1,acoustic_complexity,512,1,NA,5,1810.39075889547,NA 
rayol-farm2_2019-05-02_02-38-35.wav,44100,16,60,1,acoustic_complexity,512,1,NA,5,1811.14258985005,NA 
rayol-farm2_2019-05-02_02-40-35.wav,44100,16,60,1,acoustic_complexity,512,1,NA,5,1813.64623687597,NA 
rayol-farm2_2019-05-02_02-42-35.wav,44100,16,60,1,acoustic_complexity,512,1,NA,5,1810.94860827519,NA 
rayol-farm2_2019-05-02_02-44-35.wav,44100,16,60,1,acoustic_complexity,512,1,NA,5,1810.687152138,NA 
rayol-farm2_2019-05-02_02-46-35.wav,44100,16,60,1,acoustic_complexity,512,1,NA,5,1800.80326320318,NA 
rayol-farm2_2019-05-02_02-48-35.wav,44100,16,60,1,acoustic_complexity,512,1,NA,5,1816.31057595254,NA 
rayol-farm2_2019-05-02_02-50-36.wav,44100,16,60,1,acoustic_complexity,512,1,NA,5,1818.58294860182,NA 
rayol-farm2_2019-05-02_02-52-36.wav,44100,16,60,1,acoustic_complexity,512,1,NA,5,1819.3738823667,NA 
rayol-farm2_2019-05-02_02-54-36.wav,44100,16,60,1,acoustic_complexity,512,1,NA,5,1802.96463063035,NA 
rayol-farm2_2019-05-02_02-56-36.wav,44100,16,60,1,acoustic_complexity,512,1,NA,5,1818.00455939841,NA 
rayol-farm2_2019-05-02_02-58-36.wav,44100,16,60,1,acoustic_complexity,512,1,NA,5,1816.57272778277,NA 
rayol-farm2_2019-05-02_03-00-36.wav,44100,16,60,1,acoustic_complexity,512,1,NA,5,1811.96589277993,NA 
rayol-farm2_2019-05-02_03-02-36.wav,44100,16,60,1,acoustic_complexity,512,1,NA,5,1814.39278682031,NA 
rayol-farm2_2019-05-02_03-04-36.wav,44100,16,60,1,acoustic_complexity,512,1,NA,5,1810.29562559605,NA 
rayol-farm2_2019-05-02_03-06-37.wav,44100,16,60,1,acoustic_complexity,512,1,NA,5,1798.52796448207,NA 
rayol-farm2_2019-05-02_03-08-37.wav,44100,16,60,1,acoustic_complexity,512,1,NA,5,1811.75105694686,NA 
rayol-farm2_2019-05-02_03-10-37.wav,44100,16,60,1,acoustic_complexity,512,1,NA,5,1800.80496040987,NA 
rayol-farm2_2019-05-02_03-12-37.wav,44100,16,60,1,acoustic_complexity,512,1,NA,5,1814.16736336399,NA 
rayol-farm2_2019-05-02_03-14-37.wav,44100,16,60,1,acoustic_complexity,512,1,NA,5,1817.19218400442,NA 
rayol-farm2_2019-05-02_03-16-37.wav,44100,16,60,1,acoustic_complexity,512,1,NA,5,1803.84133339017,NA 
rayol-farm2_2019-05-02_03-18-37.wav,44100,16,60,1,acoustic_complexity,512,1,NA,5,1803.17577638009,NA 
rayol-farm2_2019-05-02_03-20-37.wav,44100,16,60,1,acoustic_complexity,512,1,NA,5,1819.1323216973,NA 
rayol-farm2_2019-05-02_03-22-38.wav,44100,16,60,1,acoustic_complexity,512,1,NA,5,1806.84938442115,NA 
rayol-farm2_2019-05-02_03-24-38.wav,44100,16,60,1,acoustic_complexity,512,1,NA,5,1811.63958017795,NA 
rayol-farm2_2019-05-02_03-26-38.wav,44100,16,60,1,acoustic_complexity,512,1,NA,5,1812.64349367141,NA 
rayol-farm2_2019-05-02_03-28-38.wav,44100,16,60,1,acoustic_complexity,512,1,NA,5,1811.04178177871,NA 
rayol-farm2_2019-05-02_03-30-38.wav,44100,16,60,1,acoustic_complexity,512,1,NA,5,1812.34777801646,NA 
rayol-farm2_2019-05-02_03-32-38.wav,44100,16,60,1,acoustic_complexity,512,1,NA,5,1817.20768011796,NA 
rayol-farm2_2019-05-02_03-34-38.wav,44100,16,60,1,acoustic_complexity,512,1,NA,5,1812.33341443894,NA 
rayol-farm2_2019-05-02_03-36-38.wav,44100,16,60,1,acoustic_complexity,512,1,NA,5,1826.78171789408,NA 
rayol-farm2_2019-05-02_03-38-39.wav,44100,16,60,1,acoustic_complexity,512,1,NA,5,1816.89457294312,NA 
rayol-farm2_2019-05-02_03-40-39.wav,44100,16,60,1,acoustic_complexity,512,1,NA,5,1809.09814112856,NA 
rayol-farm2_2019-05-02_03-42-39.wav,44100,16,60,1,acoustic_complexity,512,1,NA,5,1812.43401563562,NA 
rayol-farm2_2019-05-02_03-44-39.wav,44100,16,60,1,acoustic_complexity,512,1,NA,5,1809.70107106362,NA 
rayol-farm2_2019-05-02_03-46-39.wav,44100,16,60,1,acoustic_complexity,512,1,NA,5,1818.60072644042,NA 
rayol-farm2_2019-05-02_03-48-39.wav,44100,16,60,1,acoustic_complexity,512,1,NA,5,1808.63903454364,NA 
rayol-farm2_2019-05-02_03-50-39.wav,44100,16,60,1,acoustic_complexity,512,1,NA,5,1811.86092223268,NA 
rayol-farm2_2019-05-02_03-52-39.wav,44100,16,60,1,acoustic_complexity,512,1,NA,5,1798.58915710463,NA 
rayol-farm2_2019-05-02_03-54-39.wav,44100,16,60,1,acoustic_complexity,512,1,NA,5,1812.0073398251,NA 
rayol-farm2_2019-05-02_03-56-40.wav,44100,16,60,1,acoustic_complexity,512,1,NA,5,1807.22489780808,NA 
rayol-farm2_2019-05-02_03-58-40.wav,44100,16,60,1,acoustic_complexity,512,1,NA,5,1802.98889688127,NA 
rayol-farm2_2019-05-02_04-00-40.wav,44100,16,60,1,acoustic_complexity,512,1,NA,5,1810.25489272842,NA 
rayol-farm2_2019-05-02_04-02-40.wav,44100,16,60,1,acoustic_complexity,512,1,NA,5,1818.60308399073,NA 
rayol-farm2_2019-05-02_04-04-40.wav,44100,16,60,1,acoustic_complexity,512,1,NA,5,1804.64061471723,NA 
rayol-farm2_2019-05-02_04-06-40.wav,44100,16,60,1,acoustic_complexity,512,1,NA,5,1801.18453626564,NA 
rayol-farm2_2019-05-02_04-08-40.wav,44100,16,60,1,acoustic_complexity,512,1,NA,5,1824.28587712464,NA 
rayol-farm2_2019-05-02_04-10-40.wav,44100,16,60,1,acoustic_complexity,512,1,NA,5,1821.84173824485,NA 
rayol-farm2_2019-05-02_04-12-41.wav,44100,16,60,1,acoustic_complexity,512,1,NA,5,1818.94951147255,NA 
rayol-farm2_2019-05-02_04-14-41.wav,44100,16,60,1,acoustic_complexity,512,1,NA,5,1813.2573044531,NA 
rayol-farm2_2019-05-02_04-16-41.wav,44100,16,60,1,acoustic_complexity,512,1,NA,5,1811.16697724918,NA 
rayol-farm2_2019-05-02_04-18-41.wav,44100,16,60,1,acoustic_complexity,512,1,NA,5,1813.89630730292,NA 
rayol-farm2_2019-05-02_04-20-41.wav,44100,16,60,1,acoustic_complexity,512,1,NA,5,1816.86357551351,NA 
rayol-farm2_2019-05-02_04-22-41.wav,44100,16,60,1,acoustic_complexity,512,1,NA,5,1804.40752044026,NA 
rayol-farm2_2019-05-02_04-24-41.wav,44100,16,60,1,acoustic_complexity,512,1,NA,5,1812.43703533147,NA 
rayol-farm2_2019-05-02_04-26-41.wav,44100,16,60,1,acoustic_complexity,512,1,NA,5,1805.09339074136,NA 
rayol-farm2_2019-05-02_04-28-42.wav,44100,16,60,1,acoustic_complexity,512,1,NA,5,1807.77064193921,NA 
rayol-farm2_2019-05-02_04-30-42.wav,44100,16,60,1,acoustic_complexity,512,1,NA,5,1809.36597304554,NA 
rayol-farm2_2019-05-02_04-32-42.wav,44100,16,60,1,acoustic_complexity,512,1,NA,5,1810.07804372522,NA 
rayol-farm2_2019-05-02_04-34-42.wav,44100,16,60,1,acoustic_complexity,512,1,NA,5,1807.25955816139,NA 
rayol-farm2_2019-05-02_04-36-42.wav,44100,16,60,1,acoustic_complexity,512,1,NA,5,1806.66361298524,NA 
rayol-farm2_2019-05-02_04-38-42.wav,44100,16,60,1,acoustic_complexity,512,1,NA,5,1802.08258266406,NA 
rayol-farm2_2019-05-02_04-40-42.wav,44100,16,60,1,acoustic_complexity,512,1,NA,5,1812.887125944,NA 
rayol-farm2_2019-05-02_04-42-42.wav,44100,16,60,1,acoustic_complexity,512,1,NA,5,1812.40093459992,NA 
rayol-farm2_2019-05-02_04-44-42.wav,44100,16,60,1,acoustic_complexity,512,1,NA,5,1806.22122547078,NA 
rayol-farm2_2019-05-02_04-46-43.wav,44100,16,60,1,acoustic_complexity,512,1,NA,5,1817.88331217348,NA 
rayol-farm2_2019-05-02_04-48-43.wav,44100,16,60,1,acoustic_complexity,512,1,NA,5,1813.99150617644,NA 
rayol-farm2_2019-05-02_04-50-43.wav,44100,16,60,1,acoustic_complexity,512,1,NA,5,1809.55821203092,NA 
rayol-farm2_2019-05-02_04-52-43.wav,44100,16,60,1,acoustic_complexity,512,1,NA,5,1810.28763154372,NA 
rayol-farm2_2019-05-02_04-54-43.wav,44100,16,60,1,acoustic_complexity,512,1,NA,5,1819.36440150329,NA 
rayol-farm2_2019-05-02_04-56-43.wav,44100,16,60,1,acoustic_complexity,512,1,NA,5,1802.20340869674,NA 
rayol-farm2_2019-05-02_04-58-43.wav,44100,16,60,1,acoustic_complexity,512,1,NA,5,1820.31938373139,NA 
rayol-farm2_2019-05-02_05-00-43.wav,44100,16,60,1,acoustic_complexity,512,1,NA,5,1821.33506320419,NA 
rayol-farm2_2019-05-02_05-02-44.wav,44100,16,60,1,acoustic_complexity,512,1,NA,5,1812.55639279225,NA 
rayol-farm2_2019-05-02_05-04-44.wav,44100,16,60,1,acoustic_complexity,512,1,NA,5,1813.34663582543,NA 
rayol-farm2_2019-05-02_05-06-44.wav,44100,16,60,1,acoustic_complexity,512,1,NA,5,1818.89940326812,NA 
rayol-farm2_2019-05-02_05-08-44.wav,44100,16,60,1,acoustic_complexity,512,1,NA,5,1820.78742626433,NA 
rayol-farm2_2019-05-02_05-10-44.wav,44100,16,60,1,acoustic_complexity,512,1,NA,5,1809.06997495941,NA 
rayol-farm2_2019-05-02_05-12-44.wav,44100,16,60,1,acoustic_complexity,512,1,NA,5,1825.3087407097,NA 
rayol-farm2_2019-05-02_05-14-44.wav,44100,16,60,1,acoustic_complexity,512,1,NA,5,1813.45139425237,NA 
rayol-farm2_2019-05-02_05-16-44.wav,44100,16,60,1,acoustic_complexity,512,1,NA,5,1825.5631925642,NA 
rayol-farm2_2019-05-02_05-18-45.wav,44100,16,60,1,acoustic_complexity,512,1,NA,5,1812.6825339656,NA 
rayol-farm2_2019-05-02_05-20-45.wav,44100,16,60,1,acoustic_complexity,512,1,NA,5,1812.18825572128,NA 
rayol-farm2_2019-05-02_05-22-45.wav,44100,16,60,1,acoustic_complexity,512,1,NA,5,1806.19254224118,NA 
rayol-farm2_2019-05-02_05-24-45.wav,44100,16,60,1,acoustic_complexity,512,1,NA,5,1819.47291840063,NA 
rayol-farm2_2019-05-02_05-26-45.wav,44100,16,60,1,acoustic_complexity,512,1,NA,5,1870.85134614616,NA 
rayol-farm2_2019-05-02_05-28-45.wav,44100,16,60,1,acoustic_complexity,512,1,NA,5,1840.02469171747,NA 
rayol-farm2_2019-05-02_05-30-45.wav,44100,16,60,1,acoustic_complexity,512,1,NA,5,1838.1002466428,NA 
rayol-farm2_2019-05-02_05-32-45.wav,44100,16,60,1,acoustic_complexity,512,1,NA,5,1824.86528317604,NA 
rayol-farm2_2019-05-02_05-34-45.wav,44100,16,60,1,acoustic_complexity,512,1,NA,5,1822.7324128687,NA 
rayol-farm2_2019-05-02_05-36-46.wav,44100,16,60,1,acoustic_complexity,512,1,NA,5,1804.24771766274,NA 
rayol-farm2_2019-05-02_05-38-46.wav,44100,16,60,1,acoustic_complexity,512,1,NA,5,1812.30471944499,NA 
rayol-farm2_2019-05-02_05-40-46.wav,44100,16,60,1,acoustic_complexity,512,1,NA,5,1804.88316823156,NA 
rayol-farm2_2019-05-02_05-42-46.wav,44100,16,60,1,acoustic_complexity,512,1,NA,5,1825.76582714894,NA 
rayol-farm2_2019-05-02_05-44-46.wav,44100,16,60,1,acoustic_complexity,512,1,NA,5,1825.74250398536,NA 
rayol-farm2_2019-05-02_05-46-46.wav,44100,16,60,1,acoustic_complexity,512,1,NA,5,1818.13804096034,NA 
rayol-farm2_2019-05-02_05-48-46.wav,44100,16,60,1,acoustic_complexity,512,1,NA,5,1818.96733666749,NA 
rayol-farm2_2019-05-02_05-50-46.wav,44100,16,60,1,acoustic_complexity,512,1,NA,5,1809.29600089114,NA 
rayol-farm2_2019-05-02_05-52-47.wav,44100,16,60,1,acoustic_complexity,512,1,NA,5,1818.04384763931,NA 
rayol-farm2_2019-05-02_05-54-47.wav,44100,16,60,1,acoustic_complexity,512,1,NA,5,1820.08102568549,NA 
rayol-farm2_2019-05-02_05-56-47.wav,44100,16,60,1,acoustic_complexity,512,1,NA,5,1809.57327625841,NA 
rayol-farm2_2019-05-02_05-58-47.wav,44100,16,60,1,acoustic_complexity,512,1,NA,5,1836.9137298333,NA 
rayol-farm2_2019-05-02_06-00-47.wav,44100,16,60,1,acoustic_complexity,512,1,NA,5,1844.38881522829,NA 
rayol-farm2_2019-05-02_06-02-47.wav,44100,16,60,1,acoustic_complexity,512,1,NA,5,1833.9266871822,NA 
rayol-farm2_2019-05-02_06-04-47.wav,44100,16,60,1,acoustic_complexity,512,1,NA,5,1830.54941235744,NA 
rayol-farm2_2019-05-02_06-06-47.wav,44100,16,60,1,acoustic_complexity,512,1,NA,5,1846.43008992459,NA 
rayol-farm2_2019-05-02_06-08-48.wav,44100,16,60,1,acoustic_complexity,512,1,NA,5,1850.78900001004,NA 
rayol-farm2_2019-05-02_06-10-48.wav,44100,16,60,1,acoustic_complexity,512,1,NA,5,1829.68183945086,NA 
rayol-farm2_2019-05-02_06-12-48.wav,44100,16,60,1,acoustic_complexity,512,1,NA,5,1828.68534322032,NA 
rayol-farm2_2019-05-02_06-14-48.wav,44100,16,60,1,acoustic_complexity,512,1,NA,5,1825.20715718634,NA 
rayol-farm2_2019-05-02_06-16-48.wav,44100,16,60,1,acoustic_complexity,512,1,NA,5,1815.02937561944,NA 
rayol-farm2_2019-05-02_06-18-48.wav,44100,16,60,1,acoustic_complexity,512,1,NA,5,1817.38931180014,NA 
rayol-farm2_2019-05-02_06-20-48.wav,44100,16,60,1,acoustic_complexity,512,1,NA,5,1817.15817441996,NA 
rayol-farm2_2019-05-02_06-22-48.wav,44100,16,60,1,acoustic_complexity,512,1,NA,5,1812.49090511413,NA 
rayol-farm2_2019-05-02_06-24-48.wav,44100,16,60,1,acoustic_complexity,512,1,NA,5,1811.90961937398,NA 
rayol-farm2_2019-05-02_06-26-49.wav,44100,16,60,1,acoustic_complexity,512,1,NA,5,1812.59687715529,NA 
rayol-farm2_2019-05-02_06-28-49.wav,44100,16,60,1,acoustic_complexity,512,1,NA,5,1819.25783128981,NA 
rayol-farm2_2019-05-02_06-30-49.wav,44100,16,60,1,acoustic_complexity,512,1,NA,5,1810.38072033328,NA 
rayol-farm2_2019-05-02_06-32-49.wav,44100,16,60,1,acoustic_complexity,512,1,NA,5,1821.2750958181,NA 
rayol-farm2_2019-05-02_06-34-49.wav,44100,16,60,1,acoustic_complexity,512,1,NA,5,1818.43746554327,NA 
rayol-farm2_2019-05-02_06-36-49.wav,44100,16,60,1,acoustic_complexity,512,1,NA,5,1818.39015213486,NA 
rayol-farm2_2019-05-02_06-38-49.wav,44100,16,60,1,acoustic_complexity,512,1,NA,5,1816.30648138745,NA 
rayol-farm2_2019-05-02_06-40-49.wav,44100,16,60,1,acoustic_complexity,512,1,NA,5,1821.52427661973,NA 
rayol-farm2_2019-05-02_06-42-50.wav,44100,16,60,1,acoustic_complexity,512,1,NA,5,1837.30617307513,NA 
rayol-farm2_2019-05-02_06-44-50.wav,44100,16,60,1,acoustic_complexity,512,1,NA,5,1825.50728767696,NA 
rayol-farm2_2019-05-02_06-46-50.wav,44100,16,60,1,acoustic_complexity,512,1,NA,5,1839.22394048503,NA 
rayol-farm2_2019-05-02_06-48-50.wav,44100,16,60,1,acoustic_complexity,512,1,NA,5,1823.5563826363,NA 
rayol-farm2_2019-05-02_06-50-50.wav,44100,16,60,1,acoustic_complexity,512,1,NA,5,1815.9752560435,NA 
rayol-farm2_2019-05-02_06-52-50.wav,44100,16,60,1,acoustic_complexity,512,1,NA,5,1815.80585309475,NA 
rayol-farm2_2019-05-02_06-54-50.wav,44100,16,60,1,acoustic_complexity,512,1,NA,5,1828.99254687946,NA 
rayol-farm2_2019-05-02_06-56-50.wav,44100,16,60,1,acoustic_complexity,512,1,NA,5,1826.64491509415,NA 
rayol-farm2_2019-05-02_06-58-50.wav,44100,16,60,1,acoustic_complexity,512,1,NA,5,1806.17018427611,NA 
rayol-farm2_2019-05-02_07-00-51.wav,44100,16,60,1,acoustic_complexity,512,1,NA,5,1808.62378742979,NA 
rayol-farm2_2019-05-02_07-02-51.wav,44100,16,60,1,acoustic_complexity,512,1,NA,5,1804.43446391238,NA 
rayol-farm2_2019-05-02_07-04-51.wav,44100,16,60,1,acoustic_complexity,512,1,NA,5,1806.50415276234,NA 
rayol-farm2_2019-05-02_07-06-51.wav,44100,16,60,1,acoustic_complexity,512,1,NA,5,1819.78265406657,NA 
rayol-farm2_2019-05-02_07-08-51.wav,44100,16,60,1,acoustic_complexity,512,1,NA,5,1835.09060444564,NA 
rayol-farm2_2019-05-02_07-10-51.wav,44100,16,60,1,acoustic_complexity,512,1,NA,5,1819.76733374874,NA 
rayol-farm2_2019-05-02_07-12-51.wav,44100,16,60,1,acoustic_complexity,512,1,NA,5,1819.00402355995,NA 
rayol-farm2_2019-05-02_07-14-51.wav,44100,16,60,1,acoustic_complexity,512,1,NA,5,1829.19837978627,NA 
rayol-farm2_2019-05-02_07-16-52.wav,44100,16,60,1,acoustic_complexity,512,1,NA,5,1813.99957147528,NA 
rayol-farm2_2019-05-02_07-18-52.wav,44100,16,60,1,acoustic_complexity,512,1,NA,5,1805.31010880769,NA 
rayol-farm2_2019-05-02_07-20-52.wav,44100,16,60,1,acoustic_complexity,512,1,NA,5,1821.71964015867,NA 
rayol-farm2_2019-05-02_07-22-52.wav,44100,16,60,1,acoustic_complexity,512,1,NA,5,1816.84606469252,NA 
rayol-farm2_2019-05-02_07-24-52.wav,44100,16,60,1,acoustic_complexity,512,1,NA,5,1828.09223663941,NA 
rayol-farm2_2019-05-02_07-26-52.wav,44100,16,60,1,acoustic_complexity,512,1,NA,5,1817.85221693132,NA 
rayol-farm2_2019-05-02_07-28-52.wav,44100,16,60,1,acoustic_complexity,512,1,NA,5,1831.38136145418,NA 
rayol-farm2_2019-05-02_07-30-52.wav,44100,16,60,1,acoustic_complexity,512,1,NA,5,1828.29778743228,NA 
rayol-farm2_2019-05-02_07-32-53.wav,44100,16,60,1,acoustic_complexity,512,1,NA,5,1837.88740505861,NA 
rayol-farm2_2019-05-02_07-34-53.wav,44100,16,60,1,acoustic_complexity,512,1,NA,5,1825.57365187027,NA 
rayol-farm2_2019-05-02_07-36-53.wav,44100,16,60,1,acoustic_complexity,512,1,NA,5,1815.09975406493,NA 
rayol-farm2_2019-05-02_07-38-53.wav,44100,16,60,1,acoustic_complexity,512,1,NA,5,1823.00418727884,NA 
rayol-farm2_2019-05-02_07-40-53.wav,44100,16,60,1,acoustic_complexity,512,1,NA,5,1797.83227061977,NA 
rayol-farm2_2019-05-02_07-42-53.wav,44100,16,60,1,acoustic_complexity,512,1,NA,5,1792.88568244751,NA 
rayol-farm2_2019-05-02_07-44-53.wav,44100,16,60,1,acoustic_complexity,512,1,NA,5,1794.06164551465,NA 
rayol-farm2_2019-05-02_07-46-53.wav,44100,16,60,1,acoustic_complexity,512,1,NA,5,1796.22467805282,NA 
rayol-farm2_2019-05-02_07-48-53.wav,44100,16,60,1,acoustic_complexity,512,1,NA,5,1794.39175374305,NA 
rayol-farm2_2019-05-02_07-50-54.wav,44100,16,60,1,acoustic_complexity,512,1,NA,5,1805.18899230684,NA 
rayol-farm2_2019-05-02_07-52-54.wav,44100,16,60,1,acoustic_complexity,512,1,NA,5,1800.96961348277,NA 
rayol-farm2_2019-05-02_07-54-54.wav,44100,16,60,1,acoustic_complexity,512,1,NA,5,1814.67339067171,NA 
rayol-farm2_2019-05-02_07-56-54.wav,44100,16,60,1,acoustic_complexity,512,1,NA,5,1794.16105829608,NA 
rayol-farm2_2019-05-02_07-58-54.wav,44100,16,60,1,acoustic_complexity,512,1,NA,5,1809.44609728952,NA 
rayol-farm2_2019-05-02_08-00-54.wav,44100,16,60,1,acoustic_complexity,512,1,NA,5,1801.83103169076,NA 
rayol-farm2_2019-05-02_08-02-54.wav,44100,16,60,1,acoustic_complexity,512,1,NA,5,1797.9272619971,NA 
rayol-farm2_2019-05-02_08-04-54.wav,44100,16,60,1,acoustic_complexity,512,1,NA,5,1810.14568595435,NA 
rayol-farm2_2019-05-02_08-06-55.wav,44100,16,60,1,acoustic_complexity,512,1,NA,5,1796.45970020504,NA 
rayol-farm2_2019-05-02_08-08-55.wav,44100,16,60,1,acoustic_complexity,512,1,NA,5,1806.65028206343,NA 
rayol-farm2_2019-05-02_08-10-55.wav,44100,16,60,1,acoustic_complexity,512,1,NA,5,1810.4555967886,NA 
rayol-farm2_2019-05-02_08-12-55.wav,44100,16,60,1,acoustic_complexity,512,1,NA,5,1806.80623552203,NA 
rayol-farm2_2019-05-02_08-14-55.wav,44100,16,60,1,acoustic_complexity,512,1,NA,5,1808.62458478632,NA 
rayol-farm2_2019-05-02_08-16-55.wav,44100,16,60,1,acoustic_complexity,512,1,NA,5,1805.13733417245,NA 
rayol-farm2_2019-05-02_08-18-55.wav,44100,16,60,1,acoustic_complexity,512,1,NA,5,1787.3365559936,NA 
rayol-farm2_2019-05-02_08-20-55.wav,44100,16,60,1,acoustic_complexity,512,1,NA,5,1795.14124495592,NA 
rayol-farm2_2019-05-02_08-22-55.wav,44100,16,60,1,acoustic_complexity,512,1,NA,5,1796.76539415199,NA 
rayol-farm2_2019-05-02_08-24-56.wav,44100,16,60,1,acoustic_complexity,512,1,NA,5,1783.21348143126,NA 
rayol-farm2_2019-05-02_08-26-56.wav,44100,16,60,1,acoustic_complexity,512,1,NA,5,1791.99141207627,NA 
rayol-farm2_2019-05-02_08-28-56.wav,44100,16,60,1,acoustic_complexity,512,1,NA,5,1824.10905578715,NA 
rayol-farm2_2019-05-02_08-30-56.wav,44100,16,60,1,acoustic_complexity,512,1,NA,5,1835.14099365788,NA 
rayol-farm2_2019-05-02_08-32-56.wav,44100,16,60,1,acoustic_complexity,512,1,NA,5,1821.44286348603,NA 
rayol-farm2_2019-05-02_08-34-56.wav,44100,16,60,1,acoustic_complexity,512,1,NA,5,1814.03661374283,NA 
rayol-farm2_2019-05-02_08-36-56.wav,44100,16,60,1,acoustic_complexity,512,1,NA,5,1811.99916231061,NA 
rayol-farm2_2019-05-02_08-38-56.wav,44100,16,60,1,acoustic_complexity,512,1,NA,5,1819.50074163775,NA 
rayol-farm2_2019-05-02_08-40-57.wav,44100,16,60,1,acoustic_complexity,512,1,NA,5,1832.58268508996,NA 
rayol-farm2_2019-05-02_08-42-57.wav,44100,16,60,1,acoustic_complexity,512,1,NA,5,1827.69022230894,NA 
rayol-farm2_2019-05-02_08-44-57.wav,44100,16,60,1,acoustic_complexity,512,1,NA,5,1821.87894572741,NA 
rayol-farm2_2019-05-02_08-46-57.wav,44100,16,60,1,acoustic_complexity,512,1,NA,5,1815.0299646384,NA 
rayol-farm2_2019-05-02_08-48-57.wav,44100,16,60,1,acoustic_complexity,512,1,NA,5,1833.84950004331,NA 
rayol-farm2_2019-05-02_08-50-57.wav,44100,16,60,1,acoustic_complexity,512,1,NA,5,1815.53019757599,NA 
rayol-farm2_2019-05-02_08-52-57.wav,44100,16,60,1,acoustic_complexity,512,1,NA,5,1826.43326351884,NA 
rayol-farm2_2019-05-02_08-54-57.wav,44100,16,60,1,acoustic_complexity,512,1,NA,5,1838.43394247287,NA 
rayol-farm2_2019-05-02_08-56-58.wav,44100,16,60,1,acoustic_complexity,512,1,NA,5,1815.34026009984,NA 
rayol-farm2_2019-05-02_08-58-58.wav,44100,16,60,1,acoustic_complexity,512,1,NA,5,1820.51333691189,NA 
rayol-farm2_2019-05-02_09-00-58.wav,44100,16,60,1,acoustic_complexity,512,1,NA,5,1879.29649625829,NA 
rayol-farm2_2019-05-02_09-02-58.wav,44100,16,60,1,acoustic_complexity,512,1,NA,5,1838.5967824561,NA 
rayol-farm2_2019-05-02_09-04-58.wav,44100,16,60,1,acoustic_complexity,512,1,NA,5,1835.17491876609,NA 
rayol-farm2_2019-05-02_09-06-58.wav,44100,16,60,1,acoustic_complexity,512,1,NA,5,1829.98368142371,NA 
rayol-farm2_2019-05-02_09-08-58.wav,44100,16,60,1,acoustic_complexity,512,1,NA,5,1827.9170443099,NA 
rayol-farm2_2019-05-02_09-10-58.wav,44100,16,60,1,acoustic_complexity,512,1,NA,5,1818.02701966394,NA 
rayol-farm2_2019-05-02_09-12-58.wav,44100,16,60,1,acoustic_complexity,512,1,NA,5,1825.64450668778,NA 
rayol-farm2_2019-05-02_09-14-59.wav,44100,16,60,1,acoustic_complexity,512,1,NA,5,1820.63358629909,NA 
rayol-farm2_2019-05-02_09-16-59.wav,44100,16,60,1,acoustic_complexity,512,1,NA,5,1833.94186083111,NA 
rayol-farm2_2019-05-02_09-18-59.wav,44100,16,60,1,acoustic_complexity,512,1,NA,5,1817.18238464251,NA 
rayol-farm2_2019-05-02_09-20-59.wav,44100,16,60,1,acoustic_complexity,512,1,NA,5,1852.38520405608,NA 
rayol-farm2_2019-05-02_09-22-59.wav,44100,16,60,1,acoustic_complexity,512,1,NA,5,1823.13507799523,NA 
rayol-farm2_2019-05-02_09-24-59.wav,44100,16,60,1,acoustic_complexity,512,1,NA,5,1823.85753687078,NA 
rayol-farm2_2019-05-02_09-26-59.wav,44100,16,60,1,acoustic_complexity,512,1,NA,5,1823.90556874727,NA 
rayol-farm2_2019-05-02_09-28-59.wav,44100,16,60,1,acoustic_complexity,512,1,NA,5,1823.60116883602,NA 
rayol-farm2_2019-05-02_09-31-00.wav,44100,16,60,1,acoustic_complexity,512,1,NA,5,1819.57620168108,NA 
rayol-farm2_2019-05-02_09-33-00.wav,44100,16,60,1,acoustic_complexity,512,1,NA,5,1819.54125049681,NA 
rayol-farm2_2019-05-02_09-35-00.wav,44100,16,60,1,acoustic_complexity,512,1,NA,5,1806.67653225057,NA 
rayol-farm2_2019-05-02_09-37-00.wav,44100,16,60,1,acoustic_complexity,512,1,NA,5,1809.74563676798,NA 
rayol-farm2_2019-05-02_09-39-00.wav,44100,16,60,1,acoustic_complexity,512,1,NA,5,1822.73070537229,NA 
rayol-farm2_2019-05-02_09-41-00.wav,44100,16,60,1,acoustic_complexity,512,1,NA,5,1803.05972119398,NA 
rayol-farm2_2019-05-02_09-43-00.wav,44100,16,60,1,acoustic_complexity,512,1,NA,5,1812.84829564972,NA 
rayol-farm2_2019-05-02_09-45-00.wav,44100,16,60,1,acoustic_complexity,512,1,NA,5,1808.18276811712,NA 
rayol-farm2_2019-05-02_09-47-01.wav,44100,16,60,1,acoustic_complexity,512,1,NA,5,1789.81864355335,NA 
rayol-farm2_2019-05-02_09-49-01.wav,44100,16,60,1,acoustic_complexity,512,1,NA,5,1800.15063268608,NA 
rayol-farm2_2019-05-02_09-51-01.wav,44100,16,60,1,acoustic_complexity,512,1,NA,5,1819.34873915922,NA 
rayol-farm2_2019-05-02_09-53-01.wav,44100,16,60,1,acoustic_complexity,512,1,NA,5,1800.48896704212,NA 
rayol-farm2_2019-05-02_09-55-01.wav,44100,16,60,1,acoustic_complexity,512,1,NA,5,1819.63670567744,NA 
rayol-farm2_2019-05-02_09-57-01.wav,44100,16,60,1,acoustic_complexity,512,1,NA,5,1810.12607109651,NA 
rayol-farm2_2019-05-02_09-59-01.wav,44100,16,60,1,acoustic_complexity,512,1,NA,5,1792.09379707283,NA 
rayol-farm2_2019-05-02_10-01-01.wav,44100,16,60,1,acoustic_complexity,512,1,NA,5,1791.7555463804,NA 
rayol-farm2_2019-05-02_10-03-02.wav,44100,16,60,1,acoustic_complexity,512,1,NA,5,1821.50018866751,NA 
rayol-farm2_2019-05-02_10-05-02.wav,44100,16,60,1,acoustic_complexity,512,1,NA,5,1834.87046320684,NA 
rayol-farm2_2019-05-02_10-07-02.wav,44100,16,60,1,acoustic_complexity,512,1,NA,5,1793.31079174085,NA 
rayol-farm2_2019-05-02_10-09-02.wav,44100,16,60,1,acoustic_complexity,512,1,NA,5,1819.03495808142,NA 
rayol-farm2_2019-05-02_10-11-02.wav,44100,16,60,1,acoustic_complexity,512,1,NA,5,1817.98300301348,NA 
rayol-farm2_2019-05-02_10-13-02.wav,44100,16,60,1,acoustic_complexity,512,1,NA,5,1818.34236999798,NA 
rayol-farm2_2019-05-02_10-15-02.wav,44100,16,60,1,acoustic_complexity,512,1,NA,5,1837.80493880438,NA 
rayol-farm2_2019-05-02_10-17-02.wav,44100,16,60,1,acoustic_complexity,512,1,NA,5,1829.88065146361,NA 
rayol-farm2_2019-05-02_10-19-02.wav,44100,16,60,1,acoustic_complexity,512,1,NA,5,1814.71483016595,NA 
rayol-farm2_2019-05-02_10-21-03.wav,44100,16,60,1,acoustic_complexity,512,1,NA,5,1816.14826030528,NA 
rayol-farm2_2019-05-02_10-23-03.wav,44100,16,60,1,acoustic_complexity,512,1,NA,5,1812.48960643623,NA 
rayol-farm2_2019-05-02_10-25-03.wav,44100,16,60,1,acoustic_complexity,512,1,NA,5,1820.74827156685,NA 
rayol-farm2_2019-05-02_10-27-03.wav,44100,16,60,1,acoustic_complexity,512,1,NA,5,1816.14207782729,NA 
rayol-farm2_2019-05-02_10-29-03.wav,44100,16,60,1,acoustic_complexity,512,1,NA,5,1828.83342156784,NA 
rayol-farm2_2019-05-02_10-31-03.wav,44100,16,60,1,acoustic_complexity,512,1,NA,5,1814.24379226143,NA 
rayol-farm2_2019-05-02_10-33-03.wav,44100,16,60,1,acoustic_complexity,512,1,NA,5,1827.18418713239,NA 
rayol-farm2_2019-05-02_10-35-03.wav,44100,16,60,1,acoustic_complexity,512,1,NA,5,1824.07763732066,NA 
rayol-farm2_2019-05-02_10-37-04.wav,44100,16,60,1,acoustic_complexity,512,1,NA,5,1908.8671901467,NA 
rayol-farm2_2019-05-02_10-39-04.wav,44100,16,60,1,acoustic_complexity,512,1,NA,5,1835.1463515947,NA 
rayol-farm2_2019-05-02_10-41-04.wav,44100,16,60,1,acoustic_complexity,512,1,NA,5,1822.66700318498,NA 
rayol-farm2_2019-05-02_10-43-04.wav,44100,16,60,1,acoustic_complexity,512,1,NA,5,1829.31174261826,NA 
rayol-farm2_2019-05-02_10-45-04.wav,44100,16,60,1,acoustic_complexity,512,1,NA,5,1814.73391531863,NA 
rayol-farm2_2019-05-02_10-47-04.wav,44100,16,60,1,acoustic_complexity,512,1,NA,5,1809.5472358071,NA 
rayol-farm2_2019-05-02_10-49-04.wav,44100,16,60,1,acoustic_complexity,512,1,NA,5,1814.10458721195,NA 
rayol-farm2_2019-05-02_10-51-04.wav,44100,16,60,1,acoustic_complexity,512,1,NA,5,1827.56020800466,NA 
rayol-farm2_2019-05-02_10-53-05.wav,44100,16,60,1,acoustic_complexity,512,1,NA,5,1834.10460697405,NA 
rayol-farm2_2019-05-02_10-55-05.wav,44100,16,60,1,acoustic_complexity,512,1,NA,5,1849.98465915215,NA 
rayol-farm2_2019-05-02_10-57-05.wav,44100,16,60,1,acoustic_complexity,512,1,NA,5,1849.8575956113,NA 
rayol-farm2_2019-05-02_10-59-05.wav,44100,16,60,1,acoustic_complexity,512,1,NA,5,1829.37802852148,NA 
rayol-farm2_2019-05-02_11-01-05.wav,44100,16,60,1,acoustic_complexity,512,1,NA,5,1868.39540640375,NA 
rayol-farm2_2019-05-02_11-03-05.wav,44100,16,60,1,acoustic_complexity,512,1,NA,5,1828.01972484215,NA 
rayol-farm2_2019-05-02_11-05-05.wav,44100,16,60,1,acoustic_complexity,512,1,NA,5,1840.51064793831,NA 
rayol-farm2_2019-05-02_11-07-05.wav,44100,16,60,1,acoustic_complexity,512,1,NA,5,1823.25157825754,NA 
rayol-farm2_2019-05-02_11-09-05.wav,44100,16,60,1,acoustic_complexity,512,1,NA,5,1814.04124067106,NA 
rayol-farm2_2019-05-02_11-11-06.wav,44100,16,60,1,acoustic_complexity,512,1,NA,5,1826.18339297941,NA 
rayol-farm2_2019-05-02_11-13-06.wav,44100,16,60,1,acoustic_complexity,512,1,NA,5,1816.76608562734,NA 
rayol-farm2_2019-05-02_11-15-06.wav,44100,16,60,1,acoustic_complexity,512,1,NA,5,1818.37990325105,NA 
rayol-farm2_2019-05-02_11-17-06.wav,44100,16,60,1,acoustic_complexity,512,1,NA,5,1812.36573661656,NA 
rayol-farm2_2019-05-02_11-19-06.wav,44100,16,60,1,acoustic_complexity,512,1,NA,5,1819.05998084876,NA 
rayol-farm2_2019-05-02_11-21-06.wav,44100,16,60,1,acoustic_complexity,512,1,NA,5,1814.7534648712,NA 
rayol-farm2_2019-05-02_11-23-06.wav,44100,16,60,1,acoustic_complexity,512,1,NA,5,1850.65376893886,NA 
rayol-farm2_2019-05-02_11-25-06.wav,44100,16,60,1,acoustic_complexity,512,1,NA,5,1815.51694648825,NA 
rayol-farm2_2019-05-02_11-27-07.wav,44100,16,60,1,acoustic_complexity,512,1,NA,5,1840.20140671543,NA 
rayol-farm2_2019-05-02_11-29-07.wav,44100,16,60,1,acoustic_complexity,512,1,NA,5,1830.50825269105,NA 
rayol-farm2_2019-05-02_11-31-07.wav,44100,16,60,1,acoustic_complexity,512,1,NA,5,1847.77425691498,NA 
rayol-farm2_2019-05-02_11-33-07.wav,44100,16,60,1,acoustic_complexity,512,1,NA,5,1798.4963496819,NA 
rayol-farm2_2019-05-02_11-35-07.wav,44100,16,60,1,acoustic_complexity,512,1,NA,5,1836.09008990455,NA 
rayol-farm2_2019-05-02_11-37-07.wav,44100,16,60,1,acoustic_complexity,512,1,NA,5,1834.03611669326,NA 
rayol-farm2_2019-05-02_11-39-07.wav,44100,16,60,1,acoustic_complexity,512,1,NA,5,1811.92667187994,NA 
rayol-farm2_2019-05-02_11-41-07.wav,44100,16,60,1,acoustic_complexity,512,1,NA,5,1806.48472947063,NA 
rayol-farm2_2019-05-02_11-43-08.wav,44100,16,60,1,acoustic_complexity,512,1,NA,5,1823.20944135944,NA 
rayol-farm2_2019-05-02_11-45-08.wav,44100,16,60,1,acoustic_complexity,512,1,NA,5,1834.64481919043,NA 
rayol-farm2_2019-05-02_11-47-08.wav,44100,16,60,1,acoustic_complexity,512,1,NA,5,1833.05840932916,NA 
rayol-farm2_2019-05-02_11-49-08.wav,44100,16,60,1,acoustic_complexity,512,1,NA,5,1805.43076797521,NA 
rayol-farm2_2019-05-02_11-51-08.wav,44100,16,60,1,acoustic_complexity,512,1,NA,5,1805.55216063756,NA 
rayol-farm2_2019-05-02_11-53-08.wav,44100,16,60,1,acoustic_complexity,512,1,NA,5,1802.58498577331,NA 
rayol-farm2_2019-05-02_11-55-08.wav,44100,16,60,1,acoustic_complexity,512,1,NA,5,2009.04319359872,NA 
rayol-farm2_2019-05-02_11-57-08.wav,44100,16,60,1,acoustic_complexity,512,1,NA,5,1820.22291057708,NA 
rayol-farm2_2019-05-02_11-59-09.wav,44100,16,60,1,acoustic_complexity,512,1,NA,5,1860.30177178366,NA 
rayol-farm2_2019-05-02_12-01-09.wav,44100,16,60,1,acoustic_complexity,512,1,NA,5,1823.28009597365,NA 
rayol-farm2_2019-05-02_12-03-09.wav,44100,16,60,1,acoustic_complexity,512,1,NA,5,1845.38747907533,NA 
rayol-farm2_2019-05-02_12-05-09.wav,44100,16,60,1,acoustic_complexity,512,1,NA,5,1822.53745979272,NA 
rayol-farm2_2019-05-02_12-07-09.wav,44100,16,60,1,acoustic_complexity,512,1,NA,5,1820.18121883538,NA 
rayol-farm2_2019-05-02_12-09-09.wav,44100,16,60,1,acoustic_complexity,512,1,NA,5,1819.00214836313,NA 
rayol-farm2_2019-05-02_12-11-09.wav,44100,16,60,1,acoustic_complexity,512,1,NA,5,1825.38714669657,NA 
rayol-farm2_2019-05-02_12-13-09.wav,44100,16,60,1,acoustic_complexity,512,1,NA,5,1810.82247342975,NA 
rayol-farm2_2019-05-02_12-15-09.wav,44100,16,60,1,acoustic_complexity,512,1,NA,5,1828.30697141257,NA 
rayol-farm2_2019-05-02_12-17-10.wav,44100,16,60,1,acoustic_complexity,512,1,NA,5,1827.55925637656,NA 
rayol-farm2_2019-05-02_12-19-10.wav,44100,16,60,1,acoustic_complexity,512,1,NA,5,1830.622443573,NA 
rayol-farm2_2019-05-02_12-21-10.wav,44100,16,60,1,acoustic_complexity,512,1,NA,5,1844.80150339198,NA 
rayol-farm2_2019-05-02_12-23-10.wav,44100,16,60,1,acoustic_complexity,512,1,NA,5,1819.99097875684,NA 
rayol-farm2_2019-05-02_12-25-10.wav,44100,16,60,1,acoustic_complexity,512,1,NA,5,1804.69978627229,NA 
rayol-farm2_2019-05-02_12-27-10.wav,44100,16,60,1,acoustic_complexity,512,1,NA,5,1798.9447699409,NA 
rayol-farm2_2019-05-02_12-29-10.wav,44100,16,60,1,acoustic_complexity,512,1,NA,5,1815.93515041478,NA 
rayol-farm2_2019-05-02_12-31-10.wav,44100,16,60,1,acoustic_complexity,512,1,NA,5,1816.93514460995,NA 
rayol-farm2_2019-05-02_12-33-11.wav,44100,16,60,1,acoustic_complexity,512,1,NA,5,1815.086575035,NA 
rayol-farm2_2019-05-02_12-35-11.wav,44100,16,60,1,acoustic_complexity,512,1,NA,5,1831.75357904393,NA 
rayol-farm2_2019-05-02_12-37-11.wav,44100,16,60,1,acoustic_complexity,512,1,NA,5,1815.30356999783,NA 
rayol-farm2_2019-05-02_12-39-11.wav,44100,16,60,1,acoustic_complexity,512,1,NA,5,1821.43838392881,NA 
rayol-farm2_2019-05-02_12-41-11.wav,44100,16,60,1,acoustic_complexity,512,1,NA,5,1841.22160588586,NA 
rayol-farm2_2019-05-02_12-43-11.wav,44100,16,60,1,acoustic_complexity,512,1,NA,5,1821.86902108221,NA 
rayol-farm2_2019-05-02_12-45-11.wav,44100,16,60,1,acoustic_complexity,512,1,NA,5,1833.46501671969,NA 
rayol-farm2_2019-05-02_12-47-11.wav,44100,16,60,1,acoustic_complexity,512,1,NA,5,1822.7369161862,NA 
rayol-farm2_2019-05-02_12-49-12.wav,44100,16,60,1,acoustic_complexity,512,1,NA,5,1805.72686525439,NA 
rayol-farm2_2019-05-02_12-51-12.wav,44100,16,60,1,acoustic_complexity,512,1,NA,5,1832.57861163041,NA 
rayol-farm2_2019-05-02_12-53-12.wav,44100,16,60,1,acoustic_complexity,512,1,NA,5,1835.52492814994,NA 
rayol-farm2_2019-05-02_12-55-12.wav,44100,16,60,1,acoustic_complexity,512,1,NA,5,1832.53160341667,NA 
rayol-farm2_2019-05-02_12-57-12.wav,44100,16,60,1,acoustic_complexity,512,1,NA,5,1855.14324444225,NA 
rayol-farm2_2019-05-02_12-59-12.wav,44100,16,60,1,acoustic_complexity,512,1,NA,5,1822.36232623044,NA 
rayol-farm2_2019-05-02_13-01-12.wav,44100,16,60,1,acoustic_complexity,512,1,NA,5,1809.08905178756,NA 
rayol-farm2_2019-05-02_13-03-12.wav,44100,16,60,1,acoustic_complexity,512,1,NA,5,1862.56815602162,NA 
rayol-farm2_2019-05-02_13-05-12.wav,44100,16,60,1,acoustic_complexity,512,1,NA,5,1822.2762635495,NA 
rayol-farm2_2019-05-02_13-07-13.wav,44100,16,60,1,acoustic_complexity,512,1,NA,5,1834.90443163061,NA 
rayol-farm2_2019-05-02_13-09-13.wav,44100,16,60,1,acoustic_complexity,512,1,NA,5,1836.85750545989,NA 
rayol-farm2_2019-05-02_13-11-13.wav,44100,16,60,1,acoustic_complexity,512,1,NA,5,1832.44900926938,NA 
rayol-farm2_2019-05-02_13-13-13.wav,44100,16,60,1,acoustic_complexity,512,1,NA,5,1819.72318112456,NA 
rayol-farm2_2019-05-02_13-15-13.wav,44100,16,60,1,acoustic_complexity,512,1,NA,5,1823.19684554543,NA 
rayol-farm2_2019-05-02_13-17-13.wav,44100,16,60,1,acoustic_complexity,512,1,NA,5,1820.46809996053,NA 
rayol-farm2_2019-05-02_13-19-13.wav,44100,16,60,1,acoustic_complexity,512,1,NA,5,1869.10358691836,NA 
rayol-farm2_2019-05-02_13-21-13.wav,44100,16,60,1,acoustic_complexity,512,1,NA,5,1821.67731022469,NA 
rayol-farm2_2019-05-02_13-23-14.wav,44100,16,60,1,acoustic_complexity,512,1,NA,5,1817.1320034509,NA 
rayol-farm2_2019-05-02_13-25-14.wav,44100,16,60,1,acoustic_complexity,512,1,NA,5,1827.81619360577,NA 
rayol-farm2_2019-05-02_13-27-14.wav,44100,16,60,1,acoustic_complexity,512,1,NA,5,1821.29732111887,NA 
rayol-farm2_2019-05-02_13-29-14.wav,44100,16,60,1,acoustic_complexity,512,1,NA,5,1845.3114323937,NA 
rayol-farm2_2019-05-02_13-31-14.wav,44100,16,60,1,acoustic_complexity,512,1,NA,5,1853.47605523277,NA 
rayol-farm2_2019-05-02_13-33-14.wav,44100,16,60,1,acoustic_complexity,512,1,NA,5,1800.19888653626,NA 
rayol-farm2_2019-05-02_13-35-14.wav,44100,16,60,1,acoustic_complexity,512,1,NA,5,1798.96883401732,NA 
rayol-farm2_2019-05-02_13-37-14.wav,44100,16,60,1,acoustic_complexity,512,1,NA,5,1794.97659983259,NA 
rayol-farm2_2019-05-02_13-39-15.wav,44100,16,60,1,acoustic_complexity,512,1,NA,5,1774.03048237911,NA 
rayol-farm2_2019-05-02_13-41-15.wav,44100,16,60,1,acoustic_complexity,512,1,NA,5,1779.64537307026,NA 
rayol-farm2_2019-05-02_13-43-15.wav,44100,16,60,1,acoustic_complexity,512,1,NA,5,1787.9262318634,NA 
rayol-farm2_2019-05-02_13-45-15.wav,44100,16,60,1,acoustic_complexity,512,1,NA,5,1820.49424360127,NA 
rayol-farm2_2019-05-02_13-47-15.wav,44100,16,60,1,acoustic_complexity,512,1,NA,5,1789.06046231472,NA 
rayol-farm2_2019-05-02_13-49-15.wav,44100,16,60,1,acoustic_complexity,512,1,NA,5,1809.50263151058,NA 
rayol-farm2_2019-05-02_13-51-15.wav,44100,16,60,1,acoustic_complexity,512,1,NA,5,1818.00288610803,NA 
rayol-farm2_2019-05-02_13-53-15.wav,44100,16,60,1,acoustic_complexity,512,1,NA,5,1799.44992394898,NA 
rayol-farm2_2019-05-02_13-55-16.wav,44100,16,60,1,acoustic_complexity,512,1,NA,5,1807.47691253848,NA 
rayol-farm2_2019-05-02_13-57-16.wav,44100,16,60,1,acoustic_complexity,512,1,NA,5,1793.151739115,NA 
rayol-farm2_2019-05-02_13-59-16.wav,44100,16,60,1,acoustic_complexity,512,1,NA,5,1787.71378703938,NA 
rayol-farm2_2019-05-02_14-01-16.wav,44100,16,60,1,acoustic_complexity,512,1,NA,5,1785.46656041582,NA 
rayol-farm2_2019-05-02_14-03-16.wav,44100,16,60,1,acoustic_complexity,512,1,NA,5,1799.92459942479,NA 
rayol-farm2_2019-05-02_14-05-16.wav,44100,16,60,1,acoustic_complexity,512,1,NA,5,1749.37676853729,NA 
rayol-farm2_2019-05-02_14-07-16.wav,44100,16,60,1,acoustic_complexity,512,1,NA,5,1794.05328021083,NA 
rayol-farm2_2019-05-02_14-09-16.wav,44100,16,60,1,acoustic_complexity,512,1,NA,5,1809.70176705774,NA 
rayol-farm2_2019-05-02_14-11-17.wav,44100,16,60,1,acoustic_complexity,512,1,NA,5,1805.59903371441,NA 
rayol-farm2_2019-05-02_14-13-17.wav,44100,16,60,1,acoustic_complexity,512,1,NA,5,1812.04838280428,NA 
rayol-farm2_2019-05-02_14-15-17.wav,44100,16,60,1,acoustic_complexity,512,1,NA,5,1745.58967085703,NA 
rayol-farm2_2019-05-02_14-17-17.wav,44100,16,60,1,acoustic_complexity,512,1,NA,5,1815.89172115774,NA 
rayol-farm2_2019-05-02_14-19-17.wav,44100,16,60,1,acoustic_complexity,512,1,NA,5,1824.87007323956,NA 
rayol-farm2_2019-05-02_14-21-17.wav,44100,16,60,1,acoustic_complexity,512,1,NA,5,1810.23626807851,NA 
rayol-farm2_2019-05-02_14-23-17.wav,44100,16,60,1,acoustic_complexity,512,1,NA,5,1820.90678398978,NA 
rayol-farm2_2019-05-02_14-25-17.wav,44100,16,60,1,acoustic_complexity,512,1,NA,5,1813.98593168991,NA 
rayol-farm2_2019-05-02_14-27-17.wav,44100,16,60,1,acoustic_complexity,512,1,NA,5,1833.44769347019,NA 
rayol-farm2_2019-05-02_14-29-18.wav,44100,16,60,1,acoustic_complexity,512,1,NA,5,1807.7415063541,NA 
rayol-farm2_2019-05-02_14-31-18.wav,44100,16,60,1,acoustic_complexity,512,1,NA,5,1800.68074037701,NA 
rayol-farm2_2019-05-02_14-33-18.wav,44100,16,60,1,acoustic_complexity,512,1,NA,5,1800.96824348885,NA 
rayol-farm2_2019-05-02_14-35-18.wav,44100,16,60,1,acoustic_complexity,512,1,NA,5,1813.6579796934,NA 
rayol-farm2_2019-05-02_14-37-18.wav,44100,16,60,1,acoustic_complexity,512,1,NA,5,1813.47083595855,NA 
rayol-farm2_2019-05-02_14-39-18.wav,44100,16,60,1,acoustic_complexity,512,1,NA,5,1809.31222727513,NA 
rayol-farm2_2019-05-02_14-41-18.wav,44100,16,60,1,acoustic_complexity,512,1,NA,5,1808.78721462681,NA 
rayol-farm2_2019-05-02_14-43-18.wav,44100,16,60,1,acoustic_complexity,512,1,NA,5,1805.97607950593,NA 
rayol-farm2_2019-05-02_14-45-19.wav,44100,16,60,1,acoustic_complexity,512,1,NA,5,1813.20651088652,NA 
rayol-farm2_2019-05-02_14-47-19.wav,44100,16,60,1,acoustic_complexity,512,1,NA,5,1815.07733849407,NA 
rayol-farm2_2019-05-02_14-49-19.wav,44100,16,60,1,acoustic_complexity,512,1,NA,5,1801.40834580873,NA 
rayol-farm2_2019-05-02_14-51-19.wav,44100,16,60,1,acoustic_complexity,512,1,NA,5,1815.52244726568,NA 
rayol-farm2_2019-05-02_14-53-19.wav,44100,16,60,1,acoustic_complexity,512,1,NA,5,1828.49551642322,NA 
rayol-farm2_2019-05-02_14-55-19.wav,44100,16,60,1,acoustic_complexity,512,1,NA,5,1791.96303007426,NA 
rayol-farm2_2019-05-02_14-57-19.wav,44100,16,60,1,acoustic_complexity,512,1,NA,5,1797.03512898686,NA 
rayol-farm2_2019-05-02_14-59-19.wav,44100,16,60,1,acoustic_complexity,512,1,NA,5,1825.24463284543,NA 
rayol-farm2_2019-05-02_15-01-20.wav,44100,16,60,1,acoustic_complexity,512,1,NA,5,1788.52296886783,NA 
rayol-farm2_2019-05-02_15-03-20.wav,44100,16,60,1,acoustic_complexity,512,1,NA,5,1807.61517896111,NA 
rayol-farm2_2019-05-02_15-05-20.wav,44100,16,60,1,acoustic_complexity,512,1,NA,5,1794.11500692762,NA 
rayol-farm2_2019-05-02_15-07-20.wav,44100,16,60,1,acoustic_complexity,512,1,NA,5,1812.29809091261,NA 
rayol-farm2_2019-05-02_15-09-20.wav,44100,16,60,1,acoustic_complexity,512,1,NA,5,1811.22222267873,NA 
rayol-farm2_2019-05-02_15-11-20.wav,44100,16,60,1,acoustic_complexity,512,1,NA,5,1811.00039735244,NA 
rayol-farm2_2019-05-02_15-13-20.wav,44100,16,60,1,acoustic_complexity,512,1,NA,5,1800.51532960807,NA 
rayol-farm2_2019-05-02_15-15-20.wav,44100,16,60,1,acoustic_complexity,512,1,NA,5,1800.42422655311,NA 
rayol-farm2_2019-05-02_15-17-20.wav,44100,16,60,1,acoustic_complexity,512,1,NA,5,1805.28328786836,NA 
rayol-farm2_2019-05-02_15-19-21.wav,44100,16,60,1,acoustic_complexity,512,1,NA,5,1793.89731930557,NA 
rayol-farm2_2019-05-02_15-21-21.wav,44100,16,60,1,acoustic_complexity,512,1,NA,5,1816.60482603789,NA 
rayol-farm2_2019-05-02_15-23-21.wav,44100,16,60,1,acoustic_complexity,512,1,NA,5,1818.2603861879,NA 
rayol-farm2_2019-05-02_15-25-21.wav,44100,16,60,1,acoustic_complexity,512,1,NA,5,1816.66175042149,NA 
rayol-farm2_2019-05-02_15-27-21.wav,44100,16,60,1,acoustic_complexity,512,1,NA,5,1839.83081779394,NA 
rayol-farm2_2019-05-02_15-29-21.wav,44100,16,60,1,acoustic_complexity,512,1,NA,5,1796.87855629844,NA 
rayol-farm2_2019-05-02_15-31-21.wav,44100,16,60,1,acoustic_complexity,512,1,NA,5,1788.71219297587,NA 
rayol-farm2_2019-05-02_15-33-21.wav,44100,16,60,1,acoustic_complexity,512,1,NA,5,1796.29041941045,NA 
rayol-farm2_2019-05-02_15-35-22.wav,44100,16,60,1,acoustic_complexity,512,1,NA,5,1797.59022066783,NA 
rayol-farm2_2019-05-02_15-37-22.wav,44100,16,60,1,acoustic_complexity,512,1,NA,5,1785.29875358262,NA 
rayol-farm2_2019-05-02_15-39-22.wav,44100,16,60,1,acoustic_complexity,512,1,NA,5,1798.2369263664,NA 
rayol-farm2_2019-05-02_15-41-22.wav,44100,16,60,1,acoustic_complexity,512,1,NA,5,1763.83473250958,NA 
rayol-farm2_2019-05-02_15-43-22.wav,44100,16,60,1,acoustic_complexity,512,1,NA,5,1788.46107722266,NA 
rayol-farm2_2019-05-02_15-45-22.wav,44100,16,60,1,acoustic_complexity,512,1,NA,5,1791.74131674291,NA 
rayol-farm2_2019-05-02_15-47-22.wav,44100,16,60,1,acoustic_complexity,512,1,NA,5,1811.09913546899,NA 
rayol-farm2_2019-05-02_15-49-22.wav,44100,16,60,1,acoustic_complexity,512,1,NA,5,1807.96795371199,NA 
rayol-farm2_2019-05-02_15-51-23.wav,44100,16,60,1,acoustic_complexity,512,1,NA,5,1896.40151556598,NA 
rayol-farm2_2019-05-02_15-53-23.wav,44100,16,60,1,acoustic_complexity,512,1,NA,5,1805.91150671417,NA 
rayol-farm2_2019-05-02_15-55-23.wav,44100,16,60,1,acoustic_complexity,512,1,NA,5,1804.72832091855,NA 
rayol-farm2_2019-05-02_15-57-23.wav,44100,16,60,1,acoustic_complexity,512,1,NA,5,1805.94509035782,NA 
rayol-farm2_2019-05-02_15-59-23.wav,44100,16,60,1,acoustic_complexity,512,1,NA,5,1862.82991330549,NA 
rayol-farm2_2019-05-02_16-01-23.wav,44100,16,60,1,acoustic_complexity,512,1,NA,5,1803.75158841646,NA 
rayol-farm2_2019-05-02_16-03-23.wav,44100,16,60,1,acoustic_complexity,512,1,NA,5,1776.05928653481,NA 
rayol-farm2_2019-05-02_16-05-23.wav,44100,16,60,1,acoustic_complexity,512,1,NA,5,1793.63407038771,NA 
rayol-farm2_2019-05-02_16-07-24.wav,44100,16,60,1,acoustic_complexity,512,1,NA,5,1791.58712320623,NA 
rayol-farm2_2019-05-02_16-09-24.wav,44100,16,60,1,acoustic_complexity,512,1,NA,5,1791.12439800454,NA 
rayol-farm2_2019-05-02_16-11-24.wav,44100,16,60,1,acoustic_complexity,512,1,NA,5,1802.09351031225,NA 
rayol-farm2_2019-05-02_16-13-24.wav,44100,16,60,1,acoustic_complexity,512,1,NA,5,1803.65157567703,NA 
rayol-farm2_2019-05-02_16-15-24.wav,44100,16,60,1,acoustic_complexity,512,1,NA,5,1794.30445296829,NA 
rayol-farm2_2019-05-02_16-17-24.wav,44100,16,60,1,acoustic_complexity,512,1,NA,5,1811.38171814685,NA 
rayol-farm2_2019-05-02_16-19-24.wav,44100,16,60,1,acoustic_complexity,512,1,NA,5,1783.03864764959,NA 
rayol-farm2_2019-05-02_16-21-24.wav,44100,16,60,1,acoustic_complexity,512,1,NA,5,1805.48582065342,NA 
rayol-farm2_2019-05-02_16-23-24.wav,44100,16,60,1,acoustic_complexity,512,1,NA,5,1800.28077428514,NA 
rayol-farm2_2019-05-02_16-25-25.wav,44100,16,60,1,acoustic_complexity,512,1,NA,5,1792.35347492548,NA 
rayol-farm2_2019-05-02_16-27-25.wav,44100,16,60,1,acoustic_complexity,512,1,NA,5,1837.41993975438,NA 
rayol-farm2_2019-05-02_16-29-25.wav,44100,16,60,1,acoustic_complexity,512,1,NA,5,1791.61486095204,NA 
rayol-farm2_2019-05-02_16-31-25.wav,44100,16,60,1,acoustic_complexity,512,1,NA,5,1788.02944018331,NA 
rayol-farm2_2019-05-02_16-33-25.wav,44100,16,60,1,acoustic_complexity,512,1,NA,5,1794.22647060388,NA 
rayol-farm2_2019-05-02_16-35-25.wav,44100,16,60,1,acoustic_complexity,512,1,NA,5,1801.96791977007,NA 
rayol-farm2_2019-05-02_16-37-25.wav,44100,16,60,1,acoustic_complexity,512,1,NA,5,1797.67614909045,NA 
rayol-farm2_2019-05-02_16-39-25.wav,44100,16,60,1,acoustic_complexity,512,1,NA,5,1797.70359824759,NA 
rayol-farm2_2019-05-02_16-41-26.wav,44100,16,60,1,acoustic_complexity,512,1,NA,5,1795.65289715519,NA 
rayol-farm2_2019-05-02_16-43-26.wav,44100,16,60,1,acoustic_complexity,512,1,NA,5,1801.71204892637,NA 
rayol-farm2_2019-05-02_16-45-26.wav,44100,16,60,1,acoustic_complexity,512,1,NA,5,1790.12031641247,NA 
rayol-farm2_2019-05-02_16-47-26.wav,44100,16,60,1,acoustic_complexity,512,1,NA,5,1803.72821132354,NA 
rayol-farm2_2019-05-02_16-49-26.wav,44100,16,60,1,acoustic_complexity,512,1,NA,5,1784.84568117727,NA 
rayol-farm2_2019-05-02_16-51-26.wav,44100,16,60,1,acoustic_complexity,512,1,NA,5,1794.04703418055,NA 
rayol-farm2_2019-05-02_16-53-26.wav,44100,16,60,1,acoustic_complexity,512,1,NA,5,1790.61827922723,NA 
rayol-farm2_2019-05-02_16-55-26.wav,44100,16,60,1,acoustic_complexity,512,1,NA,5,1781.97123441485,NA 
rayol-farm2_2019-05-02_16-57-27.wav,44100,16,60,1,acoustic_complexity,512,1,NA,5,1784.25730583246,NA 
rayol-farm2_2019-05-02_16-59-27.wav,44100,16,60,1,acoustic_complexity,512,1,NA,5,1780.57894815663,NA 
rayol-farm2_2019-05-02_17-01-27.wav,44100,16,60,1,acoustic_complexity,512,1,NA,5,1803.44836216236,NA 
rayol-farm2_2019-05-02_17-03-27.wav,44100,16,60,1,acoustic_complexity,512,1,NA,5,1781.1382407456,NA 
rayol-farm2_2019-05-02_17-05-27.wav,44100,16,60,1,acoustic_complexity,512,1,NA,5,1794.01774196697,NA 
rayol-farm2_2019-05-02_17-07-27.wav,44100,16,60,1,acoustic_complexity,512,1,NA,5,1809.21161546579,NA 
rayol-farm2_2019-05-02_17-09-27.wav,44100,16,60,1,acoustic_complexity,512,1,NA,5,1797.59118210528,NA 
rayol-farm2_2019-05-02_17-11-27.wav,44100,16,60,1,acoustic_complexity,512,1,NA,5,1809.17625973163,NA 
rayol-farm2_2019-05-02_17-13-28.wav,44100,16,60,1,acoustic_complexity,512,1,NA,5,1790.74646179981,NA 
rayol-farm2_2019-05-02_17-15-28.wav,44100,16,60,1,acoustic_complexity,512,1,NA,5,1793.00070497452,NA 
rayol-farm2_2019-05-02_17-17-28.wav,44100,16,60,1,acoustic_complexity,512,1,NA,5,1791.57929390968,NA 
rayol-farm2_2019-05-02_17-19-28.wav,44100,16,60,1,acoustic_complexity,512,1,NA,5,1803.50027313865,NA 
rayol-farm2_2019-05-02_17-21-28.wav,44100,16,60,1,acoustic_complexity,512,1,NA,5,1793.82046538509,NA 
rayol-farm2_2019-05-02_17-23-28.wav,44100,16,60,1,acoustic_complexity,512,1,NA,5,1800.47536106225,NA 
rayol-farm2_2019-05-02_17-25-28.wav,44100,16,60,1,acoustic_complexity,512,1,NA,5,1793.82428945476,NA 
rayol-farm2_2019-05-02_17-27-28.wav,44100,16,60,1,acoustic_complexity,512,1,NA,5,1791.85921043141,NA 
rayol-farm2_2019-05-02_17-29-28.wav,44100,16,60,1,acoustic_complexity,512,1,NA,5,1798.99710058445,NA 
rayol-farm2_2019-05-02_17-31-29.wav,44100,16,60,1,acoustic_complexity,512,1,NA,5,1798.38841650362,NA 
rayol-farm2_2019-05-02_17-33-29.wav,44100,16,60,1,acoustic_complexity,512,1,NA,5,1806.48706439062,NA 
rayol-farm2_2019-05-02_17-35-29.wav,44100,16,60,1,acoustic_complexity,512,1,NA,5,1805.79651587062,NA 
rayol-farm2_2019-05-02_17-37-29.wav,44100,16,60,1,acoustic_complexity,512,1,NA,5,1793.49599264599,NA 
rayol-farm2_2019-05-02_17-39-29.wav,44100,16,60,1,acoustic_complexity,512,1,NA,5,1800.21387677794,NA 
rayol-farm2_2019-05-02_17-41-29.wav,44100,16,60,1,acoustic_complexity,512,1,NA,5,1796.54575332294,NA 
rayol-farm2_2019-05-02_17-43-29.wav,44100,16,60,1,acoustic_complexity,512,1,NA,5,1805.98338428189,NA 
rayol-farm2_2019-05-02_17-45-29.wav,44100,16,60,1,acoustic_complexity,512,1,NA,5,1778.82670361328,NA 
rayol-farm2_2019-05-02_17-47-30.wav,44100,16,60,1,acoustic_complexity,512,1,NA,5,1786.32991613232,NA 
rayol-farm2_2019-05-02_17-49-30.wav,44100,16,60,1,acoustic_complexity,512,1,NA,5,1797.1306793628,NA 
rayol-farm2_2019-05-02_17-51-30.wav,44100,16,60,1,acoustic_complexity,512,1,NA,5,1801.61209770902,NA 
rayol-farm2_2019-05-02_17-53-30.wav,44100,16,60,1,acoustic_complexity,512,1,NA,5,1798.96577509413,NA 
rayol-farm2_2019-05-02_17-55-30.wav,44100,16,60,1,acoustic_complexity,512,1,NA,5,1800.7453625742,NA 
rayol-farm2_2019-05-02_17-57-30.wav,44100,16,60,1,acoustic_complexity,512,1,NA,5,1827.39496725234,NA 
rayol-farm2_2019-05-02_17-59-30.wav,44100,16,60,1,acoustic_complexity,512,1,NA,5,1798.10606095658,NA 
rayol-farm2_2019-05-02_18-01-30.wav,44100,16,60,1,acoustic_complexity,512,1,NA,5,1777.28118719134,NA 
rayol-farm2_2019-05-02_18-03-31.wav,44100,16,60,1,acoustic_complexity,512,1,NA,5,1790.43627290265,NA 
rayol-farm2_2019-05-02_18-05-31.wav,44100,16,60,1,acoustic_complexity,512,1,NA,5,1791.56062096855,NA 
rayol-farm2_2019-05-02_18-07-31.wav,44100,16,60,1,acoustic_complexity,512,1,NA,5,1796.64820408954,NA 
rayol-farm2_2019-05-02_18-09-31.wav,44100,16,60,1,acoustic_complexity,512,1,NA,5,1783.57390688316,NA 
rayol-farm2_2019-05-02_18-11-31.wav,44100,16,60,1,acoustic_complexity,512,1,NA,5,1791.04247147872,NA 
rayol-farm2_2019-05-02_18-13-31.wav,44100,16,60,1,acoustic_complexity,512,1,NA,5,1801.9548611377,NA 
rayol-farm2_2019-05-02_18-15-31.wav,44100,16,60,1,acoustic_complexity,512,1,NA,5,1807.32914088507,NA 
rayol-farm2_2019-05-02_18-17-31.wav,44100,16,60,1,acoustic_complexity,512,1,NA,5,1806.50957448857,NA 
rayol-farm2_2019-05-02_18-19-32.wav,44100,16,60,1,acoustic_complexity,512,1,NA,5,1804.32591247662,NA 
rayol-farm2_2019-05-02_18-21-32.wav,44100,16,60,1,acoustic_complexity,512,1,NA,5,1786.28661615326,NA 
rayol-farm2_2019-05-02_18-23-32.wav,44100,16,60,1,acoustic_complexity,512,1,NA,5,1783.61284321152,NA 
rayol-farm2_2019-05-02_18-25-32.wav,44100,16,60,1,acoustic_complexity,512,1,NA,5,1786.04362231152,NA 
rayol-farm2_2019-05-02_18-27-32.wav,44100,16,60,1,acoustic_complexity,512,1,NA,5,1795.1585176146,NA 
rayol-farm2_2019-05-02_18-29-32.wav,44100,16,60,1,acoustic_complexity,512,1,NA,5,1784.09967047401,NA 
rayol-farm2_2019-05-02_18-31-32.wav,44100,16,60,1,acoustic_complexity,512,1,NA,5,1793.34531542807,NA 
rayol-farm2_2019-05-02_18-33-32.wav,44100,16,60,1,acoustic_complexity,512,1,NA,5,1804.35545721182,NA 
rayol-farm2_2019-05-02_18-35-33.wav,44100,16,60,1,acoustic_complexity,512,1,NA,5,1791.85185085726,NA 
rayol-farm2_2019-05-02_18-37-33.wav,44100,16,60,1,acoustic_complexity,512,1,NA,5,1780.50481062269,NA 
rayol-farm2_2019-05-02_18-39-33.wav,44100,16,60,1,acoustic_complexity,512,1,NA,5,1784.64327347041,NA 
rayol-farm2_2019-05-02_18-41-33.wav,44100,16,60,1,acoustic_complexity,512,1,NA,5,1795.64611361612,NA 
rayol-farm2_2019-05-02_18-43-33.wav,44100,16,60,1,acoustic_complexity,512,1,NA,5,1813.47499041679,NA 
rayol-farm2_2019-05-02_18-45-33.wav,44100,16,60,1,acoustic_complexity,512,1,NA,5,1801.7107757978,NA 
rayol-farm2_2019-05-02_18-47-33.wav,44100,16,60,1,acoustic_complexity,512,1,NA,5,1789.28851500823,NA 
rayol-farm2_2019-05-02_18-49-33.wav,44100,16,60,1,acoustic_complexity,512,1,NA,5,1808.78470238683,NA 
rayol-farm2_2019-05-02_18-51-33.wav,44100,16,60,1,acoustic_complexity,512,1,NA,5,1809.76162316263,NA 
rayol-farm2_2019-05-02_18-53-34.wav,44100,16,60,1,acoustic_complexity,512,1,NA,5,1817.80198386235,NA 
rayol-farm2_2019-05-02_18-55-34.wav,44100,16,60,1,acoustic_complexity,512,1,NA,5,1818.37293690796,NA 
rayol-farm2_2019-05-02_18-57-34.wav,44100,16,60,1,acoustic_complexity,512,1,NA,5,1822.78780082417,NA 
rayol-farm2_2019-05-02_18-59-34.wav,44100,16,60,1,acoustic_complexity,512,1,NA,5,1807.74717984225,NA 
rayol-farm2_2019-05-02_19-01-34.wav,44100,16,60,1,acoustic_complexity,512,1,NA,5,1787.76230912176,NA 
rayol-farm2_2019-05-02_19-03-34.wav,44100,16,60,1,acoustic_complexity,512,1,NA,5,1794.47228637899,NA 
rayol-farm2_2019-05-02_19-05-34.wav,44100,16,60,1,acoustic_complexity,512,1,NA,5,1794.15285267046,NA 
rayol-farm2_2019-05-02_19-07-34.wav,44100,16,60,1,acoustic_complexity,512,1,NA,5,1795.5324235783,NA 
rayol-farm2_2019-05-02_19-09-35.wav,44100,16,60,1,acoustic_complexity,512,1,NA,5,1795.78307729563,NA 
rayol-farm2_2019-05-02_19-11-35.wav,44100,16,60,1,acoustic_complexity,512,1,NA,5,1796.62186186014,NA 
rayol-farm2_2019-05-02_19-13-35.wav,44100,16,60,1,acoustic_complexity,512,1,NA,5,1816.92813656251,NA 
rayol-farm2_2019-05-02_19-15-35.wav,44100,16,60,1,acoustic_complexity,512,1,NA,5,1828.5200649469,NA 
rayol-farm2_2019-05-02_19-17-35.wav,44100,16,60,1,acoustic_complexity,512,1,NA,5,1801.73224273763,NA 
rayol-farm2_2019-05-02_19-19-35.wav,44100,16,60,1,acoustic_complexity,512,1,NA,5,1822.85733420906,NA 
rayol-farm2_2019-05-02_19-21-35.wav,44100,16,60,1,acoustic_complexity,512,1,NA,5,1819.08025512971,NA 
rayol-farm2_2019-05-02_19-23-35.wav,44100,16,60,1,acoustic_complexity,512,1,NA,5,1816.01654603992,NA 
rayol-farm2_2019-05-02_19-25-36.wav,44100,16,60,1,acoustic_complexity,512,1,NA,5,1826.93430610469,NA 
rayol-farm2_2019-05-02_19-27-36.wav,44100,16,60,1,acoustic_complexity,512,1,NA,5,1834.19537370631,NA 
rayol-farm2_2019-05-02_19-29-36.wav,44100,16,60,1,acoustic_complexity,512,1,NA,5,1804.26195557554,NA 
rayol-farm2_2019-05-02_19-31-36.wav,44100,16,60,1,acoustic_complexity,512,1,NA,5,1825.43921353857,NA 
rayol-farm2_2019-05-02_19-33-36.wav,44100,16,60,1,acoustic_complexity,512,1,NA,5,1816.1299608311,NA 
rayol-farm2_2019-05-02_19-35-36.wav,44100,16,60,1,acoustic_complexity,512,1,NA,5,1806.62649593047,NA 
rayol-farm2_2019-05-02_19-37-36.wav,44100,16,60,1,acoustic_complexity,512,1,NA,5,1813.67092510014,NA 
rayol-farm2_2019-05-02_19-39-36.wav,44100,16,60,1,acoustic_complexity,512,1,NA,5,1829.44298638317,NA 
rayol-farm2_2019-05-02_19-41-37.wav,44100,16,60,1,acoustic_complexity,512,1,NA,5,1808.49217329591,NA 
rayol-farm2_2019-05-02_19-43-37.wav,44100,16,60,1,acoustic_complexity,512,1,NA,5,1821.05597724377,NA 
rayol-farm2_2019-05-02_19-45-37.wav,44100,16,60,1,acoustic_complexity,512,1,NA,5,1806.1805501991,NA 
rayol-farm2_2019-05-02_19-47-37.wav,44100,16,60,1,acoustic_complexity,512,1,NA,5,1815.69957640066,NA 
rayol-farm2_2019-05-02_19-49-37.wav,44100,16,60,1,acoustic_complexity,512,1,NA,5,1819.86536415059,NA 
rayol-farm2_2019-05-02_19-51-37.wav,44100,16,60,1,acoustic_complexity,512,1,NA,5,1817.97269382674,NA 
rayol-farm2_2019-05-02_19-53-37.wav,44100,16,60,1,acoustic_complexity,512,1,NA,5,1802.78301053049,NA 
rayol-farm2_2019-05-02_19-55-37.wav,44100,16,60,1,acoustic_complexity,512,1,NA,5,1822.97005292419,NA 
rayol-farm2_2019-05-02_19-57-37.wav,44100,16,60,1,acoustic_complexity,512,1,NA,5,1827.35720154202,NA 
rayol-farm2_2019-05-02_19-59-38.wav,44100,16,60,1,acoustic_complexity,512,1,NA,5,1815.49045671521,NA 
rayol-farm2_2019-05-02_20-01-38.wav,44100,16,60,1,acoustic_complexity,512,1,NA,5,1822.85820335622,NA 
rayol-farm2_2019-05-02_20-03-38.wav,44100,16,60,1,acoustic_complexity,512,1,NA,5,1813.2316826364,NA 
rayol-farm2_2019-05-02_20-05-38.wav,44100,16,60,1,acoustic_complexity,512,1,NA,5,1808.49337342022,NA 
rayol-farm2_2019-05-02_20-07-38.wav,44100,16,60,1,acoustic_complexity,512,1,NA,5,1824.84145393987,NA 
rayol-farm2_2019-05-02_20-09-38.wav,44100,16,60,1,acoustic_complexity,512,1,NA,5,1806.27711374856,NA 
rayol-farm2_2019-05-02_20-11-38.wav,44100,16,60,1,acoustic_complexity,512,1,NA,5,1825.81550036531,NA 
rayol-farm2_2019-05-02_20-13-38.wav,44100,16,60,1,acoustic_complexity,512,1,NA,5,1818.60448694046,NA 
rayol-farm2_2019-05-02_20-15-39.wav,44100,16,60,1,acoustic_complexity,512,1,NA,5,1816.07822006747,NA 
rayol-farm2_2019-05-02_20-17-39.wav,44100,16,60,1,acoustic_complexity,512,1,NA,5,1819.08551917384,NA 
rayol-farm2_2019-05-02_20-19-39.wav,44100,16,60,1,acoustic_complexity,512,1,NA,5,1817.20850809961,NA 
rayol-farm2_2019-05-02_20-21-39.wav,44100,16,60,1,acoustic_complexity,512,1,NA,5,1803.37756574202,NA 
rayol-farm2_2019-05-02_20-23-39.wav,44100,16,60,1,acoustic_complexity,512,1,NA,5,1813.47070182789,NA 
rayol-farm2_2019-05-02_20-25-39.wav,44100,16,60,1,acoustic_complexity,512,1,NA,5,1813.82793595149,NA 
rayol-farm2_2019-05-02_20-27-39.wav,44100,16,60,1,acoustic_complexity,512,1,NA,5,1809.32834621065,NA 
rayol-farm2_2019-05-02_20-29-39.wav,44100,16,60,1,acoustic_complexity,512,1,NA,5,1799.22502646295,NA 
rayol-farm2_2019-05-02_20-31-40.wav,44100,16,60,1,acoustic_complexity,512,1,NA,5,1826.38647307177,NA 
rayol-farm2_2019-05-02_20-33-40.wav,44100,16,60,1,acoustic_complexity,512,1,NA,5,1824.95354667146,NA 
rayol-farm2_2019-05-02_20-35-40.wav,44100,16,60,1,acoustic_complexity,512,1,NA,5,1819.11670023616,NA 
rayol-farm2_2019-05-02_20-37-40.wav,44100,16,60,1,acoustic_complexity,512,1,NA,5,1821.14580890831,NA 
rayol-farm2_2019-05-02_20-39-40.wav,44100,16,60,1,acoustic_complexity,512,1,NA,5,1802.89295641396,NA 
rayol-farm2_2019-05-02_20-41-40.wav,44100,16,60,1,acoustic_complexity,512,1,NA,5,1815.75121154619,NA 
rayol-farm2_2019-05-02_20-43-40.wav,44100,16,60,1,acoustic_complexity,512,1,NA,5,1813.16288181983,NA 
rayol-farm2_2019-05-02_20-45-40.wav,44100,16,60,1,acoustic_complexity,512,1,NA,5,1810.40285633585,NA 
rayol-farm2_2019-05-02_20-47-41.wav,44100,16,60,1,acoustic_complexity,512,1,NA,5,1799.07834121475,NA 
rayol-farm2_2019-05-02_20-49-41.wav,44100,16,60,1,acoustic_complexity,512,1,NA,5,1820.89700645074,NA 
rayol-farm2_2019-05-02_20-51-41.wav,44100,16,60,1,acoustic_complexity,512,1,NA,5,1814.14946296017,NA 
rayol-farm2_2019-05-02_20-53-41.wav,44100,16,60,1,acoustic_complexity,512,1,NA,5,1828.32242200839,NA 
rayol-farm2_2019-05-02_20-55-41.wav,44100,16,60,1,acoustic_complexity,512,1,NA,5,1824.72522247746,NA 
rayol-farm2_2019-05-02_20-57-41.wav,44100,16,60,1,acoustic_complexity,512,1,NA,5,1814.49291968906,NA 
rayol-farm2_2019-05-02_20-59-41.wav,44100,16,60,1,acoustic_complexity,512,1,NA,5,1821.89444058007,NA 
rayol-farm2_2019-05-02_21-01-41.wav,44100,16,60,1,acoustic_complexity,512,1,NA,5,1813.09451739323,NA 
rayol-farm2_2019-05-02_21-03-42.wav,44100,16,60,1,acoustic_complexity,512,1,NA,5,1817.35686945556,NA 
rayol-farm2_2019-05-02_21-05-42.wav,44100,16,60,1,acoustic_complexity,512,1,NA,5,1804.6873730366,NA 
rayol-farm2_2019-05-02_21-07-42.wav,44100,16,60,1,acoustic_complexity,512,1,NA,5,1811.82106421172,NA 
rayol-farm2_2019-05-02_21-09-42.wav,44100,16,60,1,acoustic_complexity,512,1,NA,5,1818.70675382815,NA 
rayol-farm2_2019-05-02_21-11-42.wav,44100,16,60,1,acoustic_complexity,512,1,NA,5,1818.8948559465,NA 
rayol-farm2_2019-05-02_21-13-42.wav,44100,16,60,1,acoustic_complexity,512,1,NA,5,1809.34270192038,NA 
rayol-farm2_2019-05-02_21-15-42.wav,44100,16,60,1,acoustic_complexity,512,1,NA,5,1798.55280476517,NA 
rayol-farm2_2019-05-02_21-17-42.wav,44100,16,60,1,acoustic_complexity,512,1,NA,5,1810.34184404466,NA 
rayol-farm2_2019-05-02_21-19-42.wav,44100,16,60,1,acoustic_complexity,512,1,NA,5,1810.21383700386,NA 
rayol-farm2_2019-05-02_21-21-43.wav,44100,16,60,1,acoustic_complexity,512,1,NA,5,1818.40886190418,NA 
rayol-farm2_2019-05-02_21-23-43.wav,44100,16,60,1,acoustic_complexity,512,1,NA,5,1804.31426518329,NA 
rayol-farm2_2019-05-02_21-25-43.wav,44100,16,60,1,acoustic_complexity,512,1,NA,5,1800.53494714673,NA 
rayol-farm2_2019-05-02_21-27-43.wav,44100,16,60,1,acoustic_complexity,512,1,NA,5,1820.43708110119,NA 
rayol-farm2_2019-05-02_21-29-43.wav,44100,16,60,1,acoustic_complexity,512,1,NA,5,1803.65221638371,NA 
rayol-farm2_2019-05-02_21-31-43.wav,44100,16,60,1,acoustic_complexity,512,1,NA,5,1815.97204966577,NA 
rayol-farm2_2019-05-02_21-33-43.wav,44100,16,60,1,acoustic_complexity,512,1,NA,5,1813.68864359883,NA 
rayol-farm2_2019-05-02_21-35-43.wav,44100,16,60,1,acoustic_complexity,512,1,NA,5,1809.15837869833,NA 
rayol-farm2_2019-05-02_21-37-44.wav,44100,16,60,1,acoustic_complexity,512,1,NA,5,1803.70229529243,NA 
rayol-farm2_2019-05-02_21-39-44.wav,44100,16,60,1,acoustic_complexity,512,1,NA,5,1814.9510631922,NA 
rayol-farm2_2019-05-02_21-41-44.wav,44100,16,60,1,acoustic_complexity,512,1,NA,5,1801.33222460537,NA 
rayol-farm2_2019-05-02_21-43-44.wav,44100,16,60,1,acoustic_complexity,512,1,NA,5,1812.02504041171,NA 
rayol-farm2_2019-05-02_21-45-44.wav,44100,16,60,1,acoustic_complexity,512,1,NA,5,1817.77021314918,NA 
rayol-farm2_2019-05-02_21-47-44.wav,44100,16,60,1,acoustic_complexity,512,1,NA,5,1803.49885147205,NA 
rayol-farm2_2019-05-02_21-49-44.wav,44100,16,60,1,acoustic_complexity,512,1,NA,5,1811.16292496682,NA 
rayol-farm2_2019-05-02_21-51-44.wav,44100,16,60,1,acoustic_complexity,512,1,NA,5,1813.03319472122,NA 
rayol-farm2_2019-05-02_21-53-45.wav,44100,16,60,1,acoustic_complexity,512,1,NA,5,1803.52053796599,NA 
rayol-farm2_2019-05-02_21-55-45.wav,44100,16,60,1,acoustic_complexity,512,1,NA,5,1808.23141978962,NA 
rayol-farm2_2019-05-02_21-57-45.wav,44100,16,60,1,acoustic_complexity,512,1,NA,5,1801.44085311022,NA 
rayol-farm2_2019-05-02_21-59-45.wav,44100,16,60,1,acoustic_complexity,512,1,NA,5,1799.54282944407,NA 
rayol-farm2_2019-05-02_22-01-45.wav,44100,16,60,1,acoustic_complexity,512,1,NA,5,1797.39794865518,NA 
rayol-farm2_2019-05-02_22-03-45.wav,44100,16,60,1,acoustic_complexity,512,1,NA,5,1813.23852337352,NA 
rayol-farm2_2019-05-02_22-05-45.wav,44100,16,60,1,acoustic_complexity,512,1,NA,5,1828.27908198198,NA 
rayol-farm2_2019-05-02_22-07-45.wav,44100,16,60,1,acoustic_complexity,512,1,NA,5,1813.787421511,NA 
rayol-farm2_2019-05-02_22-09-46.wav,44100,16,60,1,acoustic_complexity,512,1,NA,5,1805.35781439274,NA 
rayol-farm2_2019-05-02_22-11-46.wav,44100,16,60,1,acoustic_complexity,512,1,NA,5,1800.69521179394,NA 
rayol-farm2_2019-05-02_22-13-46.wav,44100,16,60,1,acoustic_complexity,512,1,NA,5,1804.27440822962,NA 
rayol-farm2_2019-05-02_22-15-46.wav,44100,16,60,1,acoustic_complexity,512,1,NA,5,1785.03520533844,NA 
rayol-farm2_2019-05-02_22-17-46.wav,44100,16,60,1,acoustic_complexity,512,1,NA,5,1802.18944225458,NA 
rayol-farm2_2019-05-02_22-19-46.wav,44100,16,60,1,acoustic_complexity,512,1,NA,5,1795.56834185855,NA 
rayol-farm2_2019-05-02_22-21-46.wav,44100,16,60,1,acoustic_complexity,512,1,NA,5,1795.23535561436,NA 
rayol-farm2_2019-05-02_22-23-46.wav,44100,16,60,1,acoustic_complexity,512,1,NA,5,1807.43369290937,NA 
rayol-farm2_2019-05-02_22-25-47.wav,44100,16,60,1,acoustic_complexity,512,1,NA,5,1794.88335718138,NA 
rayol-farm2_2019-05-02_22-27-47.wav,44100,16,60,1,acoustic_complexity,512,1,NA,5,1801.99086145332,NA 
rayol-farm2_2019-05-02_22-29-47.wav,44100,16,60,1,acoustic_complexity,512,1,NA,5,1816.29506861512,NA 
rayol-farm2_2019-05-02_22-31-47.wav,44100,16,60,1,acoustic_complexity,512,1,NA,5,1794.00125489226,NA 
rayol-farm2_2019-05-02_22-33-47.wav,44100,16,60,1,acoustic_complexity,512,1,NA,5,1807.06723597374,NA 
rayol-farm2_2019-05-02_22-35-47.wav,44100,16,60,1,acoustic_complexity,512,1,NA,5,1804.42037221576,NA 
rayol-farm2_2019-05-02_22-37-47.wav,44100,16,60,1,acoustic_complexity,512,1,NA,5,1810.1562701106,NA 
rayol-farm2_2019-05-02_22-39-47.wav,44100,16,60,1,acoustic_complexity,512,1,NA,5,1794.74013170528,NA 
rayol-farm2_2019-05-02_22-41-47.wav,44100,16,60,1,acoustic_complexity,512,1,NA,5,1808.92177809698,NA 
rayol-farm2_2019-05-02_22-43-48.wav,44100,16,60,1,acoustic_complexity,512,1,NA,5,1814.74613908172,NA 
rayol-farm2_2019-05-02_22-45-48.wav,44100,16,60,1,acoustic_complexity,512,1,NA,5,1813.13534770007,NA 
rayol-farm2_2019-05-02_22-47-48.wav,44100,16,60,1,acoustic_complexity,512,1,NA,5,1799.47853235928,NA 
rayol-farm2_2019-05-02_22-49-48.wav,44100,16,60,1,acoustic_complexity,512,1,NA,5,1794.84328895058,NA 
rayol-farm2_2019-05-02_22-51-48.wav,44100,16,60,1,acoustic_complexity,512,1,NA,5,1799.71614417501,NA 
rayol-farm2_2019-05-02_22-53-48.wav,44100,16,60,1,acoustic_complexity,512,1,NA,5,1792.10180485902,NA 
rayol-farm2_2019-05-02_22-55-48.wav,44100,16,60,1,acoustic_complexity,512,1,NA,5,1799.6093222829,NA 
rayol-farm2_2019-05-02_22-57-48.wav,44100,16,60,1,acoustic_complexity,512,1,NA,5,1814.86109799661,NA 
rayol-farm2_2019-05-02_22-59-49.wav,44100,16,60,1,acoustic_complexity,512,1,NA,5,1812.43392919332,NA 
rayol-farm2_2019-05-02_23-01-49.wav,44100,16,60,1,acoustic_complexity,512,1,NA,5,1803.55064317386,NA 
rayol-farm2_2019-05-02_23-03-49.wav,44100,16,60,1,acoustic_complexity,512,1,NA,5,1789.89552338885,NA 
rayol-farm2_2019-05-02_23-05-49.wav,44100,16,60,1,acoustic_complexity,512,1,NA,5,1801.24919548912,NA 
rayol-farm2_2019-05-02_23-07-49.wav,44100,16,60,1,acoustic_complexity,512,1,NA,5,1799.94864878681,NA 
rayol-farm2_2019-05-02_23-09-49.wav,44100,16,60,1,acoustic_complexity,512,1,NA,5,1803.11256610739,NA 
rayol-farm2_2019-05-02_23-11-49.wav,44100,16,60,1,acoustic_complexity,512,1,NA,5,1806.61991050336,NA 
rayol-farm2_2019-05-02_23-13-49.wav,44100,16,60,1,acoustic_complexity,512,1,NA,5,1797.93065312632,NA 
rayol-farm2_2019-05-02_23-15-50.wav,44100,16,60,1,acoustic_complexity,512,1,NA,5,1806.23450577909,NA 
rayol-farm2_2019-05-02_23-17-50.wav,44100,16,60,1,acoustic_complexity,512,1,NA,5,1805.44355163877,NA 
rayol-farm2_2019-05-02_23-19-50.wav,44100,16,60,1,acoustic_complexity,512,1,NA,5,1809.63911876465,NA 
rayol-farm2_2019-05-02_23-21-50.wav,44100,16,60,1,acoustic_complexity,512,1,NA,5,1804.798627252,NA 
rayol-farm2_2019-05-02_23-23-50.wav,44100,16,60,1,acoustic_complexity,512,1,NA,5,1794.7795588983,NA 
rayol-farm2_2019-05-02_23-25-50.wav,44100,16,60,1,acoustic_complexity,512,1,NA,5,1798.90686109047,NA 
rayol-farm2_2019-05-02_23-27-50.wav,44100,16,60,1,acoustic_complexity,512,1,NA,5,1807.24583888974,NA 
rayol-farm2_2019-05-02_23-29-50.wav,44100,16,60,1,acoustic_complexity,512,1,NA,5,1804.88142418158,NA 
rayol-farm2_2019-05-02_23-31-51.wav,44100,16,60,1,acoustic_complexity,512,1,NA,5,1780.7953784769,NA 
rayol-farm2_2019-05-02_23-33-51.wav,44100,16,60,1,acoustic_complexity,512,1,NA,5,1784.69627717333,NA 
rayol-farm2_2019-05-02_23-35-51.wav,44100,16,60,1,acoustic_complexity,512,1,NA,5,1789.02047414465,NA 
rayol-farm2_2019-05-02_23-37-51.wav,44100,16,60,1,acoustic_complexity,512,1,NA,5,1799.17802160083,NA 
rayol-farm2_2019-05-02_23-39-51.wav,44100,16,60,1,acoustic_complexity,512,1,NA,5,1795.37703398713,NA 
rayol-farm2_2019-05-02_23-41-51.wav,44100,16,60,1,acoustic_complexity,512,1,NA,5,1792.74281535936,NA 
rayol-farm2_2019-05-02_23-43-51.wav,44100,16,60,1,acoustic_complexity,512,1,NA,5,1794.05393550468,NA 
rayol-farm2_2019-05-02_23-45-51.wav,44100,16,60,1,acoustic_complexity,512,1,NA,5,1796.36060824578,NA 
rayol-farm2_2019-05-02_23-47-51.wav,44100,16,60,1,acoustic_complexity,512,1,NA,5,1801.9514492608,NA 
rayol-farm2_2019-05-02_23-49-52.wav,44100,16,60,1,acoustic_complexity,512,1,NA,5,1793.78586806656,NA 
rayol-farm2_2019-05-02_23-51-52.wav,44100,16,60,1,acoustic_complexity,512,1,NA,5,1792.09251936646,NA 
rayol-farm2_2019-05-02_23-53-52.wav,44100,16,60,1,acoustic_complexity,512,1,NA,5,1794.06429957974,NA 
rayol-farm2_2019-05-02_23-55-52.wav,44100,16,60,1,acoustic_complexity,512,1,NA,5,1792.0307845704,NA 
rayol-farm2_2019-05-02_23-57-52.wav,44100,16,60,1,acoustic_complexity,512,1,NA,5,1796.17357441257,NA 
rayol-farm2_2019-05-02_23-59-52.wav,44100,16,60,1,acoustic_complexity,512,1,NA,5,1791.38026088024,NA
