FILENAME,SAMPLINGRATE,BIT,DURATION,CHANNELS,INDEX,FFT_W,ANTHRO_MIN,ANTHRO_MAX,BIO_MIN,BIO_MAX,LEFT_CHANNEL,RIGHT_CHANNEL
rayol-farm2_2019-04-03_00-00-32.wav,44100,16,60,1,ndsi,1024,1000,2000,2000,11000,0.912648387177974,NA 
rayol-farm2_2019-04-03_00-02-32.wav,44100,16,60,1,ndsi,1024,1000,2000,2000,11000,0.912830249596844,NA 
rayol-farm2_2019-04-03_00-04-32.wav,44100,16,60,1,ndsi,1024,1000,2000,2000,11000,0.911316813955877,NA 
rayol-farm2_2019-04-03_00-06-32.wav,44100,16,60,1,ndsi,1024,1000,2000,2000,11000,0.910399725394071,NA 
rayol-farm2_2019-04-03_00-08-33.wav,44100,16,60,1,ndsi,1024,1000,2000,2000,11000,0.910961850531473,NA 
rayol-farm2_2019-04-03_00-10-33.wav,44100,16,60,1,ndsi,1024,1000,2000,2000,11000,0.910794468502337,NA 
rayol-farm2_2019-04-03_00-12-33.wav,44100,16,60,1,ndsi,1024,1000,2000,2000,11000,0.911654516519665,NA 
rayol-farm2_2019-04-03_00-14-33.wav,44100,16,60,1,ndsi,1024,1000,2000,2000,11000,0.911128568398855,NA 
rayol-farm2_2019-04-03_00-16-33.wav,44100,16,60,1,ndsi,1024,1000,2000,2000,11000,0.910816679974001,NA 
rayol-farm2_2019-04-03_00-18-33.wav,44100,16,60,1,ndsi,1024,1000,2000,2000,11000,0.910873129084171,NA 
rayol-farm2_2019-04-03_00-20-33.wav,44100,16,60,1,ndsi,1024,1000,2000,2000,11000,0.912174997790112,NA 
rayol-farm2_2019-04-03_00-22-33.wav,44100,16,60,1,ndsi,1024,1000,2000,2000,11000,0.911242019700213,NA 
rayol-farm2_2019-04-03_00-24-33.wav,44100,16,60,1,ndsi,1024,1000,2000,2000,11000,0.909260972059169,NA 
rayol-farm2_2019-04-03_00-26-34.wav,44100,16,60,1,ndsi,1024,1000,2000,2000,11000,0.909470338630662,NA 
rayol-farm2_2019-04-03_00-28-34.wav,44100,16,60,1,ndsi,1024,1000,2000,2000,11000,0.902873350540753,NA 
rayol-farm2_2019-04-03_00-30-34.wav,44100,16,60,1,ndsi,1024,1000,2000,2000,11000,0.908029641796011,NA 
rayol-farm2_2019-04-03_00-32-34.wav,44100,16,60,1,ndsi,1024,1000,2000,2000,11000,0.90755219111185,NA 
rayol-farm2_2019-04-03_00-34-34.wav,44100,16,60,1,ndsi,1024,1000,2000,2000,11000,0.909944366857964,NA 
rayol-farm2_2019-04-03_00-36-34.wav,44100,16,60,1,ndsi,1024,1000,2000,2000,11000,0.824468752641276,NA 
rayol-farm2_2019-04-03_00-38-34.wav,44100,16,60,1,ndsi,1024,1000,2000,2000,11000,0.833638507940025,NA 
rayol-farm2_2019-04-03_00-40-34.wav,44100,16,60,1,ndsi,1024,1000,2000,2000,11000,0.719681355658651,NA 
rayol-farm2_2019-04-03_00-42-35.wav,44100,16,60,1,ndsi,1024,1000,2000,2000,11000,0.808694565262571,NA 
rayol-farm2_2019-04-03_00-44-35.wav,44100,16,60,1,ndsi,1024,1000,2000,2000,11000,0.80959307156465,NA 
rayol-farm2_2019-04-03_00-46-35.wav,44100,16,60,1,ndsi,1024,1000,2000,2000,11000,0.904122005789047,NA 
rayol-farm2_2019-04-03_00-48-35.wav,44100,16,60,1,ndsi,1024,1000,2000,2000,11000,0.908133133029657,NA 
rayol-farm2_2019-04-03_00-50-35.wav,44100,16,60,1,ndsi,1024,1000,2000,2000,11000,0.908771998452041,NA 
rayol-farm2_2019-04-03_00-52-35.wav,44100,16,60,1,ndsi,1024,1000,2000,2000,11000,0.908812895847702,NA 
rayol-farm2_2019-04-03_00-54-35.wav,44100,16,60,1,ndsi,1024,1000,2000,2000,11000,0.909604145965312,NA 
rayol-farm2_2019-04-03_00-56-35.wav,44100,16,60,1,ndsi,1024,1000,2000,2000,11000,0.910262235146502,NA 
rayol-farm2_2019-04-03_00-58-36.wav,44100,16,60,1,ndsi,1024,1000,2000,2000,11000,0.91011097004319,NA 
rayol-farm2_2019-04-03_01-00-36.wav,44100,16,60,1,ndsi,1024,1000,2000,2000,11000,0.910505189318561,NA 
rayol-farm2_2019-04-03_01-02-36.wav,44100,16,60,1,ndsi,1024,1000,2000,2000,11000,0.910363271598917,NA 
rayol-farm2_2019-04-03_01-04-36.wav,44100,16,60,1,ndsi,1024,1000,2000,2000,11000,0.910922999521612,NA 
rayol-farm2_2019-04-03_01-06-36.wav,44100,16,60,1,ndsi,1024,1000,2000,2000,11000,0.910964458256091,NA 
rayol-farm2_2019-04-03_01-08-36.wav,44100,16,60,1,ndsi,1024,1000,2000,2000,11000,0.910091404660836,NA 
rayol-farm2_2019-04-03_01-10-36.wav,44100,16,60,1,ndsi,1024,1000,2000,2000,11000,0.910332716819085,NA 
rayol-farm2_2019-04-03_01-12-36.wav,44100,16,60,1,ndsi,1024,1000,2000,2000,11000,0.910324403164784,NA 
rayol-farm2_2019-04-03_01-14-37.wav,44100,16,60,1,ndsi,1024,1000,2000,2000,11000,0.90978775244821,NA 
rayol-farm2_2019-04-03_01-16-37.wav,44100,16,60,1,ndsi,1024,1000,2000,2000,11000,0.909614863908654,NA 
rayol-farm2_2019-04-03_01-18-37.wav,44100,16,60,1,ndsi,1024,1000,2000,2000,11000,0.910037419401958,NA 
rayol-farm2_2019-04-03_01-20-37.wav,44100,16,60,1,ndsi,1024,1000,2000,2000,11000,0.910666059224281,NA 
rayol-farm2_2019-04-03_01-22-37.wav,44100,16,60,1,ndsi,1024,1000,2000,2000,11000,0.909876971524897,NA 
rayol-farm2_2019-04-03_01-24-37.wav,44100,16,60,1,ndsi,1024,1000,2000,2000,11000,0.910039945147925,NA 
rayol-farm2_2019-04-03_01-26-37.wav,44100,16,60,1,ndsi,1024,1000,2000,2000,11000,0.91009189965527,NA 
rayol-farm2_2019-04-03_01-28-37.wav,44100,16,60,1,ndsi,1024,1000,2000,2000,11000,0.910202535895018,NA 
rayol-farm2_2019-04-03_01-30-37.wav,44100,16,60,1,ndsi,1024,1000,2000,2000,11000,0.907108757507744,NA 
rayol-farm2_2019-04-03_01-32-38.wav,44100,16,60,1,ndsi,1024,1000,2000,2000,11000,0.909345638511732,NA 
rayol-farm2_2019-04-03_01-34-38.wav,44100,16,60,1,ndsi,1024,1000,2000,2000,11000,0.909506112588157,NA 
rayol-farm2_2019-04-03_01-36-38.wav,44100,16,60,1,ndsi,1024,1000,2000,2000,11000,0.910317448822117,NA 
rayol-farm2_2019-04-03_01-38-38.wav,44100,16,60,1,ndsi,1024,1000,2000,2000,11000,0.909385121573814,NA 
rayol-farm2_2019-04-03_01-40-38.wav,44100,16,60,1,ndsi,1024,1000,2000,2000,11000,0.910324871876012,NA 
rayol-farm2_2019-04-03_01-42-38.wav,44100,16,60,1,ndsi,1024,1000,2000,2000,11000,0.910373806930752,NA 
rayol-farm2_2019-04-03_01-44-38.wav,44100,16,60,1,ndsi,1024,1000,2000,2000,11000,0.910327993315788,NA 
rayol-farm2_2019-04-03_01-46-38.wav,44100,16,60,1,ndsi,1024,1000,2000,2000,11000,0.909885201977581,NA 
rayol-farm2_2019-04-03_01-48-39.wav,44100,16,60,1,ndsi,1024,1000,2000,2000,11000,0.909074530724266,NA 
rayol-farm2_2019-04-03_01-50-39.wav,44100,16,60,1,ndsi,1024,1000,2000,2000,11000,0.90662806946273,NA 
rayol-farm2_2019-04-03_01-52-39.wav,44100,16,60,1,ndsi,1024,1000,2000,2000,11000,0.909617604963174,NA 
rayol-farm2_2019-04-03_01-54-39.wav,44100,16,60,1,ndsi,1024,1000,2000,2000,11000,0.909727615378394,NA 
rayol-farm2_2019-04-03_01-56-39.wav,44100,16,60,1,ndsi,1024,1000,2000,2000,11000,0.910454336298291,NA 
rayol-farm2_2019-04-03_01-58-39.wav,44100,16,60,1,ndsi,1024,1000,2000,2000,11000,0.909872912287288,NA 
rayol-farm2_2019-04-03_02-00-39.wav,44100,16,60,1,ndsi,1024,1000,2000,2000,11000,0.910618298333885,NA 
rayol-farm2_2019-04-03_02-02-39.wav,44100,16,60,1,ndsi,1024,1000,2000,2000,11000,0.909596218942224,NA 
rayol-farm2_2019-04-03_02-04-40.wav,44100,16,60,1,ndsi,1024,1000,2000,2000,11000,0.910824627333786,NA 
rayol-farm2_2019-04-03_02-06-40.wav,44100,16,60,1,ndsi,1024,1000,2000,2000,11000,0.910760288222732,NA 
rayol-farm2_2019-04-03_02-08-40.wav,44100,16,60,1,ndsi,1024,1000,2000,2000,11000,0.907322911948807,NA 
rayol-farm2_2019-04-03_02-10-40.wav,44100,16,60,1,ndsi,1024,1000,2000,2000,11000,0.911602464126359,NA 
rayol-farm2_2019-04-03_02-12-40.wav,44100,16,60,1,ndsi,1024,1000,2000,2000,11000,0.910342045477819,NA 
rayol-farm2_2019-04-03_02-14-40.wav,44100,16,60,1,ndsi,1024,1000,2000,2000,11000,0.91134504462197,NA 
rayol-farm2_2019-04-03_02-16-40.wav,44100,16,60,1,ndsi,1024,1000,2000,2000,11000,0.910480609748801,NA 
rayol-farm2_2019-04-03_02-18-40.wav,44100,16,60,1,ndsi,1024,1000,2000,2000,11000,0.90917305759603,NA 
rayol-farm2_2019-04-03_02-20-41.wav,44100,16,60,1,ndsi,1024,1000,2000,2000,11000,0.910756171232683,NA 
rayol-farm2_2019-04-03_02-22-41.wav,44100,16,60,1,ndsi,1024,1000,2000,2000,11000,0.909417841414621,NA 
rayol-farm2_2019-04-03_02-24-41.wav,44100,16,60,1,ndsi,1024,1000,2000,2000,11000,0.910733399821196,NA 
rayol-farm2_2019-04-03_02-26-41.wav,44100,16,60,1,ndsi,1024,1000,2000,2000,11000,0.910274603370839,NA 
rayol-farm2_2019-04-03_02-28-41.wav,44100,16,60,1,ndsi,1024,1000,2000,2000,11000,0.911036877121706,NA 
rayol-farm2_2019-04-03_02-30-41.wav,44100,16,60,1,ndsi,1024,1000,2000,2000,11000,0.910726382175609,NA 
rayol-farm2_2019-04-03_02-32-41.wav,44100,16,60,1,ndsi,1024,1000,2000,2000,11000,0.908953467104894,NA 
rayol-farm2_2019-04-03_02-34-41.wav,44100,16,60,1,ndsi,1024,1000,2000,2000,11000,0.91068540899317,NA 
rayol-farm2_2019-04-03_02-36-41.wav,44100,16,60,1,ndsi,1024,1000,2000,2000,11000,0.907234837627177,NA 
rayol-farm2_2019-04-03_02-38-42.wav,44100,16,60,1,ndsi,1024,1000,2000,2000,11000,0.910829681469029,NA 
rayol-farm2_2019-04-03_02-40-42.wav,44100,16,60,1,ndsi,1024,1000,2000,2000,11000,0.907834049220639,NA 
rayol-farm2_2019-04-03_02-42-42.wav,44100,16,60,1,ndsi,1024,1000,2000,2000,11000,0.910931264965776,NA 
rayol-farm2_2019-04-03_02-44-42.wav,44100,16,60,1,ndsi,1024,1000,2000,2000,11000,0.90869637649431,NA 
rayol-farm2_2019-04-03_02-46-42.wav,44100,16,60,1,ndsi,1024,1000,2000,2000,11000,0.909745536521612,NA 
rayol-farm2_2019-04-03_02-48-42.wav,44100,16,60,1,ndsi,1024,1000,2000,2000,11000,0.911131201877443,NA 
rayol-farm2_2019-04-03_02-50-42.wav,44100,16,60,1,ndsi,1024,1000,2000,2000,11000,0.911086060014295,NA 
rayol-farm2_2019-04-03_02-52-42.wav,44100,16,60,1,ndsi,1024,1000,2000,2000,11000,0.910929005969252,NA 
rayol-farm2_2019-04-03_02-54-43.wav,44100,16,60,1,ndsi,1024,1000,2000,2000,11000,0.911447537889351,NA 
rayol-farm2_2019-04-03_02-56-43.wav,44100,16,60,1,ndsi,1024,1000,2000,2000,11000,0.909912797846141,NA 
rayol-farm2_2019-04-03_02-58-43.wav,44100,16,60,1,ndsi,1024,1000,2000,2000,11000,0.910716239197147,NA 
rayol-farm2_2019-04-03_03-00-43.wav,44100,16,60,1,ndsi,1024,1000,2000,2000,11000,0.910020738445913,NA 
rayol-farm2_2019-04-03_03-02-43.wav,44100,16,60,1,ndsi,1024,1000,2000,2000,11000,0.911436620723459,NA 
rayol-farm2_2019-04-03_03-04-43.wav,44100,16,60,1,ndsi,1024,1000,2000,2000,11000,0.910263316017178,NA 
rayol-farm2_2019-04-03_03-06-43.wav,44100,16,60,1,ndsi,1024,1000,2000,2000,11000,0.911376431570829,NA 
rayol-farm2_2019-04-03_03-08-43.wav,44100,16,60,1,ndsi,1024,1000,2000,2000,11000,0.911158556607833,NA 
rayol-farm2_2019-04-03_03-10-44.wav,44100,16,60,1,ndsi,1024,1000,2000,2000,11000,0.910980068987958,NA 
rayol-farm2_2019-04-03_03-12-44.wav,44100,16,60,1,ndsi,1024,1000,2000,2000,11000,0.911480141657792,NA 
rayol-farm2_2019-04-03_03-14-44.wav,44100,16,60,1,ndsi,1024,1000,2000,2000,11000,0.904167859474399,NA 
rayol-farm2_2019-04-03_03-16-44.wav,44100,16,60,1,ndsi,1024,1000,2000,2000,11000,0.911784744988154,NA 
rayol-farm2_2019-04-03_03-18-44.wav,44100,16,60,1,ndsi,1024,1000,2000,2000,11000,0.911243051872563,NA 
rayol-farm2_2019-04-03_03-20-44.wav,44100,16,60,1,ndsi,1024,1000,2000,2000,11000,0.911531059720778,NA 
rayol-farm2_2019-04-03_03-22-44.wav,44100,16,60,1,ndsi,1024,1000,2000,2000,11000,0.911027701473848,NA 
rayol-farm2_2019-04-03_03-24-44.wav,44100,16,60,1,ndsi,1024,1000,2000,2000,11000,0.911753082388618,NA 
rayol-farm2_2019-04-03_03-26-44.wav,44100,16,60,1,ndsi,1024,1000,2000,2000,11000,0.911131860464401,NA 
rayol-farm2_2019-04-03_03-28-45.wav,44100,16,60,1,ndsi,1024,1000,2000,2000,11000,0.912339864238008,NA 
rayol-farm2_2019-04-03_03-30-45.wav,44100,16,60,1,ndsi,1024,1000,2000,2000,11000,0.912147640617641,NA 
rayol-farm2_2019-04-03_03-32-45.wav,44100,16,60,1,ndsi,1024,1000,2000,2000,11000,0.912592695550571,NA 
rayol-farm2_2019-04-03_03-34-45.wav,44100,16,60,1,ndsi,1024,1000,2000,2000,11000,0.911385568539174,NA 
rayol-farm2_2019-04-03_03-36-45.wav,44100,16,60,1,ndsi,1024,1000,2000,2000,11000,0.911714125224462,NA 
rayol-farm2_2019-04-03_03-38-45.wav,44100,16,60,1,ndsi,1024,1000,2000,2000,11000,0.912915667112224,NA 
rayol-farm2_2019-04-03_03-40-45.wav,44100,16,60,1,ndsi,1024,1000,2000,2000,11000,0.911294303913289,NA 
rayol-farm2_2019-04-03_03-42-45.wav,44100,16,60,1,ndsi,1024,1000,2000,2000,11000,0.912263134300968,NA 
rayol-farm2_2019-04-03_03-44-46.wav,44100,16,60,1,ndsi,1024,1000,2000,2000,11000,0.911422077760122,NA 
rayol-farm2_2019-04-03_03-46-46.wav,44100,16,60,1,ndsi,1024,1000,2000,2000,11000,0.911526397790912,NA 
rayol-farm2_2019-04-03_03-48-46.wav,44100,16,60,1,ndsi,1024,1000,2000,2000,11000,0.911597245622823,NA 
rayol-farm2_2019-04-03_03-50-46.wav,44100,16,60,1,ndsi,1024,1000,2000,2000,11000,0.911434862356063,NA 
rayol-farm2_2019-04-03_03-52-46.wav,44100,16,60,1,ndsi,1024,1000,2000,2000,11000,0.912891621113769,NA 
rayol-farm2_2019-04-03_03-54-46.wav,44100,16,60,1,ndsi,1024,1000,2000,2000,11000,0.912694442756493,NA 
rayol-farm2_2019-04-03_03-56-46.wav,44100,16,60,1,ndsi,1024,1000,2000,2000,11000,0.91337658491802,NA 
rayol-farm2_2019-04-03_03-58-46.wav,44100,16,60,1,ndsi,1024,1000,2000,2000,11000,0.911325958349865,NA 
rayol-farm2_2019-04-03_04-00-47.wav,44100,16,60,1,ndsi,1024,1000,2000,2000,11000,0.91266111241482,NA 
rayol-farm2_2019-04-03_04-02-47.wav,44100,16,60,1,ndsi,1024,1000,2000,2000,11000,0.912460975182386,NA 
rayol-farm2_2019-04-03_04-04-47.wav,44100,16,60,1,ndsi,1024,1000,2000,2000,11000,0.912476106907677,NA 
rayol-farm2_2019-04-03_04-06-47.wav,44100,16,60,1,ndsi,1024,1000,2000,2000,11000,0.911277460409206,NA 
rayol-farm2_2019-04-03_04-08-47.wav,44100,16,60,1,ndsi,1024,1000,2000,2000,11000,0.911155038053879,NA 
rayol-farm2_2019-04-03_04-10-47.wav,44100,16,60,1,ndsi,1024,1000,2000,2000,11000,0.910318014664773,NA 
rayol-farm2_2019-04-03_04-12-47.wav,44100,16,60,1,ndsi,1024,1000,2000,2000,11000,0.912429354041904,NA 
rayol-farm2_2019-04-03_04-14-47.wav,44100,16,60,1,ndsi,1024,1000,2000,2000,11000,0.912118379519966,NA 
rayol-farm2_2019-04-03_04-16-48.wav,44100,16,60,1,ndsi,1024,1000,2000,2000,11000,0.912850156440087,NA 
rayol-farm2_2019-04-03_04-18-48.wav,44100,16,60,1,ndsi,1024,1000,2000,2000,11000,0.911474918121724,NA 
rayol-farm2_2019-04-03_04-20-48.wav,44100,16,60,1,ndsi,1024,1000,2000,2000,11000,0.913937016193401,NA 
rayol-farm2_2019-04-03_04-22-48.wav,44100,16,60,1,ndsi,1024,1000,2000,2000,11000,0.913269241725129,NA 
rayol-farm2_2019-04-03_04-24-48.wav,44100,16,60,1,ndsi,1024,1000,2000,2000,11000,0.913882551666153,NA 
rayol-farm2_2019-04-03_04-26-48.wav,44100,16,60,1,ndsi,1024,1000,2000,2000,11000,0.906414093109057,NA 
rayol-farm2_2019-04-03_04-28-48.wav,44100,16,60,1,ndsi,1024,1000,2000,2000,11000,0.91343958308609,NA 
rayol-farm2_2019-04-03_04-30-48.wav,44100,16,60,1,ndsi,1024,1000,2000,2000,11000,0.913667083069214,NA 
rayol-farm2_2019-04-03_04-32-48.wav,44100,16,60,1,ndsi,1024,1000,2000,2000,11000,0.913934082860892,NA 
rayol-farm2_2019-04-03_04-34-49.wav,44100,16,60,1,ndsi,1024,1000,2000,2000,11000,0.912318699860557,NA 
rayol-farm2_2019-04-03_04-36-49.wav,44100,16,60,1,ndsi,1024,1000,2000,2000,11000,0.911626373652366,NA 
rayol-farm2_2019-04-03_04-38-49.wav,44100,16,60,1,ndsi,1024,1000,2000,2000,11000,0.911280699973725,NA 
rayol-farm2_2019-04-03_04-40-49.wav,44100,16,60,1,ndsi,1024,1000,2000,2000,11000,0.911361208453213,NA 
rayol-farm2_2019-04-03_04-42-49.wav,44100,16,60,1,ndsi,1024,1000,2000,2000,11000,0.92219205634781,NA 
rayol-farm2_2019-04-03_04-44-49.wav,44100,16,60,1,ndsi,1024,1000,2000,2000,11000,0.911888423763328,NA 
rayol-farm2_2019-04-03_04-46-49.wav,44100,16,60,1,ndsi,1024,1000,2000,2000,11000,0.911551525193183,NA 
rayol-farm2_2019-04-03_04-48-49.wav,44100,16,60,1,ndsi,1024,1000,2000,2000,11000,0.912646585757741,NA 
rayol-farm2_2019-04-03_04-50-50.wav,44100,16,60,1,ndsi,1024,1000,2000,2000,11000,0.911892174200823,NA 
rayol-farm2_2019-04-03_04-52-50.wav,44100,16,60,1,ndsi,1024,1000,2000,2000,11000,0.913300779023397,NA 
rayol-farm2_2019-04-03_04-54-50.wav,44100,16,60,1,ndsi,1024,1000,2000,2000,11000,0.914157902174746,NA 
rayol-farm2_2019-04-03_04-56-50.wav,44100,16,60,1,ndsi,1024,1000,2000,2000,11000,0.911789253705871,NA 
rayol-farm2_2019-04-03_04-58-50.wav,44100,16,60,1,ndsi,1024,1000,2000,2000,11000,0.910858295999981,NA 
rayol-farm2_2019-04-03_05-00-50.wav,44100,16,60,1,ndsi,1024,1000,2000,2000,11000,0.911646072256377,NA 
rayol-farm2_2019-04-03_05-02-50.wav,44100,16,60,1,ndsi,1024,1000,2000,2000,11000,0.912067452276871,NA 
rayol-farm2_2019-04-03_05-04-50.wav,44100,16,60,1,ndsi,1024,1000,2000,2000,11000,0.911710958239127,NA 
rayol-farm2_2019-04-03_05-06-51.wav,44100,16,60,1,ndsi,1024,1000,2000,2000,11000,0.910892508353278,NA 
rayol-farm2_2019-04-03_05-08-51.wav,44100,16,60,1,ndsi,1024,1000,2000,2000,11000,0.910781512860974,NA 
rayol-farm2_2019-04-03_05-10-51.wav,44100,16,60,1,ndsi,1024,1000,2000,2000,11000,0.910540530893148,NA 
rayol-farm2_2019-04-03_05-12-51.wav,44100,16,60,1,ndsi,1024,1000,2000,2000,11000,0.910961560757551,NA 
rayol-farm2_2019-04-03_05-14-51.wav,44100,16,60,1,ndsi,1024,1000,2000,2000,11000,0.910829407476896,NA 
rayol-farm2_2019-04-03_05-16-51.wav,44100,16,60,1,ndsi,1024,1000,2000,2000,11000,0.909197531565769,NA 
rayol-farm2_2019-04-03_05-18-51.wav,44100,16,60,1,ndsi,1024,1000,2000,2000,11000,0.90784139512219,NA 
rayol-farm2_2019-04-03_05-20-51.wav,44100,16,60,1,ndsi,1024,1000,2000,2000,11000,0.895635484319444,NA 
rayol-farm2_2019-04-03_05-22-51.wav,44100,16,60,1,ndsi,1024,1000,2000,2000,11000,0.90168011596565,NA 
rayol-farm2_2019-04-03_05-24-52.wav,44100,16,60,1,ndsi,1024,1000,2000,2000,11000,0.872134660670421,NA 
rayol-farm2_2019-04-03_05-26-52.wav,44100,16,60,1,ndsi,1024,1000,2000,2000,11000,0.801519785638114,NA 
rayol-farm2_2019-04-03_05-28-52.wav,44100,16,60,1,ndsi,1024,1000,2000,2000,11000,0.819780430025081,NA 
rayol-farm2_2019-04-03_05-30-52.wav,44100,16,60,1,ndsi,1024,1000,2000,2000,11000,0.82181506136336,NA 
rayol-farm2_2019-04-03_05-32-52.wav,44100,16,60,1,ndsi,1024,1000,2000,2000,11000,0.841108797396195,NA 
rayol-farm2_2019-04-03_05-34-52.wav,44100,16,60,1,ndsi,1024,1000,2000,2000,11000,0.817918548260001,NA 
rayol-farm2_2019-04-03_05-36-52.wav,44100,16,60,1,ndsi,1024,1000,2000,2000,11000,0.825505510691804,NA 
rayol-farm2_2019-04-03_05-38-52.wav,44100,16,60,1,ndsi,1024,1000,2000,2000,11000,0.833689488995156,NA 
rayol-farm2_2019-04-03_05-40-53.wav,44100,16,60,1,ndsi,1024,1000,2000,2000,11000,0.852920551638037,NA 
rayol-farm2_2019-04-03_05-42-53.wav,44100,16,60,1,ndsi,1024,1000,2000,2000,11000,0.869516169722192,NA 
rayol-farm2_2019-04-03_05-44-53.wav,44100,16,60,1,ndsi,1024,1000,2000,2000,11000,0.880960924883379,NA 
rayol-farm2_2019-04-03_05-46-53.wav,44100,16,60,1,ndsi,1024,1000,2000,2000,11000,0.889522995094392,NA 
rayol-farm2_2019-04-03_05-48-53.wav,44100,16,60,1,ndsi,1024,1000,2000,2000,11000,0.891033008181798,NA 
rayol-farm2_2019-04-03_05-50-53.wav,44100,16,60,1,ndsi,1024,1000,2000,2000,11000,0.894424294338527,NA 
rayol-farm2_2019-04-03_05-52-53.wav,44100,16,60,1,ndsi,1024,1000,2000,2000,11000,0.896671408690701,NA 
rayol-farm2_2019-04-03_05-54-53.wav,44100,16,60,1,ndsi,1024,1000,2000,2000,11000,0.89267184299597,NA 
rayol-farm2_2019-04-03_05-56-54.wav,44100,16,60,1,ndsi,1024,1000,2000,2000,11000,0.895848377409383,NA 
rayol-farm2_2019-04-03_05-58-54.wav,44100,16,60,1,ndsi,1024,1000,2000,2000,11000,0.807161162816134,NA 
rayol-farm2_2019-04-03_06-00-54.wav,44100,16,60,1,ndsi,1024,1000,2000,2000,11000,0.888583160505069,NA 
rayol-farm2_2019-04-03_06-02-54.wav,44100,16,60,1,ndsi,1024,1000,2000,2000,11000,0.887878636113602,NA 
rayol-farm2_2019-04-03_06-04-54.wav,44100,16,60,1,ndsi,1024,1000,2000,2000,11000,0.890950262221832,NA 
rayol-farm2_2019-04-03_06-06-54.wav,44100,16,60,1,ndsi,1024,1000,2000,2000,11000,0.89852985444722,NA 
rayol-farm2_2019-04-03_06-08-54.wav,44100,16,60,1,ndsi,1024,1000,2000,2000,11000,0.899034842309353,NA 
rayol-farm2_2019-04-03_06-10-54.wav,44100,16,60,1,ndsi,1024,1000,2000,2000,11000,0.900918344940052,NA 
rayol-farm2_2019-04-03_06-12-54.wav,44100,16,60,1,ndsi,1024,1000,2000,2000,11000,0.901052363837401,NA 
rayol-farm2_2019-04-03_06-14-55.wav,44100,16,60,1,ndsi,1024,1000,2000,2000,11000,0.899561262478946,NA 
rayol-farm2_2019-04-03_06-16-55.wav,44100,16,60,1,ndsi,1024,1000,2000,2000,11000,0.89773079727776,NA 
rayol-farm2_2019-04-03_06-18-55.wav,44100,16,60,1,ndsi,1024,1000,2000,2000,11000,0.886952547305623,NA 
rayol-farm2_2019-04-03_06-20-55.wav,44100,16,60,1,ndsi,1024,1000,2000,2000,11000,0.890055247460785,NA 
rayol-farm2_2019-04-03_06-22-55.wav,44100,16,60,1,ndsi,1024,1000,2000,2000,11000,0.894355251161337,NA 
rayol-farm2_2019-04-03_06-24-55.wav,44100,16,60,1,ndsi,1024,1000,2000,2000,11000,0.90042196631131,NA 
rayol-farm2_2019-04-03_06-26-55.wav,44100,16,60,1,ndsi,1024,1000,2000,2000,11000,0.899588373225854,NA 
rayol-farm2_2019-04-03_06-28-55.wav,44100,16,60,1,ndsi,1024,1000,2000,2000,11000,0.898494903814688,NA 
rayol-farm2_2019-04-03_06-30-56.wav,44100,16,60,1,ndsi,1024,1000,2000,2000,11000,0.901796882616625,NA 
rayol-farm2_2019-04-03_06-32-56.wav,44100,16,60,1,ndsi,1024,1000,2000,2000,11000,0.890600154073219,NA 
rayol-farm2_2019-04-03_06-34-56.wav,44100,16,60,1,ndsi,1024,1000,2000,2000,11000,0.883261929155501,NA 
rayol-farm2_2019-04-03_06-36-56.wav,44100,16,60,1,ndsi,1024,1000,2000,2000,11000,0.890574227390327,NA 
rayol-farm2_2019-04-03_06-38-56.wav,44100,16,60,1,ndsi,1024,1000,2000,2000,11000,0.928089782212815,NA 
rayol-farm2_2019-04-03_06-40-56.wav,44100,16,60,1,ndsi,1024,1000,2000,2000,11000,0.937060244389499,NA 
rayol-farm2_2019-04-03_06-42-56.wav,44100,16,60,1,ndsi,1024,1000,2000,2000,11000,0.936078865190065,NA 
rayol-farm2_2019-04-03_06-44-56.wav,44100,16,60,1,ndsi,1024,1000,2000,2000,11000,0.381810547365288,NA 
rayol-farm2_2019-04-03_06-46-57.wav,44100,16,60,1,ndsi,1024,1000,2000,2000,11000,0.89150959814295,NA 
rayol-farm2_2019-04-03_06-48-57.wav,44100,16,60,1,ndsi,1024,1000,2000,2000,11000,0.922905860724818,NA 
rayol-farm2_2019-04-03_06-50-57.wav,44100,16,60,1,ndsi,1024,1000,2000,2000,11000,0.946316830805851,NA 
rayol-farm2_2019-04-03_06-52-57.wav,44100,16,60,1,ndsi,1024,1000,2000,2000,11000,0.949469953607794,NA 
rayol-farm2_2019-04-03_06-54-57.wav,44100,16,60,1,ndsi,1024,1000,2000,2000,11000,0.953724922295093,NA 
rayol-farm2_2019-04-03_06-56-57.wav,44100,16,60,1,ndsi,1024,1000,2000,2000,11000,0.869784624692825,NA 
rayol-farm2_2019-04-03_06-58-57.wav,44100,16,60,1,ndsi,1024,1000,2000,2000,11000,0.920102640928507,NA 
rayol-farm2_2019-04-03_07-00-57.wav,44100,16,60,1,ndsi,1024,1000,2000,2000,11000,0.942239158024065,NA 
rayol-farm2_2019-04-03_07-02-57.wav,44100,16,60,1,ndsi,1024,1000,2000,2000,11000,0.947182327805889,NA 
rayol-farm2_2019-04-03_07-04-58.wav,44100,16,60,1,ndsi,1024,1000,2000,2000,11000,0.88099371463401,NA 
rayol-farm2_2019-04-03_07-06-58.wav,44100,16,60,1,ndsi,1024,1000,2000,2000,11000,0.905866369725915,NA 
rayol-farm2_2019-04-03_07-08-58.wav,44100,16,60,1,ndsi,1024,1000,2000,2000,11000,0.929455405379288,NA 
rayol-farm2_2019-04-03_07-10-58.wav,44100,16,60,1,ndsi,1024,1000,2000,2000,11000,0.309982742254037,NA 
rayol-farm2_2019-04-03_07-12-58.wav,44100,16,60,1,ndsi,1024,1000,2000,2000,11000,0.0825211246611963,NA 
rayol-farm2_2019-04-03_07-14-58.wav,44100,16,60,1,ndsi,1024,1000,2000,2000,11000,0.907230071634661,NA 
rayol-farm2_2019-04-03_07-16-58.wav,44100,16,60,1,ndsi,1024,1000,2000,2000,11000,0.900368203098847,NA 
rayol-farm2_2019-04-03_07-18-58.wav,44100,16,60,1,ndsi,1024,1000,2000,2000,11000,0.863828866769046,NA 
rayol-farm2_2019-04-03_07-20-59.wav,44100,16,60,1,ndsi,1024,1000,2000,2000,11000,0.879947833492575,NA 
rayol-farm2_2019-04-03_07-22-59.wav,44100,16,60,1,ndsi,1024,1000,2000,2000,11000,0.902759727015115,NA 
rayol-farm2_2019-04-03_07-24-59.wav,44100,16,60,1,ndsi,1024,1000,2000,2000,11000,0.856251275706885,NA 
rayol-farm2_2019-04-03_07-26-59.wav,44100,16,60,1,ndsi,1024,1000,2000,2000,11000,0.89143067101108,NA 
rayol-farm2_2019-04-03_07-28-59.wav,44100,16,60,1,ndsi,1024,1000,2000,2000,11000,0.875233194849868,NA 
rayol-farm2_2019-04-03_07-30-59.wav,44100,16,60,1,ndsi,1024,1000,2000,2000,11000,0.894772956866446,NA 
rayol-farm2_2019-04-03_07-32-59.wav,44100,16,60,1,ndsi,1024,1000,2000,2000,11000,0.871285813377719,NA 
rayol-farm2_2019-04-03_07-34-59.wav,44100,16,60,1,ndsi,1024,1000,2000,2000,11000,0.860657007078167,NA 
rayol-farm2_2019-04-03_07-37-00.wav,44100,16,60,1,ndsi,1024,1000,2000,2000,11000,0.876089926522743,NA 
rayol-farm2_2019-04-03_07-39-00.wav,44100,16,60,1,ndsi,1024,1000,2000,2000,11000,0.885842514433864,NA 
rayol-farm2_2019-04-03_07-41-00.wav,44100,16,60,1,ndsi,1024,1000,2000,2000,11000,0.803068754378762,NA 
rayol-farm2_2019-04-03_07-43-00.wav,44100,16,60,1,ndsi,1024,1000,2000,2000,11000,0.867324841354696,NA 
rayol-farm2_2019-04-03_07-45-00.wav,44100,16,60,1,ndsi,1024,1000,2000,2000,11000,0.851130036967576,NA 
rayol-farm2_2019-04-03_07-47-00.wav,44100,16,60,1,ndsi,1024,1000,2000,2000,11000,0.858763698572517,NA 
rayol-farm2_2019-04-03_07-49-00.wav,44100,16,60,1,ndsi,1024,1000,2000,2000,11000,0.913372066223418,NA 
rayol-farm2_2019-04-03_07-51-00.wav,44100,16,60,1,ndsi,1024,1000,2000,2000,11000,0.860345677790137,NA 
rayol-farm2_2019-04-03_07-53-01.wav,44100,16,60,1,ndsi,1024,1000,2000,2000,11000,0.797346637344747,NA 
rayol-farm2_2019-04-03_07-55-01.wav,44100,16,60,1,ndsi,1024,1000,2000,2000,11000,0.847613568763838,NA 
rayol-farm2_2019-04-03_07-57-01.wav,44100,16,60,1,ndsi,1024,1000,2000,2000,11000,0.861478909964534,NA 
rayol-farm2_2019-04-03_07-59-01.wav,44100,16,60,1,ndsi,1024,1000,2000,2000,11000,0.836695577733964,NA 
rayol-farm2_2019-04-03_08-01-01.wav,44100,16,60,1,ndsi,1024,1000,2000,2000,11000,0.817151890066072,NA 
rayol-farm2_2019-04-03_08-03-01.wav,44100,16,60,1,ndsi,1024,1000,2000,2000,11000,0.683051280591172,NA 
rayol-farm2_2019-04-03_08-05-01.wav,44100,16,60,1,ndsi,1024,1000,2000,2000,11000,0.602113658351717,NA 
rayol-farm2_2019-04-03_08-07-01.wav,44100,16,60,1,ndsi,1024,1000,2000,2000,11000,0.8678071161358,NA 
rayol-farm2_2019-04-03_08-09-01.wav,44100,16,60,1,ndsi,1024,1000,2000,2000,11000,0.894597644121923,NA 
rayol-farm2_2019-04-03_08-11-02.wav,44100,16,60,1,ndsi,1024,1000,2000,2000,11000,0.873443042123909,NA 
rayol-farm2_2019-04-03_08-13-02.wav,44100,16,60,1,ndsi,1024,1000,2000,2000,11000,0.824565415375355,NA 
rayol-farm2_2019-04-03_08-15-02.wav,44100,16,60,1,ndsi,1024,1000,2000,2000,11000,0.820228239812256,NA 
rayol-farm2_2019-04-03_08-17-02.wav,44100,16,60,1,ndsi,1024,1000,2000,2000,11000,0.867626046691757,NA 
rayol-farm2_2019-04-03_08-19-02.wav,44100,16,60,1,ndsi,1024,1000,2000,2000,11000,0.711779491493589,NA 
rayol-farm2_2019-04-03_08-21-02.wav,44100,16,60,1,ndsi,1024,1000,2000,2000,11000,0.00803112342041663,NA 
rayol-farm2_2019-04-03_08-23-02.wav,44100,16,60,1,ndsi,1024,1000,2000,2000,11000,0.525794437316892,NA 
rayol-farm2_2019-04-03_08-25-02.wav,44100,16,60,1,ndsi,1024,1000,2000,2000,11000,0.802370882989227,NA 
rayol-farm2_2019-04-03_08-27-03.wav,44100,16,60,1,ndsi,1024,1000,2000,2000,11000,0.669460828413137,NA 
rayol-farm2_2019-04-03_08-29-03.wav,44100,16,60,1,ndsi,1024,1000,2000,2000,11000,0.845140231897933,NA 
rayol-farm2_2019-04-03_08-31-03.wav,44100,16,60,1,ndsi,1024,1000,2000,2000,11000,0.55355766920506,NA 
rayol-farm2_2019-04-03_08-33-03.wav,44100,16,60,1,ndsi,1024,1000,2000,2000,11000,0.551261832271037,NA 
rayol-farm2_2019-04-03_08-35-03.wav,44100,16,60,1,ndsi,1024,1000,2000,2000,11000,0.770984879080533,NA 
rayol-farm2_2019-04-03_08-37-03.wav,44100,16,60,1,ndsi,1024,1000,2000,2000,11000,0.632289937893725,NA 
rayol-farm2_2019-04-03_08-39-03.wav,44100,16,60,1,ndsi,1024,1000,2000,2000,11000,0.718741854529583,NA 
rayol-farm2_2019-04-03_08-41-03.wav,44100,16,60,1,ndsi,1024,1000,2000,2000,11000,0.873126854719924,NA 
rayol-farm2_2019-04-03_08-43-04.wav,44100,16,60,1,ndsi,1024,1000,2000,2000,11000,0.84824273598255,NA 
rayol-farm2_2019-04-03_08-45-04.wav,44100,16,60,1,ndsi,1024,1000,2000,2000,11000,0.886167225924691,NA 
rayol-farm2_2019-04-03_08-47-04.wav,44100,16,60,1,ndsi,1024,1000,2000,2000,11000,0.856968697372905,NA 
rayol-farm2_2019-04-03_08-49-04.wav,44100,16,60,1,ndsi,1024,1000,2000,2000,11000,0.848658983207622,NA 
rayol-farm2_2019-04-03_08-51-04.wav,44100,16,60,1,ndsi,1024,1000,2000,2000,11000,0.831299782593266,NA 
rayol-farm2_2019-04-03_08-53-04.wav,44100,16,60,1,ndsi,1024,1000,2000,2000,11000,0.799082849269841,NA 
rayol-farm2_2019-04-03_08-55-04.wav,44100,16,60,1,ndsi,1024,1000,2000,2000,11000,0.489057958265731,NA 
rayol-farm2_2019-04-03_08-57-04.wav,44100,16,60,1,ndsi,1024,1000,2000,2000,11000,0.447524839549226,NA 
rayol-farm2_2019-04-03_08-59-05.wav,44100,16,60,1,ndsi,1024,1000,2000,2000,11000,0.457580840943654,NA 
rayol-farm2_2019-04-03_09-01-05.wav,44100,16,60,1,ndsi,1024,1000,2000,2000,11000,0.225218178143131,NA 
rayol-farm2_2019-04-03_09-03-05.wav,44100,16,60,1,ndsi,1024,1000,2000,2000,11000,0.457405753097946,NA 
rayol-farm2_2019-04-03_09-05-05.wav,44100,16,60,1,ndsi,1024,1000,2000,2000,11000,0.524055288544604,NA 
rayol-farm2_2019-04-03_09-07-05.wav,44100,16,60,1,ndsi,1024,1000,2000,2000,11000,0.519209074999368,NA 
rayol-farm2_2019-04-03_09-09-05.wav,44100,16,60,1,ndsi,1024,1000,2000,2000,11000,0.649907093745809,NA 
rayol-farm2_2019-04-03_09-11-05.wav,44100,16,60,1,ndsi,1024,1000,2000,2000,11000,0.410557181693782,NA 
rayol-farm2_2019-04-03_09-13-05.wav,44100,16,60,1,ndsi,1024,1000,2000,2000,11000,0.439208310478926,NA 
rayol-farm2_2019-04-03_09-15-06.wav,44100,16,60,1,ndsi,1024,1000,2000,2000,11000,0.209558359166627,NA 
rayol-farm2_2019-04-03_09-17-06.wav,44100,16,60,1,ndsi,1024,1000,2000,2000,11000,0.541675256075664,NA 
rayol-farm2_2019-04-03_09-19-06.wav,44100,16,60,1,ndsi,1024,1000,2000,2000,11000,0.285039169302229,NA 
rayol-farm2_2019-04-03_09-21-06.wav,44100,16,60,1,ndsi,1024,1000,2000,2000,11000,0.224875598173723,NA 
rayol-farm2_2019-04-03_09-23-06.wav,44100,16,60,1,ndsi,1024,1000,2000,2000,11000,0.073965782025419,NA 
rayol-farm2_2019-04-03_09-25-06.wav,44100,16,60,1,ndsi,1024,1000,2000,2000,11000,0.315538480454041,NA 
rayol-farm2_2019-04-03_09-27-06.wav,44100,16,60,1,ndsi,1024,1000,2000,2000,11000,0.147210815775849,NA 
rayol-farm2_2019-04-03_09-29-06.wav,44100,16,60,1,ndsi,1024,1000,2000,2000,11000,0.488651604753951,NA 
rayol-farm2_2019-04-03_09-31-06.wav,44100,16,60,1,ndsi,1024,1000,2000,2000,11000,0.248242720548641,NA 
rayol-farm2_2019-04-03_09-33-07.wav,44100,16,60,1,ndsi,1024,1000,2000,2000,11000,0.118857705192572,NA 
rayol-farm2_2019-04-03_09-35-07.wav,44100,16,60,1,ndsi,1024,1000,2000,2000,11000,0.433675329417571,NA 
rayol-farm2_2019-04-03_09-37-07.wav,44100,16,60,1,ndsi,1024,1000,2000,2000,11000,0.244710994336374,NA 
rayol-farm2_2019-04-03_09-39-07.wav,44100,16,60,1,ndsi,1024,1000,2000,2000,11000,0.306809983974472,NA 
rayol-farm2_2019-04-03_09-41-07.wav,44100,16,60,1,ndsi,1024,1000,2000,2000,11000,0.053556169055846,NA 
rayol-farm2_2019-04-03_09-43-07.wav,44100,16,60,1,ndsi,1024,1000,2000,2000,11000,0.228390358027334,NA 
rayol-farm2_2019-04-03_09-45-07.wav,44100,16,60,1,ndsi,1024,1000,2000,2000,11000,0.33819798278904,NA 
rayol-farm2_2019-04-03_09-47-07.wav,44100,16,60,1,ndsi,1024,1000,2000,2000,11000,0.468623782533349,NA 
rayol-farm2_2019-04-03_09-49-08.wav,44100,16,60,1,ndsi,1024,1000,2000,2000,11000,0.532113568842702,NA 
rayol-farm2_2019-04-03_09-51-08.wav,44100,16,60,1,ndsi,1024,1000,2000,2000,11000,0.749846607012783,NA 
rayol-farm2_2019-04-03_09-53-08.wav,44100,16,60,1,ndsi,1024,1000,2000,2000,11000,0.827525337358129,NA 
rayol-farm2_2019-04-03_09-55-08.wav,44100,16,60,1,ndsi,1024,1000,2000,2000,11000,0.819024449760814,NA 
rayol-farm2_2019-04-03_09-57-08.wav,44100,16,60,1,ndsi,1024,1000,2000,2000,11000,0.641555659169481,NA 
rayol-farm2_2019-04-03_09-59-08.wav,44100,16,60,1,ndsi,1024,1000,2000,2000,11000,0.637214928725032,NA 
rayol-farm2_2019-04-03_10-01-08.wav,44100,16,60,1,ndsi,1024,1000,2000,2000,11000,0.707459439766486,NA 
rayol-farm2_2019-04-03_10-03-08.wav,44100,16,60,1,ndsi,1024,1000,2000,2000,11000,0.701196819928447,NA 
rayol-farm2_2019-04-03_10-05-09.wav,44100,16,60,1,ndsi,1024,1000,2000,2000,11000,0.625881038237303,NA 
rayol-farm2_2019-04-03_10-07-09.wav,44100,16,60,1,ndsi,1024,1000,2000,2000,11000,0.686523360131798,NA 
rayol-farm2_2019-04-03_10-09-09.wav,44100,16,60,1,ndsi,1024,1000,2000,2000,11000,0.816761820201226,NA 
rayol-farm2_2019-04-03_10-11-09.wav,44100,16,60,1,ndsi,1024,1000,2000,2000,11000,0.835395620546461,NA 
rayol-farm2_2019-04-03_10-13-09.wav,44100,16,60,1,ndsi,1024,1000,2000,2000,11000,0.775865638667498,NA 
rayol-farm2_2019-04-03_10-15-09.wav,44100,16,60,1,ndsi,1024,1000,2000,2000,11000,0.861307676220329,NA 
rayol-farm2_2019-04-03_10-17-09.wav,44100,16,60,1,ndsi,1024,1000,2000,2000,11000,0.877387200851474,NA 
rayol-farm2_2019-04-03_10-19-09.wav,44100,16,60,1,ndsi,1024,1000,2000,2000,11000,0.885117777256034,NA 
rayol-farm2_2019-04-03_10-21-09.wav,44100,16,60,1,ndsi,1024,1000,2000,2000,11000,0.842946772503541,NA 
rayol-farm2_2019-04-03_10-23-10.wav,44100,16,60,1,ndsi,1024,1000,2000,2000,11000,0.843221346579683,NA 
rayol-farm2_2019-04-03_10-25-10.wav,44100,16,60,1,ndsi,1024,1000,2000,2000,11000,0.884176791719292,NA 
rayol-farm2_2019-04-03_10-27-10.wav,44100,16,60,1,ndsi,1024,1000,2000,2000,11000,0.861529095413983,NA 
rayol-farm2_2019-04-03_10-29-10.wav,44100,16,60,1,ndsi,1024,1000,2000,2000,11000,0.85988115279643,NA 
rayol-farm2_2019-04-03_10-31-10.wav,44100,16,60,1,ndsi,1024,1000,2000,2000,11000,0.124719367858048,NA 
rayol-farm2_2019-04-03_10-33-10.wav,44100,16,60,1,ndsi,1024,1000,2000,2000,11000,0.824279854075542,NA 
rayol-farm2_2019-04-03_10-35-10.wav,44100,16,60,1,ndsi,1024,1000,2000,2000,11000,0.877089898957249,NA 
rayol-farm2_2019-04-03_10-37-10.wav,44100,16,60,1,ndsi,1024,1000,2000,2000,11000,0.859978343932997,NA 
rayol-farm2_2019-04-03_10-39-11.wav,44100,16,60,1,ndsi,1024,1000,2000,2000,11000,0.702864252613988,NA 
rayol-farm2_2019-04-03_10-41-11.wav,44100,16,60,1,ndsi,1024,1000,2000,2000,11000,0.786809482870928,NA 
rayol-farm2_2019-04-03_10-43-11.wav,44100,16,60,1,ndsi,1024,1000,2000,2000,11000,0.49941274853683,NA 
rayol-farm2_2019-04-03_10-45-11.wav,44100,16,60,1,ndsi,1024,1000,2000,2000,11000,0.457324420897858,NA 
rayol-farm2_2019-04-03_10-47-11.wav,44100,16,60,1,ndsi,1024,1000,2000,2000,11000,0.45320041131535,NA 
rayol-farm2_2019-04-03_10-49-11.wav,44100,16,60,1,ndsi,1024,1000,2000,2000,11000,0.415771174694914,NA 
rayol-farm2_2019-04-03_10-51-11.wav,44100,16,60,1,ndsi,1024,1000,2000,2000,11000,0.387476286936466,NA 
rayol-farm2_2019-04-03_10-53-11.wav,44100,16,60,1,ndsi,1024,1000,2000,2000,11000,0.123634390556242,NA 
rayol-farm2_2019-04-03_10-55-12.wav,44100,16,60,1,ndsi,1024,1000,2000,2000,11000,0.496391390232893,NA 
rayol-farm2_2019-04-03_10-57-12.wav,44100,16,60,1,ndsi,1024,1000,2000,2000,11000,0.525925717310387,NA 
rayol-farm2_2019-04-03_10-59-12.wav,44100,16,60,1,ndsi,1024,1000,2000,2000,11000,0.364249499607006,NA 
rayol-farm2_2019-04-03_11-01-12.wav,44100,16,60,1,ndsi,1024,1000,2000,2000,11000,0.513650214244887,NA 
rayol-farm2_2019-04-03_11-03-12.wav,44100,16,60,1,ndsi,1024,1000,2000,2000,11000,0.288678034385242,NA 
rayol-farm2_2019-04-03_11-05-12.wav,44100,16,60,1,ndsi,1024,1000,2000,2000,11000,0.127375085284494,NA 
rayol-farm2_2019-04-03_11-07-12.wav,44100,16,60,1,ndsi,1024,1000,2000,2000,11000,0.681831367034659,NA 
rayol-farm2_2019-04-03_11-09-12.wav,44100,16,60,1,ndsi,1024,1000,2000,2000,11000,0.304098147888618,NA 
rayol-farm2_2019-04-03_11-11-13.wav,44100,16,60,1,ndsi,1024,1000,2000,2000,11000,0.118297239234169,NA 
rayol-farm2_2019-04-03_11-13-13.wav,44100,16,60,1,ndsi,1024,1000,2000,2000,11000,0.314972303360746,NA 
rayol-farm2_2019-04-03_11-15-13.wav,44100,16,60,1,ndsi,1024,1000,2000,2000,11000,0.444506174911196,NA 
rayol-farm2_2019-04-03_11-17-13.wav,44100,16,60,1,ndsi,1024,1000,2000,2000,11000,0.577474676901977,NA 
rayol-farm2_2019-04-03_11-19-13.wav,44100,16,60,1,ndsi,1024,1000,2000,2000,11000,0.525679086827053,NA 
rayol-farm2_2019-04-03_11-21-13.wav,44100,16,60,1,ndsi,1024,1000,2000,2000,11000,0.193648582909955,NA 
rayol-farm2_2019-04-03_11-23-13.wav,44100,16,60,1,ndsi,1024,1000,2000,2000,11000,0.508750608689097,NA 
rayol-farm2_2019-04-03_11-25-13.wav,44100,16,60,1,ndsi,1024,1000,2000,2000,11000,0.398603177666452,NA 
rayol-farm2_2019-04-03_11-27-13.wav,44100,16,60,1,ndsi,1024,1000,2000,2000,11000,0.457403059640766,NA 
rayol-farm2_2019-04-03_11-29-14.wav,44100,16,60,1,ndsi,1024,1000,2000,2000,11000,0.606331493385153,NA 
rayol-farm2_2019-04-03_11-31-14.wav,44100,16,60,1,ndsi,1024,1000,2000,2000,11000,0.426362126601639,NA 
rayol-farm2_2019-04-03_11-33-14.wav,44100,16,60,1,ndsi,1024,1000,2000,2000,11000,0.597761499674221,NA 
rayol-farm2_2019-04-03_11-35-14.wav,44100,16,60,1,ndsi,1024,1000,2000,2000,11000,0.869268403694021,NA 
rayol-farm2_2019-04-03_11-37-14.wav,44100,16,60,1,ndsi,1024,1000,2000,2000,11000,0.914865315755583,NA 
rayol-farm2_2019-04-03_11-39-14.wav,44100,16,60,1,ndsi,1024,1000,2000,2000,11000,0.906011026792682,NA 
rayol-farm2_2019-04-03_11-41-14.wav,44100,16,60,1,ndsi,1024,1000,2000,2000,11000,0.874291632718588,NA 
rayol-farm2_2019-04-03_11-43-14.wav,44100,16,60,1,ndsi,1024,1000,2000,2000,11000,0.875014515447656,NA 
rayol-farm2_2019-04-03_11-45-15.wav,44100,16,60,1,ndsi,1024,1000,2000,2000,11000,0.782398520297349,NA 
rayol-farm2_2019-04-03_11-47-15.wav,44100,16,60,1,ndsi,1024,1000,2000,2000,11000,0.076244468032424,NA 
rayol-farm2_2019-04-03_11-49-15.wav,44100,16,60,1,ndsi,1024,1000,2000,2000,11000,0.00118914476463966,NA 
rayol-farm2_2019-04-03_11-51-15.wav,44100,16,60,1,ndsi,1024,1000,2000,2000,11000,0.108076847200502,NA 
rayol-farm2_2019-04-03_11-53-15.wav,44100,16,60,1,ndsi,1024,1000,2000,2000,11000,0.280051235442589,NA 
rayol-farm2_2019-04-03_11-55-15.wav,44100,16,60,1,ndsi,1024,1000,2000,2000,11000,0.351480655986529,NA 
rayol-farm2_2019-04-03_11-57-15.wav,44100,16,60,1,ndsi,1024,1000,2000,2000,11000,0.422750732333915,NA 
rayol-farm2_2019-04-03_11-59-15.wav,44100,16,60,1,ndsi,1024,1000,2000,2000,11000,0.926592268399644,NA 
rayol-farm2_2019-04-03_12-01-16.wav,44100,16,60,1,ndsi,1024,1000,2000,2000,11000,0.898124055951514,NA 
rayol-farm2_2019-04-03_12-03-16.wav,44100,16,60,1,ndsi,1024,1000,2000,2000,11000,0.763428398861798,NA 
rayol-farm2_2019-04-03_12-05-16.wav,44100,16,60,1,ndsi,1024,1000,2000,2000,11000,0.855131080928814,NA 
rayol-farm2_2019-04-03_12-07-16.wav,44100,16,60,1,ndsi,1024,1000,2000,2000,11000,0.821850798661256,NA 
rayol-farm2_2019-04-03_12-09-16.wav,44100,16,60,1,ndsi,1024,1000,2000,2000,11000,0.863786031021078,NA 
rayol-farm2_2019-04-03_12-11-16.wav,44100,16,60,1,ndsi,1024,1000,2000,2000,11000,0.789196505840236,NA 
rayol-farm2_2019-04-03_12-13-16.wav,44100,16,60,1,ndsi,1024,1000,2000,2000,11000,0.817022694785971,NA 
rayol-farm2_2019-04-03_12-15-16.wav,44100,16,60,1,ndsi,1024,1000,2000,2000,11000,0.805405060628167,NA 
rayol-farm2_2019-04-03_12-17-17.wav,44100,16,60,1,ndsi,1024,1000,2000,2000,11000,0.826685220731367,NA 
rayol-farm2_2019-04-03_12-19-17.wav,44100,16,60,1,ndsi,1024,1000,2000,2000,11000,0.823801805474962,NA 
rayol-farm2_2019-04-03_12-21-17.wav,44100,16,60,1,ndsi,1024,1000,2000,2000,11000,0.875331431604871,NA 
rayol-farm2_2019-04-03_12-23-17.wav,44100,16,60,1,ndsi,1024,1000,2000,2000,11000,0.843580380701777,NA 
rayol-farm2_2019-04-03_12-25-17.wav,44100,16,60,1,ndsi,1024,1000,2000,2000,11000,0.815462028415963,NA 
rayol-farm2_2019-04-03_12-27-17.wav,44100,16,60,1,ndsi,1024,1000,2000,2000,11000,0.877274550674884,NA 
rayol-farm2_2019-04-03_12-29-17.wav,44100,16,60,1,ndsi,1024,1000,2000,2000,11000,0.897069847251214,NA 
rayol-farm2_2019-04-03_12-31-17.wav,44100,16,60,1,ndsi,1024,1000,2000,2000,11000,0.862396940566127,NA 
rayol-farm2_2019-04-03_12-33-17.wav,44100,16,60,1,ndsi,1024,1000,2000,2000,11000,0.861334379423862,NA 
rayol-farm2_2019-04-03_12-35-18.wav,44100,16,60,1,ndsi,1024,1000,2000,2000,11000,0.849816100434639,NA 
rayol-farm2_2019-04-03_12-37-18.wav,44100,16,60,1,ndsi,1024,1000,2000,2000,11000,0.890664866256437,NA 
rayol-farm2_2019-04-03_12-39-18.wav,44100,16,60,1,ndsi,1024,1000,2000,2000,11000,0.897007221105978,NA 
rayol-farm2_2019-04-03_12-41-18.wav,44100,16,60,1,ndsi,1024,1000,2000,2000,11000,0.905297611917142,NA 
rayol-farm2_2019-04-03_12-43-18.wav,44100,16,60,1,ndsi,1024,1000,2000,2000,11000,0.895607590028124,NA 
rayol-farm2_2019-04-03_12-45-18.wav,44100,16,60,1,ndsi,1024,1000,2000,2000,11000,0.917151729056575,NA 
rayol-farm2_2019-04-03_12-47-18.wav,44100,16,60,1,ndsi,1024,1000,2000,2000,11000,0.817422461078747,NA 
rayol-farm2_2019-04-03_12-49-18.wav,44100,16,60,1,ndsi,1024,1000,2000,2000,11000,0.789737000451811,NA 
rayol-farm2_2019-04-03_12-51-19.wav,44100,16,60,1,ndsi,1024,1000,2000,2000,11000,0.881810895897832,NA 
rayol-farm2_2019-04-03_12-53-19.wav,44100,16,60,1,ndsi,1024,1000,2000,2000,11000,0.895680559494236,NA 
rayol-farm2_2019-04-03_12-55-19.wav,44100,16,60,1,ndsi,1024,1000,2000,2000,11000,0.844553206184903,NA 
rayol-farm2_2019-04-03_12-57-19.wav,44100,16,60,1,ndsi,1024,1000,2000,2000,11000,0.900067667451222,NA 
rayol-farm2_2019-04-03_12-59-19.wav,44100,16,60,1,ndsi,1024,1000,2000,2000,11000,0.804227036352404,NA 
rayol-farm2_2019-04-03_13-01-19.wav,44100,16,60,1,ndsi,1024,1000,2000,2000,11000,0.600731601983814,NA 
rayol-farm2_2019-04-03_13-03-19.wav,44100,16,60,1,ndsi,1024,1000,2000,2000,11000,0.834351611313921,NA 
rayol-farm2_2019-04-03_13-05-19.wav,44100,16,60,1,ndsi,1024,1000,2000,2000,11000,0.322270046819489,NA 
rayol-farm2_2019-04-03_13-07-20.wav,44100,16,60,1,ndsi,1024,1000,2000,2000,11000,0.872914403724534,NA 
rayol-farm2_2019-04-03_13-09-20.wav,44100,16,60,1,ndsi,1024,1000,2000,2000,11000,0.698350238844878,NA 
rayol-farm2_2019-04-03_13-11-20.wav,44100,16,60,1,ndsi,1024,1000,2000,2000,11000,0.865502604397987,NA 
rayol-farm2_2019-04-03_13-13-20.wav,44100,16,60,1,ndsi,1024,1000,2000,2000,11000,0.888803900736202,NA 
rayol-farm2_2019-04-03_13-15-20.wav,44100,16,60,1,ndsi,1024,1000,2000,2000,11000,0.918384018371454,NA 
rayol-farm2_2019-04-03_13-17-20.wav,44100,16,60,1,ndsi,1024,1000,2000,2000,11000,0.674076824128636,NA 
rayol-farm2_2019-04-03_13-19-20.wav,44100,16,60,1,ndsi,1024,1000,2000,2000,11000,0.746912953739742,NA 
rayol-farm2_2019-04-03_13-21-20.wav,44100,16,60,1,ndsi,1024,1000,2000,2000,11000,0.842391697796347,NA 
rayol-farm2_2019-04-03_13-23-20.wav,44100,16,60,1,ndsi,1024,1000,2000,2000,11000,0.839095817546658,NA 
rayol-farm2_2019-04-03_13-25-21.wav,44100,16,60,1,ndsi,1024,1000,2000,2000,11000,0.880067264830304,NA 
rayol-farm2_2019-04-03_13-27-21.wav,44100,16,60,1,ndsi,1024,1000,2000,2000,11000,0.879658444752048,NA 
rayol-farm2_2019-04-03_13-29-21.wav,44100,16,60,1,ndsi,1024,1000,2000,2000,11000,0.893352436053925,NA 
rayol-farm2_2019-04-03_13-31-21.wav,44100,16,60,1,ndsi,1024,1000,2000,2000,11000,0.842435881700233,NA 
rayol-farm2_2019-04-03_13-33-21.wav,44100,16,60,1,ndsi,1024,1000,2000,2000,11000,0.338865536611921,NA 
rayol-farm2_2019-04-03_13-35-21.wav,44100,16,60,1,ndsi,1024,1000,2000,2000,11000,0.44376570824302,NA 
rayol-farm2_2019-04-03_13-37-21.wav,44100,16,60,1,ndsi,1024,1000,2000,2000,11000,0.381392088451257,NA 
rayol-farm2_2019-04-03_13-39-21.wav,44100,16,60,1,ndsi,1024,1000,2000,2000,11000,0.458003363481533,NA 
rayol-farm2_2019-04-03_13-41-22.wav,44100,16,60,1,ndsi,1024,1000,2000,2000,11000,0.349784907201272,NA 
rayol-farm2_2019-04-03_13-43-22.wav,44100,16,60,1,ndsi,1024,1000,2000,2000,11000,0.34813228142994,NA 
rayol-farm2_2019-04-03_13-45-22.wav,44100,16,60,1,ndsi,1024,1000,2000,2000,11000,0.569901520641496,NA 
rayol-farm2_2019-04-03_13-47-22.wav,44100,16,60,1,ndsi,1024,1000,2000,2000,11000,0.521896974154132,NA 
rayol-farm2_2019-04-03_13-49-22.wav,44100,16,60,1,ndsi,1024,1000,2000,2000,11000,0.468120112000545,NA 
rayol-farm2_2019-04-03_13-51-22.wav,44100,16,60,1,ndsi,1024,1000,2000,2000,11000,0.49767271602273,NA 
rayol-farm2_2019-04-03_13-53-22.wav,44100,16,60,1,ndsi,1024,1000,2000,2000,11000,0.40543272628623,NA 
rayol-farm2_2019-04-03_13-55-22.wav,44100,16,60,1,ndsi,1024,1000,2000,2000,11000,0.37218386123025,NA 
rayol-farm2_2019-04-03_13-57-22.wav,44100,16,60,1,ndsi,1024,1000,2000,2000,11000,0.417251512589147,NA 
rayol-farm2_2019-04-03_13-59-23.wav,44100,16,60,1,ndsi,1024,1000,2000,2000,11000,0.306511605812677,NA 
rayol-farm2_2019-04-03_14-01-23.wav,44100,16,60,1,ndsi,1024,1000,2000,2000,11000,0.492785020134168,NA 
rayol-farm2_2019-04-03_14-03-23.wav,44100,16,60,1,ndsi,1024,1000,2000,2000,11000,0.592675821321333,NA 
rayol-farm2_2019-04-03_14-05-23.wav,44100,16,60,1,ndsi,1024,1000,2000,2000,11000,0.620400101498275,NA 
rayol-farm2_2019-04-03_14-07-23.wav,44100,16,60,1,ndsi,1024,1000,2000,2000,11000,0.350605004834329,NA 
rayol-farm2_2019-04-03_14-09-23.wav,44100,16,60,1,ndsi,1024,1000,2000,2000,11000,0.606550884437012,NA 
rayol-farm2_2019-04-03_14-11-23.wav,44100,16,60,1,ndsi,1024,1000,2000,2000,11000,0.360722884039625,NA 
rayol-farm2_2019-04-03_14-13-23.wav,44100,16,60,1,ndsi,1024,1000,2000,2000,11000,0.503668776493789,NA 
rayol-farm2_2019-04-03_14-15-24.wav,44100,16,60,1,ndsi,1024,1000,2000,2000,11000,0.57183412348512,NA 
rayol-farm2_2019-04-03_14-17-24.wav,44100,16,60,1,ndsi,1024,1000,2000,2000,11000,0.533535552602124,NA 
rayol-farm2_2019-04-03_14-19-24.wav,44100,16,60,1,ndsi,1024,1000,2000,2000,11000,0.49361527242101,NA 
rayol-farm2_2019-04-03_14-21-24.wav,44100,16,60,1,ndsi,1024,1000,2000,2000,11000,0.478596674094589,NA 
rayol-farm2_2019-04-03_14-23-24.wav,44100,16,60,1,ndsi,1024,1000,2000,2000,11000,-0.0365050603256208,NA 
rayol-farm2_2019-04-03_14-25-24.wav,44100,16,60,1,ndsi,1024,1000,2000,2000,11000,0.0705076644165118,NA 
rayol-farm2_2019-04-03_14-27-24.wav,44100,16,60,1,ndsi,1024,1000,2000,2000,11000,0.429065986910873,NA 
rayol-farm2_2019-04-03_14-29-24.wav,44100,16,60,1,ndsi,1024,1000,2000,2000,11000,0.633283529718358,NA 
rayol-farm2_2019-04-03_14-31-25.wav,44100,16,60,1,ndsi,1024,1000,2000,2000,11000,0.734129195830436,NA 
rayol-farm2_2019-04-03_14-33-25.wav,44100,16,60,1,ndsi,1024,1000,2000,2000,11000,0.661848086138248,NA 
rayol-farm2_2019-04-03_14-35-25.wav,44100,16,60,1,ndsi,1024,1000,2000,2000,11000,0.640268614752501,NA 
rayol-farm2_2019-04-03_14-37-25.wav,44100,16,60,1,ndsi,1024,1000,2000,2000,11000,0.665340825163927,NA 
rayol-farm2_2019-04-03_14-39-25.wav,44100,16,60,1,ndsi,1024,1000,2000,2000,11000,0.326463817036982,NA 
rayol-farm2_2019-04-03_14-41-25.wav,44100,16,60,1,ndsi,1024,1000,2000,2000,11000,0.6051987619847,NA 
rayol-farm2_2019-04-03_14-43-25.wav,44100,16,60,1,ndsi,1024,1000,2000,2000,11000,0.60396175809724,NA 
rayol-farm2_2019-04-03_14-45-25.wav,44100,16,60,1,ndsi,1024,1000,2000,2000,11000,-0.108675428470108,NA 
rayol-farm2_2019-04-03_14-47-26.wav,44100,16,60,1,ndsi,1024,1000,2000,2000,11000,0.584172055054236,NA 
rayol-farm2_2019-04-03_14-49-26.wav,44100,16,60,1,ndsi,1024,1000,2000,2000,11000,0.472508796227683,NA 
rayol-farm2_2019-04-03_14-51-26.wav,44100,16,60,1,ndsi,1024,1000,2000,2000,11000,0.559676507061959,NA 
rayol-farm2_2019-04-03_14-53-26.wav,44100,16,60,1,ndsi,1024,1000,2000,2000,11000,0.535228411238466,NA 
rayol-farm2_2019-04-03_14-55-26.wav,44100,16,60,1,ndsi,1024,1000,2000,2000,11000,0.678888102826022,NA 
rayol-farm2_2019-04-03_14-57-26.wav,44100,16,60,1,ndsi,1024,1000,2000,2000,11000,0.723884815498734,NA 
rayol-farm2_2019-04-03_14-59-26.wav,44100,16,60,1,ndsi,1024,1000,2000,2000,11000,0.716908962236031,NA 
rayol-farm2_2019-04-03_15-01-26.wav,44100,16,60,1,ndsi,1024,1000,2000,2000,11000,0.635309892023386,NA 
rayol-farm2_2019-04-03_15-03-26.wav,44100,16,60,1,ndsi,1024,1000,2000,2000,11000,0.779642642927491,NA 
rayol-farm2_2019-04-03_15-05-27.wav,44100,16,60,1,ndsi,1024,1000,2000,2000,11000,0.772470908033685,NA 
rayol-farm2_2019-04-03_15-07-27.wav,44100,16,60,1,ndsi,1024,1000,2000,2000,11000,0.509349221774942,NA 
rayol-farm2_2019-04-03_15-09-27.wav,44100,16,60,1,ndsi,1024,1000,2000,2000,11000,0.649400877985309,NA 
rayol-farm2_2019-04-03_15-11-27.wav,44100,16,60,1,ndsi,1024,1000,2000,2000,11000,0.772870152953987,NA 
rayol-farm2_2019-04-03_15-13-27.wav,44100,16,60,1,ndsi,1024,1000,2000,2000,11000,0.658917906024201,NA 
rayol-farm2_2019-04-03_15-15-27.wav,44100,16,60,1,ndsi,1024,1000,2000,2000,11000,0.737509913339764,NA 
rayol-farm2_2019-04-03_15-17-27.wav,44100,16,60,1,ndsi,1024,1000,2000,2000,11000,0.655849558343295,NA 
rayol-farm2_2019-04-03_15-19-27.wav,44100,16,60,1,ndsi,1024,1000,2000,2000,11000,0.815417081789172,NA 
rayol-farm2_2019-04-03_15-21-28.wav,44100,16,60,1,ndsi,1024,1000,2000,2000,11000,0.835445551077354,NA 
rayol-farm2_2019-04-03_15-23-28.wav,44100,16,60,1,ndsi,1024,1000,2000,2000,11000,0.797542742628239,NA 
rayol-farm2_2019-04-03_15-25-28.wav,44100,16,60,1,ndsi,1024,1000,2000,2000,11000,0.839241371024498,NA 
rayol-farm2_2019-04-03_15-27-28.wav,44100,16,60,1,ndsi,1024,1000,2000,2000,11000,0.818826476596556,NA 
rayol-farm2_2019-04-03_15-29-28.wav,44100,16,60,1,ndsi,1024,1000,2000,2000,11000,-0.18759417030262,NA 
rayol-farm2_2019-04-03_15-31-28.wav,44100,16,60,1,ndsi,1024,1000,2000,2000,11000,0.809000424674355,NA 
rayol-farm2_2019-04-03_15-33-28.wav,44100,16,60,1,ndsi,1024,1000,2000,2000,11000,0.751796105938708,NA 
rayol-farm2_2019-04-03_15-35-28.wav,44100,16,60,1,ndsi,1024,1000,2000,2000,11000,0.782981416404446,NA 
rayol-farm2_2019-04-03_15-37-29.wav,44100,16,60,1,ndsi,1024,1000,2000,2000,11000,0.807949322647369,NA 
rayol-farm2_2019-04-03_15-39-29.wav,44100,16,60,1,ndsi,1024,1000,2000,2000,11000,0.721519114589714,NA 
rayol-farm2_2019-04-03_15-41-29.wav,44100,16,60,1,ndsi,1024,1000,2000,2000,11000,0.764410627247782,NA 
rayol-farm2_2019-04-03_15-43-29.wav,44100,16,60,1,ndsi,1024,1000,2000,2000,11000,0.857929773157465,NA 
rayol-farm2_2019-04-03_15-45-29.wav,44100,16,60,1,ndsi,1024,1000,2000,2000,11000,0.842242012072118,NA 
rayol-farm2_2019-04-03_15-47-29.wav,44100,16,60,1,ndsi,1024,1000,2000,2000,11000,0.844740674962857,NA 
rayol-farm2_2019-04-03_15-49-29.wav,44100,16,60,1,ndsi,1024,1000,2000,2000,11000,0.733620245284708,NA 
rayol-farm2_2019-04-03_15-51-29.wav,44100,16,60,1,ndsi,1024,1000,2000,2000,11000,0.52248809193431,NA 
rayol-farm2_2019-04-03_15-53-29.wav,44100,16,60,1,ndsi,1024,1000,2000,2000,11000,0.413499118335475,NA 
rayol-farm2_2019-04-03_15-55-30.wav,44100,16,60,1,ndsi,1024,1000,2000,2000,11000,0.806461702724805,NA 
rayol-farm2_2019-04-03_15-57-30.wav,44100,16,60,1,ndsi,1024,1000,2000,2000,11000,0.465837550308241,NA 
rayol-farm2_2019-04-03_15-59-30.wav,44100,16,60,1,ndsi,1024,1000,2000,2000,11000,0.768644128555888,NA 
rayol-farm2_2019-04-03_16-01-30.wav,44100,16,60,1,ndsi,1024,1000,2000,2000,11000,0.793609622268498,NA 
rayol-farm2_2019-04-03_16-03-30.wav,44100,16,60,1,ndsi,1024,1000,2000,2000,11000,0.331924847784687,NA 
rayol-farm2_2019-04-03_16-05-30.wav,44100,16,60,1,ndsi,1024,1000,2000,2000,11000,0.803070188926073,NA 
rayol-farm2_2019-04-03_16-07-30.wav,44100,16,60,1,ndsi,1024,1000,2000,2000,11000,0.794402307014693,NA 
rayol-farm2_2019-04-03_16-09-30.wav,44100,16,60,1,ndsi,1024,1000,2000,2000,11000,0.790801559920072,NA 
rayol-farm2_2019-04-03_16-11-31.wav,44100,16,60,1,ndsi,1024,1000,2000,2000,11000,0.846687407926842,NA 
rayol-farm2_2019-04-03_16-13-31.wav,44100,16,60,1,ndsi,1024,1000,2000,2000,11000,0.758212277061215,NA 
rayol-farm2_2019-04-03_16-15-31.wav,44100,16,60,1,ndsi,1024,1000,2000,2000,11000,0.842708369598965,NA 
rayol-farm2_2019-04-03_16-17-31.wav,44100,16,60,1,ndsi,1024,1000,2000,2000,11000,0.816711111209242,NA 
rayol-farm2_2019-04-03_16-19-31.wav,44100,16,60,1,ndsi,1024,1000,2000,2000,11000,0.804102617265861,NA 
rayol-farm2_2019-04-03_16-21-31.wav,44100,16,60,1,ndsi,1024,1000,2000,2000,11000,0.812235541439704,NA 
rayol-farm2_2019-04-03_16-23-31.wav,44100,16,60,1,ndsi,1024,1000,2000,2000,11000,0.81638254972118,NA 
rayol-farm2_2019-04-03_16-25-31.wav,44100,16,60,1,ndsi,1024,1000,2000,2000,11000,0.802579334440263,NA 
rayol-farm2_2019-04-03_16-27-32.wav,44100,16,60,1,ndsi,1024,1000,2000,2000,11000,0.794330370573238,NA 
rayol-farm2_2019-04-03_16-29-32.wav,44100,16,60,1,ndsi,1024,1000,2000,2000,11000,0.77554265534993,NA 
rayol-farm2_2019-04-03_16-31-32.wav,44100,16,60,1,ndsi,1024,1000,2000,2000,11000,0.781042396283723,NA 
rayol-farm2_2019-04-03_16-33-32.wav,44100,16,60,1,ndsi,1024,1000,2000,2000,11000,0.724814934124089,NA 
rayol-farm2_2019-04-03_16-35-32.wav,44100,16,60,1,ndsi,1024,1000,2000,2000,11000,0.737676929634047,NA 
rayol-farm2_2019-04-03_16-37-32.wav,44100,16,60,1,ndsi,1024,1000,2000,2000,11000,0.816028254167649,NA 
rayol-farm2_2019-04-03_16-39-32.wav,44100,16,60,1,ndsi,1024,1000,2000,2000,11000,0.708006566934315,NA 
rayol-farm2_2019-04-03_16-41-32.wav,44100,16,60,1,ndsi,1024,1000,2000,2000,11000,0.694455980991226,NA 
rayol-farm2_2019-04-03_16-43-33.wav,44100,16,60,1,ndsi,1024,1000,2000,2000,11000,0.684028058002237,NA 
rayol-farm2_2019-04-03_16-45-33.wav,44100,16,60,1,ndsi,1024,1000,2000,2000,11000,0.72398516461748,NA 
rayol-farm2_2019-04-03_16-47-33.wav,44100,16,60,1,ndsi,1024,1000,2000,2000,11000,0.654835900410297,NA 
rayol-farm2_2019-04-03_16-49-33.wav,44100,16,60,1,ndsi,1024,1000,2000,2000,11000,0.655287503297322,NA 
rayol-farm2_2019-04-03_16-51-33.wav,44100,16,60,1,ndsi,1024,1000,2000,2000,11000,0.686286971379889,NA 
rayol-farm2_2019-04-03_16-53-33.wav,44100,16,60,1,ndsi,1024,1000,2000,2000,11000,0.759621060700215,NA 
rayol-farm2_2019-04-03_16-55-33.wav,44100,16,60,1,ndsi,1024,1000,2000,2000,11000,0.698691151990965,NA 
rayol-farm2_2019-04-03_16-57-33.wav,44100,16,60,1,ndsi,1024,1000,2000,2000,11000,0.726968417355449,NA 
rayol-farm2_2019-04-03_16-59-33.wav,44100,16,60,1,ndsi,1024,1000,2000,2000,11000,0.734016014103313,NA 
rayol-farm2_2019-04-03_17-01-34.wav,44100,16,60,1,ndsi,1024,1000,2000,2000,11000,0.64443638467978,NA 
rayol-farm2_2019-04-03_17-03-34.wav,44100,16,60,1,ndsi,1024,1000,2000,2000,11000,0.651348171709411,NA 
rayol-farm2_2019-04-03_17-05-34.wav,44100,16,60,1,ndsi,1024,1000,2000,2000,11000,0.645407527025607,NA 
rayol-farm2_2019-04-03_17-07-34.wav,44100,16,60,1,ndsi,1024,1000,2000,2000,11000,0.688736394051983,NA 
rayol-farm2_2019-04-03_17-09-34.wav,44100,16,60,1,ndsi,1024,1000,2000,2000,11000,0.720918740412846,NA 
rayol-farm2_2019-04-03_17-11-34.wav,44100,16,60,1,ndsi,1024,1000,2000,2000,11000,0.681635930134978,NA 
rayol-farm2_2019-04-03_17-13-34.wav,44100,16,60,1,ndsi,1024,1000,2000,2000,11000,0.731287177151456,NA 
rayol-farm2_2019-04-03_17-15-34.wav,44100,16,60,1,ndsi,1024,1000,2000,2000,11000,0.765400127875391,NA 
rayol-farm2_2019-04-03_17-17-35.wav,44100,16,60,1,ndsi,1024,1000,2000,2000,11000,0.773073147497412,NA 
rayol-farm2_2019-04-03_17-19-35.wav,44100,16,60,1,ndsi,1024,1000,2000,2000,11000,0.771908614930394,NA 
rayol-farm2_2019-04-03_17-21-35.wav,44100,16,60,1,ndsi,1024,1000,2000,2000,11000,0.768226288334709,NA 
rayol-farm2_2019-04-03_17-23-35.wav,44100,16,60,1,ndsi,1024,1000,2000,2000,11000,0.728452602932947,NA 
rayol-farm2_2019-04-03_17-25-35.wav,44100,16,60,1,ndsi,1024,1000,2000,2000,11000,0.764936646846841,NA 
rayol-farm2_2019-04-03_17-27-35.wav,44100,16,60,1,ndsi,1024,1000,2000,2000,11000,0.724423226587971,NA 
rayol-farm2_2019-04-03_17-29-35.wav,44100,16,60,1,ndsi,1024,1000,2000,2000,11000,0.776869269753959,NA 
rayol-farm2_2019-04-03_17-31-35.wav,44100,16,60,1,ndsi,1024,1000,2000,2000,11000,0.796189730537365,NA 
rayol-farm2_2019-04-03_17-33-35.wav,44100,16,60,1,ndsi,1024,1000,2000,2000,11000,0.734640819639645,NA 
rayol-farm2_2019-04-03_17-35-36.wav,44100,16,60,1,ndsi,1024,1000,2000,2000,11000,0.786231307735317,NA 
rayol-farm2_2019-04-03_17-37-36.wav,44100,16,60,1,ndsi,1024,1000,2000,2000,11000,0.800293392558829,NA 
rayol-farm2_2019-04-03_17-39-36.wav,44100,16,60,1,ndsi,1024,1000,2000,2000,11000,0.805953662969642,NA 
rayol-farm2_2019-04-03_17-41-36.wav,44100,16,60,1,ndsi,1024,1000,2000,2000,11000,0.794573599593491,NA 
rayol-farm2_2019-04-03_17-43-36.wav,44100,16,60,1,ndsi,1024,1000,2000,2000,11000,0.798930702974543,NA 
rayol-farm2_2019-04-03_17-45-36.wav,44100,16,60,1,ndsi,1024,1000,2000,2000,11000,0.791660935879606,NA 
rayol-farm2_2019-04-03_17-47-36.wav,44100,16,60,1,ndsi,1024,1000,2000,2000,11000,0.769554506189016,NA 
rayol-farm2_2019-04-03_17-49-36.wav,44100,16,60,1,ndsi,1024,1000,2000,2000,11000,0.794228295452354,NA 
rayol-farm2_2019-04-03_17-51-37.wav,44100,16,60,1,ndsi,1024,1000,2000,2000,11000,0.779567977453039,NA 
rayol-farm2_2019-04-03_17-53-37.wav,44100,16,60,1,ndsi,1024,1000,2000,2000,11000,0.789634830906792,NA 
rayol-farm2_2019-04-03_17-55-37.wav,44100,16,60,1,ndsi,1024,1000,2000,2000,11000,0.801057884502574,NA 
rayol-farm2_2019-04-03_17-57-37.wav,44100,16,60,1,ndsi,1024,1000,2000,2000,11000,0.789843927509404,NA 
rayol-farm2_2019-04-03_17-59-37.wav,44100,16,60,1,ndsi,1024,1000,2000,2000,11000,0.802417939610792,NA 
rayol-farm2_2019-04-03_18-01-37.wav,44100,16,60,1,ndsi,1024,1000,2000,2000,11000,0.826631324594789,NA 
rayol-farm2_2019-04-03_18-03-37.wav,44100,16,60,1,ndsi,1024,1000,2000,2000,11000,0.889158298409524,NA 
rayol-farm2_2019-04-03_18-05-37.wav,44100,16,60,1,ndsi,1024,1000,2000,2000,11000,0.713129983071494,NA 
rayol-farm2_2019-04-03_18-07-38.wav,44100,16,60,1,ndsi,1024,1000,2000,2000,11000,0.844877738331447,NA 
rayol-farm2_2019-04-03_18-09-38.wav,44100,16,60,1,ndsi,1024,1000,2000,2000,11000,0.834746016422143,NA 
rayol-farm2_2019-04-03_18-11-38.wav,44100,16,60,1,ndsi,1024,1000,2000,2000,11000,0.843387849686436,NA 
rayol-farm2_2019-04-03_18-13-38.wav,44100,16,60,1,ndsi,1024,1000,2000,2000,11000,0.861999785159792,NA 
rayol-farm2_2019-04-03_18-15-38.wav,44100,16,60,1,ndsi,1024,1000,2000,2000,11000,0.797030318648681,NA 
rayol-farm2_2019-04-03_18-17-38.wav,44100,16,60,1,ndsi,1024,1000,2000,2000,11000,0.768988711238253,NA 
rayol-farm2_2019-04-03_18-19-38.wav,44100,16,60,1,ndsi,1024,1000,2000,2000,11000,0.814936198533313,NA 
rayol-farm2_2019-04-03_18-21-38.wav,44100,16,60,1,ndsi,1024,1000,2000,2000,11000,0.786585750659658,NA 
rayol-farm2_2019-04-03_18-23-38.wav,44100,16,60,1,ndsi,1024,1000,2000,2000,11000,0.807009412512046,NA 
rayol-farm2_2019-04-03_18-25-39.wav,44100,16,60,1,ndsi,1024,1000,2000,2000,11000,0.753812256558767,NA 
rayol-farm2_2019-04-03_18-27-39.wav,44100,16,60,1,ndsi,1024,1000,2000,2000,11000,0.825691741478145,NA 
rayol-farm2_2019-04-03_18-29-39.wav,44100,16,60,1,ndsi,1024,1000,2000,2000,11000,0.849248930306187,NA 
rayol-farm2_2019-04-03_18-31-39.wav,44100,16,60,1,ndsi,1024,1000,2000,2000,11000,0.794995700581548,NA 
rayol-farm2_2019-04-03_18-33-39.wav,44100,16,60,1,ndsi,1024,1000,2000,2000,11000,0.77241247571835,NA 
rayol-farm2_2019-04-03_18-35-39.wav,44100,16,60,1,ndsi,1024,1000,2000,2000,11000,0.760439797132894,NA 
rayol-farm2_2019-04-03_18-37-39.wav,44100,16,60,1,ndsi,1024,1000,2000,2000,11000,0.789786167097799,NA 
rayol-farm2_2019-04-03_18-39-39.wav,44100,16,60,1,ndsi,1024,1000,2000,2000,11000,0.818865298650725,NA 
rayol-farm2_2019-04-03_18-41-40.wav,44100,16,60,1,ndsi,1024,1000,2000,2000,11000,0.808330319626251,NA 
rayol-farm2_2019-04-03_18-43-40.wav,44100,16,60,1,ndsi,1024,1000,2000,2000,11000,0.835928712741337,NA 
rayol-farm2_2019-04-03_18-45-40.wav,44100,16,60,1,ndsi,1024,1000,2000,2000,11000,0.836397104354308,NA 
rayol-farm2_2019-04-03_18-47-40.wav,44100,16,60,1,ndsi,1024,1000,2000,2000,11000,0.877887273727211,NA 
rayol-farm2_2019-04-03_18-49-40.wav,44100,16,60,1,ndsi,1024,1000,2000,2000,11000,0.861960766839111,NA 
rayol-farm2_2019-04-03_18-51-40.wav,44100,16,60,1,ndsi,1024,1000,2000,2000,11000,0.870692570949303,NA 
rayol-farm2_2019-04-03_18-53-40.wav,44100,16,60,1,ndsi,1024,1000,2000,2000,11000,0.87523987768444,NA 
rayol-farm2_2019-04-03_18-55-40.wav,44100,16,60,1,ndsi,1024,1000,2000,2000,11000,0.876055950833911,NA 
rayol-farm2_2019-04-03_18-57-41.wav,44100,16,60,1,ndsi,1024,1000,2000,2000,11000,0.870911310555936,NA 
rayol-farm2_2019-04-03_18-59-41.wav,44100,16,60,1,ndsi,1024,1000,2000,2000,11000,0.863733901948891,NA 
rayol-farm2_2019-04-03_19-01-41.wav,44100,16,60,1,ndsi,1024,1000,2000,2000,11000,0.914442122506289,NA 
rayol-farm2_2019-04-03_19-03-41.wav,44100,16,60,1,ndsi,1024,1000,2000,2000,11000,0.849355168283187,NA 
rayol-farm2_2019-04-03_19-05-41.wav,44100,16,60,1,ndsi,1024,1000,2000,2000,11000,0.896606771112208,NA 
rayol-farm2_2019-04-03_19-07-41.wav,44100,16,60,1,ndsi,1024,1000,2000,2000,11000,0.907078145331236,NA 
rayol-farm2_2019-04-03_19-09-41.wav,44100,16,60,1,ndsi,1024,1000,2000,2000,11000,0.883013615496294,NA 
rayol-farm2_2019-04-03_19-11-41.wav,44100,16,60,1,ndsi,1024,1000,2000,2000,11000,0.907547235591848,NA 
rayol-farm2_2019-04-03_19-13-42.wav,44100,16,60,1,ndsi,1024,1000,2000,2000,11000,0.841940353155817,NA 
rayol-farm2_2019-04-03_19-15-42.wav,44100,16,60,1,ndsi,1024,1000,2000,2000,11000,0.803001790224206,NA 
rayol-farm2_2019-04-03_19-17-42.wav,44100,16,60,1,ndsi,1024,1000,2000,2000,11000,0.815022800191462,NA 
rayol-farm2_2019-04-03_19-19-42.wav,44100,16,60,1,ndsi,1024,1000,2000,2000,11000,0.781295771161134,NA 
rayol-farm2_2019-04-03_19-21-42.wav,44100,16,60,1,ndsi,1024,1000,2000,2000,11000,0.768076133061327,NA 
rayol-farm2_2019-04-03_19-23-42.wav,44100,16,60,1,ndsi,1024,1000,2000,2000,11000,0.735429793470082,NA 
rayol-farm2_2019-04-03_19-25-42.wav,44100,16,60,1,ndsi,1024,1000,2000,2000,11000,0.827868173130821,NA 
rayol-farm2_2019-04-03_19-27-42.wav,44100,16,60,1,ndsi,1024,1000,2000,2000,11000,0.829026326647113,NA 
rayol-farm2_2019-04-03_19-29-42.wav,44100,16,60,1,ndsi,1024,1000,2000,2000,11000,0.864144317412415,NA 
rayol-farm2_2019-04-03_19-31-43.wav,44100,16,60,1,ndsi,1024,1000,2000,2000,11000,0.845823058458626,NA 
rayol-farm2_2019-04-03_19-33-43.wav,44100,16,60,1,ndsi,1024,1000,2000,2000,11000,0.87335107347475,NA 
rayol-farm2_2019-04-03_19-35-43.wav,44100,16,60,1,ndsi,1024,1000,2000,2000,11000,0.857382108526112,NA 
rayol-farm2_2019-04-03_19-37-43.wav,44100,16,60,1,ndsi,1024,1000,2000,2000,11000,0.833213945929507,NA 
rayol-farm2_2019-04-03_19-39-43.wav,44100,16,60,1,ndsi,1024,1000,2000,2000,11000,0.861801407138417,NA 
rayol-farm2_2019-04-03_19-41-43.wav,44100,16,60,1,ndsi,1024,1000,2000,2000,11000,0.889430375045034,NA 
rayol-farm2_2019-04-03_19-43-43.wav,44100,16,60,1,ndsi,1024,1000,2000,2000,11000,0.874448986440749,NA 
rayol-farm2_2019-04-03_19-45-43.wav,44100,16,60,1,ndsi,1024,1000,2000,2000,11000,0.858756233781363,NA 
rayol-farm2_2019-04-03_19-47-44.wav,44100,16,60,1,ndsi,1024,1000,2000,2000,11000,0.860560419382245,NA 
rayol-farm2_2019-04-03_19-49-44.wav,44100,16,60,1,ndsi,1024,1000,2000,2000,11000,0.865539620985565,NA 
rayol-farm2_2019-04-03_19-51-44.wav,44100,16,60,1,ndsi,1024,1000,2000,2000,11000,0.863263068866998,NA 
rayol-farm2_2019-04-03_19-53-44.wav,44100,16,60,1,ndsi,1024,1000,2000,2000,11000,0.876089513421021,NA 
rayol-farm2_2019-04-03_19-55-44.wav,44100,16,60,1,ndsi,1024,1000,2000,2000,11000,0.876773443898318,NA 
rayol-farm2_2019-04-03_19-57-44.wav,44100,16,60,1,ndsi,1024,1000,2000,2000,11000,0.875167923989043,NA 
rayol-farm2_2019-04-03_19-59-44.wav,44100,16,60,1,ndsi,1024,1000,2000,2000,11000,0.875335429923197,NA 
rayol-farm2_2019-04-03_20-01-44.wav,44100,16,60,1,ndsi,1024,1000,2000,2000,11000,0.881720456958797,NA 
rayol-farm2_2019-04-03_20-03-45.wav,44100,16,60,1,ndsi,1024,1000,2000,2000,11000,0.882848921121868,NA 
rayol-farm2_2019-04-03_20-05-45.wav,44100,16,60,1,ndsi,1024,1000,2000,2000,11000,0.881375929834274,NA 
rayol-farm2_2019-04-03_20-07-45.wav,44100,16,60,1,ndsi,1024,1000,2000,2000,11000,0.890778574666135,NA 
rayol-farm2_2019-04-03_20-09-45.wav,44100,16,60,1,ndsi,1024,1000,2000,2000,11000,0.884209139337024,NA 
rayol-farm2_2019-04-03_20-11-45.wav,44100,16,60,1,ndsi,1024,1000,2000,2000,11000,0.88671449881225,NA 
rayol-farm2_2019-04-03_20-13-45.wav,44100,16,60,1,ndsi,1024,1000,2000,2000,11000,0.890030694962808,NA 
rayol-farm2_2019-04-03_20-15-45.wav,44100,16,60,1,ndsi,1024,1000,2000,2000,11000,0.884326857239279,NA 
rayol-farm2_2019-04-03_20-17-45.wav,44100,16,60,1,ndsi,1024,1000,2000,2000,11000,0.891642765539985,NA 
rayol-farm2_2019-04-03_20-19-45.wav,44100,16,60,1,ndsi,1024,1000,2000,2000,11000,0.915905545771531,NA 
rayol-farm2_2019-04-03_20-21-46.wav,44100,16,60,1,ndsi,1024,1000,2000,2000,11000,0.946566237342052,NA 
rayol-farm2_2019-04-03_20-23-46.wav,44100,16,60,1,ndsi,1024,1000,2000,2000,11000,0.902380234570142,NA 
rayol-farm2_2019-04-03_20-25-46.wav,44100,16,60,1,ndsi,1024,1000,2000,2000,11000,0.879251796421377,NA 
rayol-farm2_2019-04-03_20-27-46.wav,44100,16,60,1,ndsi,1024,1000,2000,2000,11000,0.882870158979327,NA 
rayol-farm2_2019-04-03_20-29-46.wav,44100,16,60,1,ndsi,1024,1000,2000,2000,11000,0.879134010907035,NA 
rayol-farm2_2019-04-03_20-31-46.wav,44100,16,60,1,ndsi,1024,1000,2000,2000,11000,0.87442755391811,NA 
rayol-farm2_2019-04-03_20-33-46.wav,44100,16,60,1,ndsi,1024,1000,2000,2000,11000,0.88141304834597,NA 
rayol-farm2_2019-04-03_20-35-46.wav,44100,16,60,1,ndsi,1024,1000,2000,2000,11000,0.871879949148903,NA 
rayol-farm2_2019-04-03_20-37-47.wav,44100,16,60,1,ndsi,1024,1000,2000,2000,11000,0.876923699008558,NA 
rayol-farm2_2019-04-03_20-39-47.wav,44100,16,60,1,ndsi,1024,1000,2000,2000,11000,0.884154513903051,NA 
rayol-farm2_2019-04-03_20-41-47.wav,44100,16,60,1,ndsi,1024,1000,2000,2000,11000,0.881103258445331,NA 
rayol-farm2_2019-04-03_20-43-47.wav,44100,16,60,1,ndsi,1024,1000,2000,2000,11000,0.882580677556785,NA 
rayol-farm2_2019-04-03_20-45-47.wav,44100,16,60,1,ndsi,1024,1000,2000,2000,11000,0.886732837984559,NA 
rayol-farm2_2019-04-03_20-47-47.wav,44100,16,60,1,ndsi,1024,1000,2000,2000,11000,0.883367168807149,NA 
rayol-farm2_2019-04-03_20-49-47.wav,44100,16,60,1,ndsi,1024,1000,2000,2000,11000,0.869664819625938,NA 
rayol-farm2_2019-04-03_20-51-47.wav,44100,16,60,1,ndsi,1024,1000,2000,2000,11000,0.833698159834719,NA 
rayol-farm2_2019-04-03_20-53-48.wav,44100,16,60,1,ndsi,1024,1000,2000,2000,11000,0.754644718843244,NA 
rayol-farm2_2019-04-03_20-55-48.wav,44100,16,60,1,ndsi,1024,1000,2000,2000,11000,0.763712407138988,NA 
rayol-farm2_2019-04-03_20-57-48.wav,44100,16,60,1,ndsi,1024,1000,2000,2000,11000,0.78879744452687,NA 
rayol-farm2_2019-04-03_20-59-48.wav,44100,16,60,1,ndsi,1024,1000,2000,2000,11000,0.758539374644112,NA 
rayol-farm2_2019-04-03_21-01-48.wav,44100,16,60,1,ndsi,1024,1000,2000,2000,11000,0.797659020198043,NA 
rayol-farm2_2019-04-03_21-03-48.wav,44100,16,60,1,ndsi,1024,1000,2000,2000,11000,0.755839510967747,NA 
rayol-farm2_2019-04-03_21-05-48.wav,44100,16,60,1,ndsi,1024,1000,2000,2000,11000,0.778535316404873,NA 
rayol-farm2_2019-04-03_21-07-48.wav,44100,16,60,1,ndsi,1024,1000,2000,2000,11000,0.752332087480787,NA 
rayol-farm2_2019-04-03_21-09-49.wav,44100,16,60,1,ndsi,1024,1000,2000,2000,11000,0.774857535788345,NA 
rayol-farm2_2019-04-03_21-11-49.wav,44100,16,60,1,ndsi,1024,1000,2000,2000,11000,0.780087273065061,NA 
rayol-farm2_2019-04-03_21-13-49.wav,44100,16,60,1,ndsi,1024,1000,2000,2000,11000,0.786287644651739,NA 
rayol-farm2_2019-04-03_21-15-49.wav,44100,16,60,1,ndsi,1024,1000,2000,2000,11000,0.78320799907999,NA 
rayol-farm2_2019-04-03_21-17-49.wav,44100,16,60,1,ndsi,1024,1000,2000,2000,11000,0.823734517663052,NA 
rayol-farm2_2019-04-03_21-19-49.wav,44100,16,60,1,ndsi,1024,1000,2000,2000,11000,0.762864652595375,NA 
rayol-farm2_2019-04-03_21-21-49.wav,44100,16,60,1,ndsi,1024,1000,2000,2000,11000,0.757059942932721,NA 
rayol-farm2_2019-04-03_21-23-49.wav,44100,16,60,1,ndsi,1024,1000,2000,2000,11000,0.782431705322222,NA 
rayol-farm2_2019-04-03_21-25-49.wav,44100,16,60,1,ndsi,1024,1000,2000,2000,11000,0.759822095936337,NA 
rayol-farm2_2019-04-03_21-27-50.wav,44100,16,60,1,ndsi,1024,1000,2000,2000,11000,0.823294027767544,NA 
rayol-farm2_2019-04-03_21-29-50.wav,44100,16,60,1,ndsi,1024,1000,2000,2000,11000,0.827753362616571,NA 
rayol-farm2_2019-04-03_21-31-50.wav,44100,16,60,1,ndsi,1024,1000,2000,2000,11000,0.844645604989126,NA 
rayol-farm2_2019-04-03_21-33-50.wav,44100,16,60,1,ndsi,1024,1000,2000,2000,11000,0.831924671061324,NA 
rayol-farm2_2019-04-03_21-35-50.wav,44100,16,60,1,ndsi,1024,1000,2000,2000,11000,0.820517841178498,NA 
rayol-farm2_2019-04-03_21-37-50.wav,44100,16,60,1,ndsi,1024,1000,2000,2000,11000,0.8106725412989,NA 
rayol-farm2_2019-04-03_21-39-50.wav,44100,16,60,1,ndsi,1024,1000,2000,2000,11000,0.802339008130209,NA 
rayol-farm2_2019-04-03_21-41-50.wav,44100,16,60,1,ndsi,1024,1000,2000,2000,11000,0.732135864276448,NA 
rayol-farm2_2019-04-03_21-43-51.wav,44100,16,60,1,ndsi,1024,1000,2000,2000,11000,0.723338354617663,NA 
rayol-farm2_2019-04-03_21-45-51.wav,44100,16,60,1,ndsi,1024,1000,2000,2000,11000,0.77684076819396,NA 
rayol-farm2_2019-04-03_21-47-51.wav,44100,16,60,1,ndsi,1024,1000,2000,2000,11000,0.752827434344946,NA 
rayol-farm2_2019-04-03_21-49-51.wav,44100,16,60,1,ndsi,1024,1000,2000,2000,11000,0.790354285088375,NA 
rayol-farm2_2019-04-03_21-51-51.wav,44100,16,60,1,ndsi,1024,1000,2000,2000,11000,0.779555697273455,NA 
rayol-farm2_2019-04-03_21-53-51.wav,44100,16,60,1,ndsi,1024,1000,2000,2000,11000,0.778351192076139,NA 
rayol-farm2_2019-04-03_21-55-51.wav,44100,16,60,1,ndsi,1024,1000,2000,2000,11000,0.753931639815515,NA 
rayol-farm2_2019-04-03_21-57-51.wav,44100,16,60,1,ndsi,1024,1000,2000,2000,11000,0.752200746219566,NA 
rayol-farm2_2019-04-03_21-59-52.wav,44100,16,60,1,ndsi,1024,1000,2000,2000,11000,0.789376822577504,NA 
rayol-farm2_2019-04-03_22-01-52.wav,44100,16,60,1,ndsi,1024,1000,2000,2000,11000,0.810935490213473,NA 
rayol-farm2_2019-04-03_22-03-52.wav,44100,16,60,1,ndsi,1024,1000,2000,2000,11000,0.844475277070102,NA 
rayol-farm2_2019-04-03_22-05-52.wav,44100,16,60,1,ndsi,1024,1000,2000,2000,11000,0.837388650721626,NA 
rayol-farm2_2019-04-03_22-07-52.wav,44100,16,60,1,ndsi,1024,1000,2000,2000,11000,0.816741171547611,NA 
rayol-farm2_2019-04-03_22-09-52.wav,44100,16,60,1,ndsi,1024,1000,2000,2000,11000,0.788874864427544,NA 
rayol-farm2_2019-04-03_22-11-52.wav,44100,16,60,1,ndsi,1024,1000,2000,2000,11000,0.778988736737461,NA 
rayol-farm2_2019-04-03_22-13-52.wav,44100,16,60,1,ndsi,1024,1000,2000,2000,11000,0.802833160340328,NA 
rayol-farm2_2019-04-03_22-15-52.wav,44100,16,60,1,ndsi,1024,1000,2000,2000,11000,0.787058094062852,NA 
rayol-farm2_2019-04-03_22-17-53.wav,44100,16,60,1,ndsi,1024,1000,2000,2000,11000,0.776030636562622,NA 
rayol-farm2_2019-04-03_22-19-53.wav,44100,16,60,1,ndsi,1024,1000,2000,2000,11000,0.76295312836541,NA 
rayol-farm2_2019-04-03_22-21-53.wav,44100,16,60,1,ndsi,1024,1000,2000,2000,11000,0.738523248469638,NA 
rayol-farm2_2019-04-03_22-23-53.wav,44100,16,60,1,ndsi,1024,1000,2000,2000,11000,0.739324413476807,NA 
rayol-farm2_2019-04-03_22-25-53.wav,44100,16,60,1,ndsi,1024,1000,2000,2000,11000,0.716741308309675,NA 
rayol-farm2_2019-04-03_22-27-53.wav,44100,16,60,1,ndsi,1024,1000,2000,2000,11000,0.776331902346641,NA 
rayol-farm2_2019-04-03_22-29-53.wav,44100,16,60,1,ndsi,1024,1000,2000,2000,11000,0.801174441793816,NA 
rayol-farm2_2019-04-03_22-31-53.wav,44100,16,60,1,ndsi,1024,1000,2000,2000,11000,0.82203610835944,NA 
rayol-farm2_2019-04-03_22-33-54.wav,44100,16,60,1,ndsi,1024,1000,2000,2000,11000,0.766221879106501,NA 
rayol-farm2_2019-04-03_22-35-54.wav,44100,16,60,1,ndsi,1024,1000,2000,2000,11000,0.778602470797624,NA 
rayol-farm2_2019-04-03_22-37-54.wav,44100,16,60,1,ndsi,1024,1000,2000,2000,11000,0.653390188814685,NA 
rayol-farm2_2019-04-03_22-39-54.wav,44100,16,60,1,ndsi,1024,1000,2000,2000,11000,0.762250750012044,NA 
rayol-farm2_2019-04-03_22-41-54.wav,44100,16,60,1,ndsi,1024,1000,2000,2000,11000,0.743470373983575,NA 
rayol-farm2_2019-04-03_22-43-54.wav,44100,16,60,1,ndsi,1024,1000,2000,2000,11000,0.770921535423944,NA 
rayol-farm2_2019-04-03_22-45-54.wav,44100,16,60,1,ndsi,1024,1000,2000,2000,11000,0.812469944759322,NA 
rayol-farm2_2019-04-03_22-47-54.wav,44100,16,60,1,ndsi,1024,1000,2000,2000,11000,0.838417936630378,NA 
rayol-farm2_2019-04-03_22-49-55.wav,44100,16,60,1,ndsi,1024,1000,2000,2000,11000,0.856807021982676,NA 
rayol-farm2_2019-04-03_22-51-55.wav,44100,16,60,1,ndsi,1024,1000,2000,2000,11000,0.852430678503235,NA 
rayol-farm2_2019-04-03_22-53-55.wav,44100,16,60,1,ndsi,1024,1000,2000,2000,11000,0.832925859639128,NA 
rayol-farm2_2019-04-03_22-55-55.wav,44100,16,60,1,ndsi,1024,1000,2000,2000,11000,0.858912466558465,NA 
rayol-farm2_2019-04-03_22-57-55.wav,44100,16,60,1,ndsi,1024,1000,2000,2000,11000,0.871028920530129,NA 
rayol-farm2_2019-04-03_22-59-55.wav,44100,16,60,1,ndsi,1024,1000,2000,2000,11000,0.876206496803742,NA 
rayol-farm2_2019-04-03_23-01-55.wav,44100,16,60,1,ndsi,1024,1000,2000,2000,11000,0.884853292872054,NA 
rayol-farm2_2019-04-03_23-03-55.wav,44100,16,60,1,ndsi,1024,1000,2000,2000,11000,0.885730046692549,NA 
rayol-farm2_2019-04-03_23-05-56.wav,44100,16,60,1,ndsi,1024,1000,2000,2000,11000,0.889003029905731,NA 
rayol-farm2_2019-04-03_23-07-56.wav,44100,16,60,1,ndsi,1024,1000,2000,2000,11000,0.882565055362049,NA 
rayol-farm2_2019-04-03_23-09-56.wav,44100,16,60,1,ndsi,1024,1000,2000,2000,11000,0.888483612743716,NA 
rayol-farm2_2019-04-03_23-11-56.wav,44100,16,60,1,ndsi,1024,1000,2000,2000,11000,0.891201428213074,NA 
rayol-farm2_2019-04-03_23-13-56.wav,44100,16,60,1,ndsi,1024,1000,2000,2000,11000,0.895811745584049,NA 
rayol-farm2_2019-04-03_23-15-56.wav,44100,16,60,1,ndsi,1024,1000,2000,2000,11000,0.894528281838358,NA 
rayol-farm2_2019-04-03_23-17-56.wav,44100,16,60,1,ndsi,1024,1000,2000,2000,11000,0.894582517542766,NA 
rayol-farm2_2019-04-03_23-19-56.wav,44100,16,60,1,ndsi,1024,1000,2000,2000,11000,0.896436962190693,NA 
rayol-farm2_2019-04-03_23-21-56.wav,44100,16,60,1,ndsi,1024,1000,2000,2000,11000,0.898430618159383,NA 
rayol-farm2_2019-04-03_23-23-57.wav,44100,16,60,1,ndsi,1024,1000,2000,2000,11000,0.90004048208233,NA 
rayol-farm2_2019-04-03_23-25-57.wav,44100,16,60,1,ndsi,1024,1000,2000,2000,11000,0.899780285222585,NA 
rayol-farm2_2019-04-03_23-27-57.wav,44100,16,60,1,ndsi,1024,1000,2000,2000,11000,0.900320652422976,NA 
rayol-farm2_2019-04-03_23-29-57.wav,44100,16,60,1,ndsi,1024,1000,2000,2000,11000,0.89669600922984,NA 
rayol-farm2_2019-04-03_23-31-57.wav,44100,16,60,1,ndsi,1024,1000,2000,2000,11000,0.899318515800059,NA 
rayol-farm2_2019-04-03_23-33-57.wav,44100,16,60,1,ndsi,1024,1000,2000,2000,11000,0.897826431472755,NA 
rayol-farm2_2019-04-03_23-35-57.wav,44100,16,60,1,ndsi,1024,1000,2000,2000,11000,0.896639603664517,NA 
rayol-farm2_2019-04-03_23-37-57.wav,44100,16,60,1,ndsi,1024,1000,2000,2000,11000,0.901196839920216,NA 
rayol-farm2_2019-04-03_23-39-58.wav,44100,16,60,1,ndsi,1024,1000,2000,2000,11000,0.899219245224773,NA 
rayol-farm2_2019-04-03_23-41-58.wav,44100,16,60,1,ndsi,1024,1000,2000,2000,11000,0.898154631561617,NA 
rayol-farm2_2019-04-03_23-43-58.wav,44100,16,60,1,ndsi,1024,1000,2000,2000,11000,0.821452632948144,NA 
rayol-farm2_2019-04-03_23-45-58.wav,44100,16,60,1,ndsi,1024,1000,2000,2000,11000,0.899546210242666,NA 
rayol-farm2_2019-04-03_23-47-58.wav,44100,16,60,1,ndsi,1024,1000,2000,2000,11000,0.89607807944297,NA 
rayol-farm2_2019-04-03_23-49-58.wav,44100,16,60,1,ndsi,1024,1000,2000,2000,11000,0.899904150878481,NA 
rayol-farm2_2019-04-03_23-51-58.wav,44100,16,60,1,ndsi,1024,1000,2000,2000,11000,0.899941044487753,NA 
rayol-farm2_2019-04-03_23-53-58.wav,44100,16,60,1,ndsi,1024,1000,2000,2000,11000,0.899406315037767,NA 
rayol-farm2_2019-04-03_23-55-59.wav,44100,16,60,1,ndsi,1024,1000,2000,2000,11000,0.89317042397552,NA 
rayol-farm2_2019-04-03_23-57-59.wav,44100,16,60,1,ndsi,1024,1000,2000,2000,11000,0.872394881296915,NA 
rayol-farm2_2019-04-03_23-59-59.wav,44100,16,60,1,ndsi,1024,1000,2000,2000,11000,0.800638584772622,NA
