FILENAME,SAMPLINGRATE,BIT,DURATION,CHANNELS,INDEX,FFT_W,MIN_FREQ,MAX_FREQ,J,LEFT_CHANNEL,RIGHT_CHANNEL
rayol-farm2_2019-05-09_00-00-35.wav,44100,16,60,1,acoustic_complexity,512,1,NA,5,1820.77175821874,NA 
rayol-farm2_2019-05-09_00-02-35.wav,44100,16,60,1,acoustic_complexity,512,1,NA,5,1811.78114095626,NA 
rayol-farm2_2019-05-09_00-04-35.wav,44100,16,60,1,acoustic_complexity,512,1,NA,5,1832.92303454313,NA 
rayol-farm2_2019-05-09_00-06-35.wav,44100,16,60,1,acoustic_complexity,512,1,NA,5,1841.35975735757,NA 
rayol-farm2_2019-05-09_00-08-35.wav,44100,16,60,1,acoustic_complexity,512,1,NA,5,1815.58030233637,NA 
rayol-farm2_2019-05-09_00-10-35.wav,44100,16,60,1,acoustic_complexity,512,1,NA,5,1821.54636794965,NA 
rayol-farm2_2019-05-09_00-12-35.wav,44100,16,60,1,acoustic_complexity,512,1,NA,5,1817.91719173152,NA 
rayol-farm2_2019-05-09_00-14-35.wav,44100,16,60,1,acoustic_complexity,512,1,NA,5,1804.18728352859,NA 
rayol-farm2_2019-05-09_00-16-36.wav,44100,16,60,1,acoustic_complexity,512,1,NA,5,1808.78702012583,NA 
rayol-farm2_2019-05-09_00-18-36.wav,44100,16,60,1,acoustic_complexity,512,1,NA,5,1832.35396232542,NA 
rayol-farm2_2019-05-09_00-20-36.wav,44100,16,60,1,acoustic_complexity,512,1,NA,5,1821.69282038791,NA 
rayol-farm2_2019-05-09_00-22-36.wav,44100,16,60,1,acoustic_complexity,512,1,NA,5,1811.9178408503,NA 
rayol-farm2_2019-05-09_00-24-36.wav,44100,16,60,1,acoustic_complexity,512,1,NA,5,1808.11045559535,NA 
rayol-farm2_2019-05-09_00-26-36.wav,44100,16,60,1,acoustic_complexity,512,1,NA,5,1812.41838519176,NA 
rayol-farm2_2019-05-09_00-28-36.wav,44100,16,60,1,acoustic_complexity,512,1,NA,5,1806.30454786231,NA 
rayol-farm2_2019-05-09_00-30-36.wav,44100,16,60,1,acoustic_complexity,512,1,NA,5,1803.38984027725,NA 
rayol-farm2_2019-05-09_00-32-37.wav,44100,16,60,1,acoustic_complexity,512,1,NA,5,1822.68814107472,NA 
rayol-farm2_2019-05-09_00-34-37.wav,44100,16,60,1,acoustic_complexity,512,1,NA,5,1797.57917995029,NA 
rayol-farm2_2019-05-09_00-36-37.wav,44100,16,60,1,acoustic_complexity,512,1,NA,5,1820.61280144984,NA 
rayol-farm2_2019-05-09_00-38-37.wav,44100,16,60,1,acoustic_complexity,512,1,NA,5,1821.11464085491,NA 
rayol-farm2_2019-05-09_00-40-37.wav,44100,16,60,1,acoustic_complexity,512,1,NA,5,1816.24559217815,NA 
rayol-farm2_2019-05-09_00-42-37.wav,44100,16,60,1,acoustic_complexity,512,1,NA,5,1819.8250829794,NA 
rayol-farm2_2019-05-09_00-44-37.wav,44100,16,60,1,acoustic_complexity,512,1,NA,5,1822.68085556063,NA 
rayol-farm2_2019-05-09_00-46-37.wav,44100,16,60,1,acoustic_complexity,512,1,NA,5,1817.62331523403,NA 
rayol-farm2_2019-05-09_00-48-38.wav,44100,16,60,1,acoustic_complexity,512,1,NA,5,1823.26333973015,NA 
rayol-farm2_2019-05-09_00-50-38.wav,44100,16,60,1,acoustic_complexity,512,1,NA,5,1809.85914649429,NA 
rayol-farm2_2019-05-09_00-52-38.wav,44100,16,60,1,acoustic_complexity,512,1,NA,5,1803.95792965272,NA 
rayol-farm2_2019-05-09_00-54-38.wav,44100,16,60,1,acoustic_complexity,512,1,NA,5,1794.24242784146,NA 
rayol-farm2_2019-05-09_00-56-38.wav,44100,16,60,1,acoustic_complexity,512,1,NA,5,1796.71785103535,NA 
rayol-farm2_2019-05-09_00-58-38.wav,44100,16,60,1,acoustic_complexity,512,1,NA,5,1784.04528010436,NA 
rayol-farm2_2019-05-09_01-00-38.wav,44100,16,60,1,acoustic_complexity,512,1,NA,5,1785.62882587308,NA 
rayol-farm2_2019-05-09_01-02-38.wav,44100,16,60,1,acoustic_complexity,512,1,NA,5,1785.83491825532,NA 
rayol-farm2_2019-05-09_01-04-39.wav,44100,16,60,1,acoustic_complexity,512,1,NA,5,1795.91440021097,NA 
rayol-farm2_2019-05-09_01-06-39.wav,44100,16,60,1,acoustic_complexity,512,1,NA,5,1806.20984351178,NA 
rayol-farm2_2019-05-09_01-08-39.wav,44100,16,60,1,acoustic_complexity,512,1,NA,5,1807.42121075835,NA 
rayol-farm2_2019-05-09_01-10-39.wav,44100,16,60,1,acoustic_complexity,512,1,NA,5,1837.95820456345,NA 
rayol-farm2_2019-05-09_01-12-39.wav,44100,16,60,1,acoustic_complexity,512,1,NA,5,1836.9319752441,NA 
rayol-farm2_2019-05-09_01-14-39.wav,44100,16,60,1,acoustic_complexity,512,1,NA,5,1807.32491438004,NA 
rayol-farm2_2019-05-09_01-16-39.wav,44100,16,60,1,acoustic_complexity,512,1,NA,5,1822.95216111459,NA 
rayol-farm2_2019-05-09_01-18-39.wav,44100,16,60,1,acoustic_complexity,512,1,NA,5,1819.22848764744,NA 
rayol-farm2_2019-05-09_01-20-40.wav,44100,16,60,1,acoustic_complexity,512,1,NA,5,1806.77671907156,NA 
rayol-farm2_2019-05-09_01-22-40.wav,44100,16,60,1,acoustic_complexity,512,1,NA,5,1800.57060894606,NA 
rayol-farm2_2019-05-09_01-24-40.wav,44100,16,60,1,acoustic_complexity,512,1,NA,5,1795.88106133112,NA 
rayol-farm2_2019-05-09_01-26-40.wav,44100,16,60,1,acoustic_complexity,512,1,NA,5,1778.88329538659,NA 
rayol-farm2_2019-05-09_01-28-40.wav,44100,16,60,1,acoustic_complexity,512,1,NA,5,1783.21201535842,NA 
rayol-farm2_2019-05-09_01-30-40.wav,44100,16,60,1,acoustic_complexity,512,1,NA,5,1776.01448747214,NA 
rayol-farm2_2019-05-09_01-32-40.wav,44100,16,60,1,acoustic_complexity,512,1,NA,5,1774.66085221897,NA 
rayol-farm2_2019-05-09_01-34-40.wav,44100,16,60,1,acoustic_complexity,512,1,NA,5,1786.13736095539,NA 
rayol-farm2_2019-05-09_01-36-40.wav,44100,16,60,1,acoustic_complexity,512,1,NA,5,1783.78206487937,NA 
rayol-farm2_2019-05-09_01-38-41.wav,44100,16,60,1,acoustic_complexity,512,1,NA,5,1795.82708929313,NA 
rayol-farm2_2019-05-09_01-40-41.wav,44100,16,60,1,acoustic_complexity,512,1,NA,5,1783.14666697753,NA 
rayol-farm2_2019-05-09_01-42-41.wav,44100,16,60,1,acoustic_complexity,512,1,NA,5,1779.00951101917,NA 
rayol-farm2_2019-05-09_01-44-41.wav,44100,16,60,1,acoustic_complexity,512,1,NA,5,1778.6123807175,NA 
rayol-farm2_2019-05-09_01-46-41.wav,44100,16,60,1,acoustic_complexity,512,1,NA,5,1785.14878012041,NA 
rayol-farm2_2019-05-09_01-48-41.wav,44100,16,60,1,acoustic_complexity,512,1,NA,5,1786.59561157326,NA 
rayol-farm2_2019-05-09_01-50-41.wav,44100,16,60,1,acoustic_complexity,512,1,NA,5,1786.98495713044,NA 
rayol-farm2_2019-05-09_01-52-41.wav,44100,16,60,1,acoustic_complexity,512,1,NA,5,1782.11562336508,NA 
rayol-farm2_2019-05-09_01-54-42.wav,44100,16,60,1,acoustic_complexity,512,1,NA,5,1774.44555856956,NA 
rayol-farm2_2019-05-09_01-56-42.wav,44100,16,60,1,acoustic_complexity,512,1,NA,5,1788.84413029032,NA 
rayol-farm2_2019-05-09_01-58-42.wav,44100,16,60,1,acoustic_complexity,512,1,NA,5,1789.40938749265,NA 
rayol-farm2_2019-05-09_02-00-42.wav,44100,16,60,1,acoustic_complexity,512,1,NA,5,1795.590409393,NA 
rayol-farm2_2019-05-09_02-02-42.wav,44100,16,60,1,acoustic_complexity,512,1,NA,5,1793.09866918182,NA 
rayol-farm2_2019-05-09_02-04-42.wav,44100,16,60,1,acoustic_complexity,512,1,NA,5,1789.03731448496,NA 
rayol-farm2_2019-05-09_02-06-42.wav,44100,16,60,1,acoustic_complexity,512,1,NA,5,1809.22104469004,NA 
rayol-farm2_2019-05-09_02-08-42.wav,44100,16,60,1,acoustic_complexity,512,1,NA,5,1796.62064807986,NA 
rayol-farm2_2019-05-09_02-10-43.wav,44100,16,60,1,acoustic_complexity,512,1,NA,5,1798.99361874645,NA 
rayol-farm2_2019-05-09_02-12-43.wav,44100,16,60,1,acoustic_complexity,512,1,NA,5,1796.41723577063,NA 
rayol-farm2_2019-05-09_02-14-43.wav,44100,16,60,1,acoustic_complexity,512,1,NA,5,1800.76082500682,NA 
rayol-farm2_2019-05-09_02-16-43.wav,44100,16,60,1,acoustic_complexity,512,1,NA,5,1805.46845020743,NA 
rayol-farm2_2019-05-09_02-18-43.wav,44100,16,60,1,acoustic_complexity,512,1,NA,5,1799.35834709937,NA 
rayol-farm2_2019-05-09_02-20-43.wav,44100,16,60,1,acoustic_complexity,512,1,NA,5,1802.74062104842,NA 
rayol-farm2_2019-05-09_02-22-43.wav,44100,16,60,1,acoustic_complexity,512,1,NA,5,1797.94005285598,NA 
rayol-farm2_2019-05-09_02-24-43.wav,44100,16,60,1,acoustic_complexity,512,1,NA,5,1807.20985356954,NA 
rayol-farm2_2019-05-09_02-26-44.wav,44100,16,60,1,acoustic_complexity,512,1,NA,5,1799.0545496725,NA 
rayol-farm2_2019-05-09_02-28-44.wav,44100,16,60,1,acoustic_complexity,512,1,NA,5,1790.38638625802,NA 
rayol-farm2_2019-05-09_02-30-44.wav,44100,16,60,1,acoustic_complexity,512,1,NA,5,1799.04553762335,NA 
rayol-farm2_2019-05-09_02-32-44.wav,44100,16,60,1,acoustic_complexity,512,1,NA,5,1803.12580344315,NA 
rayol-farm2_2019-05-09_02-34-44.wav,44100,16,60,1,acoustic_complexity,512,1,NA,5,1797.99376795315,NA 
rayol-farm2_2019-05-09_02-36-44.wav,44100,16,60,1,acoustic_complexity,512,1,NA,5,1815.45309561897,NA 
rayol-farm2_2019-05-09_02-38-44.wav,44100,16,60,1,acoustic_complexity,512,1,NA,5,1803.63764756883,NA 
rayol-farm2_2019-05-09_02-40-44.wav,44100,16,60,1,acoustic_complexity,512,1,NA,5,1809.20064039668,NA 
rayol-farm2_2019-05-09_02-42-44.wav,44100,16,60,1,acoustic_complexity,512,1,NA,5,1807.20189995732,NA 
rayol-farm2_2019-05-09_02-44-45.wav,44100,16,60,1,acoustic_complexity,512,1,NA,5,1811.30929838017,NA 
rayol-farm2_2019-05-09_02-46-45.wav,44100,16,60,1,acoustic_complexity,512,1,NA,5,1829.43187983167,NA 
rayol-farm2_2019-05-09_02-48-45.wav,44100,16,60,1,acoustic_complexity,512,1,NA,5,1840.5356280233,NA 
rayol-farm2_2019-05-09_02-50-45.wav,44100,16,60,1,acoustic_complexity,512,1,NA,5,1816.74583265496,NA 
rayol-farm2_2019-05-09_02-52-45.wav,44100,16,60,1,acoustic_complexity,512,1,NA,5,1800.34567865518,NA 
rayol-farm2_2019-05-09_02-54-45.wav,44100,16,60,1,acoustic_complexity,512,1,NA,5,1810.50104939932,NA 
rayol-farm2_2019-05-09_02-56-45.wav,44100,16,60,1,acoustic_complexity,512,1,NA,5,1789.6964199531,NA 
rayol-farm2_2019-05-09_02-58-45.wav,44100,16,60,1,acoustic_complexity,512,1,NA,5,1806.27149659294,NA 
rayol-farm2_2019-05-09_03-00-46.wav,44100,16,60,1,acoustic_complexity,512,1,NA,5,1803.10842455347,NA 
rayol-farm2_2019-05-09_03-02-46.wav,44100,16,60,1,acoustic_complexity,512,1,NA,5,1799.26573499753,NA 
rayol-farm2_2019-05-09_03-04-46.wav,44100,16,60,1,acoustic_complexity,512,1,NA,5,1790.98363929634,NA 
rayol-farm2_2019-05-09_03-06-46.wav,44100,16,60,1,acoustic_complexity,512,1,NA,5,1801.07217527341,NA 
rayol-farm2_2019-05-09_03-08-46.wav,44100,16,60,1,acoustic_complexity,512,1,NA,5,1794.45337654591,NA 
rayol-farm2_2019-05-09_03-10-46.wav,44100,16,60,1,acoustic_complexity,512,1,NA,5,1794.78035647212,NA 
rayol-farm2_2019-05-09_03-12-46.wav,44100,16,60,1,acoustic_complexity,512,1,NA,5,1803.74290813366,NA 
rayol-farm2_2019-05-09_03-14-46.wav,44100,16,60,1,acoustic_complexity,512,1,NA,5,1785.18670612412,NA 
rayol-farm2_2019-05-09_03-16-47.wav,44100,16,60,1,acoustic_complexity,512,1,NA,5,1798.30832137079,NA 
rayol-farm2_2019-05-09_03-18-47.wav,44100,16,60,1,acoustic_complexity,512,1,NA,5,1790.2620563009,NA 
rayol-farm2_2019-05-09_03-20-47.wav,44100,16,60,1,acoustic_complexity,512,1,NA,5,1789.67989538194,NA 
rayol-farm2_2019-05-09_03-22-47.wav,44100,16,60,1,acoustic_complexity,512,1,NA,5,1795.74608604087,NA 
rayol-farm2_2019-05-09_03-24-47.wav,44100,16,60,1,acoustic_complexity,512,1,NA,5,1807.49127502984,NA 
rayol-farm2_2019-05-09_03-26-47.wav,44100,16,60,1,acoustic_complexity,512,1,NA,5,1809.31285873379,NA 
rayol-farm2_2019-05-09_03-28-47.wav,44100,16,60,1,acoustic_complexity,512,1,NA,5,1793.9996470891,NA 
rayol-farm2_2019-05-09_03-30-47.wav,44100,16,60,1,acoustic_complexity,512,1,NA,5,1794.99924083744,NA 
rayol-farm2_2019-05-09_03-32-47.wav,44100,16,60,1,acoustic_complexity,512,1,NA,5,1800.91726080546,NA 
rayol-farm2_2019-05-09_03-34-48.wav,44100,16,60,1,acoustic_complexity,512,1,NA,5,1803.48830685296,NA 
rayol-farm2_2019-05-09_03-36-48.wav,44100,16,60,1,acoustic_complexity,512,1,NA,5,1786.70375526264,NA 
rayol-farm2_2019-05-09_03-38-48.wav,44100,16,60,1,acoustic_complexity,512,1,NA,5,1801.55076889069,NA 
rayol-farm2_2019-05-09_03-40-48.wav,44100,16,60,1,acoustic_complexity,512,1,NA,5,1795.10458984613,NA 
rayol-farm2_2019-05-09_03-42-48.wav,44100,16,60,1,acoustic_complexity,512,1,NA,5,1789.2255926629,NA 
rayol-farm2_2019-05-09_03-44-48.wav,44100,16,60,1,acoustic_complexity,512,1,NA,5,1791.47345013776,NA 
rayol-farm2_2019-05-09_03-46-48.wav,44100,16,60,1,acoustic_complexity,512,1,NA,5,1800.77827265696,NA 
rayol-farm2_2019-05-09_03-48-48.wav,44100,16,60,1,acoustic_complexity,512,1,NA,5,1799.86283666156,NA 
rayol-farm2_2019-05-09_03-50-49.wav,44100,16,60,1,acoustic_complexity,512,1,NA,5,1801.32784030094,NA 
rayol-farm2_2019-05-09_03-52-49.wav,44100,16,60,1,acoustic_complexity,512,1,NA,5,1798.37118094551,NA 
rayol-farm2_2019-05-09_03-54-49.wav,44100,16,60,1,acoustic_complexity,512,1,NA,5,1795.59872818168,NA 
rayol-farm2_2019-05-09_03-56-49.wav,44100,16,60,1,acoustic_complexity,512,1,NA,5,1803.06164562317,NA 
rayol-farm2_2019-05-09_03-58-49.wav,44100,16,60,1,acoustic_complexity,512,1,NA,5,1797.56723128205,NA 
rayol-farm2_2019-05-09_04-00-49.wav,44100,16,60,1,acoustic_complexity,512,1,NA,5,1808.71739633314,NA 
rayol-farm2_2019-05-09_04-02-49.wav,44100,16,60,1,acoustic_complexity,512,1,NA,5,1803.02601462674,NA 
rayol-farm2_2019-05-09_04-04-49.wav,44100,16,60,1,acoustic_complexity,512,1,NA,5,1806.09072745573,NA 
rayol-farm2_2019-05-09_04-06-50.wav,44100,16,60,1,acoustic_complexity,512,1,NA,5,1796.17475996588,NA 
rayol-farm2_2019-05-09_04-08-50.wav,44100,16,60,1,acoustic_complexity,512,1,NA,5,1808.9473090472,NA 
rayol-farm2_2019-05-09_04-10-50.wav,44100,16,60,1,acoustic_complexity,512,1,NA,5,1798.13787151847,NA 
rayol-farm2_2019-05-09_04-12-50.wav,44100,16,60,1,acoustic_complexity,512,1,NA,5,1803.08790915958,NA 
rayol-farm2_2019-05-09_04-14-50.wav,44100,16,60,1,acoustic_complexity,512,1,NA,5,1791.76239411193,NA 
rayol-farm2_2019-05-09_04-16-50.wav,44100,16,60,1,acoustic_complexity,512,1,NA,5,1806.04498003953,NA 
rayol-farm2_2019-05-09_04-18-50.wav,44100,16,60,1,acoustic_complexity,512,1,NA,5,1795.04156696461,NA 
rayol-farm2_2019-05-09_04-20-50.wav,44100,16,60,1,acoustic_complexity,512,1,NA,5,1797.03011754254,NA 
rayol-farm2_2019-05-09_04-22-51.wav,44100,16,60,1,acoustic_complexity,512,1,NA,5,1796.16585937136,NA 
rayol-farm2_2019-05-09_04-24-51.wav,44100,16,60,1,acoustic_complexity,512,1,NA,5,1803.25522103312,NA 
rayol-farm2_2019-05-09_04-26-51.wav,44100,16,60,1,acoustic_complexity,512,1,NA,5,1798.62640784237,NA 
rayol-farm2_2019-05-09_04-28-51.wav,44100,16,60,1,acoustic_complexity,512,1,NA,5,1800.42322788245,NA 
rayol-farm2_2019-05-09_04-30-51.wav,44100,16,60,1,acoustic_complexity,512,1,NA,5,1789.97673923866,NA 
rayol-farm2_2019-05-09_04-32-51.wav,44100,16,60,1,acoustic_complexity,512,1,NA,5,1798.88289258776,NA 
rayol-farm2_2019-05-09_04-34-51.wav,44100,16,60,1,acoustic_complexity,512,1,NA,5,1794.01939366675,NA 
rayol-farm2_2019-05-09_04-36-51.wav,44100,16,60,1,acoustic_complexity,512,1,NA,5,1806.05351261215,NA 
rayol-farm2_2019-05-09_04-38-52.wav,44100,16,60,1,acoustic_complexity,512,1,NA,5,1787.73389698203,NA 
rayol-farm2_2019-05-09_04-40-52.wav,44100,16,60,1,acoustic_complexity,512,1,NA,5,1790.26648314724,NA 
rayol-farm2_2019-05-09_04-42-52.wav,44100,16,60,1,acoustic_complexity,512,1,NA,5,1791.49984956824,NA 
rayol-farm2_2019-05-09_04-44-52.wav,44100,16,60,1,acoustic_complexity,512,1,NA,5,1799.58616910531,NA 
rayol-farm2_2019-05-09_04-46-52.wav,44100,16,60,1,acoustic_complexity,512,1,NA,5,1794.26862037835,NA 
rayol-farm2_2019-05-09_04-48-52.wav,44100,16,60,1,acoustic_complexity,512,1,NA,5,1792.60744950292,NA 
rayol-farm2_2019-05-09_04-50-52.wav,44100,16,60,1,acoustic_complexity,512,1,NA,5,1805.34283499598,NA 
rayol-farm2_2019-05-09_04-52-52.wav,44100,16,60,1,acoustic_complexity,512,1,NA,5,1789.56783177346,NA 
rayol-farm2_2019-05-09_04-54-52.wav,44100,16,60,1,acoustic_complexity,512,1,NA,5,1797.74212872896,NA 
rayol-farm2_2019-05-09_04-56-53.wav,44100,16,60,1,acoustic_complexity,512,1,NA,5,1797.03139537888,NA 
rayol-farm2_2019-05-09_04-58-53.wav,44100,16,60,1,acoustic_complexity,512,1,NA,5,1790.86179277584,NA 
rayol-farm2_2019-05-09_05-00-53.wav,44100,16,60,1,acoustic_complexity,512,1,NA,5,1799.52759433232,NA 
rayol-farm2_2019-05-09_05-02-53.wav,44100,16,60,1,acoustic_complexity,512,1,NA,5,1787.45623095691,NA 
rayol-farm2_2019-05-09_05-04-53.wav,44100,16,60,1,acoustic_complexity,512,1,NA,5,1789.62937026847,NA 
rayol-farm2_2019-05-09_05-06-53.wav,44100,16,60,1,acoustic_complexity,512,1,NA,5,1802.56962575388,NA 
rayol-farm2_2019-05-09_05-08-53.wav,44100,16,60,1,acoustic_complexity,512,1,NA,5,1799.54949231644,NA 
rayol-farm2_2019-05-09_05-10-53.wav,44100,16,60,1,acoustic_complexity,512,1,NA,5,1795.55828586079,NA 
rayol-farm2_2019-05-09_05-12-54.wav,44100,16,60,1,acoustic_complexity,512,1,NA,5,1799.22354287061,NA 
rayol-farm2_2019-05-09_05-14-54.wav,44100,16,60,1,acoustic_complexity,512,1,NA,5,1796.47748035438,NA 
rayol-farm2_2019-05-09_05-16-54.wav,44100,16,60,1,acoustic_complexity,512,1,NA,5,1798.82009011024,NA 
rayol-farm2_2019-05-09_05-18-54.wav,44100,16,60,1,acoustic_complexity,512,1,NA,5,1809.49375107545,NA 
rayol-farm2_2019-05-09_05-20-54.wav,44100,16,60,1,acoustic_complexity,512,1,NA,5,1804.25666770062,NA 
rayol-farm2_2019-05-09_05-22-54.wav,44100,16,60,1,acoustic_complexity,512,1,NA,5,1797.92040617419,NA 
rayol-farm2_2019-05-09_05-24-54.wav,44100,16,60,1,acoustic_complexity,512,1,NA,5,1803.4647566709,NA 
rayol-farm2_2019-05-09_05-26-54.wav,44100,16,60,1,acoustic_complexity,512,1,NA,5,1800.52779544837,NA 
rayol-farm2_2019-05-09_05-28-55.wav,44100,16,60,1,acoustic_complexity,512,1,NA,5,1796.2284671827,NA 
rayol-farm2_2019-05-09_05-30-55.wav,44100,16,60,1,acoustic_complexity,512,1,NA,5,1796.99911698959,NA 
rayol-farm2_2019-05-09_05-32-55.wav,44100,16,60,1,acoustic_complexity,512,1,NA,5,1808.34105968087,NA 
rayol-farm2_2019-05-09_05-34-55.wav,44100,16,60,1,acoustic_complexity,512,1,NA,5,1805.19637557966,NA 
rayol-farm2_2019-05-09_05-36-55.wav,44100,16,60,1,acoustic_complexity,512,1,NA,5,1815.56143224706,NA 
rayol-farm2_2019-05-09_05-38-55.wav,44100,16,60,1,acoustic_complexity,512,1,NA,5,1806.86384646293,NA 
rayol-farm2_2019-05-09_05-40-55.wav,44100,16,60,1,acoustic_complexity,512,1,NA,5,1806.23929305686,NA 
rayol-farm2_2019-05-09_05-42-55.wav,44100,16,60,1,acoustic_complexity,512,1,NA,5,1810.57592746277,NA 
rayol-farm2_2019-05-09_05-44-56.wav,44100,16,60,1,acoustic_complexity,512,1,NA,5,1812.30952554753,NA 
rayol-farm2_2019-05-09_05-46-56.wav,44100,16,60,1,acoustic_complexity,512,1,NA,5,1802.39339934187,NA 
rayol-farm2_2019-05-09_05-48-56.wav,44100,16,60,1,acoustic_complexity,512,1,NA,5,1801.34707342772,NA 
rayol-farm2_2019-05-09_05-50-56.wav,44100,16,60,1,acoustic_complexity,512,1,NA,5,1795.12309912276,NA 
rayol-farm2_2019-05-09_05-52-56.wav,44100,16,60,1,acoustic_complexity,512,1,NA,5,1798.16903913475,NA 
rayol-farm2_2019-05-09_05-54-56.wav,44100,16,60,1,acoustic_complexity,512,1,NA,5,1797.01813093081,NA 
rayol-farm2_2019-05-09_05-56-56.wav,44100,16,60,1,acoustic_complexity,512,1,NA,5,1802.52676631368,NA 
rayol-farm2_2019-05-09_05-58-56.wav,44100,16,60,1,acoustic_complexity,512,1,NA,5,1806.37048571279,NA 
rayol-farm2_2019-05-09_06-00-57.wav,44100,16,60,1,acoustic_complexity,512,1,NA,5,1815.13958583185,NA 
rayol-farm2_2019-05-09_06-02-57.wav,44100,16,60,1,acoustic_complexity,512,1,NA,5,1809.52493888555,NA 
rayol-farm2_2019-05-09_06-04-57.wav,44100,16,60,1,acoustic_complexity,512,1,NA,5,1794.88143323465,NA 
rayol-farm2_2019-05-09_06-06-57.wav,44100,16,60,1,acoustic_complexity,512,1,NA,5,1807.10442916692,NA 
rayol-farm2_2019-05-09_06-08-57.wav,44100,16,60,1,acoustic_complexity,512,1,NA,5,1810.61615156719,NA 
rayol-farm2_2019-05-09_06-10-57.wav,44100,16,60,1,acoustic_complexity,512,1,NA,5,1803.28030413122,NA 
rayol-farm2_2019-05-09_06-12-57.wav,44100,16,60,1,acoustic_complexity,512,1,NA,5,1797.81763054803,NA 
rayol-farm2_2019-05-09_06-14-57.wav,44100,16,60,1,acoustic_complexity,512,1,NA,5,1792.35422480131,NA 
rayol-farm2_2019-05-09_06-16-57.wav,44100,16,60,1,acoustic_complexity,512,1,NA,5,1789.5689853749,NA 
rayol-farm2_2019-05-09_06-18-58.wav,44100,16,60,1,acoustic_complexity,512,1,NA,5,1792.02110562756,NA 
rayol-farm2_2019-05-09_06-20-58.wav,44100,16,60,1,acoustic_complexity,512,1,NA,5,1796.21649157141,NA 
rayol-farm2_2019-05-09_06-22-58.wav,44100,16,60,1,acoustic_complexity,512,1,NA,5,1817.15872246041,NA 
rayol-farm2_2019-05-09_06-24-58.wav,44100,16,60,1,acoustic_complexity,512,1,NA,5,1820.74574617424,NA 
rayol-farm2_2019-05-09_06-26-58.wav,44100,16,60,1,acoustic_complexity,512,1,NA,5,1806.9467237338,NA 
rayol-farm2_2019-05-09_06-28-58.wav,44100,16,60,1,acoustic_complexity,512,1,NA,5,1817.34483125608,NA 
rayol-farm2_2019-05-09_06-30-58.wav,44100,16,60,1,acoustic_complexity,512,1,NA,5,1828.32798218633,NA 
rayol-farm2_2019-05-09_06-32-58.wav,44100,16,60,1,acoustic_complexity,512,1,NA,5,1810.43391162279,NA 
rayol-farm2_2019-05-09_06-34-59.wav,44100,16,60,1,acoustic_complexity,512,1,NA,5,1798.26429674153,NA 
rayol-farm2_2019-05-09_06-36-59.wav,44100,16,60,1,acoustic_complexity,512,1,NA,5,1796.52806145615,NA 
rayol-farm2_2019-05-09_06-38-59.wav,44100,16,60,1,acoustic_complexity,512,1,NA,5,1802.50669067161,NA 
rayol-farm2_2019-05-09_06-40-59.wav,44100,16,60,1,acoustic_complexity,512,1,NA,5,1801.97720094586,NA 
rayol-farm2_2019-05-09_06-42-59.wav,44100,16,60,1,acoustic_complexity,512,1,NA,5,1801.4212713955,NA 
rayol-farm2_2019-05-09_06-44-59.wav,44100,16,60,1,acoustic_complexity,512,1,NA,5,1810.4514006025,NA 
rayol-farm2_2019-05-09_06-46-59.wav,44100,16,60,1,acoustic_complexity,512,1,NA,5,1802.74971585554,NA 
rayol-farm2_2019-05-09_06-48-59.wav,44100,16,60,1,acoustic_complexity,512,1,NA,5,1797.69434493557,NA 
rayol-farm2_2019-05-09_06-51-00.wav,44100,16,60,1,acoustic_complexity,512,1,NA,5,1799.39201887781,NA 
rayol-farm2_2019-05-09_06-53-00.wav,44100,16,60,1,acoustic_complexity,512,1,NA,5,1810.39305793666,NA 
rayol-farm2_2019-05-09_06-55-00.wav,44100,16,60,1,acoustic_complexity,512,1,NA,5,1806.40759137418,NA 
rayol-farm2_2019-05-09_06-57-00.wav,44100,16,60,1,acoustic_complexity,512,1,NA,5,1796.3163585042,NA 
rayol-farm2_2019-05-09_06-59-00.wav,44100,16,60,1,acoustic_complexity,512,1,NA,5,1797.50741829769,NA 
rayol-farm2_2019-05-09_07-01-00.wav,44100,16,60,1,acoustic_complexity,512,1,NA,5,1788.52960348801,NA 
rayol-farm2_2019-05-09_07-03-00.wav,44100,16,60,1,acoustic_complexity,512,1,NA,5,1802.20760570673,NA 
rayol-farm2_2019-05-09_07-05-00.wav,44100,16,60,1,acoustic_complexity,512,1,NA,5,1819.34989963246,NA 
rayol-farm2_2019-05-09_07-07-01.wav,44100,16,60,1,acoustic_complexity,512,1,NA,5,1810.22222658915,NA 
rayol-farm2_2019-05-09_07-09-01.wav,44100,16,60,1,acoustic_complexity,512,1,NA,5,1798.65623457141,NA 
rayol-farm2_2019-05-09_07-11-01.wav,44100,16,60,1,acoustic_complexity,512,1,NA,5,1796.32470436491,NA 
rayol-farm2_2019-05-09_07-13-01.wav,44100,16,60,1,acoustic_complexity,512,1,NA,5,1817.19704797777,NA 
rayol-farm2_2019-05-09_07-15-01.wav,44100,16,60,1,acoustic_complexity,512,1,NA,5,1813.06717314642,NA 
rayol-farm2_2019-05-09_07-17-01.wav,44100,16,60,1,acoustic_complexity,512,1,NA,5,1803.32663892838,NA 
rayol-farm2_2019-05-09_07-19-01.wav,44100,16,60,1,acoustic_complexity,512,1,NA,5,1802.44829291124,NA 
rayol-farm2_2019-05-09_07-21-01.wav,44100,16,60,1,acoustic_complexity,512,1,NA,5,1800.19413678944,NA 
rayol-farm2_2019-05-09_07-23-02.wav,44100,16,60,1,acoustic_complexity,512,1,NA,5,1804.47230084708,NA 
rayol-farm2_2019-05-09_07-25-02.wav,44100,16,60,1,acoustic_complexity,512,1,NA,5,1792.25903995578,NA 
rayol-farm2_2019-05-09_07-27-02.wav,44100,16,60,1,acoustic_complexity,512,1,NA,5,1795.12260515166,NA 
rayol-farm2_2019-05-09_07-29-02.wav,44100,16,60,1,acoustic_complexity,512,1,NA,5,1810.98070911266,NA 
rayol-farm2_2019-05-09_07-31-02.wav,44100,16,60,1,acoustic_complexity,512,1,NA,5,1808.04845274761,NA 
rayol-farm2_2019-05-09_07-33-02.wav,44100,16,60,1,acoustic_complexity,512,1,NA,5,1796.26053597865,NA 
rayol-farm2_2019-05-09_07-35-02.wav,44100,16,60,1,acoustic_complexity,512,1,NA,5,1809.02959050757,NA 
rayol-farm2_2019-05-09_07-37-02.wav,44100,16,60,1,acoustic_complexity,512,1,NA,5,1813.89273210979,NA 
rayol-farm2_2019-05-09_07-39-02.wav,44100,16,60,1,acoustic_complexity,512,1,NA,5,1810.37773041277,NA 
rayol-farm2_2019-05-09_07-41-03.wav,44100,16,60,1,acoustic_complexity,512,1,NA,5,1811.29806337034,NA 
rayol-farm2_2019-05-09_07-43-03.wav,44100,16,60,1,acoustic_complexity,512,1,NA,5,1800.22974755432,NA 
rayol-farm2_2019-05-09_07-45-03.wav,44100,16,60,1,acoustic_complexity,512,1,NA,5,1795.18635982947,NA 
rayol-farm2_2019-05-09_07-47-03.wav,44100,16,60,1,acoustic_complexity,512,1,NA,5,1803.00229211588,NA 
rayol-farm2_2019-05-09_07-49-03.wav,44100,16,60,1,acoustic_complexity,512,1,NA,5,1800.72428609817,NA 
rayol-farm2_2019-05-09_07-51-03.wav,44100,16,60,1,acoustic_complexity,512,1,NA,5,1790.08404411188,NA 
rayol-farm2_2019-05-09_07-53-03.wav,44100,16,60,1,acoustic_complexity,512,1,NA,5,1804.59551846251,NA 
rayol-farm2_2019-05-09_07-55-03.wav,44100,16,60,1,acoustic_complexity,512,1,NA,5,1790.01039876583,NA 
rayol-farm2_2019-05-09_07-57-04.wav,44100,16,60,1,acoustic_complexity,512,1,NA,5,1800.78151878152,NA 
rayol-farm2_2019-05-09_07-59-04.wav,44100,16,60,1,acoustic_complexity,512,1,NA,5,1797.27219869784,NA 
rayol-farm2_2019-05-09_08-01-04.wav,44100,16,60,1,acoustic_complexity,512,1,NA,5,1802.57153552008,NA 
rayol-farm2_2019-05-09_08-03-04.wav,44100,16,60,1,acoustic_complexity,512,1,NA,5,1802.04031263068,NA 
rayol-farm2_2019-05-09_08-05-04.wav,44100,16,60,1,acoustic_complexity,512,1,NA,5,1784.82292064745,NA 
rayol-farm2_2019-05-09_08-07-04.wav,44100,16,60,1,acoustic_complexity,512,1,NA,5,1826.7044732095,NA 
rayol-farm2_2019-05-09_08-09-04.wav,44100,16,60,1,acoustic_complexity,512,1,NA,5,1803.55576567334,NA 
rayol-farm2_2019-05-09_08-11-04.wav,44100,16,60,1,acoustic_complexity,512,1,NA,5,1830.19337564338,NA 
rayol-farm2_2019-05-09_08-13-05.wav,44100,16,60,1,acoustic_complexity,512,1,NA,5,1799.66018211092,NA 
rayol-farm2_2019-05-09_08-15-05.wav,44100,16,60,1,acoustic_complexity,512,1,NA,5,1785.94246085633,NA 
rayol-farm2_2019-05-09_08-17-05.wav,44100,16,60,1,acoustic_complexity,512,1,NA,5,1807.02168650039,NA 
rayol-farm2_2019-05-09_08-19-05.wav,44100,16,60,1,acoustic_complexity,512,1,NA,5,1824.50925153555,NA 
rayol-farm2_2019-05-09_08-21-05.wav,44100,16,60,1,acoustic_complexity,512,1,NA,5,1790.96511307645,NA 
rayol-farm2_2019-05-09_08-23-05.wav,44100,16,60,1,acoustic_complexity,512,1,NA,5,1798.68587289332,NA 
rayol-farm2_2019-05-09_08-25-05.wav,44100,16,60,1,acoustic_complexity,512,1,NA,5,1799.64308510537,NA 
rayol-farm2_2019-05-09_08-27-05.wav,44100,16,60,1,acoustic_complexity,512,1,NA,5,1805.35616283436,NA 
rayol-farm2_2019-05-09_08-29-06.wav,44100,16,60,1,acoustic_complexity,512,1,NA,5,1818.66661417528,NA 
rayol-farm2_2019-05-09_08-31-06.wav,44100,16,60,1,acoustic_complexity,512,1,NA,5,1821.06699187689,NA 
rayol-farm2_2019-05-09_08-33-06.wav,44100,16,60,1,acoustic_complexity,512,1,NA,5,1839.3429184711,NA 
rayol-farm2_2019-05-09_08-35-06.wav,44100,16,60,1,acoustic_complexity,512,1,NA,5,1821.56565944285,NA 
rayol-farm2_2019-05-09_08-37-06.wav,44100,16,60,1,acoustic_complexity,512,1,NA,5,1816.69231083967,NA 
rayol-farm2_2019-05-09_08-39-06.wav,44100,16,60,1,acoustic_complexity,512,1,NA,5,1829.2262390415,NA 
rayol-farm2_2019-05-09_08-41-06.wav,44100,16,60,1,acoustic_complexity,512,1,NA,5,1807.51820604575,NA 
rayol-farm2_2019-05-09_08-43-06.wav,44100,16,60,1,acoustic_complexity,512,1,NA,5,1817.05917001575,NA 
rayol-farm2_2019-05-09_08-45-06.wav,44100,16,60,1,acoustic_complexity,512,1,NA,5,1811.04165336872,NA 
rayol-farm2_2019-05-09_08-47-07.wav,44100,16,60,1,acoustic_complexity,512,1,NA,5,1815.37393742005,NA 
rayol-farm2_2019-05-09_08-49-07.wav,44100,16,60,1,acoustic_complexity,512,1,NA,5,1828.89280381192,NA 
rayol-farm2_2019-05-09_08-51-07.wav,44100,16,60,1,acoustic_complexity,512,1,NA,5,1821.81518939521,NA 
rayol-farm2_2019-05-09_08-53-07.wav,44100,16,60,1,acoustic_complexity,512,1,NA,5,1809.31866153304,NA 
rayol-farm2_2019-05-09_08-55-07.wav,44100,16,60,1,acoustic_complexity,512,1,NA,5,1830.57147735017,NA 
rayol-farm2_2019-05-09_08-57-07.wav,44100,16,60,1,acoustic_complexity,512,1,NA,5,1811.2478958304,NA 
rayol-farm2_2019-05-09_08-59-07.wav,44100,16,60,1,acoustic_complexity,512,1,NA,5,1828.73652509897,NA 
rayol-farm2_2019-05-09_09-01-07.wav,44100,16,60,1,acoustic_complexity,512,1,NA,5,1786.04271909554,NA 
rayol-farm2_2019-05-09_09-03-08.wav,44100,16,60,1,acoustic_complexity,512,1,NA,5,1782.33967862892,NA 
rayol-farm2_2019-05-09_09-05-08.wav,44100,16,60,1,acoustic_complexity,512,1,NA,5,1802.83797144144,NA 
rayol-farm2_2019-05-09_09-07-08.wav,44100,16,60,1,acoustic_complexity,512,1,NA,5,1797.17470870325,NA 
rayol-farm2_2019-05-09_09-09-08.wav,44100,16,60,1,acoustic_complexity,512,1,NA,5,1795.05144667489,NA 
rayol-farm2_2019-05-09_09-11-08.wav,44100,16,60,1,acoustic_complexity,512,1,NA,5,1826.75154177676,NA 
rayol-farm2_2019-05-09_09-13-08.wav,44100,16,60,1,acoustic_complexity,512,1,NA,5,1816.06843060941,NA 
rayol-farm2_2019-05-09_09-15-08.wav,44100,16,60,1,acoustic_complexity,512,1,NA,5,1807.2517605257,NA 
rayol-farm2_2019-05-09_09-17-08.wav,44100,16,60,1,acoustic_complexity,512,1,NA,5,1809.57376604048,NA 
rayol-farm2_2019-05-09_09-19-09.wav,44100,16,60,1,acoustic_complexity,512,1,NA,5,1806.25223803735,NA 
rayol-farm2_2019-05-09_09-21-09.wav,44100,16,60,1,acoustic_complexity,512,1,NA,5,1823.53582778223,NA 
rayol-farm2_2019-05-09_09-23-09.wav,44100,16,60,1,acoustic_complexity,512,1,NA,5,1827.20532094186,NA 
rayol-farm2_2019-05-09_09-25-09.wav,44100,16,60,1,acoustic_complexity,512,1,NA,5,1807.46773514178,NA 
rayol-farm2_2019-05-09_09-27-09.wav,44100,16,60,1,acoustic_complexity,512,1,NA,5,1819.52672407249,NA 
rayol-farm2_2019-05-09_09-29-09.wav,44100,16,60,1,acoustic_complexity,512,1,NA,5,1821.0379102997,NA 
rayol-farm2_2019-05-09_09-31-09.wav,44100,16,60,1,acoustic_complexity,512,1,NA,5,1840.24382801689,NA 
rayol-farm2_2019-05-09_09-33-09.wav,44100,16,60,1,acoustic_complexity,512,1,NA,5,1826.46789223135,NA 
rayol-farm2_2019-05-09_09-35-10.wav,44100,16,60,1,acoustic_complexity,512,1,NA,5,1821.32480553212,NA 
rayol-farm2_2019-05-09_09-37-10.wav,44100,16,60,1,acoustic_complexity,512,1,NA,5,1814.58457076354,NA 
rayol-farm2_2019-05-09_09-39-10.wav,44100,16,60,1,acoustic_complexity,512,1,NA,5,1822.54069338157,NA 
rayol-farm2_2019-05-09_09-41-10.wav,44100,16,60,1,acoustic_complexity,512,1,NA,5,1842.6230997695,NA 
rayol-farm2_2019-05-09_09-43-10.wav,44100,16,60,1,acoustic_complexity,512,1,NA,5,1811.73486451665,NA 
rayol-farm2_2019-05-09_09-45-10.wav,44100,16,60,1,acoustic_complexity,512,1,NA,5,1810.72411823489,NA 
rayol-farm2_2019-05-09_09-47-10.wav,44100,16,60,1,acoustic_complexity,512,1,NA,5,1840.22194360919,NA 
rayol-farm2_2019-05-09_09-49-10.wav,44100,16,60,1,acoustic_complexity,512,1,NA,5,1817.16175103379,NA 
rayol-farm2_2019-05-09_09-51-10.wav,44100,16,60,1,acoustic_complexity,512,1,NA,5,1822.8037861837,NA 
rayol-farm2_2019-05-09_09-53-11.wav,44100,16,60,1,acoustic_complexity,512,1,NA,5,1874.47827725641,NA 
rayol-farm2_2019-05-09_09-55-11.wav,44100,16,60,1,acoustic_complexity,512,1,NA,5,1900.55376615984,NA 
rayol-farm2_2019-05-09_09-57-11.wav,44100,16,60,1,acoustic_complexity,512,1,NA,5,1847.04278049905,NA 
rayol-farm2_2019-05-09_09-59-11.wav,44100,16,60,1,acoustic_complexity,512,1,NA,5,1827.35826574177,NA 
rayol-farm2_2019-05-09_10-01-11.wav,44100,16,60,1,acoustic_complexity,512,1,NA,5,1819.69712797428,NA 
rayol-farm2_2019-05-09_10-03-11.wav,44100,16,60,1,acoustic_complexity,512,1,NA,5,1824.44910166293,NA 
rayol-farm2_2019-05-09_10-05-11.wav,44100,16,60,1,acoustic_complexity,512,1,NA,5,1812.14884505735,NA 
rayol-farm2_2019-05-09_10-07-11.wav,44100,16,60,1,acoustic_complexity,512,1,NA,5,1821.87483243373,NA 
rayol-farm2_2019-05-09_10-09-12.wav,44100,16,60,1,acoustic_complexity,512,1,NA,5,1824.80155195507,NA 
rayol-farm2_2019-05-09_10-11-12.wav,44100,16,60,1,acoustic_complexity,512,1,NA,5,1842.87826126291,NA 
rayol-farm2_2019-05-09_10-13-12.wav,44100,16,60,1,acoustic_complexity,512,1,NA,5,1831.39209356432,NA 
rayol-farm2_2019-05-09_10-15-12.wav,44100,16,60,1,acoustic_complexity,512,1,NA,5,1845.97039586592,NA 
rayol-farm2_2019-05-09_10-17-12.wav,44100,16,60,1,acoustic_complexity,512,1,NA,5,1814.59083978581,NA 
rayol-farm2_2019-05-09_10-19-12.wav,44100,16,60,1,acoustic_complexity,512,1,NA,5,1834.8509249135,NA 
rayol-farm2_2019-05-09_10-21-12.wav,44100,16,60,1,acoustic_complexity,512,1,NA,5,1819.96238896981,NA 
rayol-farm2_2019-05-09_10-23-12.wav,44100,16,60,1,acoustic_complexity,512,1,NA,5,1823.94114903148,NA 
rayol-farm2_2019-05-09_10-25-13.wav,44100,16,60,1,acoustic_complexity,512,1,NA,5,1826.13016583894,NA 
rayol-farm2_2019-05-09_10-27-13.wav,44100,16,60,1,acoustic_complexity,512,1,NA,5,1817.54899102725,NA 
rayol-farm2_2019-05-09_10-29-13.wav,44100,16,60,1,acoustic_complexity,512,1,NA,5,1804.56669017597,NA 
rayol-farm2_2019-05-09_10-31-13.wav,44100,16,60,1,acoustic_complexity,512,1,NA,5,1821.82361088598,NA 
rayol-farm2_2019-05-09_10-33-13.wav,44100,16,60,1,acoustic_complexity,512,1,NA,5,1818.40973489,NA 
rayol-farm2_2019-05-09_10-35-13.wav,44100,16,60,1,acoustic_complexity,512,1,NA,5,1814.86729298355,NA 
rayol-farm2_2019-05-09_10-37-13.wav,44100,16,60,1,acoustic_complexity,512,1,NA,5,1821.24819037197,NA 
rayol-farm2_2019-05-09_10-39-13.wav,44100,16,60,1,acoustic_complexity,512,1,NA,5,1833.36362819776,NA 
rayol-farm2_2019-05-09_10-41-14.wav,44100,16,60,1,acoustic_complexity,512,1,NA,5,1826.90463629513,NA 
rayol-farm2_2019-05-09_10-43-14.wav,44100,16,60,1,acoustic_complexity,512,1,NA,5,1812.5046455445,NA 
rayol-farm2_2019-05-09_10-45-14.wav,44100,16,60,1,acoustic_complexity,512,1,NA,5,1825.74901342854,NA 
rayol-farm2_2019-05-09_10-47-14.wav,44100,16,60,1,acoustic_complexity,512,1,NA,5,1833.1657505617,NA 
rayol-farm2_2019-05-09_10-49-14.wav,44100,16,60,1,acoustic_complexity,512,1,NA,5,1834.39864767436,NA 
rayol-farm2_2019-05-09_10-51-14.wav,44100,16,60,1,acoustic_complexity,512,1,NA,5,1858.20934721926,NA 
rayol-farm2_2019-05-09_10-53-14.wav,44100,16,60,1,acoustic_complexity,512,1,NA,5,1822.13288564412,NA 
rayol-farm2_2019-05-09_10-55-14.wav,44100,16,60,1,acoustic_complexity,512,1,NA,5,1831.90061512061,NA 
rayol-farm2_2019-05-09_10-57-14.wav,44100,16,60,1,acoustic_complexity,512,1,NA,5,1813.67473030425,NA 
rayol-farm2_2019-05-09_10-59-15.wav,44100,16,60,1,acoustic_complexity,512,1,NA,5,1850.19283654889,NA 
rayol-farm2_2019-05-09_11-01-15.wav,44100,16,60,1,acoustic_complexity,512,1,NA,5,1827.02411923036,NA 
rayol-farm2_2019-05-09_11-03-15.wav,44100,16,60,1,acoustic_complexity,512,1,NA,5,1811.75461147071,NA 
rayol-farm2_2019-05-09_11-05-15.wav,44100,16,60,1,acoustic_complexity,512,1,NA,5,1851.14810999822,NA 
rayol-farm2_2019-05-09_11-07-15.wav,44100,16,60,1,acoustic_complexity,512,1,NA,5,1828.2408279895,NA 
rayol-farm2_2019-05-09_11-09-15.wav,44100,16,60,1,acoustic_complexity,512,1,NA,5,1832.01042982261,NA 
rayol-farm2_2019-05-09_11-11-15.wav,44100,16,60,1,acoustic_complexity,512,1,NA,5,1808.70198311995,NA 
rayol-farm2_2019-05-09_11-13-15.wav,44100,16,60,1,acoustic_complexity,512,1,NA,5,1846.64884228861,NA 
rayol-farm2_2019-05-09_11-15-16.wav,44100,16,60,1,acoustic_complexity,512,1,NA,5,1826.91726343014,NA 
rayol-farm2_2019-05-09_11-17-16.wav,44100,16,60,1,acoustic_complexity,512,1,NA,5,1836.72690094555,NA 
rayol-farm2_2019-05-09_11-19-16.wav,44100,16,60,1,acoustic_complexity,512,1,NA,5,1815.53580127444,NA 
rayol-farm2_2019-05-09_11-21-16.wav,44100,16,60,1,acoustic_complexity,512,1,NA,5,1823.71973981853,NA 
rayol-farm2_2019-05-09_11-23-16.wav,44100,16,60,1,acoustic_complexity,512,1,NA,5,1831.94444382629,NA 
rayol-farm2_2019-05-09_11-25-16.wav,44100,16,60,1,acoustic_complexity,512,1,NA,5,1839.32675621683,NA 
rayol-farm2_2019-05-09_11-27-16.wav,44100,16,60,1,acoustic_complexity,512,1,NA,5,1833.4940778043,NA 
rayol-farm2_2019-05-09_11-29-16.wav,44100,16,60,1,acoustic_complexity,512,1,NA,5,1807.91988615668,NA 
rayol-farm2_2019-05-09_11-31-17.wav,44100,16,60,1,acoustic_complexity,512,1,NA,5,1809.2113286369,NA 
rayol-farm2_2019-05-09_11-33-17.wav,44100,16,60,1,acoustic_complexity,512,1,NA,5,1827.40301225178,NA 
rayol-farm2_2019-05-09_11-35-17.wav,44100,16,60,1,acoustic_complexity,512,1,NA,5,1824.05802775455,NA 
rayol-farm2_2019-05-09_11-37-17.wav,44100,16,60,1,acoustic_complexity,512,1,NA,5,1818.38700894755,NA 
rayol-farm2_2019-05-09_11-39-17.wav,44100,16,60,1,acoustic_complexity,512,1,NA,5,1808.69470800466,NA 
rayol-farm2_2019-05-09_11-41-17.wav,44100,16,60,1,acoustic_complexity,512,1,NA,5,1831.25112839261,NA 
rayol-farm2_2019-05-09_11-43-17.wav,44100,16,60,1,acoustic_complexity,512,1,NA,5,1849.08133850419,NA 
rayol-farm2_2019-05-09_11-45-17.wav,44100,16,60,1,acoustic_complexity,512,1,NA,5,1833.79437676775,NA 
rayol-farm2_2019-05-09_11-47-18.wav,44100,16,60,1,acoustic_complexity,512,1,NA,5,1819.71871995456,NA 
rayol-farm2_2019-05-09_11-49-18.wav,44100,16,60,1,acoustic_complexity,512,1,NA,5,1866.43356066285,NA 
rayol-farm2_2019-05-09_11-51-18.wav,44100,16,60,1,acoustic_complexity,512,1,NA,5,1832.66962969155,NA 
rayol-farm2_2019-05-09_11-53-18.wav,44100,16,60,1,acoustic_complexity,512,1,NA,5,1860.72404928971,NA 
rayol-farm2_2019-05-09_11-55-18.wav,44100,16,60,1,acoustic_complexity,512,1,NA,5,1828.17440941653,NA 
rayol-farm2_2019-05-09_11-57-18.wav,44100,16,60,1,acoustic_complexity,512,1,NA,5,1833.61714214171,NA 
rayol-farm2_2019-05-09_11-59-18.wav,44100,16,60,1,acoustic_complexity,512,1,NA,5,1813.51836144509,NA 
rayol-farm2_2019-05-09_12-01-18.wav,44100,16,60,1,acoustic_complexity,512,1,NA,5,1813.69804645559,NA 
rayol-farm2_2019-05-09_12-03-18.wav,44100,16,60,1,acoustic_complexity,512,1,NA,5,1853.72111270992,NA 
rayol-farm2_2019-05-09_12-05-19.wav,44100,16,60,1,acoustic_complexity,512,1,NA,5,1847.8692244101,NA 
rayol-farm2_2019-05-09_12-07-19.wav,44100,16,60,1,acoustic_complexity,512,1,NA,5,1847.74059239563,NA 
rayol-farm2_2019-05-09_12-09-19.wav,44100,16,60,1,acoustic_complexity,512,1,NA,5,1879.30371087946,NA 
rayol-farm2_2019-05-09_12-11-19.wav,44100,16,60,1,acoustic_complexity,512,1,NA,5,1900.94978986858,NA 
rayol-farm2_2019-05-09_12-13-19.wav,44100,16,60,1,acoustic_complexity,512,1,NA,5,1851.11663908945,NA 
rayol-farm2_2019-05-09_12-15-19.wav,44100,16,60,1,acoustic_complexity,512,1,NA,5,1878.57043609178,NA 
rayol-farm2_2019-05-09_12-17-19.wav,44100,16,60,1,acoustic_complexity,512,1,NA,5,1842.54477228782,NA 
rayol-farm2_2019-05-09_12-19-19.wav,44100,16,60,1,acoustic_complexity,512,1,NA,5,1821.4905840421,NA 
rayol-farm2_2019-05-09_12-21-20.wav,44100,16,60,1,acoustic_complexity,512,1,NA,5,1819.14446813926,NA 
rayol-farm2_2019-05-09_12-23-20.wav,44100,16,60,1,acoustic_complexity,512,1,NA,5,1851.33203608146,NA 
rayol-farm2_2019-05-09_12-25-20.wav,44100,16,60,1,acoustic_complexity,512,1,NA,5,1841.65687036318,NA 
rayol-farm2_2019-05-09_12-27-20.wav,44100,16,60,1,acoustic_complexity,512,1,NA,5,1843.70431488056,NA 
rayol-farm2_2019-05-09_12-29-20.wav,44100,16,60,1,acoustic_complexity,512,1,NA,5,1827.08774690512,NA 
rayol-farm2_2019-05-09_12-31-20.wav,44100,16,60,1,acoustic_complexity,512,1,NA,5,1817.84786808518,NA 
rayol-farm2_2019-05-09_12-33-20.wav,44100,16,60,1,acoustic_complexity,512,1,NA,5,1847.85524578083,NA 
rayol-farm2_2019-05-09_12-35-20.wav,44100,16,60,1,acoustic_complexity,512,1,NA,5,1861.21300196375,NA 
rayol-farm2_2019-05-09_12-37-20.wav,44100,16,60,1,acoustic_complexity,512,1,NA,5,1850.53013989817,NA 
rayol-farm2_2019-05-09_12-39-21.wav,44100,16,60,1,acoustic_complexity,512,1,NA,5,1846.57392181506,NA 
rayol-farm2_2019-05-09_12-41-21.wav,44100,16,60,1,acoustic_complexity,512,1,NA,5,1835.83124818267,NA 
rayol-farm2_2019-05-09_12-43-21.wav,44100,16,60,1,acoustic_complexity,512,1,NA,5,1823.15855942431,NA 
rayol-farm2_2019-05-09_12-45-21.wav,44100,16,60,1,acoustic_complexity,512,1,NA,5,1850.68533429837,NA 
rayol-farm2_2019-05-09_12-47-21.wav,44100,16,60,1,acoustic_complexity,512,1,NA,5,1831.60172313131,NA 
rayol-farm2_2019-05-09_12-49-21.wav,44100,16,60,1,acoustic_complexity,512,1,NA,5,1849.02958795472,NA 
rayol-farm2_2019-05-09_12-51-21.wav,44100,16,60,1,acoustic_complexity,512,1,NA,5,1842.15965452321,NA 
rayol-farm2_2019-05-09_12-53-21.wav,44100,16,60,1,acoustic_complexity,512,1,NA,5,1859.33522247999,NA 
rayol-farm2_2019-05-09_12-55-22.wav,44100,16,60,1,acoustic_complexity,512,1,NA,5,1825.44194360487,NA 
rayol-farm2_2019-05-09_12-57-22.wav,44100,16,60,1,acoustic_complexity,512,1,NA,5,1809.73604839467,NA 
rayol-farm2_2019-05-09_12-59-22.wav,44100,16,60,1,acoustic_complexity,512,1,NA,5,1811.69905123656,NA 
rayol-farm2_2019-05-09_13-01-22.wav,44100,16,60,1,acoustic_complexity,512,1,NA,5,1845.71951806402,NA 
rayol-farm2_2019-05-09_13-03-22.wav,44100,16,60,1,acoustic_complexity,512,1,NA,5,1819.78226726076,NA 
rayol-farm2_2019-05-09_13-05-22.wav,44100,16,60,1,acoustic_complexity,512,1,NA,5,1810.78030395579,NA 
rayol-farm2_2019-05-09_13-07-22.wav,44100,16,60,1,acoustic_complexity,512,1,NA,5,1846.4614161509,NA 
rayol-farm2_2019-05-09_13-09-22.wav,44100,16,60,1,acoustic_complexity,512,1,NA,5,1841.54103599963,NA 
rayol-farm2_2019-05-09_13-11-23.wav,44100,16,60,1,acoustic_complexity,512,1,NA,5,1852.01289701015,NA 
rayol-farm2_2019-05-09_13-13-23.wav,44100,16,60,1,acoustic_complexity,512,1,NA,5,1951.06067878365,NA 
rayol-farm2_2019-05-09_13-15-23.wav,44100,16,60,1,acoustic_complexity,512,1,NA,5,1841.15159551285,NA 
rayol-farm2_2019-05-09_13-17-23.wav,44100,16,60,1,acoustic_complexity,512,1,NA,5,1835.50194187708,NA 
rayol-farm2_2019-05-09_13-19-23.wav,44100,16,60,1,acoustic_complexity,512,1,NA,5,1834.83164015486,NA 
rayol-farm2_2019-05-09_13-21-23.wav,44100,16,60,1,acoustic_complexity,512,1,NA,5,1812.67082343929,NA 
rayol-farm2_2019-05-09_13-23-23.wav,44100,16,60,1,acoustic_complexity,512,1,NA,5,1832.91159517078,NA 
rayol-farm2_2019-05-09_13-25-23.wav,44100,16,60,1,acoustic_complexity,512,1,NA,5,1837.0921062462,NA 
rayol-farm2_2019-05-09_13-27-23.wav,44100,16,60,1,acoustic_complexity,512,1,NA,5,1858.01519741727,NA 
rayol-farm2_2019-05-09_13-29-24.wav,44100,16,60,1,acoustic_complexity,512,1,NA,5,1812.37634132463,NA 
rayol-farm2_2019-05-09_13-31-24.wav,44100,16,60,1,acoustic_complexity,512,1,NA,5,1829.244939312,NA 
rayol-farm2_2019-05-09_13-33-24.wav,44100,16,60,1,acoustic_complexity,512,1,NA,5,1825.02512220477,NA 
rayol-farm2_2019-05-09_13-35-24.wav,44100,16,60,1,acoustic_complexity,512,1,NA,5,1853.25526775665,NA 
rayol-farm2_2019-05-09_13-37-24.wav,44100,16,60,1,acoustic_complexity,512,1,NA,5,1828.12447274827,NA 
rayol-farm2_2019-05-09_13-39-24.wav,44100,16,60,1,acoustic_complexity,512,1,NA,5,1825.61658998265,NA 
rayol-farm2_2019-05-09_13-41-24.wav,44100,16,60,1,acoustic_complexity,512,1,NA,5,1829.61374468596,NA 
rayol-farm2_2019-05-09_13-43-24.wav,44100,16,60,1,acoustic_complexity,512,1,NA,5,1811.00591783491,NA 
rayol-farm2_2019-05-09_13-45-25.wav,44100,16,60,1,acoustic_complexity,512,1,NA,5,1796.04226807371,NA 
rayol-farm2_2019-05-09_13-47-25.wav,44100,16,60,1,acoustic_complexity,512,1,NA,5,1805.99898847728,NA 
rayol-farm2_2019-05-09_13-49-25.wav,44100,16,60,1,acoustic_complexity,512,1,NA,5,1843.19976346519,NA 
rayol-farm2_2019-05-09_13-51-25.wav,44100,16,60,1,acoustic_complexity,512,1,NA,5,1832.32960198717,NA 
rayol-farm2_2019-05-09_13-53-25.wav,44100,16,60,1,acoustic_complexity,512,1,NA,5,1838.09170170533,NA 
rayol-farm2_2019-05-09_13-55-25.wav,44100,16,60,1,acoustic_complexity,512,1,NA,5,1823.43229865545,NA 
rayol-farm2_2019-05-09_13-57-25.wav,44100,16,60,1,acoustic_complexity,512,1,NA,5,1834.6616608714,NA 
rayol-farm2_2019-05-09_13-59-25.wav,44100,16,60,1,acoustic_complexity,512,1,NA,5,1804.87745475824,NA 
rayol-farm2_2019-05-09_14-01-26.wav,44100,16,60,1,acoustic_complexity,512,1,NA,5,1797.74762314154,NA 
rayol-farm2_2019-05-09_14-03-26.wav,44100,16,60,1,acoustic_complexity,512,1,NA,5,1826.01528983236,NA 
rayol-farm2_2019-05-09_14-05-26.wav,44100,16,60,1,acoustic_complexity,512,1,NA,5,1832.43990207329,NA 
rayol-farm2_2019-05-09_14-07-26.wav,44100,16,60,1,acoustic_complexity,512,1,NA,5,1822.46562620736,NA 
rayol-farm2_2019-05-09_14-09-26.wav,44100,16,60,1,acoustic_complexity,512,1,NA,5,1847.99907157097,NA 
rayol-farm2_2019-05-09_14-11-26.wav,44100,16,60,1,acoustic_complexity,512,1,NA,5,1888.10005310389,NA 
rayol-farm2_2019-05-09_14-13-26.wav,44100,16,60,1,acoustic_complexity,512,1,NA,5,1819.76781704819,NA 
rayol-farm2_2019-05-09_14-15-26.wav,44100,16,60,1,acoustic_complexity,512,1,NA,5,1827.24570288825,NA 
rayol-farm2_2019-05-09_14-17-26.wav,44100,16,60,1,acoustic_complexity,512,1,NA,5,1794.24866317649,NA 
rayol-farm2_2019-05-09_14-19-27.wav,44100,16,60,1,acoustic_complexity,512,1,NA,5,1816.28723492625,NA 
rayol-farm2_2019-05-09_14-21-27.wav,44100,16,60,1,acoustic_complexity,512,1,NA,5,1813.44661244962,NA 
rayol-farm2_2019-05-09_14-23-27.wav,44100,16,60,1,acoustic_complexity,512,1,NA,5,1803.69128444706,NA 
rayol-farm2_2019-05-09_14-25-27.wav,44100,16,60,1,acoustic_complexity,512,1,NA,5,1787.2613294915,NA 
rayol-farm2_2019-05-09_14-27-27.wav,44100,16,60,1,acoustic_complexity,512,1,NA,5,1794.47286622125,NA 
rayol-farm2_2019-05-09_14-29-27.wav,44100,16,60,1,acoustic_complexity,512,1,NA,5,1823.56861181276,NA 
rayol-farm2_2019-05-09_14-31-27.wav,44100,16,60,1,acoustic_complexity,512,1,NA,5,1793.98780958442,NA 
rayol-farm2_2019-05-09_14-33-27.wav,44100,16,60,1,acoustic_complexity,512,1,NA,5,1817.05859838583,NA 
rayol-farm2_2019-05-09_14-35-28.wav,44100,16,60,1,acoustic_complexity,512,1,NA,5,1802.25079245971,NA 
rayol-farm2_2019-05-09_14-37-28.wav,44100,16,60,1,acoustic_complexity,512,1,NA,5,1800.14358692408,NA 
rayol-farm2_2019-05-09_14-39-28.wav,44100,16,60,1,acoustic_complexity,512,1,NA,5,1779.8939432607,NA 
rayol-farm2_2019-05-09_14-41-28.wav,44100,16,60,1,acoustic_complexity,512,1,NA,5,1810.55706984142,NA 
rayol-farm2_2019-05-09_14-43-28.wav,44100,16,60,1,acoustic_complexity,512,1,NA,5,1827.18929351296,NA 
rayol-farm2_2019-05-09_14-45-28.wav,44100,16,60,1,acoustic_complexity,512,1,NA,5,1793.00646557409,NA 
rayol-farm2_2019-05-09_14-47-28.wav,44100,16,60,1,acoustic_complexity,512,1,NA,5,1814.69950252373,NA 
rayol-farm2_2019-05-09_14-49-28.wav,44100,16,60,1,acoustic_complexity,512,1,NA,5,1802.62123646055,NA 
rayol-farm2_2019-05-09_14-51-28.wav,44100,16,60,1,acoustic_complexity,512,1,NA,5,1797.29785107614,NA 
rayol-farm2_2019-05-09_14-53-29.wav,44100,16,60,1,acoustic_complexity,512,1,NA,5,1783.95578672925,NA 
rayol-farm2_2019-05-09_14-55-29.wav,44100,16,60,1,acoustic_complexity,512,1,NA,5,1806.7441896265,NA 
rayol-farm2_2019-05-09_14-57-29.wav,44100,16,60,1,acoustic_complexity,512,1,NA,5,1815.03738240909,NA 
rayol-farm2_2019-05-09_14-59-29.wav,44100,16,60,1,acoustic_complexity,512,1,NA,5,1757.11645684945,NA 
rayol-farm2_2019-05-09_15-01-29.wav,44100,16,60,1,acoustic_complexity,512,1,NA,5,1798.35451790782,NA 
rayol-farm2_2019-05-09_15-03-29.wav,44100,16,60,1,acoustic_complexity,512,1,NA,5,1803.92151897917,NA 
rayol-farm2_2019-05-09_15-05-29.wav,44100,16,60,1,acoustic_complexity,512,1,NA,5,1828.49739805483,NA 
rayol-farm2_2019-05-09_15-07-29.wav,44100,16,60,1,acoustic_complexity,512,1,NA,5,1800.75019403543,NA 
rayol-farm2_2019-05-09_15-09-30.wav,44100,16,60,1,acoustic_complexity,512,1,NA,5,1802.31171163448,NA 
rayol-farm2_2019-05-09_15-11-30.wav,44100,16,60,1,acoustic_complexity,512,1,NA,5,1834.91224509311,NA 
rayol-farm2_2019-05-09_15-13-30.wav,44100,16,60,1,acoustic_complexity,512,1,NA,5,1842.09336826168,NA 
rayol-farm2_2019-05-09_15-15-30.wav,44100,16,60,1,acoustic_complexity,512,1,NA,5,1830.9537944782,NA 
rayol-farm2_2019-05-09_15-17-30.wav,44100,16,60,1,acoustic_complexity,512,1,NA,5,1820.4156046868,NA 
rayol-farm2_2019-05-09_15-19-30.wav,44100,16,60,1,acoustic_complexity,512,1,NA,5,1872.19934567863,NA 
rayol-farm2_2019-05-09_15-21-30.wav,44100,16,60,1,acoustic_complexity,512,1,NA,5,1863.80535553776,NA 
rayol-farm2_2019-05-09_15-23-30.wav,44100,16,60,1,acoustic_complexity,512,1,NA,5,1837.59425232501,NA 
rayol-farm2_2019-05-09_15-25-31.wav,44100,16,60,1,acoustic_complexity,512,1,NA,5,1826.93416311438,NA 
rayol-farm2_2019-05-09_15-27-31.wav,44100,16,60,1,acoustic_complexity,512,1,NA,5,1818.83651017862,NA 
rayol-farm2_2019-05-09_15-29-31.wav,44100,16,60,1,acoustic_complexity,512,1,NA,5,1839.63413596243,NA 
rayol-farm2_2019-05-09_15-31-31.wav,44100,16,60,1,acoustic_complexity,512,1,NA,5,1843.05698955101,NA 
rayol-farm2_2019-05-09_15-33-31.wav,44100,16,60,1,acoustic_complexity,512,1,NA,5,1846.89113367606,NA 
rayol-farm2_2019-05-09_15-35-31.wav,44100,16,60,1,acoustic_complexity,512,1,NA,5,1854.25513444451,NA 
rayol-farm2_2019-05-09_15-37-31.wav,44100,16,60,1,acoustic_complexity,512,1,NA,5,1838.30703890429,NA 
rayol-farm2_2019-05-09_15-39-31.wav,44100,16,60,1,acoustic_complexity,512,1,NA,5,1818.18790806506,NA 
rayol-farm2_2019-05-09_15-41-32.wav,44100,16,60,1,acoustic_complexity,512,1,NA,5,1826.69800808016,NA 
rayol-farm2_2019-05-09_15-43-32.wav,44100,16,60,1,acoustic_complexity,512,1,NA,5,1830.33529760729,NA 
rayol-farm2_2019-05-09_15-45-32.wav,44100,16,60,1,acoustic_complexity,512,1,NA,5,1830.37906432788,NA 
rayol-farm2_2019-05-09_15-47-32.wav,44100,16,60,1,acoustic_complexity,512,1,NA,5,1835.89059726186,NA 
rayol-farm2_2019-05-09_15-49-32.wav,44100,16,60,1,acoustic_complexity,512,1,NA,5,1845.73034550134,NA 
rayol-farm2_2019-05-09_15-51-32.wav,44100,16,60,1,acoustic_complexity,512,1,NA,5,1836.572334907,NA 
rayol-farm2_2019-05-09_15-53-32.wav,44100,16,60,1,acoustic_complexity,512,1,NA,5,1841.54484592718,NA 
rayol-farm2_2019-05-09_15-55-32.wav,44100,16,60,1,acoustic_complexity,512,1,NA,5,1858.42671018798,NA 
rayol-farm2_2019-05-09_15-57-32.wav,44100,16,60,1,acoustic_complexity,512,1,NA,5,1801.34760729891,NA 
rayol-farm2_2019-05-09_15-59-33.wav,44100,16,60,1,acoustic_complexity,512,1,NA,5,1801.41717357284,NA 
rayol-farm2_2019-05-09_16-01-33.wav,44100,16,60,1,acoustic_complexity,512,1,NA,5,1798.17005229274,NA 
rayol-farm2_2019-05-09_16-03-33.wav,44100,16,60,1,acoustic_complexity,512,1,NA,5,1793.58736341631,NA 
rayol-farm2_2019-05-09_16-05-33.wav,44100,16,60,1,acoustic_complexity,512,1,NA,5,1800.25289472871,NA 
rayol-farm2_2019-05-09_16-07-33.wav,44100,16,60,1,acoustic_complexity,512,1,NA,5,1754.02060917678,NA 
rayol-farm2_2019-05-09_16-09-33.wav,44100,16,60,1,acoustic_complexity,512,1,NA,5,1785.41713130977,NA 
rayol-farm2_2019-05-09_16-11-33.wav,44100,16,60,1,acoustic_complexity,512,1,NA,5,1827.35240990606,NA 
rayol-farm2_2019-05-09_16-13-33.wav,44100,16,60,1,acoustic_complexity,512,1,NA,5,1789.77135677469,NA 
rayol-farm2_2019-05-09_16-15-34.wav,44100,16,60,1,acoustic_complexity,512,1,NA,5,1800.03374320858,NA 
rayol-farm2_2019-05-09_16-17-34.wav,44100,16,60,1,acoustic_complexity,512,1,NA,5,1794.05612437488,NA 
rayol-farm2_2019-05-09_16-19-34.wav,44100,16,60,1,acoustic_complexity,512,1,NA,5,1805.75068751325,NA 
rayol-farm2_2019-05-09_16-21-34.wav,44100,16,60,1,acoustic_complexity,512,1,NA,5,1809.13538977205,NA 
rayol-farm2_2019-05-09_16-23-34.wav,44100,16,60,1,acoustic_complexity,512,1,NA,5,1801.99934674058,NA 
rayol-farm2_2019-05-09_16-25-34.wav,44100,16,60,1,acoustic_complexity,512,1,NA,5,1789.35846362473,NA 
rayol-farm2_2019-05-09_16-27-34.wav,44100,16,60,1,acoustic_complexity,512,1,NA,5,1797.96538802169,NA 
rayol-farm2_2019-05-09_16-29-34.wav,44100,16,60,1,acoustic_complexity,512,1,NA,5,1814.25367517611,NA 
rayol-farm2_2019-05-09_16-31-35.wav,44100,16,60,1,acoustic_complexity,512,1,NA,5,1805.27795174039,NA 
rayol-farm2_2019-05-09_16-33-35.wav,44100,16,60,1,acoustic_complexity,512,1,NA,5,1799.71805162787,NA 
rayol-farm2_2019-05-09_16-35-35.wav,44100,16,60,1,acoustic_complexity,512,1,NA,5,1789.57265989217,NA 
rayol-farm2_2019-05-09_16-37-35.wav,44100,16,60,1,acoustic_complexity,512,1,NA,5,1803.78479910074,NA 
rayol-farm2_2019-05-09_16-39-35.wav,44100,16,60,1,acoustic_complexity,512,1,NA,5,1801.82660448033,NA 
rayol-farm2_2019-05-09_16-41-35.wav,44100,16,60,1,acoustic_complexity,512,1,NA,5,1801.89912775936,NA 
rayol-farm2_2019-05-09_16-43-35.wav,44100,16,60,1,acoustic_complexity,512,1,NA,5,1808.44099651968,NA 
rayol-farm2_2019-05-09_16-45-35.wav,44100,16,60,1,acoustic_complexity,512,1,NA,5,1802.28580080645,NA 
rayol-farm2_2019-05-09_16-47-36.wav,44100,16,60,1,acoustic_complexity,512,1,NA,5,1792.16964410559,NA 
rayol-farm2_2019-05-09_16-49-36.wav,44100,16,60,1,acoustic_complexity,512,1,NA,5,1790.71496532817,NA 
rayol-farm2_2019-05-09_16-51-36.wav,44100,16,60,1,acoustic_complexity,512,1,NA,5,1791.28181423909,NA 
rayol-farm2_2019-05-09_16-53-36.wav,44100,16,60,1,acoustic_complexity,512,1,NA,5,1802.07802180678,NA 
rayol-farm2_2019-05-09_16-55-36.wav,44100,16,60,1,acoustic_complexity,512,1,NA,5,1796.95384718073,NA 
rayol-farm2_2019-05-09_16-57-36.wav,44100,16,60,1,acoustic_complexity,512,1,NA,5,1798.09315298084,NA 
rayol-farm2_2019-05-09_16-59-36.wav,44100,16,60,1,acoustic_complexity,512,1,NA,5,1812.86574735354,NA 
rayol-farm2_2019-05-09_17-01-36.wav,44100,16,60,1,acoustic_complexity,512,1,NA,5,1813.25723977169,NA 
rayol-farm2_2019-05-09_17-03-36.wav,44100,16,60,1,acoustic_complexity,512,1,NA,5,1817.08555241492,NA 
rayol-farm2_2019-05-09_17-05-37.wav,44100,16,60,1,acoustic_complexity,512,1,NA,5,1808.87905442771,NA 
rayol-farm2_2019-05-09_17-07-37.wav,44100,16,60,1,acoustic_complexity,512,1,NA,5,1791.10022756591,NA 
rayol-farm2_2019-05-09_17-09-37.wav,44100,16,60,1,acoustic_complexity,512,1,NA,5,1801.92859698755,NA 
rayol-farm2_2019-05-09_17-11-37.wav,44100,16,60,1,acoustic_complexity,512,1,NA,5,1804.95322664732,NA 
rayol-farm2_2019-05-09_17-13-37.wav,44100,16,60,1,acoustic_complexity,512,1,NA,5,1790.33083736184,NA 
rayol-farm2_2019-05-09_17-15-37.wav,44100,16,60,1,acoustic_complexity,512,1,NA,5,1785.31692009775,NA 
rayol-farm2_2019-05-09_17-17-37.wav,44100,16,60,1,acoustic_complexity,512,1,NA,5,1796.12878399029,NA 
rayol-farm2_2019-05-09_17-19-37.wav,44100,16,60,1,acoustic_complexity,512,1,NA,5,1783.80791498585,NA 
rayol-farm2_2019-05-09_17-21-38.wav,44100,16,60,1,acoustic_complexity,512,1,NA,5,1766.60237307213,NA 
rayol-farm2_2019-05-09_17-23-38.wav,44100,16,60,1,acoustic_complexity,512,1,NA,5,1825.58293242082,NA 
rayol-farm2_2019-05-09_17-25-38.wav,44100,16,60,1,acoustic_complexity,512,1,NA,5,1804.25583217306,NA 
rayol-farm2_2019-05-09_17-27-38.wav,44100,16,60,1,acoustic_complexity,512,1,NA,5,1810.90216622972,NA 
rayol-farm2_2019-05-09_17-29-38.wav,44100,16,60,1,acoustic_complexity,512,1,NA,5,1805.40785732316,NA 
rayol-farm2_2019-05-09_17-31-38.wav,44100,16,60,1,acoustic_complexity,512,1,NA,5,1788.53164751988,NA 
rayol-farm2_2019-05-09_17-33-38.wav,44100,16,60,1,acoustic_complexity,512,1,NA,5,1799.86096929884,NA 
rayol-farm2_2019-05-09_17-35-38.wav,44100,16,60,1,acoustic_complexity,512,1,NA,5,1798.49109865377,NA 
rayol-farm2_2019-05-09_17-37-39.wav,44100,16,60,1,acoustic_complexity,512,1,NA,5,1799.76017212947,NA 
rayol-farm2_2019-05-09_17-39-39.wav,44100,16,60,1,acoustic_complexity,512,1,NA,5,1803.41751662107,NA 
rayol-farm2_2019-05-09_17-41-39.wav,44100,16,60,1,acoustic_complexity,512,1,NA,5,1775.29865239112,NA 
rayol-farm2_2019-05-09_17-43-39.wav,44100,16,60,1,acoustic_complexity,512,1,NA,5,1789.93768206352,NA 
rayol-farm2_2019-05-09_17-45-39.wav,44100,16,60,1,acoustic_complexity,512,1,NA,5,1817.10292450754,NA 
rayol-farm2_2019-05-09_17-47-39.wav,44100,16,60,1,acoustic_complexity,512,1,NA,5,1784.17959874212,NA 
rayol-farm2_2019-05-09_17-49-39.wav,44100,16,60,1,acoustic_complexity,512,1,NA,5,1804.99737648575,NA 
rayol-farm2_2019-05-09_17-51-39.wav,44100,16,60,1,acoustic_complexity,512,1,NA,5,1795.97619879978,NA 
rayol-farm2_2019-05-09_17-53-40.wav,44100,16,60,1,acoustic_complexity,512,1,NA,5,1799.28292386073,NA 
rayol-farm2_2019-05-09_17-55-40.wav,44100,16,60,1,acoustic_complexity,512,1,NA,5,1797.21431526779,NA 
rayol-farm2_2019-05-09_17-57-40.wav,44100,16,60,1,acoustic_complexity,512,1,NA,5,1809.06629589793,NA 
rayol-farm2_2019-05-09_17-59-40.wav,44100,16,60,1,acoustic_complexity,512,1,NA,5,1791.04030385598,NA 
rayol-farm2_2019-05-09_18-01-40.wav,44100,16,60,1,acoustic_complexity,512,1,NA,5,1802.40787158116,NA 
rayol-farm2_2019-05-09_18-03-40.wav,44100,16,60,1,acoustic_complexity,512,1,NA,5,1789.17117250216,NA 
rayol-farm2_2019-05-09_18-05-40.wav,44100,16,60,1,acoustic_complexity,512,1,NA,5,1802.22504325943,NA 
rayol-farm2_2019-05-09_18-07-40.wav,44100,16,60,1,acoustic_complexity,512,1,NA,5,1796.43326862532,NA 
rayol-farm2_2019-05-09_18-09-41.wav,44100,16,60,1,acoustic_complexity,512,1,NA,5,1794.67690602767,NA 
rayol-farm2_2019-05-09_18-11-41.wav,44100,16,60,1,acoustic_complexity,512,1,NA,5,1783.3513606569,NA 
rayol-farm2_2019-05-09_18-13-41.wav,44100,16,60,1,acoustic_complexity,512,1,NA,5,1798.49491048026,NA 
rayol-farm2_2019-05-09_18-15-41.wav,44100,16,60,1,acoustic_complexity,512,1,NA,5,1809.99911758289,NA 
rayol-farm2_2019-05-09_18-17-41.wav,44100,16,60,1,acoustic_complexity,512,1,NA,5,1807.18627522709,NA 
rayol-farm2_2019-05-09_18-19-41.wav,44100,16,60,1,acoustic_complexity,512,1,NA,5,1809.85326022597,NA 
rayol-farm2_2019-05-09_18-21-41.wav,44100,16,60,1,acoustic_complexity,512,1,NA,5,1789.6216591541,NA 
rayol-farm2_2019-05-09_18-23-41.wav,44100,16,60,1,acoustic_complexity,512,1,NA,5,1800.01395592535,NA 
rayol-farm2_2019-05-09_18-25-42.wav,44100,16,60,1,acoustic_complexity,512,1,NA,5,1781.26658175958,NA 
rayol-farm2_2019-05-09_18-27-42.wav,44100,16,60,1,acoustic_complexity,512,1,NA,5,1794.32497443144,NA 
rayol-farm2_2019-05-09_18-29-42.wav,44100,16,60,1,acoustic_complexity,512,1,NA,5,1794.22664349224,NA 
rayol-farm2_2019-05-09_18-31-42.wav,44100,16,60,1,acoustic_complexity,512,1,NA,5,1793.5261351865,NA 
rayol-farm2_2019-05-09_18-33-42.wav,44100,16,60,1,acoustic_complexity,512,1,NA,5,1793.35416351492,NA 
rayol-farm2_2019-05-09_18-35-42.wav,44100,16,60,1,acoustic_complexity,512,1,NA,5,1785.19939667231,NA 
rayol-farm2_2019-05-09_18-37-42.wav,44100,16,60,1,acoustic_complexity,512,1,NA,5,1783.40872257947,NA 
rayol-farm2_2019-05-09_18-39-42.wav,44100,16,60,1,acoustic_complexity,512,1,NA,5,1794.5340778214,NA 
rayol-farm2_2019-05-09_18-41-42.wav,44100,16,60,1,acoustic_complexity,512,1,NA,5,1791.12264588068,NA 
rayol-farm2_2019-05-09_18-43-43.wav,44100,16,60,1,acoustic_complexity,512,1,NA,5,1802.28791167666,NA 
rayol-farm2_2019-05-09_18-45-43.wav,44100,16,60,1,acoustic_complexity,512,1,NA,5,1803.19289491894,NA 
rayol-farm2_2019-05-09_18-47-43.wav,44100,16,60,1,acoustic_complexity,512,1,NA,5,1808.6600708536,NA 
rayol-farm2_2019-05-09_18-49-43.wav,44100,16,60,1,acoustic_complexity,512,1,NA,5,1792.73821870873,NA 
rayol-farm2_2019-05-09_18-51-43.wav,44100,16,60,1,acoustic_complexity,512,1,NA,5,1809.16075402214,NA 
rayol-farm2_2019-05-09_18-53-43.wav,44100,16,60,1,acoustic_complexity,512,1,NA,5,1792.28659616536,NA 
rayol-farm2_2019-05-09_18-55-43.wav,44100,16,60,1,acoustic_complexity,512,1,NA,5,1783.15149029458,NA 
rayol-farm2_2019-05-09_18-57-43.wav,44100,16,60,1,acoustic_complexity,512,1,NA,5,1794.92771227831,NA 
rayol-farm2_2019-05-09_18-59-44.wav,44100,16,60,1,acoustic_complexity,512,1,NA,5,1788.10162505194,NA 
rayol-farm2_2019-05-09_19-01-44.wav,44100,16,60,1,acoustic_complexity,512,1,NA,5,1796.11154030806,NA 
rayol-farm2_2019-05-09_19-03-44.wav,44100,16,60,1,acoustic_complexity,512,1,NA,5,1788.7940581947,NA 
rayol-farm2_2019-05-09_19-05-44.wav,44100,16,60,1,acoustic_complexity,512,1,NA,5,1795.90263702993,NA 
rayol-farm2_2019-05-09_19-07-44.wav,44100,16,60,1,acoustic_complexity,512,1,NA,5,1803.09448233794,NA 
rayol-farm2_2019-05-09_19-09-44.wav,44100,16,60,1,acoustic_complexity,512,1,NA,5,1816.31118366671,NA 
rayol-farm2_2019-05-09_19-11-44.wav,44100,16,60,1,acoustic_complexity,512,1,NA,5,1806.03428633283,NA 
rayol-farm2_2019-05-09_19-13-44.wav,44100,16,60,1,acoustic_complexity,512,1,NA,5,1818.74382432424,NA 
rayol-farm2_2019-05-09_19-15-45.wav,44100,16,60,1,acoustic_complexity,512,1,NA,5,1803.35284286075,NA 
rayol-farm2_2019-05-09_19-17-45.wav,44100,16,60,1,acoustic_complexity,512,1,NA,5,1793.53153626106,NA 
rayol-farm2_2019-05-09_19-19-45.wav,44100,16,60,1,acoustic_complexity,512,1,NA,5,1809.44088758132,NA 
rayol-farm2_2019-05-09_19-21-45.wav,44100,16,60,1,acoustic_complexity,512,1,NA,5,1806.70975805154,NA 
rayol-farm2_2019-05-09_19-23-45.wav,44100,16,60,1,acoustic_complexity,512,1,NA,5,1816.60107754064,NA 
rayol-farm2_2019-05-09_19-25-45.wav,44100,16,60,1,acoustic_complexity,512,1,NA,5,1817.22411882588,NA 
rayol-farm2_2019-05-09_19-27-45.wav,44100,16,60,1,acoustic_complexity,512,1,NA,5,1809.17029705727,NA 
rayol-farm2_2019-05-09_19-29-45.wav,44100,16,60,1,acoustic_complexity,512,1,NA,5,1818.50729514255,NA 
rayol-farm2_2019-05-09_19-31-46.wav,44100,16,60,1,acoustic_complexity,512,1,NA,5,1826.20480858136,NA 
rayol-farm2_2019-05-09_19-33-46.wav,44100,16,60,1,acoustic_complexity,512,1,NA,5,1814.09882058218,NA 
rayol-farm2_2019-05-09_19-35-46.wav,44100,16,60,1,acoustic_complexity,512,1,NA,5,1823.49036935286,NA 
rayol-farm2_2019-05-09_19-37-46.wav,44100,16,60,1,acoustic_complexity,512,1,NA,5,1824.34251622694,NA 
rayol-farm2_2019-05-09_19-39-46.wav,44100,16,60,1,acoustic_complexity,512,1,NA,5,1810.15631232381,NA 
rayol-farm2_2019-05-09_19-41-46.wav,44100,16,60,1,acoustic_complexity,512,1,NA,5,1821.6927052141,NA 
rayol-farm2_2019-05-09_19-43-46.wav,44100,16,60,1,acoustic_complexity,512,1,NA,5,1828.47717814566,NA 
rayol-farm2_2019-05-09_19-45-46.wav,44100,16,60,1,acoustic_complexity,512,1,NA,5,1825.11709205815,NA 
rayol-farm2_2019-05-09_19-47-47.wav,44100,16,60,1,acoustic_complexity,512,1,NA,5,1815.07664929617,NA 
rayol-farm2_2019-05-09_19-49-47.wav,44100,16,60,1,acoustic_complexity,512,1,NA,5,1821.06910813378,NA 
rayol-farm2_2019-05-09_19-51-47.wav,44100,16,60,1,acoustic_complexity,512,1,NA,5,1810.30274288601,NA 
rayol-farm2_2019-05-09_19-53-47.wav,44100,16,60,1,acoustic_complexity,512,1,NA,5,1809.52004131392,NA 
rayol-farm2_2019-05-09_19-55-47.wav,44100,16,60,1,acoustic_complexity,512,1,NA,5,1817.7550858253,NA 
rayol-farm2_2019-05-09_19-57-47.wav,44100,16,60,1,acoustic_complexity,512,1,NA,5,1808.99484743092,NA 
rayol-farm2_2019-05-09_19-59-47.wav,44100,16,60,1,acoustic_complexity,512,1,NA,5,1819.78746419364,NA 
rayol-farm2_2019-05-09_20-01-47.wav,44100,16,60,1,acoustic_complexity,512,1,NA,5,1814.6750079072,NA 
rayol-farm2_2019-05-09_20-03-48.wav,44100,16,60,1,acoustic_complexity,512,1,NA,5,1800.8844098194,NA 
rayol-farm2_2019-05-09_20-05-48.wav,44100,16,60,1,acoustic_complexity,512,1,NA,5,1801.35244431071,NA 
rayol-farm2_2019-05-09_20-07-48.wav,44100,16,60,1,acoustic_complexity,512,1,NA,5,1816.37968785152,NA 
rayol-farm2_2019-05-09_20-09-48.wav,44100,16,60,1,acoustic_complexity,512,1,NA,5,1808.04322307723,NA 
rayol-farm2_2019-05-09_20-11-48.wav,44100,16,60,1,acoustic_complexity,512,1,NA,5,1817.97228081491,NA 
rayol-farm2_2019-05-09_20-13-48.wav,44100,16,60,1,acoustic_complexity,512,1,NA,5,1813.71073863166,NA 
rayol-farm2_2019-05-09_20-15-48.wav,44100,16,60,1,acoustic_complexity,512,1,NA,5,1817.46902208164,NA 
rayol-farm2_2019-05-09_20-17-48.wav,44100,16,60,1,acoustic_complexity,512,1,NA,5,1829.88858788524,NA 
rayol-farm2_2019-05-09_20-19-48.wav,44100,16,60,1,acoustic_complexity,512,1,NA,5,1820.25275696236,NA 
rayol-farm2_2019-05-09_20-21-49.wav,44100,16,60,1,acoustic_complexity,512,1,NA,5,1821.88114295323,NA 
rayol-farm2_2019-05-09_20-23-49.wav,44100,16,60,1,acoustic_complexity,512,1,NA,5,1807.05092299897,NA 
rayol-farm2_2019-05-09_20-25-49.wav,44100,16,60,1,acoustic_complexity,512,1,NA,5,1820.76009587635,NA 
rayol-farm2_2019-05-09_20-27-49.wav,44100,16,60,1,acoustic_complexity,512,1,NA,5,1813.68318983464,NA 
rayol-farm2_2019-05-09_20-29-49.wav,44100,16,60,1,acoustic_complexity,512,1,NA,5,1818.85135406819,NA 
rayol-farm2_2019-05-09_20-31-49.wav,44100,16,60,1,acoustic_complexity,512,1,NA,5,1812.05219485929,NA 
rayol-farm2_2019-05-09_20-33-49.wav,44100,16,60,1,acoustic_complexity,512,1,NA,5,1806.27661780115,NA 
rayol-farm2_2019-05-09_20-35-49.wav,44100,16,60,1,acoustic_complexity,512,1,NA,5,1835.39403370169,NA 
rayol-farm2_2019-05-09_20-37-50.wav,44100,16,60,1,acoustic_complexity,512,1,NA,5,1809.23773312739,NA 
rayol-farm2_2019-05-09_20-39-50.wav,44100,16,60,1,acoustic_complexity,512,1,NA,5,1804.69981964279,NA 
rayol-farm2_2019-05-09_20-41-50.wav,44100,16,60,1,acoustic_complexity,512,1,NA,5,1824.30538888567,NA 
rayol-farm2_2019-05-09_20-43-50.wav,44100,16,60,1,acoustic_complexity,512,1,NA,5,1806.96596650021,NA 
rayol-farm2_2019-05-09_20-45-50.wav,44100,16,60,1,acoustic_complexity,512,1,NA,5,1814.80770204895,NA 
rayol-farm2_2019-05-09_20-47-50.wav,44100,16,60,1,acoustic_complexity,512,1,NA,5,1816.57261572043,NA 
rayol-farm2_2019-05-09_20-49-50.wav,44100,16,60,1,acoustic_complexity,512,1,NA,5,1808.34308186166,NA 
rayol-farm2_2019-05-09_20-51-50.wav,44100,16,60,1,acoustic_complexity,512,1,NA,5,1807.80600983424,NA 
rayol-farm2_2019-05-09_20-53-51.wav,44100,16,60,1,acoustic_complexity,512,1,NA,5,1826.39280486335,NA 
rayol-farm2_2019-05-09_20-55-51.wav,44100,16,60,1,acoustic_complexity,512,1,NA,5,1799.57885362897,NA 
rayol-farm2_2019-05-09_20-57-51.wav,44100,16,60,1,acoustic_complexity,512,1,NA,5,1806.96014772862,NA 
rayol-farm2_2019-05-09_20-59-51.wav,44100,16,60,1,acoustic_complexity,512,1,NA,5,1809.14398401585,NA 
rayol-farm2_2019-05-09_21-01-51.wav,44100,16,60,1,acoustic_complexity,512,1,NA,5,1819.57685987481,NA 
rayol-farm2_2019-05-09_21-03-51.wav,44100,16,60,1,acoustic_complexity,512,1,NA,5,1808.62341025273,NA 
rayol-farm2_2019-05-09_21-05-51.wav,44100,16,60,1,acoustic_complexity,512,1,NA,5,1808.320065805,NA 
rayol-farm2_2019-05-09_21-07-51.wav,44100,16,60,1,acoustic_complexity,512,1,NA,5,1809.15847939424,NA 
rayol-farm2_2019-05-09_21-09-52.wav,44100,16,60,1,acoustic_complexity,512,1,NA,5,1803.96108351105,NA 
rayol-farm2_2019-05-09_21-11-52.wav,44100,16,60,1,acoustic_complexity,512,1,NA,5,1804.55888380645,NA 
rayol-farm2_2019-05-09_21-13-52.wav,44100,16,60,1,acoustic_complexity,512,1,NA,5,1814.35804186514,NA 
rayol-farm2_2019-05-09_21-15-52.wav,44100,16,60,1,acoustic_complexity,512,1,NA,5,1820.39339924289,NA 
rayol-farm2_2019-05-09_21-17-52.wav,44100,16,60,1,acoustic_complexity,512,1,NA,5,1818.43116743327,NA 
rayol-farm2_2019-05-09_21-19-52.wav,44100,16,60,1,acoustic_complexity,512,1,NA,5,1803.61936247128,NA 
rayol-farm2_2019-05-09_21-21-52.wav,44100,16,60,1,acoustic_complexity,512,1,NA,5,1809.56589246316,NA 
rayol-farm2_2019-05-09_21-23-52.wav,44100,16,60,1,acoustic_complexity,512,1,NA,5,1794.03430162499,NA 
rayol-farm2_2019-05-09_21-25-52.wav,44100,16,60,1,acoustic_complexity,512,1,NA,5,1803.37015462632,NA 
rayol-farm2_2019-05-09_21-27-53.wav,44100,16,60,1,acoustic_complexity,512,1,NA,5,1823.62365162264,NA 
rayol-farm2_2019-05-09_21-29-53.wav,44100,16,60,1,acoustic_complexity,512,1,NA,5,1794.06114469957,NA 
rayol-farm2_2019-05-09_21-31-53.wav,44100,16,60,1,acoustic_complexity,512,1,NA,5,1804.75114372032,NA 
rayol-farm2_2019-05-09_21-33-53.wav,44100,16,60,1,acoustic_complexity,512,1,NA,5,1793.54918617491,NA 
rayol-farm2_2019-05-09_21-35-53.wav,44100,16,60,1,acoustic_complexity,512,1,NA,5,1800.24749375088,NA 
rayol-farm2_2019-05-09_21-37-53.wav,44100,16,60,1,acoustic_complexity,512,1,NA,5,1804.73148571053,NA 
rayol-farm2_2019-05-09_21-39-53.wav,44100,16,60,1,acoustic_complexity,512,1,NA,5,1813.82476274567,NA 
rayol-farm2_2019-05-09_21-41-53.wav,44100,16,60,1,acoustic_complexity,512,1,NA,5,1810.20170923518,NA 
rayol-farm2_2019-05-09_21-43-54.wav,44100,16,60,1,acoustic_complexity,512,1,NA,5,1809.55245579333,NA 
rayol-farm2_2019-05-09_21-45-54.wav,44100,16,60,1,acoustic_complexity,512,1,NA,5,1799.73181929783,NA 
rayol-farm2_2019-05-09_21-47-54.wav,44100,16,60,1,acoustic_complexity,512,1,NA,5,1803.68630276284,NA 
rayol-farm2_2019-05-09_21-49-54.wav,44100,16,60,1,acoustic_complexity,512,1,NA,5,1797.71819721148,NA 
rayol-farm2_2019-05-09_21-51-54.wav,44100,16,60,1,acoustic_complexity,512,1,NA,5,1795.43971388466,NA 
rayol-farm2_2019-05-09_21-53-54.wav,44100,16,60,1,acoustic_complexity,512,1,NA,5,1805.61217289439,NA 
rayol-farm2_2019-05-09_21-55-54.wav,44100,16,60,1,acoustic_complexity,512,1,NA,5,1799.42292913918,NA 
rayol-farm2_2019-05-09_21-57-54.wav,44100,16,60,1,acoustic_complexity,512,1,NA,5,1807.35584064812,NA 
rayol-farm2_2019-05-09_21-59-55.wav,44100,16,60,1,acoustic_complexity,512,1,NA,5,1798.80841207167,NA 
rayol-farm2_2019-05-09_22-01-55.wav,44100,16,60,1,acoustic_complexity,512,1,NA,5,1812.31722161499,NA 
rayol-farm2_2019-05-09_22-03-55.wav,44100,16,60,1,acoustic_complexity,512,1,NA,5,1809.91528199322,NA 
rayol-farm2_2019-05-09_22-05-55.wav,44100,16,60,1,acoustic_complexity,512,1,NA,5,1805.59155347065,NA 
rayol-farm2_2019-05-09_22-07-55.wav,44100,16,60,1,acoustic_complexity,512,1,NA,5,1801.50155298223,NA 
rayol-farm2_2019-05-09_22-09-55.wav,44100,16,60,1,acoustic_complexity,512,1,NA,5,1815.60953108058,NA 
rayol-farm2_2019-05-09_22-11-55.wav,44100,16,60,1,acoustic_complexity,512,1,NA,5,1812.30122596214,NA 
rayol-farm2_2019-05-09_22-13-55.wav,44100,16,60,1,acoustic_complexity,512,1,NA,5,1819.34219014625,NA 
rayol-farm2_2019-05-09_22-15-56.wav,44100,16,60,1,acoustic_complexity,512,1,NA,5,1799.985555485,NA 
rayol-farm2_2019-05-09_22-17-56.wav,44100,16,60,1,acoustic_complexity,512,1,NA,5,1812.51617489577,NA 
rayol-farm2_2019-05-09_22-19-56.wav,44100,16,60,1,acoustic_complexity,512,1,NA,5,1790.09084563519,NA 
rayol-farm2_2019-05-09_22-21-56.wav,44100,16,60,1,acoustic_complexity,512,1,NA,5,1801.41249714114,NA 
rayol-farm2_2019-05-09_22-23-56.wav,44100,16,60,1,acoustic_complexity,512,1,NA,5,1811.0750488731,NA 
rayol-farm2_2019-05-09_22-25-56.wav,44100,16,60,1,acoustic_complexity,512,1,NA,5,1804.1800890021,NA 
rayol-farm2_2019-05-09_22-27-56.wav,44100,16,60,1,acoustic_complexity,512,1,NA,5,1815.27352951541,NA 
rayol-farm2_2019-05-09_22-29-56.wav,44100,16,60,1,acoustic_complexity,512,1,NA,5,1799.54439914044,NA 
rayol-farm2_2019-05-09_22-31-57.wav,44100,16,60,1,acoustic_complexity,512,1,NA,5,1817.3747226964,NA 
rayol-farm2_2019-05-09_22-33-57.wav,44100,16,60,1,acoustic_complexity,512,1,NA,5,1815.6181334935,NA 
rayol-farm2_2019-05-09_22-35-57.wav,44100,16,60,1,acoustic_complexity,512,1,NA,5,1809.06270888699,NA 
rayol-farm2_2019-05-09_22-37-57.wav,44100,16,60,1,acoustic_complexity,512,1,NA,5,1809.94969433866,NA 
rayol-farm2_2019-05-09_22-39-57.wav,44100,16,60,1,acoustic_complexity,512,1,NA,5,1819.03817299336,NA 
rayol-farm2_2019-05-09_22-41-57.wav,44100,16,60,1,acoustic_complexity,512,1,NA,5,1810.5758950293,NA 
rayol-farm2_2019-05-09_22-43-57.wav,44100,16,60,1,acoustic_complexity,512,1,NA,5,1812.9112442148,NA 
rayol-farm2_2019-05-09_22-45-57.wav,44100,16,60,1,acoustic_complexity,512,1,NA,5,1808.24789152861,NA 
rayol-farm2_2019-05-09_22-47-57.wav,44100,16,60,1,acoustic_complexity,512,1,NA,5,1800.95433156864,NA 
rayol-farm2_2019-05-09_22-49-58.wav,44100,16,60,1,acoustic_complexity,512,1,NA,5,1808.40997553801,NA 
rayol-farm2_2019-05-09_22-51-58.wav,44100,16,60,1,acoustic_complexity,512,1,NA,5,1807.72304262837,NA 
rayol-farm2_2019-05-09_22-53-58.wav,44100,16,60,1,acoustic_complexity,512,1,NA,5,1807.19944018548,NA 
rayol-farm2_2019-05-09_22-55-58.wav,44100,16,60,1,acoustic_complexity,512,1,NA,5,1809.80933086855,NA 
rayol-farm2_2019-05-09_22-57-58.wav,44100,16,60,1,acoustic_complexity,512,1,NA,5,1802.80066144932,NA 
rayol-farm2_2019-05-09_22-59-58.wav,44100,16,60,1,acoustic_complexity,512,1,NA,5,1806.21723017699,NA 
rayol-farm2_2019-05-09_23-01-58.wav,44100,16,60,1,acoustic_complexity,512,1,NA,5,1799.15276908383,NA 
rayol-farm2_2019-05-09_23-03-58.wav,44100,16,60,1,acoustic_complexity,512,1,NA,5,1820.61346610216,NA 
rayol-farm2_2019-05-09_23-05-59.wav,44100,16,60,1,acoustic_complexity,512,1,NA,5,1823.8635700881,NA 
rayol-farm2_2019-05-09_23-07-59.wav,44100,16,60,1,acoustic_complexity,512,1,NA,5,1811.16204324454,NA 
rayol-farm2_2019-05-09_23-09-59.wav,44100,16,60,1,acoustic_complexity,512,1,NA,5,1796.78235741204,NA 
rayol-farm2_2019-05-09_23-11-59.wav,44100,16,60,1,acoustic_complexity,512,1,NA,5,1814.84882669489,NA 
rayol-farm2_2019-05-09_23-13-59.wav,44100,16,60,1,acoustic_complexity,512,1,NA,5,1811.1029637537,NA 
rayol-farm2_2019-05-09_23-15-59.wav,44100,16,60,1,acoustic_complexity,512,1,NA,5,1810.41976830463,NA 
rayol-farm2_2019-05-09_23-17-59.wav,44100,16,60,1,acoustic_complexity,512,1,NA,5,1800.39487659788,NA 
rayol-farm2_2019-05-09_23-19-59.wav,44100,16,60,1,acoustic_complexity,512,1,NA,5,1815.63805509867,NA 
rayol-farm2_2019-05-09_23-22-00.wav,44100,16,60,1,acoustic_complexity,512,1,NA,5,1822.34081780818,NA 
rayol-farm2_2019-05-09_23-24-00.wav,44100,16,60,1,acoustic_complexity,512,1,NA,5,1807.11405796998,NA 
rayol-farm2_2019-05-09_23-26-00.wav,44100,16,60,1,acoustic_complexity,512,1,NA,5,1817.53855370635,NA 
rayol-farm2_2019-05-09_23-28-00.wav,44100,16,60,1,acoustic_complexity,512,1,NA,5,1804.9772413736,NA 
rayol-farm2_2019-05-09_23-30-00.wav,44100,16,60,1,acoustic_complexity,512,1,NA,5,1804.10650359653,NA 
rayol-farm2_2019-05-09_23-32-00.wav,44100,16,60,1,acoustic_complexity,512,1,NA,5,1822.69112758071,NA 
rayol-farm2_2019-05-09_23-34-00.wav,44100,16,60,1,acoustic_complexity,512,1,NA,5,1802.18959128809,NA 
rayol-farm2_2019-05-09_23-36-00.wav,44100,16,60,1,acoustic_complexity,512,1,NA,5,1815.55093433659,NA 
rayol-farm2_2019-05-09_23-38-01.wav,44100,16,60,1,acoustic_complexity,512,1,NA,5,1802.34712437233,NA 
rayol-farm2_2019-05-09_23-40-01.wav,44100,16,60,1,acoustic_complexity,512,1,NA,5,1807.61304675857,NA 
rayol-farm2_2019-05-09_23-42-01.wav,44100,16,60,1,acoustic_complexity,512,1,NA,5,1803.36968440122,NA 
rayol-farm2_2019-05-09_23-44-01.wav,44100,16,60,1,acoustic_complexity,512,1,NA,5,1803.63642537334,NA 
rayol-farm2_2019-05-09_23-46-01.wav,44100,16,60,1,acoustic_complexity,512,1,NA,5,1795.48755045024,NA 
rayol-farm2_2019-05-09_23-48-01.wav,44100,16,60,1,acoustic_complexity,512,1,NA,5,1808.12534307896,NA 
rayol-farm2_2019-05-09_23-50-01.wav,44100,16,60,1,acoustic_complexity,512,1,NA,5,1801.24831583973,NA 
rayol-farm2_2019-05-09_23-52-01.wav,44100,16,60,1,acoustic_complexity,512,1,NA,5,1815.89602283465,NA 
rayol-farm2_2019-05-09_23-54-01.wav,44100,16,60,1,acoustic_complexity,512,1,NA,5,1813.76202728533,NA 
rayol-farm2_2019-05-09_23-56-02.wav,44100,16,60,1,acoustic_complexity,512,1,NA,5,1803.17425833577,NA 
rayol-farm2_2019-05-09_23-58-02.wav,44100,16,60,1,acoustic_complexity,512,1,NA,5,1809.9187084302,NA
