FILENAME,SAMPLINGRATE,BIT,DURATION,CHANNELS,INDEX,FFT_W,MIN_FREQ,MAX_FREQ,J,LEFT_CHANNEL,RIGHT_CHANNEL
rayol-farm2_2019-05-04_00-01-19.wav,44100,16,60,1,acoustic_complexity,512,1,NA,5,1794.13392948642,NA 
rayol-farm2_2019-05-04_00-03-19.wav,44100,16,60,1,acoustic_complexity,512,1,NA,5,1797.78590966545,NA 
rayol-farm2_2019-05-04_00-05-20.wav,44100,16,60,1,acoustic_complexity,512,1,NA,5,1790.1907865084,NA 
rayol-farm2_2019-05-04_00-07-20.wav,44100,16,60,1,acoustic_complexity,512,1,NA,5,1796.06034637095,NA 
rayol-farm2_2019-05-04_00-09-20.wav,44100,16,60,1,acoustic_complexity,512,1,NA,5,1801.39771340696,NA 
rayol-farm2_2019-05-04_00-11-20.wav,44100,16,60,1,acoustic_complexity,512,1,NA,5,1799.51337930029,NA 
rayol-farm2_2019-05-04_00-13-20.wav,44100,16,60,1,acoustic_complexity,512,1,NA,5,1817.33588243872,NA 
rayol-farm2_2019-05-04_00-15-20.wav,44100,16,60,1,acoustic_complexity,512,1,NA,5,1800.90195941471,NA 
rayol-farm2_2019-05-04_00-17-20.wav,44100,16,60,1,acoustic_complexity,512,1,NA,5,1807.1806243995,NA 
rayol-farm2_2019-05-04_00-19-20.wav,44100,16,60,1,acoustic_complexity,512,1,NA,5,1802.82066282118,NA 
rayol-farm2_2019-05-04_00-21-21.wav,44100,16,60,1,acoustic_complexity,512,1,NA,5,1792.6776940897,NA 
rayol-farm2_2019-05-04_00-23-21.wav,44100,16,60,1,acoustic_complexity,512,1,NA,5,1805.12129496417,NA 
rayol-farm2_2019-05-04_00-25-21.wav,44100,16,60,1,acoustic_complexity,512,1,NA,5,1802.9004150873,NA 
rayol-farm2_2019-05-04_00-27-21.wav,44100,16,60,1,acoustic_complexity,512,1,NA,5,1806.71027490988,NA 
rayol-farm2_2019-05-04_00-29-21.wav,44100,16,60,1,acoustic_complexity,512,1,NA,5,1815.10131718284,NA 
rayol-farm2_2019-05-04_00-31-21.wav,44100,16,60,1,acoustic_complexity,512,1,NA,5,1792.68134430146,NA 
rayol-farm2_2019-05-04_00-33-21.wav,44100,16,60,1,acoustic_complexity,512,1,NA,5,1801.75100088255,NA 
rayol-farm2_2019-05-04_00-35-21.wav,44100,16,60,1,acoustic_complexity,512,1,NA,5,1800.5237723687,NA 
rayol-farm2_2019-05-04_00-37-22.wav,44100,16,60,1,acoustic_complexity,512,1,NA,5,1805.25441434405,NA 
rayol-farm2_2019-05-04_00-39-22.wav,44100,16,60,1,acoustic_complexity,512,1,NA,5,1795.62716029123,NA 
rayol-farm2_2019-05-04_00-41-22.wav,44100,16,60,1,acoustic_complexity,512,1,NA,5,1807.94305347923,NA 
rayol-farm2_2019-05-04_00-43-22.wav,44100,16,60,1,acoustic_complexity,512,1,NA,5,1818.3124990012,NA 
rayol-farm2_2019-05-04_00-45-22.wav,44100,16,60,1,acoustic_complexity,512,1,NA,5,1811.54841935286,NA 
rayol-farm2_2019-05-04_00-47-22.wav,44100,16,60,1,acoustic_complexity,512,1,NA,5,1802.0381897807,NA 
rayol-farm2_2019-05-04_00-49-22.wav,44100,16,60,1,acoustic_complexity,512,1,NA,5,1805.89823349194,NA 
rayol-farm2_2019-05-04_00-51-22.wav,44100,16,60,1,acoustic_complexity,512,1,NA,5,1794.76668682084,NA 
rayol-farm2_2019-05-04_00-53-22.wav,44100,16,60,1,acoustic_complexity,512,1,NA,5,1796.94602601712,NA 
rayol-farm2_2019-05-04_00-55-23.wav,44100,16,60,1,acoustic_complexity,512,1,NA,5,1810.05776512097,NA 
rayol-farm2_2019-05-04_00-57-23.wav,44100,16,60,1,acoustic_complexity,512,1,NA,5,1796.78855755118,NA 
rayol-farm2_2019-05-04_00-59-23.wav,44100,16,60,1,acoustic_complexity,512,1,NA,5,1782.12147098562,NA 
rayol-farm2_2019-05-04_01-01-23.wav,44100,16,60,1,acoustic_complexity,512,1,NA,5,1811.18235200084,NA 
rayol-farm2_2019-05-04_01-03-23.wav,44100,16,60,1,acoustic_complexity,512,1,NA,5,1793.24536878479,NA 
rayol-farm2_2019-05-04_01-05-23.wav,44100,16,60,1,acoustic_complexity,512,1,NA,5,1795.93366979578,NA 
rayol-farm2_2019-05-04_01-07-23.wav,44100,16,60,1,acoustic_complexity,512,1,NA,5,1797.37413590543,NA 
rayol-farm2_2019-05-04_01-09-23.wav,44100,16,60,1,acoustic_complexity,512,1,NA,5,1795.85281816227,NA 
rayol-farm2_2019-05-04_01-11-24.wav,44100,16,60,1,acoustic_complexity,512,1,NA,5,1789.01242319662,NA 
rayol-farm2_2019-05-04_01-13-24.wav,44100,16,60,1,acoustic_complexity,512,1,NA,5,1793.04563204263,NA 
rayol-farm2_2019-05-04_01-15-24.wav,44100,16,60,1,acoustic_complexity,512,1,NA,5,1800.45455957224,NA 
rayol-farm2_2019-05-04_01-17-24.wav,44100,16,60,1,acoustic_complexity,512,1,NA,5,1807.78213184159,NA 
rayol-farm2_2019-05-04_01-19-24.wav,44100,16,60,1,acoustic_complexity,512,1,NA,5,1803.42875434688,NA 
rayol-farm2_2019-05-04_01-21-24.wav,44100,16,60,1,acoustic_complexity,512,1,NA,5,1806.53189123187,NA 
rayol-farm2_2019-05-04_01-23-24.wav,44100,16,60,1,acoustic_complexity,512,1,NA,5,1805.69933110033,NA 
rayol-farm2_2019-05-04_01-25-24.wav,44100,16,60,1,acoustic_complexity,512,1,NA,5,1803.53997223361,NA 
rayol-farm2_2019-05-04_01-27-25.wav,44100,16,60,1,acoustic_complexity,512,1,NA,5,1795.71684147315,NA 
rayol-farm2_2019-05-04_01-29-25.wav,44100,16,60,1,acoustic_complexity,512,1,NA,5,1801.83610386729,NA 
rayol-farm2_2019-05-04_01-31-25.wav,44100,16,60,1,acoustic_complexity,512,1,NA,5,1792.08977159078,NA 
rayol-farm2_2019-05-04_01-33-25.wav,44100,16,60,1,acoustic_complexity,512,1,NA,5,1802.53378598941,NA 
rayol-farm2_2019-05-04_01-35-25.wav,44100,16,60,1,acoustic_complexity,512,1,NA,5,1798.53486969651,NA 
rayol-farm2_2019-05-04_01-37-25.wav,44100,16,60,1,acoustic_complexity,512,1,NA,5,1789.96401740351,NA 
rayol-farm2_2019-05-04_01-39-25.wav,44100,16,60,1,acoustic_complexity,512,1,NA,5,1802.8422153393,NA 
rayol-farm2_2019-05-04_01-41-25.wav,44100,16,60,1,acoustic_complexity,512,1,NA,5,1792.72976674379,NA 
rayol-farm2_2019-05-04_01-43-25.wav,44100,16,60,1,acoustic_complexity,512,1,NA,5,1808.01705593308,NA 
rayol-farm2_2019-05-04_01-45-26.wav,44100,16,60,1,acoustic_complexity,512,1,NA,5,1785.96216542442,NA 
rayol-farm2_2019-05-04_01-47-26.wav,44100,16,60,1,acoustic_complexity,512,1,NA,5,1807.58915741313,NA 
rayol-farm2_2019-05-04_01-49-26.wav,44100,16,60,1,acoustic_complexity,512,1,NA,5,1791.91466364829,NA 
rayol-farm2_2019-05-04_01-51-26.wav,44100,16,60,1,acoustic_complexity,512,1,NA,5,1806.52603404751,NA 
rayol-farm2_2019-05-04_01-53-26.wav,44100,16,60,1,acoustic_complexity,512,1,NA,5,1807.78940489532,NA 
rayol-farm2_2019-05-04_01-55-26.wav,44100,16,60,1,acoustic_complexity,512,1,NA,5,1791.72212890667,NA 
rayol-farm2_2019-05-04_01-57-26.wav,44100,16,60,1,acoustic_complexity,512,1,NA,5,1803.37571987085,NA 
rayol-farm2_2019-05-04_01-59-26.wav,44100,16,60,1,acoustic_complexity,512,1,NA,5,1799.5667279127,NA 
rayol-farm2_2019-05-04_02-01-27.wav,44100,16,60,1,acoustic_complexity,512,1,NA,5,1808.63949644473,NA 
rayol-farm2_2019-05-04_02-03-27.wav,44100,16,60,1,acoustic_complexity,512,1,NA,5,1806.7616279561,NA 
rayol-farm2_2019-05-04_02-05-27.wav,44100,16,60,1,acoustic_complexity,512,1,NA,5,1803.63416183947,NA 
rayol-farm2_2019-05-04_02-07-27.wav,44100,16,60,1,acoustic_complexity,512,1,NA,5,1805.36868589245,NA 
rayol-farm2_2019-05-04_02-09-27.wav,44100,16,60,1,acoustic_complexity,512,1,NA,5,1806.16155629565,NA 
rayol-farm2_2019-05-04_02-11-27.wav,44100,16,60,1,acoustic_complexity,512,1,NA,5,1797.8432099064,NA 
rayol-farm2_2019-05-04_02-13-27.wav,44100,16,60,1,acoustic_complexity,512,1,NA,5,1802.35162741807,NA 
rayol-farm2_2019-05-04_02-15-27.wav,44100,16,60,1,acoustic_complexity,512,1,NA,5,1799.22204739615,NA 
rayol-farm2_2019-05-04_02-17-28.wav,44100,16,60,1,acoustic_complexity,512,1,NA,5,1808.36156642278,NA 
rayol-farm2_2019-05-04_02-19-28.wav,44100,16,60,1,acoustic_complexity,512,1,NA,5,1801.96478577956,NA 
rayol-farm2_2019-05-04_02-21-28.wav,44100,16,60,1,acoustic_complexity,512,1,NA,5,1799.396185311,NA 
rayol-farm2_2019-05-04_02-23-28.wav,44100,16,60,1,acoustic_complexity,512,1,NA,5,1804.58047550825,NA 
rayol-farm2_2019-05-04_02-25-28.wav,44100,16,60,1,acoustic_complexity,512,1,NA,5,1821.70377404892,NA 
rayol-farm2_2019-05-04_02-27-28.wav,44100,16,60,1,acoustic_complexity,512,1,NA,5,1801.02229106072,NA 
rayol-farm2_2019-05-04_02-29-28.wav,44100,16,60,1,acoustic_complexity,512,1,NA,5,1810.71676693432,NA 
rayol-farm2_2019-05-04_02-31-28.wav,44100,16,60,1,acoustic_complexity,512,1,NA,5,1792.38986848276,NA 
rayol-farm2_2019-05-04_02-33-28.wav,44100,16,60,1,acoustic_complexity,512,1,NA,5,1817.87672076816,NA 
rayol-farm2_2019-05-04_02-35-29.wav,44100,16,60,1,acoustic_complexity,512,1,NA,5,1807.60570782619,NA 
rayol-farm2_2019-05-04_02-37-29.wav,44100,16,60,1,acoustic_complexity,512,1,NA,5,1807.90223596908,NA 
rayol-farm2_2019-05-04_02-39-29.wav,44100,16,60,1,acoustic_complexity,512,1,NA,5,1788.69121550484,NA 
rayol-farm2_2019-05-04_02-41-29.wav,44100,16,60,1,acoustic_complexity,512,1,NA,5,1814.79618820616,NA 
rayol-farm2_2019-05-04_02-43-29.wav,44100,16,60,1,acoustic_complexity,512,1,NA,5,1800.57571908937,NA 
rayol-farm2_2019-05-04_02-45-29.wav,44100,16,60,1,acoustic_complexity,512,1,NA,5,1795.21077365417,NA 
rayol-farm2_2019-05-04_02-47-29.wav,44100,16,60,1,acoustic_complexity,512,1,NA,5,1804.05856437416,NA 
rayol-farm2_2019-05-04_02-49-29.wav,44100,16,60,1,acoustic_complexity,512,1,NA,5,1791.9312512536,NA 
rayol-farm2_2019-05-04_02-51-30.wav,44100,16,60,1,acoustic_complexity,512,1,NA,5,1805.13537836454,NA 
rayol-farm2_2019-05-04_02-53-30.wav,44100,16,60,1,acoustic_complexity,512,1,NA,5,1805.58121191662,NA 
rayol-farm2_2019-05-04_02-55-30.wav,44100,16,60,1,acoustic_complexity,512,1,NA,5,1805.33480140203,NA 
rayol-farm2_2019-05-04_02-57-30.wav,44100,16,60,1,acoustic_complexity,512,1,NA,5,1811.76706088772,NA 
rayol-farm2_2019-05-04_02-59-30.wav,44100,16,60,1,acoustic_complexity,512,1,NA,5,1801.8171173685,NA 
rayol-farm2_2019-05-04_03-01-30.wav,44100,16,60,1,acoustic_complexity,512,1,NA,5,1789.59899536689,NA 
rayol-farm2_2019-05-04_03-03-30.wav,44100,16,60,1,acoustic_complexity,512,1,NA,5,1805.78359088008,NA 
rayol-farm2_2019-05-04_03-05-30.wav,44100,16,60,1,acoustic_complexity,512,1,NA,5,1797.10831331726,NA 
rayol-farm2_2019-05-04_03-07-31.wav,44100,16,60,1,acoustic_complexity,512,1,NA,5,1796.55416741901,NA 
rayol-farm2_2019-05-04_03-09-31.wav,44100,16,60,1,acoustic_complexity,512,1,NA,5,1804.04923256727,NA 
rayol-farm2_2019-05-04_03-11-31.wav,44100,16,60,1,acoustic_complexity,512,1,NA,5,1820.99854003066,NA 
rayol-farm2_2019-05-04_03-13-31.wav,44100,16,60,1,acoustic_complexity,512,1,NA,5,1811.03021329546,NA 
rayol-farm2_2019-05-04_03-15-31.wav,44100,16,60,1,acoustic_complexity,512,1,NA,5,1810.94230254213,NA 
rayol-farm2_2019-05-04_03-17-31.wav,44100,16,60,1,acoustic_complexity,512,1,NA,5,1801.69322982637,NA 
rayol-farm2_2019-05-04_03-19-31.wav,44100,16,60,1,acoustic_complexity,512,1,NA,5,1802.18365233957,NA 
rayol-farm2_2019-05-04_03-21-31.wav,44100,16,60,1,acoustic_complexity,512,1,NA,5,1803.39916595824,NA 
rayol-farm2_2019-05-04_03-23-32.wav,44100,16,60,1,acoustic_complexity,512,1,NA,5,1805.90451588805,NA 
rayol-farm2_2019-05-04_03-25-32.wav,44100,16,60,1,acoustic_complexity,512,1,NA,5,1812.44943425778,NA 
rayol-farm2_2019-05-04_03-27-32.wav,44100,16,60,1,acoustic_complexity,512,1,NA,5,1797.78994883969,NA 
rayol-farm2_2019-05-04_03-29-32.wav,44100,16,60,1,acoustic_complexity,512,1,NA,5,1792.12027674328,NA 
rayol-farm2_2019-05-04_03-31-32.wav,44100,16,60,1,acoustic_complexity,512,1,NA,5,1802.07132437549,NA 
rayol-farm2_2019-05-04_03-33-32.wav,44100,16,60,1,acoustic_complexity,512,1,NA,5,1778.80444143773,NA 
rayol-farm2_2019-05-04_03-35-32.wav,44100,16,60,1,acoustic_complexity,512,1,NA,5,1794.55072209919,NA 
rayol-farm2_2019-05-04_03-37-32.wav,44100,16,60,1,acoustic_complexity,512,1,NA,5,1800.73703033044,NA 
rayol-farm2_2019-05-04_03-39-32.wav,44100,16,60,1,acoustic_complexity,512,1,NA,5,1807.74623306221,NA 
rayol-farm2_2019-05-04_03-41-33.wav,44100,16,60,1,acoustic_complexity,512,1,NA,5,1790.35388337776,NA 
rayol-farm2_2019-05-04_03-43-33.wav,44100,16,60,1,acoustic_complexity,512,1,NA,5,1794.74125713338,NA 
rayol-farm2_2019-05-04_03-45-33.wav,44100,16,60,1,acoustic_complexity,512,1,NA,5,1797.45531826895,NA 
rayol-farm2_2019-05-04_03-47-33.wav,44100,16,60,1,acoustic_complexity,512,1,NA,5,1796.97262457052,NA 
rayol-farm2_2019-05-04_03-49-33.wav,44100,16,60,1,acoustic_complexity,512,1,NA,5,1801.35711672481,NA 
rayol-farm2_2019-05-04_03-51-33.wav,44100,16,60,1,acoustic_complexity,512,1,NA,5,1807.97124627835,NA 
rayol-farm2_2019-05-04_03-53-33.wav,44100,16,60,1,acoustic_complexity,512,1,NA,5,1802.73496407019,NA 
rayol-farm2_2019-05-04_03-55-33.wav,44100,16,60,1,acoustic_complexity,512,1,NA,5,1785.80126919892,NA 
rayol-farm2_2019-05-04_03-57-34.wav,44100,16,60,1,acoustic_complexity,512,1,NA,5,1803.44398069395,NA 
rayol-farm2_2019-05-04_03-59-34.wav,44100,16,60,1,acoustic_complexity,512,1,NA,5,1807.25133430949,NA 
rayol-farm2_2019-05-04_04-01-34.wav,44100,16,60,1,acoustic_complexity,512,1,NA,5,1802.13411986664,NA 
rayol-farm2_2019-05-04_04-03-34.wav,44100,16,60,1,acoustic_complexity,512,1,NA,5,1800.64003752857,NA 
rayol-farm2_2019-05-04_04-05-34.wav,44100,16,60,1,acoustic_complexity,512,1,NA,5,1799.08692699895,NA 
rayol-farm2_2019-05-04_04-07-34.wav,44100,16,60,1,acoustic_complexity,512,1,NA,5,1804.34804694738,NA 
rayol-farm2_2019-05-04_04-09-34.wav,44100,16,60,1,acoustic_complexity,512,1,NA,5,1805.53624282907,NA 
rayol-farm2_2019-05-04_04-11-34.wav,44100,16,60,1,acoustic_complexity,512,1,NA,5,1798.87148786582,NA 
rayol-farm2_2019-05-04_04-13-35.wav,44100,16,60,1,acoustic_complexity,512,1,NA,5,1797.12208863853,NA 
rayol-farm2_2019-05-04_04-15-35.wav,44100,16,60,1,acoustic_complexity,512,1,NA,5,1792.05465164566,NA 
rayol-farm2_2019-05-04_04-17-35.wav,44100,16,60,1,acoustic_complexity,512,1,NA,5,1810.13414904188,NA 
rayol-farm2_2019-05-04_04-19-35.wav,44100,16,60,1,acoustic_complexity,512,1,NA,5,1813.24168720876,NA 
rayol-farm2_2019-05-04_04-21-35.wav,44100,16,60,1,acoustic_complexity,512,1,NA,5,1806.91647454081,NA 
rayol-farm2_2019-05-04_04-23-35.wav,44100,16,60,1,acoustic_complexity,512,1,NA,5,1799.38441584609,NA 
rayol-farm2_2019-05-04_04-25-35.wav,44100,16,60,1,acoustic_complexity,512,1,NA,5,1800.19566573426,NA 
rayol-farm2_2019-05-04_04-27-35.wav,44100,16,60,1,acoustic_complexity,512,1,NA,5,1802.27185879497,NA 
rayol-farm2_2019-05-04_04-29-35.wav,44100,16,60,1,acoustic_complexity,512,1,NA,5,1802.10213341798,NA 
rayol-farm2_2019-05-04_04-31-36.wav,44100,16,60,1,acoustic_complexity,512,1,NA,5,1802.70031593319,NA 
rayol-farm2_2019-05-04_04-33-36.wav,44100,16,60,1,acoustic_complexity,512,1,NA,5,1794.63009430483,NA 
rayol-farm2_2019-05-04_04-35-36.wav,44100,16,60,1,acoustic_complexity,512,1,NA,5,1812.44400044915,NA 
rayol-farm2_2019-05-04_04-37-36.wav,44100,16,60,1,acoustic_complexity,512,1,NA,5,1790.04410583213,NA 
rayol-farm2_2019-05-04_04-39-36.wav,44100,16,60,1,acoustic_complexity,512,1,NA,5,1792.83026311719,NA 
rayol-farm2_2019-05-04_04-41-36.wav,44100,16,60,1,acoustic_complexity,512,1,NA,5,1799.36158632072,NA 
rayol-farm2_2019-05-04_04-43-36.wav,44100,16,60,1,acoustic_complexity,512,1,NA,5,1786.2213750033,NA 
rayol-farm2_2019-05-04_04-45-36.wav,44100,16,60,1,acoustic_complexity,512,1,NA,5,1797.90349254247,NA 
rayol-farm2_2019-05-04_04-47-37.wav,44100,16,60,1,acoustic_complexity,512,1,NA,5,1817.06873113463,NA 
rayol-farm2_2019-05-04_04-49-37.wav,44100,16,60,1,acoustic_complexity,512,1,NA,5,1790.37393629972,NA 
rayol-farm2_2019-05-04_04-51-37.wav,44100,16,60,1,acoustic_complexity,512,1,NA,5,1800.33590668098,NA 
rayol-farm2_2019-05-04_04-53-37.wav,44100,16,60,1,acoustic_complexity,512,1,NA,5,1801.40357332249,NA 
rayol-farm2_2019-05-04_04-55-37.wav,44100,16,60,1,acoustic_complexity,512,1,NA,5,1804.14535346357,NA 
rayol-farm2_2019-05-04_04-57-37.wav,44100,16,60,1,acoustic_complexity,512,1,NA,5,1783.82898997613,NA 
rayol-farm2_2019-05-04_04-59-37.wav,44100,16,60,1,acoustic_complexity,512,1,NA,5,1800.29171612933,NA 
rayol-farm2_2019-05-04_05-01-37.wav,44100,16,60,1,acoustic_complexity,512,1,NA,5,1804.01924154569,NA 
rayol-farm2_2019-05-04_05-03-38.wav,44100,16,60,1,acoustic_complexity,512,1,NA,5,1797.92198738388,NA 
rayol-farm2_2019-05-04_05-05-38.wav,44100,16,60,1,acoustic_complexity,512,1,NA,5,1792.29795253393,NA 
rayol-farm2_2019-05-04_05-07-38.wav,44100,16,60,1,acoustic_complexity,512,1,NA,5,1806.52228763563,NA 
rayol-farm2_2019-05-04_05-09-38.wav,44100,16,60,1,acoustic_complexity,512,1,NA,5,1789.29287802012,NA 
rayol-farm2_2019-05-04_05-11-38.wav,44100,16,60,1,acoustic_complexity,512,1,NA,5,1805.65370551196,NA 
rayol-farm2_2019-05-04_05-13-38.wav,44100,16,60,1,acoustic_complexity,512,1,NA,5,1803.23346918747,NA 
rayol-farm2_2019-05-04_05-15-38.wav,44100,16,60,1,acoustic_complexity,512,1,NA,5,1790.98042938159,NA 
rayol-farm2_2019-05-04_05-17-38.wav,44100,16,60,1,acoustic_complexity,512,1,NA,5,1799.68155452234,NA 
rayol-farm2_2019-05-04_05-19-38.wav,44100,16,60,1,acoustic_complexity,512,1,NA,5,1822.14908763907,NA 
rayol-farm2_2019-05-04_05-21-39.wav,44100,16,60,1,acoustic_complexity,512,1,NA,5,1830.2701611147,NA 
rayol-farm2_2019-05-04_05-23-39.wav,44100,16,60,1,acoustic_complexity,512,1,NA,5,1837.47845617637,NA 
rayol-farm2_2019-05-04_05-25-39.wav,44100,16,60,1,acoustic_complexity,512,1,NA,5,1803.67560341737,NA 
rayol-farm2_2019-05-04_05-27-39.wav,44100,16,60,1,acoustic_complexity,512,1,NA,5,1801.85595287283,NA 
rayol-farm2_2019-05-04_05-29-39.wav,44100,16,60,1,acoustic_complexity,512,1,NA,5,1813.79265740547,NA 
rayol-farm2_2019-05-04_05-31-39.wav,44100,16,60,1,acoustic_complexity,512,1,NA,5,1796.77220008233,NA 
rayol-farm2_2019-05-04_05-33-39.wav,44100,16,60,1,acoustic_complexity,512,1,NA,5,1811.44565681826,NA 
rayol-farm2_2019-05-04_05-35-39.wav,44100,16,60,1,acoustic_complexity,512,1,NA,5,1814.77169444695,NA 
rayol-farm2_2019-05-04_05-37-40.wav,44100,16,60,1,acoustic_complexity,512,1,NA,5,1817.71190365136,NA 
rayol-farm2_2019-05-04_05-39-40.wav,44100,16,60,1,acoustic_complexity,512,1,NA,5,1804.41541215199,NA 
rayol-farm2_2019-05-04_05-41-40.wav,44100,16,60,1,acoustic_complexity,512,1,NA,5,1809.62844711611,NA 
rayol-farm2_2019-05-04_05-43-40.wav,44100,16,60,1,acoustic_complexity,512,1,NA,5,1814.05568868272,NA 
rayol-farm2_2019-05-04_05-45-40.wav,44100,16,60,1,acoustic_complexity,512,1,NA,5,1798.45625539514,NA 
rayol-farm2_2019-05-04_05-47-40.wav,44100,16,60,1,acoustic_complexity,512,1,NA,5,1810.12678060922,NA 
rayol-farm2_2019-05-04_05-49-40.wav,44100,16,60,1,acoustic_complexity,512,1,NA,5,1803.43331922608,NA 
rayol-farm2_2019-05-04_05-51-40.wav,44100,16,60,1,acoustic_complexity,512,1,NA,5,1818.69893999692,NA 
rayol-farm2_2019-05-04_05-53-41.wav,44100,16,60,1,acoustic_complexity,512,1,NA,5,1821.68652555328,NA 
rayol-farm2_2019-05-04_05-55-41.wav,44100,16,60,1,acoustic_complexity,512,1,NA,5,1814.81242471439,NA 
rayol-farm2_2019-05-04_05-57-41.wav,44100,16,60,1,acoustic_complexity,512,1,NA,5,1826.00564245299,NA 
rayol-farm2_2019-05-04_05-59-41.wav,44100,16,60,1,acoustic_complexity,512,1,NA,5,1806.49793818988,NA 
rayol-farm2_2019-05-04_06-01-41.wav,44100,16,60,1,acoustic_complexity,512,1,NA,5,1812.36342427361,NA 
rayol-farm2_2019-05-04_06-03-41.wav,44100,16,60,1,acoustic_complexity,512,1,NA,5,1817.62756017572,NA 
rayol-farm2_2019-05-04_06-05-41.wav,44100,16,60,1,acoustic_complexity,512,1,NA,5,1808.04017362238,NA 
rayol-farm2_2019-05-04_06-07-41.wav,44100,16,60,1,acoustic_complexity,512,1,NA,5,1807.74727292095,NA 
rayol-farm2_2019-05-04_06-09-42.wav,44100,16,60,1,acoustic_complexity,512,1,NA,5,1822.23412487972,NA 
rayol-farm2_2019-05-04_06-11-42.wav,44100,16,60,1,acoustic_complexity,512,1,NA,5,1817.45624062226,NA 
rayol-farm2_2019-05-04_06-13-42.wav,44100,16,60,1,acoustic_complexity,512,1,NA,5,1821.54630656238,NA 
rayol-farm2_2019-05-04_06-15-42.wav,44100,16,60,1,acoustic_complexity,512,1,NA,5,1807.4667254911,NA 
rayol-farm2_2019-05-04_06-17-42.wav,44100,16,60,1,acoustic_complexity,512,1,NA,5,1807.9366048053,NA 
rayol-farm2_2019-05-04_06-19-42.wav,44100,16,60,1,acoustic_complexity,512,1,NA,5,1808.76760867778,NA 
rayol-farm2_2019-05-04_06-21-42.wav,44100,16,60,1,acoustic_complexity,512,1,NA,5,1784.89269119667,NA 
rayol-farm2_2019-05-04_06-23-42.wav,44100,16,60,1,acoustic_complexity,512,1,NA,5,1801.2750195384,NA 
rayol-farm2_2019-05-04_06-25-42.wav,44100,16,60,1,acoustic_complexity,512,1,NA,5,1808.6240738659,NA 
rayol-farm2_2019-05-04_06-27-43.wav,44100,16,60,1,acoustic_complexity,512,1,NA,5,1803.48598674491,NA 
rayol-farm2_2019-05-04_06-29-43.wav,44100,16,60,1,acoustic_complexity,512,1,NA,5,1798.75342048088,NA 
rayol-farm2_2019-05-04_06-31-43.wav,44100,16,60,1,acoustic_complexity,512,1,NA,5,1790.46368584634,NA 
rayol-farm2_2019-05-04_06-33-43.wav,44100,16,60,1,acoustic_complexity,512,1,NA,5,1797.30808125163,NA 
rayol-farm2_2019-05-04_06-35-43.wav,44100,16,60,1,acoustic_complexity,512,1,NA,5,1806.93155316582,NA 
rayol-farm2_2019-05-04_06-37-43.wav,44100,16,60,1,acoustic_complexity,512,1,NA,5,1791.15961786337,NA 
rayol-farm2_2019-05-04_06-39-43.wav,44100,16,60,1,acoustic_complexity,512,1,NA,5,1800.51547843405,NA 
rayol-farm2_2019-05-04_06-41-43.wav,44100,16,60,1,acoustic_complexity,512,1,NA,5,1805.78348470535,NA 
rayol-farm2_2019-05-04_06-43-44.wav,44100,16,60,1,acoustic_complexity,512,1,NA,5,1807.15760263957,NA 
rayol-farm2_2019-05-04_06-45-44.wav,44100,16,60,1,acoustic_complexity,512,1,NA,5,1801.91542150423,NA 
rayol-farm2_2019-05-04_06-47-44.wav,44100,16,60,1,acoustic_complexity,512,1,NA,5,1839.21426750876,NA 
rayol-farm2_2019-05-04_06-49-44.wav,44100,16,60,1,acoustic_complexity,512,1,NA,5,1800.52683016212,NA 
rayol-farm2_2019-05-04_06-51-44.wav,44100,16,60,1,acoustic_complexity,512,1,NA,5,1800.4042757069,NA 
rayol-farm2_2019-05-04_06-53-44.wav,44100,16,60,1,acoustic_complexity,512,1,NA,5,1804.09576539825,NA 
rayol-farm2_2019-05-04_06-55-44.wav,44100,16,60,1,acoustic_complexity,512,1,NA,5,1805.30224383887,NA 
rayol-farm2_2019-05-04_06-57-44.wav,44100,16,60,1,acoustic_complexity,512,1,NA,5,1805.85106252016,NA 
rayol-farm2_2019-05-04_06-59-44.wav,44100,16,60,1,acoustic_complexity,512,1,NA,5,1814.09756935936,NA 
rayol-farm2_2019-05-04_07-01-45.wav,44100,16,60,1,acoustic_complexity,512,1,NA,5,1804.36497824429,NA 
rayol-farm2_2019-05-04_07-03-45.wav,44100,16,60,1,acoustic_complexity,512,1,NA,5,1797.45119210428,NA 
rayol-farm2_2019-05-04_07-05-45.wav,44100,16,60,1,acoustic_complexity,512,1,NA,5,1800.44369896762,NA 
rayol-farm2_2019-05-04_07-07-45.wav,44100,16,60,1,acoustic_complexity,512,1,NA,5,1818.15433327017,NA 
rayol-farm2_2019-05-04_07-09-45.wav,44100,16,60,1,acoustic_complexity,512,1,NA,5,1803.23235958645,NA 
rayol-farm2_2019-05-04_07-11-45.wav,44100,16,60,1,acoustic_complexity,512,1,NA,5,1812.20041920616,NA 
rayol-farm2_2019-05-04_07-13-45.wav,44100,16,60,1,acoustic_complexity,512,1,NA,5,1830.66094312378,NA 
rayol-farm2_2019-05-04_07-15-45.wav,44100,16,60,1,acoustic_complexity,512,1,NA,5,1821.39955153109,NA 
rayol-farm2_2019-05-04_07-17-46.wav,44100,16,60,1,acoustic_complexity,512,1,NA,5,1809.16222788638,NA 
rayol-farm2_2019-05-04_07-19-46.wav,44100,16,60,1,acoustic_complexity,512,1,NA,5,1805.28211045617,NA 
rayol-farm2_2019-05-04_07-21-46.wav,44100,16,60,1,acoustic_complexity,512,1,NA,5,1899.26828695485,NA 
rayol-farm2_2019-05-04_07-23-46.wav,44100,16,60,1,acoustic_complexity,512,1,NA,5,1915.21671509898,NA 
rayol-farm2_2019-05-04_07-25-46.wav,44100,16,60,1,acoustic_complexity,512,1,NA,5,1812.653766316,NA 
rayol-farm2_2019-05-04_07-27-46.wav,44100,16,60,1,acoustic_complexity,512,1,NA,5,1814.9788958852,NA 
rayol-farm2_2019-05-04_07-29-46.wav,44100,16,60,1,acoustic_complexity,512,1,NA,5,1798.9295185794,NA 
rayol-farm2_2019-05-04_07-31-46.wav,44100,16,60,1,acoustic_complexity,512,1,NA,5,1808.06466053233,NA 
rayol-farm2_2019-05-04_07-33-47.wav,44100,16,60,1,acoustic_complexity,512,1,NA,5,1802.83308358056,NA 
rayol-farm2_2019-05-04_07-35-47.wav,44100,16,60,1,acoustic_complexity,512,1,NA,5,1798.60319696428,NA 
rayol-farm2_2019-05-04_07-37-47.wav,44100,16,60,1,acoustic_complexity,512,1,NA,5,1797.04130214941,NA 
rayol-farm2_2019-05-04_07-39-47.wav,44100,16,60,1,acoustic_complexity,512,1,NA,5,1794.48095142016,NA 
rayol-farm2_2019-05-04_07-41-47.wav,44100,16,60,1,acoustic_complexity,512,1,NA,5,1812.10870476369,NA 
rayol-farm2_2019-05-04_07-43-47.wav,44100,16,60,1,acoustic_complexity,512,1,NA,5,1809.55099636217,NA 
rayol-farm2_2019-05-04_07-45-47.wav,44100,16,60,1,acoustic_complexity,512,1,NA,5,1798.49714800252,NA 
rayol-farm2_2019-05-04_07-47-47.wav,44100,16,60,1,acoustic_complexity,512,1,NA,5,1759.4880969198,NA 
rayol-farm2_2019-05-04_07-49-48.wav,44100,16,60,1,acoustic_complexity,512,1,NA,5,1792.36294134424,NA 
rayol-farm2_2019-05-04_07-51-48.wav,44100,16,60,1,acoustic_complexity,512,1,NA,5,1777.58407916012,NA 
rayol-farm2_2019-05-04_07-53-48.wav,44100,16,60,1,acoustic_complexity,512,1,NA,5,1793.75426232008,NA 
rayol-farm2_2019-05-04_07-55-48.wav,44100,16,60,1,acoustic_complexity,512,1,NA,5,1784.17986689927,NA 
rayol-farm2_2019-05-04_07-57-48.wav,44100,16,60,1,acoustic_complexity,512,1,NA,5,1790.94535781672,NA 
rayol-farm2_2019-05-04_07-59-48.wav,44100,16,60,1,acoustic_complexity,512,1,NA,5,1800.44778039583,NA 
rayol-farm2_2019-05-04_08-01-48.wav,44100,16,60,1,acoustic_complexity,512,1,NA,5,1792.5042163017,NA 
rayol-farm2_2019-05-04_08-03-48.wav,44100,16,60,1,acoustic_complexity,512,1,NA,5,1791.00309357076,NA 
rayol-farm2_2019-05-04_08-05-48.wav,44100,16,60,1,acoustic_complexity,512,1,NA,5,1796.05657876548,NA 
rayol-farm2_2019-05-04_08-07-49.wav,44100,16,60,1,acoustic_complexity,512,1,NA,5,1794.96297955216,NA 
rayol-farm2_2019-05-04_08-09-49.wav,44100,16,60,1,acoustic_complexity,512,1,NA,5,1793.62742306727,NA 
rayol-farm2_2019-05-04_08-11-49.wav,44100,16,60,1,acoustic_complexity,512,1,NA,5,1811.67007073463,NA 
rayol-farm2_2019-05-04_08-13-49.wav,44100,16,60,1,acoustic_complexity,512,1,NA,5,1817.87322508349,NA 
rayol-farm2_2019-05-04_08-15-49.wav,44100,16,60,1,acoustic_complexity,512,1,NA,5,1820.28004183714,NA 
rayol-farm2_2019-05-04_08-17-49.wav,44100,16,60,1,acoustic_complexity,512,1,NA,5,1806.61651693779,NA 
rayol-farm2_2019-05-04_08-19-49.wav,44100,16,60,1,acoustic_complexity,512,1,NA,5,1817.48013472265,NA 
rayol-farm2_2019-05-04_08-21-49.wav,44100,16,60,1,acoustic_complexity,512,1,NA,5,1895.30460237796,NA 
rayol-farm2_2019-05-04_08-23-50.wav,44100,16,60,1,acoustic_complexity,512,1,NA,5,1806.42941216323,NA 
rayol-farm2_2019-05-04_08-25-50.wav,44100,16,60,1,acoustic_complexity,512,1,NA,5,1820.63984122284,NA 
rayol-farm2_2019-05-04_08-27-50.wav,44100,16,60,1,acoustic_complexity,512,1,NA,5,1814.87652735519,NA 
rayol-farm2_2019-05-04_08-29-50.wav,44100,16,60,1,acoustic_complexity,512,1,NA,5,1824.89694337238,NA 
rayol-farm2_2019-05-04_08-31-50.wav,44100,16,60,1,acoustic_complexity,512,1,NA,5,1833.83512060175,NA 
rayol-farm2_2019-05-04_08-33-50.wav,44100,16,60,1,acoustic_complexity,512,1,NA,5,1814.88729436778,NA 
rayol-farm2_2019-05-04_08-35-50.wav,44100,16,60,1,acoustic_complexity,512,1,NA,5,1839.68463022891,NA 
rayol-farm2_2019-05-04_08-37-50.wav,44100,16,60,1,acoustic_complexity,512,1,NA,5,1823.85258124027,NA 
rayol-farm2_2019-05-04_08-39-51.wav,44100,16,60,1,acoustic_complexity,512,1,NA,5,1814.94784610583,NA 
rayol-farm2_2019-05-04_08-41-51.wav,44100,16,60,1,acoustic_complexity,512,1,NA,5,1823.44443104209,NA 
rayol-farm2_2019-05-04_08-43-51.wav,44100,16,60,1,acoustic_complexity,512,1,NA,5,1819.2347024738,NA 
rayol-farm2_2019-05-04_08-45-51.wav,44100,16,60,1,acoustic_complexity,512,1,NA,5,1820.65984202251,NA 
rayol-farm2_2019-05-04_08-47-51.wav,44100,16,60,1,acoustic_complexity,512,1,NA,5,1819.7748276941,NA 
rayol-farm2_2019-05-04_08-49-51.wav,44100,16,60,1,acoustic_complexity,512,1,NA,5,1817.80317830544,NA 
rayol-farm2_2019-05-04_08-51-51.wav,44100,16,60,1,acoustic_complexity,512,1,NA,5,1808.03918804827,NA 
rayol-farm2_2019-05-04_08-53-51.wav,44100,16,60,1,acoustic_complexity,512,1,NA,5,1810.11812028695,NA 
rayol-farm2_2019-05-04_08-55-51.wav,44100,16,60,1,acoustic_complexity,512,1,NA,5,1822.12628633089,NA 
rayol-farm2_2019-05-04_08-57-52.wav,44100,16,60,1,acoustic_complexity,512,1,NA,5,1814.58766991143,NA 
rayol-farm2_2019-05-04_08-59-52.wav,44100,16,60,1,acoustic_complexity,512,1,NA,5,1815.34481034477,NA 
rayol-farm2_2019-05-04_09-01-52.wav,44100,16,60,1,acoustic_complexity,512,1,NA,5,1823.29533590664,NA 
rayol-farm2_2019-05-04_09-03-52.wav,44100,16,60,1,acoustic_complexity,512,1,NA,5,1826.2124404355,NA 
rayol-farm2_2019-05-04_09-05-52.wav,44100,16,60,1,acoustic_complexity,512,1,NA,5,1814.97494735881,NA 
rayol-farm2_2019-05-04_09-07-52.wav,44100,16,60,1,acoustic_complexity,512,1,NA,5,1830.06054102613,NA 
rayol-farm2_2019-05-04_09-09-52.wav,44100,16,60,1,acoustic_complexity,512,1,NA,5,1808.73459571034,NA 
rayol-farm2_2019-05-04_09-11-52.wav,44100,16,60,1,acoustic_complexity,512,1,NA,5,1839.77857856838,NA 
rayol-farm2_2019-05-04_09-13-53.wav,44100,16,60,1,acoustic_complexity,512,1,NA,5,1824.23456022642,NA 
rayol-farm2_2019-05-04_09-15-53.wav,44100,16,60,1,acoustic_complexity,512,1,NA,5,1814.55168374213,NA 
rayol-farm2_2019-05-04_09-17-53.wav,44100,16,60,1,acoustic_complexity,512,1,NA,5,1828.79867150638,NA 
rayol-farm2_2019-05-04_09-19-53.wav,44100,16,60,1,acoustic_complexity,512,1,NA,5,1808.63876747676,NA 
rayol-farm2_2019-05-04_09-21-53.wav,44100,16,60,1,acoustic_complexity,512,1,NA,5,1812.41994139452,NA 
rayol-farm2_2019-05-04_09-23-53.wav,44100,16,60,1,acoustic_complexity,512,1,NA,5,1809.91916807035,NA 
rayol-farm2_2019-05-04_09-25-53.wav,44100,16,60,1,acoustic_complexity,512,1,NA,5,1833.27661808796,NA 
rayol-farm2_2019-05-04_09-27-53.wav,44100,16,60,1,acoustic_complexity,512,1,NA,5,1834.54501670113,NA 
rayol-farm2_2019-05-04_09-29-54.wav,44100,16,60,1,acoustic_complexity,512,1,NA,5,1818.06211761738,NA 
rayol-farm2_2019-05-04_09-31-54.wav,44100,16,60,1,acoustic_complexity,512,1,NA,5,1815.38392118104,NA 
rayol-farm2_2019-05-04_09-33-54.wav,44100,16,60,1,acoustic_complexity,512,1,NA,5,1818.63418581888,NA 
rayol-farm2_2019-05-04_09-35-54.wav,44100,16,60,1,acoustic_complexity,512,1,NA,5,1811.95828491244,NA 
rayol-farm2_2019-05-04_09-37-54.wav,44100,16,60,1,acoustic_complexity,512,1,NA,5,1825.887215979,NA 
rayol-farm2_2019-05-04_09-39-54.wav,44100,16,60,1,acoustic_complexity,512,1,NA,5,1819.57427676418,NA 
rayol-farm2_2019-05-04_09-41-54.wav,44100,16,60,1,acoustic_complexity,512,1,NA,5,1820.00953530928,NA 
rayol-farm2_2019-05-04_09-43-54.wav,44100,16,60,1,acoustic_complexity,512,1,NA,5,1824.90074875667,NA 
rayol-farm2_2019-05-04_09-45-55.wav,44100,16,60,1,acoustic_complexity,512,1,NA,5,1837.31950483466,NA 
rayol-farm2_2019-05-04_09-47-55.wav,44100,16,60,1,acoustic_complexity,512,1,NA,5,1818.53147896164,NA 
rayol-farm2_2019-05-04_09-49-55.wav,44100,16,60,1,acoustic_complexity,512,1,NA,5,1815.93127854832,NA 
rayol-farm2_2019-05-04_09-51-55.wav,44100,16,60,1,acoustic_complexity,512,1,NA,5,1804.32282736484,NA 
rayol-farm2_2019-05-04_09-53-55.wav,44100,16,60,1,acoustic_complexity,512,1,NA,5,1835.71435122415,NA 
rayol-farm2_2019-05-04_09-55-55.wav,44100,16,60,1,acoustic_complexity,512,1,NA,5,1825.400772657,NA 
rayol-farm2_2019-05-04_09-57-55.wav,44100,16,60,1,acoustic_complexity,512,1,NA,5,1832.25064326203,NA 
rayol-farm2_2019-05-04_09-59-55.wav,44100,16,60,1,acoustic_complexity,512,1,NA,5,1808.42092354926,NA 
rayol-farm2_2019-05-04_10-01-55.wav,44100,16,60,1,acoustic_complexity,512,1,NA,5,1815.92471446454,NA 
rayol-farm2_2019-05-04_10-03-56.wav,44100,16,60,1,acoustic_complexity,512,1,NA,5,1813.6500257357,NA 
rayol-farm2_2019-05-04_10-05-56.wav,44100,16,60,1,acoustic_complexity,512,1,NA,5,1806.562872884,NA 
rayol-farm2_2019-05-04_10-07-56.wav,44100,16,60,1,acoustic_complexity,512,1,NA,5,1820.29422725882,NA 
rayol-farm2_2019-05-04_10-09-56.wav,44100,16,60,1,acoustic_complexity,512,1,NA,5,1833.48046652328,NA 
rayol-farm2_2019-05-04_10-11-56.wav,44100,16,60,1,acoustic_complexity,512,1,NA,5,1816.99091712825,NA 
rayol-farm2_2019-05-04_10-13-56.wav,44100,16,60,1,acoustic_complexity,512,1,NA,5,1812.89227133591,NA 
rayol-farm2_2019-05-04_10-15-56.wav,44100,16,60,1,acoustic_complexity,512,1,NA,5,1824.43444151247,NA 
rayol-farm2_2019-05-04_10-17-56.wav,44100,16,60,1,acoustic_complexity,512,1,NA,5,1809.27645292424,NA 
rayol-farm2_2019-05-04_10-19-57.wav,44100,16,60,1,acoustic_complexity,512,1,NA,5,1812.41847986383,NA 
rayol-farm2_2019-05-04_10-21-57.wav,44100,16,60,1,acoustic_complexity,512,1,NA,5,1796.61921807035,NA 
rayol-farm2_2019-05-04_10-23-57.wav,44100,16,60,1,acoustic_complexity,512,1,NA,5,1817.17834310493,NA 
rayol-farm2_2019-05-04_10-25-57.wav,44100,16,60,1,acoustic_complexity,512,1,NA,5,1822.88927615897,NA 
rayol-farm2_2019-05-04_10-27-57.wav,44100,16,60,1,acoustic_complexity,512,1,NA,5,1816.66086315343,NA 
rayol-farm2_2019-05-04_10-29-57.wav,44100,16,60,1,acoustic_complexity,512,1,NA,5,1840.48766354713,NA 
rayol-farm2_2019-05-04_10-31-57.wav,44100,16,60,1,acoustic_complexity,512,1,NA,5,1818.76838699726,NA 
rayol-farm2_2019-05-04_10-33-57.wav,44100,16,60,1,acoustic_complexity,512,1,NA,5,1814.55331635218,NA 
rayol-farm2_2019-05-04_10-35-58.wav,44100,16,60,1,acoustic_complexity,512,1,NA,5,1830.21516043246,NA 
rayol-farm2_2019-05-04_10-37-58.wav,44100,16,60,1,acoustic_complexity,512,1,NA,5,1820.31180033204,NA 
rayol-farm2_2019-05-04_10-39-58.wav,44100,16,60,1,acoustic_complexity,512,1,NA,5,1817.24770076036,NA 
rayol-farm2_2019-05-04_10-41-58.wav,44100,16,60,1,acoustic_complexity,512,1,NA,5,1817.73972539486,NA 
rayol-farm2_2019-05-04_10-43-58.wav,44100,16,60,1,acoustic_complexity,512,1,NA,5,1811.33072370223,NA 
rayol-farm2_2019-05-04_10-45-58.wav,44100,16,60,1,acoustic_complexity,512,1,NA,5,1818.73071624398,NA 
rayol-farm2_2019-05-04_10-47-58.wav,44100,16,60,1,acoustic_complexity,512,1,NA,5,1821.63610767817,NA 
rayol-farm2_2019-05-04_10-49-58.wav,44100,16,60,1,acoustic_complexity,512,1,NA,5,1824.34943857177,NA 
rayol-farm2_2019-05-04_10-51-59.wav,44100,16,60,1,acoustic_complexity,512,1,NA,5,1813.42244443939,NA 
rayol-farm2_2019-05-04_10-53-59.wav,44100,16,60,1,acoustic_complexity,512,1,NA,5,1810.88417242921,NA 
rayol-farm2_2019-05-04_10-55-59.wav,44100,16,60,1,acoustic_complexity,512,1,NA,5,1829.73489981778,NA 
rayol-farm2_2019-05-04_10-57-59.wav,44100,16,60,1,acoustic_complexity,512,1,NA,5,1815.66592287522,NA 
rayol-farm2_2019-05-04_10-59-59.wav,44100,16,60,1,acoustic_complexity,512,1,NA,5,1823.07513062585,NA 
rayol-farm2_2019-05-04_11-01-59.wav,44100,16,60,1,acoustic_complexity,512,1,NA,5,1812.35495807254,NA 
rayol-farm2_2019-05-04_11-03-59.wav,44100,16,60,1,acoustic_complexity,512,1,NA,5,1825.58047041215,NA 
rayol-farm2_2019-05-04_11-05-59.wav,44100,16,60,1,acoustic_complexity,512,1,NA,5,1827.9086293103,NA 
rayol-farm2_2019-05-04_11-07-59.wav,44100,16,60,1,acoustic_complexity,512,1,NA,5,1804.84101091086,NA 
rayol-farm2_2019-05-04_11-10-00.wav,44100,16,60,1,acoustic_complexity,512,1,NA,5,1808.72725203502,NA 
rayol-farm2_2019-05-04_11-12-00.wav,44100,16,60,1,acoustic_complexity,512,1,NA,5,1815.19134367572,NA 
rayol-farm2_2019-05-04_11-14-00.wav,44100,16,60,1,acoustic_complexity,512,1,NA,5,1835.77494326481,NA 
rayol-farm2_2019-05-04_11-16-00.wav,44100,16,60,1,acoustic_complexity,512,1,NA,5,1821.14838179077,NA 
rayol-farm2_2019-05-04_11-18-00.wav,44100,16,60,1,acoustic_complexity,512,1,NA,5,1830.29772826538,NA 
rayol-farm2_2019-05-04_11-20-00.wav,44100,16,60,1,acoustic_complexity,512,1,NA,5,1830.8097396463,NA 
rayol-farm2_2019-05-04_11-22-00.wav,44100,16,60,1,acoustic_complexity,512,1,NA,5,1815.75911556896,NA 
rayol-farm2_2019-05-04_11-24-00.wav,44100,16,60,1,acoustic_complexity,512,1,NA,5,1806.06389480386,NA 
rayol-farm2_2019-05-04_11-26-01.wav,44100,16,60,1,acoustic_complexity,512,1,NA,5,1831.12427212588,NA 
rayol-farm2_2019-05-04_11-28-01.wav,44100,16,60,1,acoustic_complexity,512,1,NA,5,1818.78107764689,NA 
rayol-farm2_2019-05-04_11-30-01.wav,44100,16,60,1,acoustic_complexity,512,1,NA,5,1821.31633848821,NA 
rayol-farm2_2019-05-04_11-32-01.wav,44100,16,60,1,acoustic_complexity,512,1,NA,5,1818.47056620446,NA 
rayol-farm2_2019-05-04_11-34-01.wav,44100,16,60,1,acoustic_complexity,512,1,NA,5,1818.20618413399,NA 
rayol-farm2_2019-05-04_11-36-01.wav,44100,16,60,1,acoustic_complexity,512,1,NA,5,1807.02730675417,NA 
rayol-farm2_2019-05-04_11-38-01.wav,44100,16,60,1,acoustic_complexity,512,1,NA,5,1809.00733954596,NA 
rayol-farm2_2019-05-04_11-40-01.wav,44100,16,60,1,acoustic_complexity,512,1,NA,5,1816.30874325862,NA 
rayol-farm2_2019-05-04_11-42-02.wav,44100,16,60,1,acoustic_complexity,512,1,NA,5,1821.10045438446,NA 
rayol-farm2_2019-05-04_11-44-02.wav,44100,16,60,1,acoustic_complexity,512,1,NA,5,1813.5116406517,NA 
rayol-farm2_2019-05-04_11-46-02.wav,44100,16,60,1,acoustic_complexity,512,1,NA,5,1814.09957213502,NA 
rayol-farm2_2019-05-04_11-48-02.wav,44100,16,60,1,acoustic_complexity,512,1,NA,5,1824.11443147601,NA 
rayol-farm2_2019-05-04_11-50-02.wav,44100,16,60,1,acoustic_complexity,512,1,NA,5,1841.90670592607,NA 
rayol-farm2_2019-05-04_11-52-02.wav,44100,16,60,1,acoustic_complexity,512,1,NA,5,1804.62773927207,NA 
rayol-farm2_2019-05-04_11-54-02.wav,44100,16,60,1,acoustic_complexity,512,1,NA,5,1820.4595923233,NA 
rayol-farm2_2019-05-04_11-56-02.wav,44100,16,60,1,acoustic_complexity,512,1,NA,5,1818.20751769393,NA 
rayol-farm2_2019-05-04_11-58-02.wav,44100,16,60,1,acoustic_complexity,512,1,NA,5,1919.46187947947,NA 
rayol-farm2_2019-05-04_12-00-03.wav,44100,16,60,1,acoustic_complexity,512,1,NA,5,1814.72180790449,NA 
rayol-farm2_2019-05-04_12-02-03.wav,44100,16,60,1,acoustic_complexity,512,1,NA,5,1822.3096151267,NA 
rayol-farm2_2019-05-04_12-04-03.wav,44100,16,60,1,acoustic_complexity,512,1,NA,5,1817.84243921294,NA 
rayol-farm2_2019-05-04_12-06-03.wav,44100,16,60,1,acoustic_complexity,512,1,NA,5,1876.91562852228,NA 
rayol-farm2_2019-05-04_12-08-03.wav,44100,16,60,1,acoustic_complexity,512,1,NA,5,1824.65067041521,NA 
rayol-farm2_2019-05-04_12-10-03.wav,44100,16,60,1,acoustic_complexity,512,1,NA,5,1820.02059765836,NA 
rayol-farm2_2019-05-04_12-12-03.wav,44100,16,60,1,acoustic_complexity,512,1,NA,5,1816.90982153675,NA 
rayol-farm2_2019-05-04_12-14-03.wav,44100,16,60,1,acoustic_complexity,512,1,NA,5,1828.04425492746,NA 
rayol-farm2_2019-05-04_12-16-04.wav,44100,16,60,1,acoustic_complexity,512,1,NA,5,1826.66290934393,NA 
rayol-farm2_2019-05-04_12-18-04.wav,44100,16,60,1,acoustic_complexity,512,1,NA,5,1825.01658109474,NA 
rayol-farm2_2019-05-04_12-20-04.wav,44100,16,60,1,acoustic_complexity,512,1,NA,5,1835.06323918181,NA 
rayol-farm2_2019-05-04_12-22-04.wav,44100,16,60,1,acoustic_complexity,512,1,NA,5,1886.18333296129,NA 
rayol-farm2_2019-05-04_12-24-04.wav,44100,16,60,1,acoustic_complexity,512,1,NA,5,1828.90586478167,NA 
rayol-farm2_2019-05-04_12-26-04.wav,44100,16,60,1,acoustic_complexity,512,1,NA,5,1808.61972927142,NA 
rayol-farm2_2019-05-04_12-28-04.wav,44100,16,60,1,acoustic_complexity,512,1,NA,5,1862.95072652988,NA 
rayol-farm2_2019-05-04_12-30-04.wav,44100,16,60,1,acoustic_complexity,512,1,NA,5,1823.17620116682,NA 
rayol-farm2_2019-05-04_12-32-05.wav,44100,16,60,1,acoustic_complexity,512,1,NA,5,1817.26972012236,NA 
rayol-farm2_2019-05-04_12-34-05.wav,44100,16,60,1,acoustic_complexity,512,1,NA,5,1816.93746752322,NA 
rayol-farm2_2019-05-04_12-36-05.wav,44100,16,60,1,acoustic_complexity,512,1,NA,5,1830.19334455366,NA 
rayol-farm2_2019-05-04_12-38-05.wav,44100,16,60,1,acoustic_complexity,512,1,NA,5,1818.99948924259,NA 
rayol-farm2_2019-05-04_12-40-05.wav,44100,16,60,1,acoustic_complexity,512,1,NA,5,1815.41033614795,NA 
rayol-farm2_2019-05-04_12-42-05.wav,44100,16,60,1,acoustic_complexity,512,1,NA,5,1822.56989586164,NA 
rayol-farm2_2019-05-04_12-44-05.wav,44100,16,60,1,acoustic_complexity,512,1,NA,5,1835.11976275189,NA 
rayol-farm2_2019-05-04_12-46-05.wav,44100,16,60,1,acoustic_complexity,512,1,NA,5,1816.93456513979,NA 
rayol-farm2_2019-05-04_12-48-05.wav,44100,16,60,1,acoustic_complexity,512,1,NA,5,1826.53811658094,NA 
rayol-farm2_2019-05-04_12-50-06.wav,44100,16,60,1,acoustic_complexity,512,1,NA,5,1831.35486203303,NA 
rayol-farm2_2019-05-04_12-52-06.wav,44100,16,60,1,acoustic_complexity,512,1,NA,5,1817.20223083021,NA 
rayol-farm2_2019-05-04_12-54-06.wav,44100,16,60,1,acoustic_complexity,512,1,NA,5,1852.02987955902,NA 
rayol-farm2_2019-05-04_12-56-06.wav,44100,16,60,1,acoustic_complexity,512,1,NA,5,1804.38311049012,NA 
rayol-farm2_2019-05-04_12-58-06.wav,44100,16,60,1,acoustic_complexity,512,1,NA,5,1815.99455025273,NA 
rayol-farm2_2019-05-04_13-00-06.wav,44100,16,60,1,acoustic_complexity,512,1,NA,5,1817.97482779661,NA 
rayol-farm2_2019-05-04_13-02-06.wav,44100,16,60,1,acoustic_complexity,512,1,NA,5,1819.71455319916,NA 
rayol-farm2_2019-05-04_13-04-06.wav,44100,16,60,1,acoustic_complexity,512,1,NA,5,1838.84505117549,NA 
rayol-farm2_2019-05-04_13-06-07.wav,44100,16,60,1,acoustic_complexity,512,1,NA,5,1834.64096170163,NA 
rayol-farm2_2019-05-04_13-08-07.wav,44100,16,60,1,acoustic_complexity,512,1,NA,5,1854.12462824743,NA 
rayol-farm2_2019-05-04_13-10-07.wav,44100,16,60,1,acoustic_complexity,512,1,NA,5,1814.74780773562,NA 
rayol-farm2_2019-05-04_13-12-07.wav,44100,16,60,1,acoustic_complexity,512,1,NA,5,1814.45683648207,NA 
rayol-farm2_2019-05-04_13-14-07.wav,44100,16,60,1,acoustic_complexity,512,1,NA,5,1812.64659414055,NA 
rayol-farm2_2019-05-04_13-16-07.wav,44100,16,60,1,acoustic_complexity,512,1,NA,5,1841.92612130334,NA 
rayol-farm2_2019-05-04_13-18-07.wav,44100,16,60,1,acoustic_complexity,512,1,NA,5,1840.17839618618,NA 
rayol-farm2_2019-05-04_13-20-07.wav,44100,16,60,1,acoustic_complexity,512,1,NA,5,1799.04241358482,NA 
rayol-farm2_2019-05-04_13-22-08.wav,44100,16,60,1,acoustic_complexity,512,1,NA,5,1822.89483305689,NA 
rayol-farm2_2019-05-04_13-24-08.wav,44100,16,60,1,acoustic_complexity,512,1,NA,5,1805.18077008388,NA 
rayol-farm2_2019-05-04_13-26-08.wav,44100,16,60,1,acoustic_complexity,512,1,NA,5,1828.80186865579,NA 
rayol-farm2_2019-05-04_13-28-08.wav,44100,16,60,1,acoustic_complexity,512,1,NA,5,1825.85419947242,NA 
rayol-farm2_2019-05-04_13-30-08.wav,44100,16,60,1,acoustic_complexity,512,1,NA,5,1835.61592928124,NA 
rayol-farm2_2019-05-04_13-32-08.wav,44100,16,60,1,acoustic_complexity,512,1,NA,5,1832.4773367893,NA 
rayol-farm2_2019-05-04_13-34-08.wav,44100,16,60,1,acoustic_complexity,512,1,NA,5,1822.29204495723,NA 
rayol-farm2_2019-05-04_13-36-08.wav,44100,16,60,1,acoustic_complexity,512,1,NA,5,1827.34688251475,NA 
rayol-farm2_2019-05-04_13-38-08.wav,44100,16,60,1,acoustic_complexity,512,1,NA,5,1821.28661690715,NA 
rayol-farm2_2019-05-04_13-40-09.wav,44100,16,60,1,acoustic_complexity,512,1,NA,5,1813.91953105818,NA 
rayol-farm2_2019-05-04_13-42-09.wav,44100,16,60,1,acoustic_complexity,512,1,NA,5,1818.73790868545,NA 
rayol-farm2_2019-05-04_13-44-09.wav,44100,16,60,1,acoustic_complexity,512,1,NA,5,1813.6127392751,NA 
rayol-farm2_2019-05-04_13-46-09.wav,44100,16,60,1,acoustic_complexity,512,1,NA,5,1833.11566097703,NA 
rayol-farm2_2019-05-04_13-48-09.wav,44100,16,60,1,acoustic_complexity,512,1,NA,5,1813.18619023017,NA 
rayol-farm2_2019-05-04_13-50-09.wav,44100,16,60,1,acoustic_complexity,512,1,NA,5,1808.55890274325,NA 
rayol-farm2_2019-05-04_13-52-09.wav,44100,16,60,1,acoustic_complexity,512,1,NA,5,1822.04465575039,NA 
rayol-farm2_2019-05-04_13-54-09.wav,44100,16,60,1,acoustic_complexity,512,1,NA,5,1814.72655866969,NA 
rayol-farm2_2019-05-04_13-56-10.wav,44100,16,60,1,acoustic_complexity,512,1,NA,5,1818.40659431083,NA 
rayol-farm2_2019-05-04_13-58-10.wav,44100,16,60,1,acoustic_complexity,512,1,NA,5,1820.81748228698,NA 
rayol-farm2_2019-05-04_14-00-10.wav,44100,16,60,1,acoustic_complexity,512,1,NA,5,1806.7331897756,NA 
rayol-farm2_2019-05-04_14-02-10.wav,44100,16,60,1,acoustic_complexity,512,1,NA,5,1827.17752051632,NA 
rayol-farm2_2019-05-04_14-04-10.wav,44100,16,60,1,acoustic_complexity,512,1,NA,5,1830.11255148408,NA 
rayol-farm2_2019-05-04_14-06-10.wav,44100,16,60,1,acoustic_complexity,512,1,NA,5,1804.47379199459,NA 
rayol-farm2_2019-05-04_14-08-10.wav,44100,16,60,1,acoustic_complexity,512,1,NA,5,1818.8361675804,NA 
rayol-farm2_2019-05-04_14-10-10.wav,44100,16,60,1,acoustic_complexity,512,1,NA,5,1813.7848853599,NA 
rayol-farm2_2019-05-04_14-12-11.wav,44100,16,60,1,acoustic_complexity,512,1,NA,5,1818.91758534123,NA 
rayol-farm2_2019-05-04_14-14-11.wav,44100,16,60,1,acoustic_complexity,512,1,NA,5,1802.09407809246,NA 
rayol-farm2_2019-05-04_14-16-11.wav,44100,16,60,1,acoustic_complexity,512,1,NA,5,1823.80761983495,NA 
rayol-farm2_2019-05-04_14-18-11.wav,44100,16,60,1,acoustic_complexity,512,1,NA,5,1808.81273184511,NA 
rayol-farm2_2019-05-04_14-20-11.wav,44100,16,60,1,acoustic_complexity,512,1,NA,5,1830.41737605435,NA 
rayol-farm2_2019-05-04_14-22-11.wav,44100,16,60,1,acoustic_complexity,512,1,NA,5,1821.17066074197,NA 
rayol-farm2_2019-05-04_14-24-11.wav,44100,16,60,1,acoustic_complexity,512,1,NA,5,1816.30233690969,NA 
rayol-farm2_2019-05-04_14-26-11.wav,44100,16,60,1,acoustic_complexity,512,1,NA,5,1834.38842236112,NA 
rayol-farm2_2019-05-04_14-28-12.wav,44100,16,60,1,acoustic_complexity,512,1,NA,5,1821.26115756385,NA 
rayol-farm2_2019-05-04_14-30-12.wav,44100,16,60,1,acoustic_complexity,512,1,NA,5,1873.06285211837,NA 
rayol-farm2_2019-05-04_14-32-12.wav,44100,16,60,1,acoustic_complexity,512,1,NA,5,1845.04357567678,NA 
rayol-farm2_2019-05-04_14-34-12.wav,44100,16,60,1,acoustic_complexity,512,1,NA,5,1807.76212931777,NA 
rayol-farm2_2019-05-04_14-36-12.wav,44100,16,60,1,acoustic_complexity,512,1,NA,5,1856.90651047696,NA 
rayol-farm2_2019-05-04_14-38-12.wav,44100,16,60,1,acoustic_complexity,512,1,NA,5,1824.87727067694,NA 
rayol-farm2_2019-05-04_14-40-12.wav,44100,16,60,1,acoustic_complexity,512,1,NA,5,1812.70972404903,NA 
rayol-farm2_2019-05-04_14-42-12.wav,44100,16,60,1,acoustic_complexity,512,1,NA,5,1821.54546768365,NA 
rayol-farm2_2019-05-04_14-44-12.wav,44100,16,60,1,acoustic_complexity,512,1,NA,5,1814.5136437754,NA 
rayol-farm2_2019-05-04_14-46-13.wav,44100,16,60,1,acoustic_complexity,512,1,NA,5,1845.06983114325,NA 
rayol-farm2_2019-05-04_14-48-13.wav,44100,16,60,1,acoustic_complexity,512,1,NA,5,1833.78409481953,NA 
rayol-farm2_2019-05-04_14-50-13.wav,44100,16,60,1,acoustic_complexity,512,1,NA,5,1825.17215465535,NA 
rayol-farm2_2019-05-04_14-52-13.wav,44100,16,60,1,acoustic_complexity,512,1,NA,5,1825.3685644877,NA 
rayol-farm2_2019-05-04_14-54-13.wav,44100,16,60,1,acoustic_complexity,512,1,NA,5,1815.2664958541,NA 
rayol-farm2_2019-05-04_14-56-13.wav,44100,16,60,1,acoustic_complexity,512,1,NA,5,1810.52297511258,NA 
rayol-farm2_2019-05-04_14-58-13.wav,44100,16,60,1,acoustic_complexity,512,1,NA,5,1823.39010915042,NA 
rayol-farm2_2019-05-04_15-00-13.wav,44100,16,60,1,acoustic_complexity,512,1,NA,5,1821.16290250666,NA 
rayol-farm2_2019-05-04_15-02-14.wav,44100,16,60,1,acoustic_complexity,512,1,NA,5,1866.21880957722,NA 
rayol-farm2_2019-05-04_15-04-14.wav,44100,16,60,1,acoustic_complexity,512,1,NA,5,1825.72329909134,NA 
rayol-farm2_2019-05-04_15-06-14.wav,44100,16,60,1,acoustic_complexity,512,1,NA,5,1817.40865482539,NA 
rayol-farm2_2019-05-04_15-08-14.wav,44100,16,60,1,acoustic_complexity,512,1,NA,5,1816.44279580852,NA 
rayol-farm2_2019-05-04_15-10-14.wav,44100,16,60,1,acoustic_complexity,512,1,NA,5,1831.06992107016,NA 
rayol-farm2_2019-05-04_15-12-14.wav,44100,16,60,1,acoustic_complexity,512,1,NA,5,1809.2861699091,NA 
rayol-farm2_2019-05-04_15-14-14.wav,44100,16,60,1,acoustic_complexity,512,1,NA,5,1821.04152171773,NA 
rayol-farm2_2019-05-04_15-16-14.wav,44100,16,60,1,acoustic_complexity,512,1,NA,5,1804.9242235192,NA 
rayol-farm2_2019-05-04_15-18-15.wav,44100,16,60,1,acoustic_complexity,512,1,NA,5,1814.96897217944,NA 
rayol-farm2_2019-05-04_15-20-15.wav,44100,16,60,1,acoustic_complexity,512,1,NA,5,1825.50642901312,NA 
rayol-farm2_2019-05-04_15-22-15.wav,44100,16,60,1,acoustic_complexity,512,1,NA,5,1822.78494989941,NA 
rayol-farm2_2019-05-04_15-24-15.wav,44100,16,60,1,acoustic_complexity,512,1,NA,5,1802.05203844759,NA 
rayol-farm2_2019-05-04_15-26-15.wav,44100,16,60,1,acoustic_complexity,512,1,NA,5,1819.57759011719,NA 
rayol-farm2_2019-05-04_15-28-15.wav,44100,16,60,1,acoustic_complexity,512,1,NA,5,1789.42119324982,NA 
rayol-farm2_2019-05-04_15-30-15.wav,44100,16,60,1,acoustic_complexity,512,1,NA,5,1807.52382360028,NA 
rayol-farm2_2019-05-04_15-32-15.wav,44100,16,60,1,acoustic_complexity,512,1,NA,5,1821.90278197605,NA 
rayol-farm2_2019-05-04_15-34-16.wav,44100,16,60,1,acoustic_complexity,512,1,NA,5,1822.00314532963,NA 
rayol-farm2_2019-05-04_15-36-16.wav,44100,16,60,1,acoustic_complexity,512,1,NA,5,1809.90296437111,NA 
rayol-farm2_2019-05-04_15-38-16.wav,44100,16,60,1,acoustic_complexity,512,1,NA,5,1823.3572671135,NA 
rayol-farm2_2019-05-04_15-40-16.wav,44100,16,60,1,acoustic_complexity,512,1,NA,5,1837.41563431311,NA 
rayol-farm2_2019-05-04_15-42-16.wav,44100,16,60,1,acoustic_complexity,512,1,NA,5,1825.50004227659,NA 
rayol-farm2_2019-05-04_15-44-16.wav,44100,16,60,1,acoustic_complexity,512,1,NA,5,1811.00726343344,NA 
rayol-farm2_2019-05-04_15-46-16.wav,44100,16,60,1,acoustic_complexity,512,1,NA,5,1819.97363717131,NA 
rayol-farm2_2019-05-04_15-48-16.wav,44100,16,60,1,acoustic_complexity,512,1,NA,5,1818.50923081175,NA 
rayol-farm2_2019-05-04_15-50-16.wav,44100,16,60,1,acoustic_complexity,512,1,NA,5,1805.37973974297,NA 
rayol-farm2_2019-05-04_15-52-17.wav,44100,16,60,1,acoustic_complexity,512,1,NA,5,1804.91858365634,NA 
rayol-farm2_2019-05-04_15-54-17.wav,44100,16,60,1,acoustic_complexity,512,1,NA,5,1813.52242973389,NA 
rayol-farm2_2019-05-04_15-56-17.wav,44100,16,60,1,acoustic_complexity,512,1,NA,5,1823.22657913734,NA 
rayol-farm2_2019-05-04_15-58-17.wav,44100,16,60,1,acoustic_complexity,512,1,NA,5,1822.73685815177,NA 
rayol-farm2_2019-05-04_16-00-17.wav,44100,16,60,1,acoustic_complexity,512,1,NA,5,1818.51599911914,NA 
rayol-farm2_2019-05-04_16-02-17.wav,44100,16,60,1,acoustic_complexity,512,1,NA,5,1795.2148482829,NA 
rayol-farm2_2019-05-04_16-04-17.wav,44100,16,60,1,acoustic_complexity,512,1,NA,5,1834.85470486605,NA 
rayol-farm2_2019-05-04_16-06-17.wav,44100,16,60,1,acoustic_complexity,512,1,NA,5,1828.60161298267,NA 
rayol-farm2_2019-05-04_16-08-18.wav,44100,16,60,1,acoustic_complexity,512,1,NA,5,1818.76097664733,NA 
rayol-farm2_2019-05-04_16-10-18.wav,44100,16,60,1,acoustic_complexity,512,1,NA,5,1819.21429413201,NA 
rayol-farm2_2019-05-04_16-12-18.wav,44100,16,60,1,acoustic_complexity,512,1,NA,5,1822.50784561621,NA 
rayol-farm2_2019-05-04_16-14-18.wav,44100,16,60,1,acoustic_complexity,512,1,NA,5,1828.2504537187,NA 
rayol-farm2_2019-05-04_16-16-18.wav,44100,16,60,1,acoustic_complexity,512,1,NA,5,1806.82690548139,NA 
rayol-farm2_2019-05-04_16-18-18.wav,44100,16,60,1,acoustic_complexity,512,1,NA,5,1816.32004739637,NA 
rayol-farm2_2019-05-04_16-20-18.wav,44100,16,60,1,acoustic_complexity,512,1,NA,5,1820.39823796563,NA 
rayol-farm2_2019-05-04_16-22-18.wav,44100,16,60,1,acoustic_complexity,512,1,NA,5,1832.891883715,NA 
rayol-farm2_2019-05-04_16-24-19.wav,44100,16,60,1,acoustic_complexity,512,1,NA,5,1835.46647715263,NA 
rayol-farm2_2019-05-04_16-26-19.wav,44100,16,60,1,acoustic_complexity,512,1,NA,5,1813.93335110251,NA 
rayol-farm2_2019-05-04_16-28-19.wav,44100,16,60,1,acoustic_complexity,512,1,NA,5,1813.04334316973,NA 
rayol-farm2_2019-05-04_16-30-19.wav,44100,16,60,1,acoustic_complexity,512,1,NA,5,1807.03547865456,NA 
rayol-farm2_2019-05-04_16-32-19.wav,44100,16,60,1,acoustic_complexity,512,1,NA,5,1821.06726549363,NA 
rayol-farm2_2019-05-04_16-34-19.wav,44100,16,60,1,acoustic_complexity,512,1,NA,5,1811.2699959231,NA 
rayol-farm2_2019-05-04_16-36-19.wav,44100,16,60,1,acoustic_complexity,512,1,NA,5,1813.75251900065,NA 
rayol-farm2_2019-05-04_16-38-19.wav,44100,16,60,1,acoustic_complexity,512,1,NA,5,1816.09547066436,NA 
rayol-farm2_2019-05-04_16-40-20.wav,44100,16,60,1,acoustic_complexity,512,1,NA,5,1847.65152272811,NA 
rayol-farm2_2019-05-04_16-42-20.wav,44100,16,60,1,acoustic_complexity,512,1,NA,5,1810.85267988639,NA 
rayol-farm2_2019-05-04_16-44-20.wav,44100,16,60,1,acoustic_complexity,512,1,NA,5,1796.9201455529,NA 
rayol-farm2_2019-05-04_16-46-20.wav,44100,16,60,1,acoustic_complexity,512,1,NA,5,1820.19003966262,NA 
rayol-farm2_2019-05-04_16-48-20.wav,44100,16,60,1,acoustic_complexity,512,1,NA,5,1799.62785020977,NA 
rayol-farm2_2019-05-04_16-50-20.wav,44100,16,60,1,acoustic_complexity,512,1,NA,5,1777.00122432925,NA 
rayol-farm2_2019-05-04_16-52-20.wav,44100,16,60,1,acoustic_complexity,512,1,NA,5,1799.62150407198,NA 
rayol-farm2_2019-05-04_16-54-20.wav,44100,16,60,1,acoustic_complexity,512,1,NA,5,1800.82500047544,NA 
rayol-farm2_2019-05-04_16-56-21.wav,44100,16,60,1,acoustic_complexity,512,1,NA,5,1793.40300252552,NA 
rayol-farm2_2019-05-04_16-58-21.wav,44100,16,60,1,acoustic_complexity,512,1,NA,5,1798.43259225912,NA 
rayol-farm2_2019-05-04_17-00-21.wav,44100,16,60,1,acoustic_complexity,512,1,NA,5,1791.89853352818,NA 
rayol-farm2_2019-05-04_17-02-21.wav,44100,16,60,1,acoustic_complexity,512,1,NA,5,1796.84049928864,NA 
rayol-farm2_2019-05-04_17-04-21.wav,44100,16,60,1,acoustic_complexity,512,1,NA,5,1804.62500423664,NA 
rayol-farm2_2019-05-04_17-06-21.wav,44100,16,60,1,acoustic_complexity,512,1,NA,5,1797.00046085174,NA 
rayol-farm2_2019-05-04_17-08-21.wav,44100,16,60,1,acoustic_complexity,512,1,NA,5,1782.29946078778,NA 
rayol-farm2_2019-05-04_17-10-21.wav,44100,16,60,1,acoustic_complexity,512,1,NA,5,1793.62111875572,NA 
rayol-farm2_2019-05-04_17-12-21.wav,44100,16,60,1,acoustic_complexity,512,1,NA,5,1796.89268423707,NA 
rayol-farm2_2019-05-04_17-14-22.wav,44100,16,60,1,acoustic_complexity,512,1,NA,5,1786.99603306903,NA 
rayol-farm2_2019-05-04_17-16-22.wav,44100,16,60,1,acoustic_complexity,512,1,NA,5,1785.08875516602,NA 
rayol-farm2_2019-05-04_17-18-22.wav,44100,16,60,1,acoustic_complexity,512,1,NA,5,1807.263533253,NA 
rayol-farm2_2019-05-04_17-20-22.wav,44100,16,60,1,acoustic_complexity,512,1,NA,5,1785.993371099,NA 
rayol-farm2_2019-05-04_17-22-22.wav,44100,16,60,1,acoustic_complexity,512,1,NA,5,1779.92447772209,NA 
rayol-farm2_2019-05-04_17-24-22.wav,44100,16,60,1,acoustic_complexity,512,1,NA,5,1799.76997335577,NA 
rayol-farm2_2019-05-04_17-26-22.wav,44100,16,60,1,acoustic_complexity,512,1,NA,5,1790.93861374257,NA 
rayol-farm2_2019-05-04_17-28-22.wav,44100,16,60,1,acoustic_complexity,512,1,NA,5,1785.06376100742,NA 
rayol-farm2_2019-05-04_17-30-23.wav,44100,16,60,1,acoustic_complexity,512,1,NA,5,1806.83244792319,NA 
rayol-farm2_2019-05-04_17-32-23.wav,44100,16,60,1,acoustic_complexity,512,1,NA,5,1795.92123701997,NA 
rayol-farm2_2019-05-04_17-34-23.wav,44100,16,60,1,acoustic_complexity,512,1,NA,5,1809.91563023168,NA 
rayol-farm2_2019-05-04_17-36-23.wav,44100,16,60,1,acoustic_complexity,512,1,NA,5,1794.60589963928,NA 
rayol-farm2_2019-05-04_17-38-23.wav,44100,16,60,1,acoustic_complexity,512,1,NA,5,1821.45342589763,NA 
rayol-farm2_2019-05-04_17-40-23.wav,44100,16,60,1,acoustic_complexity,512,1,NA,5,1818.3546553208,NA 
rayol-farm2_2019-05-04_17-42-23.wav,44100,16,60,1,acoustic_complexity,512,1,NA,5,1802.39053090803,NA 
rayol-farm2_2019-05-04_17-44-23.wav,44100,16,60,1,acoustic_complexity,512,1,NA,5,1778.27842785294,NA 
rayol-farm2_2019-05-04_17-46-24.wav,44100,16,60,1,acoustic_complexity,512,1,NA,5,1799.40103401466,NA 
rayol-farm2_2019-05-04_17-48-24.wav,44100,16,60,1,acoustic_complexity,512,1,NA,5,1785.85199560029,NA 
rayol-farm2_2019-05-04_17-50-24.wav,44100,16,60,1,acoustic_complexity,512,1,NA,5,1797.44839374358,NA 
rayol-farm2_2019-05-04_17-52-24.wav,44100,16,60,1,acoustic_complexity,512,1,NA,5,1775.95977414427,NA 
rayol-farm2_2019-05-04_17-54-24.wav,44100,16,60,1,acoustic_complexity,512,1,NA,5,1842.2268608298,NA 
rayol-farm2_2019-05-04_17-56-24.wav,44100,16,60,1,acoustic_complexity,512,1,NA,5,1815.66810094446,NA 
rayol-farm2_2019-05-04_17-58-24.wav,44100,16,60,1,acoustic_complexity,512,1,NA,5,1803.56080830394,NA 
rayol-farm2_2019-05-04_18-00-24.wav,44100,16,60,1,acoustic_complexity,512,1,NA,5,1808.77117635411,NA 
rayol-farm2_2019-05-04_18-02-25.wav,44100,16,60,1,acoustic_complexity,512,1,NA,5,1827.66811926706,NA 
rayol-farm2_2019-05-04_18-04-25.wav,44100,16,60,1,acoustic_complexity,512,1,NA,5,1759.17329713863,NA 
rayol-farm2_2019-05-04_18-06-25.wav,44100,16,60,1,acoustic_complexity,512,1,NA,5,1802.03455848037,NA 
rayol-farm2_2019-05-04_18-08-25.wav,44100,16,60,1,acoustic_complexity,512,1,NA,5,1819.86259398406,NA 
rayol-farm2_2019-05-04_18-10-25.wav,44100,16,60,1,acoustic_complexity,512,1,NA,5,1823.40574950276,NA 
rayol-farm2_2019-05-04_18-12-25.wav,44100,16,60,1,acoustic_complexity,512,1,NA,5,1816.20892398689,NA 
rayol-farm2_2019-05-04_18-14-25.wav,44100,16,60,1,acoustic_complexity,512,1,NA,5,1807.51148910894,NA 
rayol-farm2_2019-05-04_18-16-25.wav,44100,16,60,1,acoustic_complexity,512,1,NA,5,1801.99492827243,NA 
rayol-farm2_2019-05-04_18-18-25.wav,44100,16,60,1,acoustic_complexity,512,1,NA,5,1803.09438901321,NA 
rayol-farm2_2019-05-04_18-20-26.wav,44100,16,60,1,acoustic_complexity,512,1,NA,5,1810.45409571046,NA 
rayol-farm2_2019-05-04_18-22-26.wav,44100,16,60,1,acoustic_complexity,512,1,NA,5,1807.43999633281,NA 
rayol-farm2_2019-05-04_18-24-26.wav,44100,16,60,1,acoustic_complexity,512,1,NA,5,1840.31234984418,NA 
rayol-farm2_2019-05-04_18-26-26.wav,44100,16,60,1,acoustic_complexity,512,1,NA,5,1804.74156654652,NA 
rayol-farm2_2019-05-04_18-28-26.wav,44100,16,60,1,acoustic_complexity,512,1,NA,5,1812.73110391846,NA 
rayol-farm2_2019-05-04_18-30-26.wav,44100,16,60,1,acoustic_complexity,512,1,NA,5,1809.21554993598,NA 
rayol-farm2_2019-05-04_18-32-26.wav,44100,16,60,1,acoustic_complexity,512,1,NA,5,1804.9594061679,NA 
rayol-farm2_2019-05-04_18-34-26.wav,44100,16,60,1,acoustic_complexity,512,1,NA,5,1819.3416377509,NA 
rayol-farm2_2019-05-04_18-36-27.wav,44100,16,60,1,acoustic_complexity,512,1,NA,5,1813.96676169106,NA 
rayol-farm2_2019-05-04_18-38-27.wav,44100,16,60,1,acoustic_complexity,512,1,NA,5,1806.92170426933,NA 
rayol-farm2_2019-05-04_18-40-27.wav,44100,16,60,1,acoustic_complexity,512,1,NA,5,1822.72812248876,NA 
rayol-farm2_2019-05-04_18-42-27.wav,44100,16,60,1,acoustic_complexity,512,1,NA,5,1839.68280117487,NA 
rayol-farm2_2019-05-04_18-44-27.wav,44100,16,60,1,acoustic_complexity,512,1,NA,5,1809.60017637383,NA 
rayol-farm2_2019-05-04_18-46-27.wav,44100,16,60,1,acoustic_complexity,512,1,NA,5,1823.90740630031,NA 
rayol-farm2_2019-05-04_18-48-27.wav,44100,16,60,1,acoustic_complexity,512,1,NA,5,1808.14343199608,NA 
rayol-farm2_2019-05-04_18-50-27.wav,44100,16,60,1,acoustic_complexity,512,1,NA,5,1807.53281817501,NA 
rayol-farm2_2019-05-04_18-52-28.wav,44100,16,60,1,acoustic_complexity,512,1,NA,5,1809.26852530381,NA 
rayol-farm2_2019-05-04_18-54-28.wav,44100,16,60,1,acoustic_complexity,512,1,NA,5,1813.96956310005,NA 
rayol-farm2_2019-05-04_18-56-28.wav,44100,16,60,1,acoustic_complexity,512,1,NA,5,1820.2690355029,NA 
rayol-farm2_2019-05-04_18-58-28.wav,44100,16,60,1,acoustic_complexity,512,1,NA,5,1820.39947620306,NA 
rayol-farm2_2019-05-04_19-00-28.wav,44100,16,60,1,acoustic_complexity,512,1,NA,5,1789.34919714449,NA 
rayol-farm2_2019-05-04_19-02-28.wav,44100,16,60,1,acoustic_complexity,512,1,NA,5,1820.9147985894,NA 
rayol-farm2_2019-05-04_19-04-28.wav,44100,16,60,1,acoustic_complexity,512,1,NA,5,1823.45490027422,NA 
rayol-farm2_2019-05-04_19-06-28.wav,44100,16,60,1,acoustic_complexity,512,1,NA,5,1804.21930125668,NA 
rayol-farm2_2019-05-04_19-08-29.wav,44100,16,60,1,acoustic_complexity,512,1,NA,5,1829.5500225142,NA 
rayol-farm2_2019-05-04_19-10-29.wav,44100,16,60,1,acoustic_complexity,512,1,NA,5,1801.79413775,NA 
rayol-farm2_2019-05-04_19-12-29.wav,44100,16,60,1,acoustic_complexity,512,1,NA,5,1819.06339227836,NA 
rayol-farm2_2019-05-04_19-14-29.wav,44100,16,60,1,acoustic_complexity,512,1,NA,5,1818.18241751658,NA 
rayol-farm2_2019-05-04_19-16-29.wav,44100,16,60,1,acoustic_complexity,512,1,NA,5,1819.24312367695,NA 
rayol-farm2_2019-05-04_19-18-29.wav,44100,16,60,1,acoustic_complexity,512,1,NA,5,1810.17691767145,NA 
rayol-farm2_2019-05-04_19-20-29.wav,44100,16,60,1,acoustic_complexity,512,1,NA,5,1809.56058011559,NA 
rayol-farm2_2019-05-04_19-22-29.wav,44100,16,60,1,acoustic_complexity,512,1,NA,5,1825.74537538481,NA 
rayol-farm2_2019-05-04_19-24-30.wav,44100,16,60,1,acoustic_complexity,512,1,NA,5,1835.17525027926,NA 
rayol-farm2_2019-05-04_19-26-30.wav,44100,16,60,1,acoustic_complexity,512,1,NA,5,1812.37940938487,NA 
rayol-farm2_2019-05-04_19-28-30.wav,44100,16,60,1,acoustic_complexity,512,1,NA,5,1820.16007711847,NA 
rayol-farm2_2019-05-04_19-30-30.wav,44100,16,60,1,acoustic_complexity,512,1,NA,5,1821.95685493638,NA 
rayol-farm2_2019-05-04_19-32-30.wav,44100,16,60,1,acoustic_complexity,512,1,NA,5,1813.25626539885,NA 
rayol-farm2_2019-05-04_19-34-30.wav,44100,16,60,1,acoustic_complexity,512,1,NA,5,1831.80331424662,NA 
rayol-farm2_2019-05-04_19-36-30.wav,44100,16,60,1,acoustic_complexity,512,1,NA,5,1818.77272907093,NA 
rayol-farm2_2019-05-04_19-38-30.wav,44100,16,60,1,acoustic_complexity,512,1,NA,5,1807.09840903508,NA 
rayol-farm2_2019-05-04_19-40-30.wav,44100,16,60,1,acoustic_complexity,512,1,NA,5,1810.77466689824,NA 
rayol-farm2_2019-05-04_19-42-31.wav,44100,16,60,1,acoustic_complexity,512,1,NA,5,1811.36647193689,NA 
rayol-farm2_2019-05-04_19-44-31.wav,44100,16,60,1,acoustic_complexity,512,1,NA,5,1808.6885187106,NA 
rayol-farm2_2019-05-04_19-46-31.wav,44100,16,60,1,acoustic_complexity,512,1,NA,5,1803.53772096541,NA 
rayol-farm2_2019-05-04_19-48-31.wav,44100,16,60,1,acoustic_complexity,512,1,NA,5,1804.90199343926,NA 
rayol-farm2_2019-05-04_19-50-31.wav,44100,16,60,1,acoustic_complexity,512,1,NA,5,1799.22320497366,NA 
rayol-farm2_2019-05-04_19-52-31.wav,44100,16,60,1,acoustic_complexity,512,1,NA,5,1799.97275564273,NA 
rayol-farm2_2019-05-04_19-54-31.wav,44100,16,60,1,acoustic_complexity,512,1,NA,5,1814.0380473856,NA 
rayol-farm2_2019-05-04_19-56-31.wav,44100,16,60,1,acoustic_complexity,512,1,NA,5,1797.70367718576,NA 
rayol-farm2_2019-05-04_19-58-32.wav,44100,16,60,1,acoustic_complexity,512,1,NA,5,1807.16069381817,NA 
rayol-farm2_2019-05-04_20-00-32.wav,44100,16,60,1,acoustic_complexity,512,1,NA,5,1790.58492747978,NA 
rayol-farm2_2019-05-04_20-02-32.wav,44100,16,60,1,acoustic_complexity,512,1,NA,5,1790.60485778899,NA 
rayol-farm2_2019-05-04_20-04-32.wav,44100,16,60,1,acoustic_complexity,512,1,NA,5,1784.29876925204,NA 
rayol-farm2_2019-05-04_20-06-32.wav,44100,16,60,1,acoustic_complexity,512,1,NA,5,1790.785743515,NA 
rayol-farm2_2019-05-04_20-08-32.wav,44100,16,60,1,acoustic_complexity,512,1,NA,5,1792.7326051999,NA 
rayol-farm2_2019-05-04_20-10-32.wav,44100,16,60,1,acoustic_complexity,512,1,NA,5,1798.274482303,NA 
rayol-farm2_2019-05-04_20-12-32.wav,44100,16,60,1,acoustic_complexity,512,1,NA,5,1807.33730855622,NA 
rayol-farm2_2019-05-04_20-14-33.wav,44100,16,60,1,acoustic_complexity,512,1,NA,5,1803.71122861867,NA 
rayol-farm2_2019-05-04_20-16-33.wav,44100,16,60,1,acoustic_complexity,512,1,NA,5,1806.59460894355,NA 
rayol-farm2_2019-05-04_20-18-33.wav,44100,16,60,1,acoustic_complexity,512,1,NA,5,1791.12132913509,NA 
rayol-farm2_2019-05-04_20-20-33.wav,44100,16,60,1,acoustic_complexity,512,1,NA,5,1800.50638540949,NA 
rayol-farm2_2019-05-04_20-22-33.wav,44100,16,60,1,acoustic_complexity,512,1,NA,5,1782.09820699011,NA 
rayol-farm2_2019-05-04_20-24-33.wav,44100,16,60,1,acoustic_complexity,512,1,NA,5,1800.30850090618,NA 
rayol-farm2_2019-05-04_20-26-33.wav,44100,16,60,1,acoustic_complexity,512,1,NA,5,1787.6954112924,NA 
rayol-farm2_2019-05-04_20-28-33.wav,44100,16,60,1,acoustic_complexity,512,1,NA,5,1806.02733746737,NA 
rayol-farm2_2019-05-04_20-30-34.wav,44100,16,60,1,acoustic_complexity,512,1,NA,5,1801.13186189324,NA 
rayol-farm2_2019-05-04_20-32-34.wav,44100,16,60,1,acoustic_complexity,512,1,NA,5,1801.97473718413,NA 
rayol-farm2_2019-05-04_20-34-34.wav,44100,16,60,1,acoustic_complexity,512,1,NA,5,1860.09020942994,NA 
rayol-farm2_2019-05-04_20-36-34.wav,44100,16,60,1,acoustic_complexity,512,1,NA,5,1806.90553639144,NA 
rayol-farm2_2019-05-04_20-38-34.wav,44100,16,60,1,acoustic_complexity,512,1,NA,5,1804.22875058925,NA 
rayol-farm2_2019-05-04_20-40-34.wav,44100,16,60,1,acoustic_complexity,512,1,NA,5,1811.51778845049,NA 
rayol-farm2_2019-05-04_20-42-34.wav,44100,16,60,1,acoustic_complexity,512,1,NA,5,1800.97930281648,NA 
rayol-farm2_2019-05-04_20-44-34.wav,44100,16,60,1,acoustic_complexity,512,1,NA,5,1795.83083805416,NA 
rayol-farm2_2019-05-04_20-46-35.wav,44100,16,60,1,acoustic_complexity,512,1,NA,5,1796.90881382815,NA 
rayol-farm2_2019-05-04_20-48-35.wav,44100,16,60,1,acoustic_complexity,512,1,NA,5,1793.69183438836,NA 
rayol-farm2_2019-05-04_20-50-35.wav,44100,16,60,1,acoustic_complexity,512,1,NA,5,1787.29153481055,NA 
rayol-farm2_2019-05-04_20-52-35.wav,44100,16,60,1,acoustic_complexity,512,1,NA,5,1804.14709174703,NA 
rayol-farm2_2019-05-04_20-54-35.wav,44100,16,60,1,acoustic_complexity,512,1,NA,5,1786.15637795741,NA 
rayol-farm2_2019-05-04_20-56-35.wav,44100,16,60,1,acoustic_complexity,512,1,NA,5,1805.64343893711,NA 
rayol-farm2_2019-05-04_20-58-35.wav,44100,16,60,1,acoustic_complexity,512,1,NA,5,1793.39775203805,NA 
rayol-farm2_2019-05-04_21-00-35.wav,44100,16,60,1,acoustic_complexity,512,1,NA,5,1797.00323534666,NA 
rayol-farm2_2019-05-04_21-02-36.wav,44100,16,60,1,acoustic_complexity,512,1,NA,5,1784.64339842946,NA 
rayol-farm2_2019-05-04_21-04-36.wav,44100,16,60,1,acoustic_complexity,512,1,NA,5,1794.86260770747,NA 
rayol-farm2_2019-05-04_21-06-36.wav,44100,16,60,1,acoustic_complexity,512,1,NA,5,1788.50200595316,NA 
rayol-farm2_2019-05-04_21-08-36.wav,44100,16,60,1,acoustic_complexity,512,1,NA,5,1788.6407564662,NA 
rayol-farm2_2019-05-04_21-10-36.wav,44100,16,60,1,acoustic_complexity,512,1,NA,5,1789.26915494041,NA 
rayol-farm2_2019-05-04_21-12-36.wav,44100,16,60,1,acoustic_complexity,512,1,NA,5,1820.68423801044,NA 
rayol-farm2_2019-05-04_21-14-36.wav,44100,16,60,1,acoustic_complexity,512,1,NA,5,1832.46132925793,NA 
rayol-farm2_2019-05-04_21-16-36.wav,44100,16,60,1,acoustic_complexity,512,1,NA,5,1805.28179414033,NA 
rayol-farm2_2019-05-04_21-18-36.wav,44100,16,60,1,acoustic_complexity,512,1,NA,5,1790.22220386854,NA 
rayol-farm2_2019-05-04_21-20-37.wav,44100,16,60,1,acoustic_complexity,512,1,NA,5,1782.17242102545,NA 
rayol-farm2_2019-05-04_21-22-37.wav,44100,16,60,1,acoustic_complexity,512,1,NA,5,1792.71341435407,NA 
rayol-farm2_2019-05-04_21-24-37.wav,44100,16,60,1,acoustic_complexity,512,1,NA,5,1806.92968149202,NA 
rayol-farm2_2019-05-04_21-26-37.wav,44100,16,60,1,acoustic_complexity,512,1,NA,5,1784.75147546092,NA 
rayol-farm2_2019-05-04_21-28-37.wav,44100,16,60,1,acoustic_complexity,512,1,NA,5,1806.13358891848,NA 
rayol-farm2_2019-05-04_21-30-37.wav,44100,16,60,1,acoustic_complexity,512,1,NA,5,1798.01461843459,NA 
rayol-farm2_2019-05-04_21-32-37.wav,44100,16,60,1,acoustic_complexity,512,1,NA,5,1796.70373138642,NA 
rayol-farm2_2019-05-04_21-34-37.wav,44100,16,60,1,acoustic_complexity,512,1,NA,5,1792.27589505625,NA 
rayol-farm2_2019-05-04_21-36-38.wav,44100,16,60,1,acoustic_complexity,512,1,NA,5,1805.81530368755,NA 
rayol-farm2_2019-05-04_21-38-38.wav,44100,16,60,1,acoustic_complexity,512,1,NA,5,1810.32807778798,NA 
rayol-farm2_2019-05-04_21-40-38.wav,44100,16,60,1,acoustic_complexity,512,1,NA,5,1797.35534391741,NA 
rayol-farm2_2019-05-04_21-42-38.wav,44100,16,60,1,acoustic_complexity,512,1,NA,5,1788.03239147186,NA 
rayol-farm2_2019-05-04_21-44-38.wav,44100,16,60,1,acoustic_complexity,512,1,NA,5,1802.18601707551,NA 
rayol-farm2_2019-05-04_21-46-38.wav,44100,16,60,1,acoustic_complexity,512,1,NA,5,1815.19283688291,NA 
rayol-farm2_2019-05-04_21-48-38.wav,44100,16,60,1,acoustic_complexity,512,1,NA,5,1820.18677022848,NA 
rayol-farm2_2019-05-04_21-50-38.wav,44100,16,60,1,acoustic_complexity,512,1,NA,5,1815.65342632266,NA 
rayol-farm2_2019-05-04_21-52-39.wav,44100,16,60,1,acoustic_complexity,512,1,NA,5,1810.31099192617,NA 
rayol-farm2_2019-05-04_21-54-39.wav,44100,16,60,1,acoustic_complexity,512,1,NA,5,1811.31565975668,NA 
rayol-farm2_2019-05-04_21-56-39.wav,44100,16,60,1,acoustic_complexity,512,1,NA,5,1836.25800862166,NA 
rayol-farm2_2019-05-04_21-58-39.wav,44100,16,60,1,acoustic_complexity,512,1,NA,5,1804.24130770859,NA 
rayol-farm2_2019-05-04_22-00-39.wav,44100,16,60,1,acoustic_complexity,512,1,NA,5,1845.84801177454,NA 
rayol-farm2_2019-05-04_22-02-39.wav,44100,16,60,1,acoustic_complexity,512,1,NA,5,1806.44628165825,NA 
rayol-farm2_2019-05-04_22-04-39.wav,44100,16,60,1,acoustic_complexity,512,1,NA,5,1811.55771079161,NA 
rayol-farm2_2019-05-04_22-06-39.wav,44100,16,60,1,acoustic_complexity,512,1,NA,5,1806.76554242651,NA 
rayol-farm2_2019-05-04_22-08-40.wav,44100,16,60,1,acoustic_complexity,512,1,NA,5,1808.54013881191,NA 
rayol-farm2_2019-05-04_22-10-40.wav,44100,16,60,1,acoustic_complexity,512,1,NA,5,1803.6838287991,NA 
rayol-farm2_2019-05-04_22-12-40.wav,44100,16,60,1,acoustic_complexity,512,1,NA,5,1830.15356673153,NA 
rayol-farm2_2019-05-04_22-14-40.wav,44100,16,60,1,acoustic_complexity,512,1,NA,5,1808.64388511232,NA 
rayol-farm2_2019-05-04_22-16-40.wav,44100,16,60,1,acoustic_complexity,512,1,NA,5,1813.39457122625,NA 
rayol-farm2_2019-05-04_22-18-40.wav,44100,16,60,1,acoustic_complexity,512,1,NA,5,1809.73581598116,NA 
rayol-farm2_2019-05-04_22-20-40.wav,44100,16,60,1,acoustic_complexity,512,1,NA,5,1812.39826865417,NA 
rayol-farm2_2019-05-04_22-22-40.wav,44100,16,60,1,acoustic_complexity,512,1,NA,5,1808.86934929884,NA 
rayol-farm2_2019-05-04_22-24-41.wav,44100,16,60,1,acoustic_complexity,512,1,NA,5,1812.45324105681,NA 
rayol-farm2_2019-05-04_22-26-41.wav,44100,16,60,1,acoustic_complexity,512,1,NA,5,1817.04371125131,NA 
rayol-farm2_2019-05-04_22-28-41.wav,44100,16,60,1,acoustic_complexity,512,1,NA,5,1797.44403305631,NA 
rayol-farm2_2019-05-04_22-30-41.wav,44100,16,60,1,acoustic_complexity,512,1,NA,5,1794.01600225837,NA 
rayol-farm2_2019-05-04_22-32-41.wav,44100,16,60,1,acoustic_complexity,512,1,NA,5,1788.25152810958,NA 
rayol-farm2_2019-05-04_22-34-41.wav,44100,16,60,1,acoustic_complexity,512,1,NA,5,1800.69689177121,NA 
rayol-farm2_2019-05-04_22-36-41.wav,44100,16,60,1,acoustic_complexity,512,1,NA,5,1806.46139132537,NA 
rayol-farm2_2019-05-04_22-38-41.wav,44100,16,60,1,acoustic_complexity,512,1,NA,5,1802.74266234259,NA 
rayol-farm2_2019-05-04_22-40-42.wav,44100,16,60,1,acoustic_complexity,512,1,NA,5,1799.73653073882,NA 
rayol-farm2_2019-05-04_22-42-42.wav,44100,16,60,1,acoustic_complexity,512,1,NA,5,1780.7621131246,NA 
rayol-farm2_2019-05-04_22-44-42.wav,44100,16,60,1,acoustic_complexity,512,1,NA,5,1785.70575045657,NA 
rayol-farm2_2019-05-04_22-46-42.wav,44100,16,60,1,acoustic_complexity,512,1,NA,5,1798.0307006295,NA 
rayol-farm2_2019-05-04_22-48-42.wav,44100,16,60,1,acoustic_complexity,512,1,NA,5,1797.13350897978,NA 
rayol-farm2_2019-05-04_22-50-42.wav,44100,16,60,1,acoustic_complexity,512,1,NA,5,1788.31202134326,NA 
rayol-farm2_2019-05-04_22-52-42.wav,44100,16,60,1,acoustic_complexity,512,1,NA,5,1804.45411916898,NA 
rayol-farm2_2019-05-04_22-54-42.wav,44100,16,60,1,acoustic_complexity,512,1,NA,5,1800.54355557088,NA 
rayol-farm2_2019-05-04_22-56-42.wav,44100,16,60,1,acoustic_complexity,512,1,NA,5,1801.46728843769,NA 
rayol-farm2_2019-05-04_22-58-43.wav,44100,16,60,1,acoustic_complexity,512,1,NA,5,1792.80437228022,NA 
rayol-farm2_2019-05-04_23-00-43.wav,44100,16,60,1,acoustic_complexity,512,1,NA,5,1779.52538705351,NA 
rayol-farm2_2019-05-04_23-02-43.wav,44100,16,60,1,acoustic_complexity,512,1,NA,5,1806.03017185283,NA 
rayol-farm2_2019-05-04_23-04-43.wav,44100,16,60,1,acoustic_complexity,512,1,NA,5,1790.92866506105,NA 
rayol-farm2_2019-05-04_23-06-43.wav,44100,16,60,1,acoustic_complexity,512,1,NA,5,1786.15045338229,NA 
rayol-farm2_2019-05-04_23-08-43.wav,44100,16,60,1,acoustic_complexity,512,1,NA,5,1799.45255725313,NA 
rayol-farm2_2019-05-04_23-10-43.wav,44100,16,60,1,acoustic_complexity,512,1,NA,5,1800.47934363889,NA 
rayol-farm2_2019-05-04_23-12-43.wav,44100,16,60,1,acoustic_complexity,512,1,NA,5,1793.02987332246,NA 
rayol-farm2_2019-05-04_23-14-44.wav,44100,16,60,1,acoustic_complexity,512,1,NA,5,1797.65207641378,NA 
rayol-farm2_2019-05-04_23-16-44.wav,44100,16,60,1,acoustic_complexity,512,1,NA,5,1790.71014148506,NA 
rayol-farm2_2019-05-04_23-18-44.wav,44100,16,60,1,acoustic_complexity,512,1,NA,5,1801.12443656447,NA 
rayol-farm2_2019-05-04_23-20-44.wav,44100,16,60,1,acoustic_complexity,512,1,NA,5,1796.29007709127,NA 
rayol-farm2_2019-05-04_23-22-44.wav,44100,16,60,1,acoustic_complexity,512,1,NA,5,1783.13714899322,NA 
rayol-farm2_2019-05-04_23-24-44.wav,44100,16,60,1,acoustic_complexity,512,1,NA,5,1796.84843319865,NA 
rayol-farm2_2019-05-04_23-26-44.wav,44100,16,60,1,acoustic_complexity,512,1,NA,5,1796.07378431653,NA 
rayol-farm2_2019-05-04_23-28-44.wav,44100,16,60,1,acoustic_complexity,512,1,NA,5,1792.25653633939,NA 
rayol-farm2_2019-05-04_23-30-45.wav,44100,16,60,1,acoustic_complexity,512,1,NA,5,1794.13373412072,NA 
rayol-farm2_2019-05-04_23-32-45.wav,44100,16,60,1,acoustic_complexity,512,1,NA,5,1800.49822671812,NA 
rayol-farm2_2019-05-04_23-34-45.wav,44100,16,60,1,acoustic_complexity,512,1,NA,5,1787.19186420564,NA 
rayol-farm2_2019-05-04_23-36-45.wav,44100,16,60,1,acoustic_complexity,512,1,NA,5,1787.1507425486,NA 
rayol-farm2_2019-05-04_23-38-45.wav,44100,16,60,1,acoustic_complexity,512,1,NA,5,1786.76000990795,NA 
rayol-farm2_2019-05-04_23-40-45.wav,44100,16,60,1,acoustic_complexity,512,1,NA,5,1790.35545458624,NA 
rayol-farm2_2019-05-04_23-42-45.wav,44100,16,60,1,acoustic_complexity,512,1,NA,5,1794.69232501278,NA 
rayol-farm2_2019-05-04_23-44-45.wav,44100,16,60,1,acoustic_complexity,512,1,NA,5,1790.20660651077,NA 
rayol-farm2_2019-05-04_23-46-45.wav,44100,16,60,1,acoustic_complexity,512,1,NA,5,1800.08175493686,NA 
rayol-farm2_2019-05-04_23-48-46.wav,44100,16,60,1,acoustic_complexity,512,1,NA,5,1810.95367543375,NA 
rayol-farm2_2019-05-04_23-50-46.wav,44100,16,60,1,acoustic_complexity,512,1,NA,5,1813.18980812097,NA 
rayol-farm2_2019-05-04_23-52-46.wav,44100,16,60,1,acoustic_complexity,512,1,NA,5,1788.76574682417,NA 
rayol-farm2_2019-05-04_23-54-46.wav,44100,16,60,1,acoustic_complexity,512,1,NA,5,1791.78021504925,NA 
rayol-farm2_2019-05-04_23-56-46.wav,44100,16,60,1,acoustic_complexity,512,1,NA,5,1798.90695236406,NA 
rayol-farm2_2019-05-04_23-58-46.wav,44100,16,60,1,acoustic_complexity,512,1,NA,5,1792.86368655744,NA
