FILENAME,SAMPLINGRATE,BIT,DURATION,CHANNELS,INDEX,FFT_W,ANTHRO_MIN,ANTHRO_MAX,BIO_MIN,BIO_MAX,LEFT_CHANNEL,RIGHT_CHANNEL
rayol-farm2_2019-05-24_00-03-53.wav,44100,16,60,1,ndsi,1024,1000,2000,2000,11000,0.94687431448134,NA 
rayol-farm2_2019-05-24_00-05-53.wav,44100,16,60,1,ndsi,1024,1000,2000,2000,11000,0.947980821341346,NA 
rayol-farm2_2019-05-24_00-07-54.wav,44100,16,60,1,ndsi,1024,1000,2000,2000,11000,0.945952721299872,NA 
rayol-farm2_2019-05-24_00-09-54.wav,44100,16,60,1,ndsi,1024,1000,2000,2000,11000,0.947322215447522,NA 
rayol-farm2_2019-05-24_00-11-54.wav,44100,16,60,1,ndsi,1024,1000,2000,2000,11000,0.947025442186623,NA 
rayol-farm2_2019-05-24_00-13-54.wav,44100,16,60,1,ndsi,1024,1000,2000,2000,11000,0.947299133697015,NA 
rayol-farm2_2019-05-24_00-17-54.wav,44100,16,60,1,ndsi,1024,1000,2000,2000,11000,0.94685996009203,NA 
rayol-farm2_2019-05-24_00-19-54.wav,44100,16,60,1,ndsi,1024,1000,2000,2000,11000,0.947206274726295,NA 
rayol-farm2_2019-05-24_00-21-54.wav,44100,16,60,1,ndsi,1024,1000,2000,2000,11000,0.945628995821906,NA 
rayol-farm2_2019-05-24_00-23-55.wav,44100,16,60,1,ndsi,1024,1000,2000,2000,11000,0.947238646447687,NA 
rayol-farm2_2019-05-24_00-25-55.wav,44100,16,60,1,ndsi,1024,1000,2000,2000,11000,0.947401697322133,NA 
rayol-farm2_2019-05-24_00-27-55.wav,44100,16,60,1,ndsi,1024,1000,2000,2000,11000,0.946111055815759,NA 
rayol-farm2_2019-05-24_00-29-55.wav,44100,16,60,1,ndsi,1024,1000,2000,2000,11000,0.946487121032023,NA 
rayol-farm2_2019-05-24_00-31-55.wav,44100,16,60,1,ndsi,1024,1000,2000,2000,11000,0.946446602315429,NA 
rayol-farm2_2019-05-24_00-33-55.wav,44100,16,60,1,ndsi,1024,1000,2000,2000,11000,0.947449952161889,NA 
rayol-farm2_2019-05-24_00-35-55.wav,44100,16,60,1,ndsi,1024,1000,2000,2000,11000,0.946652968639866,NA 
rayol-farm2_2019-05-24_00-39-56.wav,44100,16,60,1,ndsi,1024,1000,2000,2000,11000,0.946873883807039,NA 
rayol-farm2_2019-05-24_00-41-56.wav,44100,16,60,1,ndsi,1024,1000,2000,2000,11000,0.945832357065588,NA 
rayol-farm2_2019-05-24_00-43-56.wav,44100,16,60,1,ndsi,1024,1000,2000,2000,11000,0.945460294694745,NA 
rayol-farm2_2019-05-24_00-45-56.wav,44100,16,60,1,ndsi,1024,1000,2000,2000,11000,0.946669230933118,NA 
rayol-farm2_2019-05-24_00-49-56.wav,44100,16,60,1,ndsi,1024,1000,2000,2000,11000,0.946832910842738,NA 
rayol-farm2_2019-05-24_00-51-56.wav,44100,16,60,1,ndsi,1024,1000,2000,2000,11000,0.946045238985457,NA 
rayol-farm2_2019-05-24_00-53-56.wav,44100,16,60,1,ndsi,1024,1000,2000,2000,11000,0.946370261048056,NA 
rayol-farm2_2019-05-24_00-55-57.wav,44100,16,60,1,ndsi,1024,1000,2000,2000,11000,0.94714053258081,NA 
rayol-farm2_2019-05-24_00-57-57.wav,44100,16,60,1,ndsi,1024,1000,2000,2000,11000,0.94710093328311,NA 
rayol-farm2_2019-05-24_00-59-57.wav,44100,16,60,1,ndsi,1024,1000,2000,2000,11000,0.947001575645901,NA 
rayol-farm2_2019-05-24_01-03-57.wav,44100,16,60,1,ndsi,1024,1000,2000,2000,11000,0.946798421029271,NA 
rayol-farm2_2019-05-24_01-05-57.wav,44100,16,60,1,ndsi,1024,1000,2000,2000,11000,0.94626138808229,NA 
rayol-farm2_2019-05-24_01-09-57.wav,44100,16,60,1,ndsi,1024,1000,2000,2000,11000,0.944652442513598,NA 
rayol-farm2_2019-05-24_01-11-58.wav,44100,16,60,1,ndsi,1024,1000,2000,2000,11000,0.943526925769129,NA 
rayol-farm2_2019-05-24_01-13-58.wav,44100,16,60,1,ndsi,1024,1000,2000,2000,11000,0.944530558945635,NA 
rayol-farm2_2019-05-24_01-15-58.wav,44100,16,60,1,ndsi,1024,1000,2000,2000,11000,0.945386173856561,NA 
rayol-farm2_2019-05-24_01-19-58.wav,44100,16,60,1,ndsi,1024,1000,2000,2000,11000,0.94564538992047,NA 
rayol-farm2_2019-05-24_01-21-58.wav,44100,16,60,1,ndsi,1024,1000,2000,2000,11000,0.944865092855657,NA 
rayol-farm2_2019-05-24_01-23-58.wav,44100,16,60,1,ndsi,1024,1000,2000,2000,11000,0.945188694345107,NA 
rayol-farm2_2019-05-24_01-25-58.wav,44100,16,60,1,ndsi,1024,1000,2000,2000,11000,0.94547839461566,NA 
rayol-farm2_2019-05-24_01-27-59.wav,44100,16,60,1,ndsi,1024,1000,2000,2000,11000,0.944639959885928,NA 
rayol-farm2_2019-05-24_01-29-59.wav,44100,16,60,1,ndsi,1024,1000,2000,2000,11000,0.943767304147585,NA 
rayol-farm2_2019-05-24_01-31-59.wav,44100,16,60,1,ndsi,1024,1000,2000,2000,11000,0.944293665469546,NA 
rayol-farm2_2019-05-24_01-33-59.wav,44100,16,60,1,ndsi,1024,1000,2000,2000,11000,0.943418365866128,NA 
rayol-farm2_2019-05-24_01-35-59.wav,44100,16,60,1,ndsi,1024,1000,2000,2000,11000,0.944240948514853,NA 
rayol-farm2_2019-05-24_01-37-59.wav,44100,16,60,1,ndsi,1024,1000,2000,2000,11000,0.944485476900791,NA 
rayol-farm2_2019-05-24_01-39-59.wav,44100,16,60,1,ndsi,1024,1000,2000,2000,11000,0.945286983597237,NA 
rayol-farm2_2019-05-24_01-41-59.wav,44100,16,60,1,ndsi,1024,1000,2000,2000,11000,0.945017195887306,NA 
rayol-farm2_2019-05-24_01-46-00.wav,44100,16,60,1,ndsi,1024,1000,2000,2000,11000,0.944481538480511,NA 
rayol-farm2_2019-05-24_01-48-00.wav,44100,16,60,1,ndsi,1024,1000,2000,2000,11000,0.943273204436955,NA 
rayol-farm2_2019-05-24_01-50-00.wav,44100,16,60,1,ndsi,1024,1000,2000,2000,11000,0.944698063068834,NA 
rayol-farm2_2019-05-24_01-52-00.wav,44100,16,60,1,ndsi,1024,1000,2000,2000,11000,0.943442969809496,NA 
rayol-farm2_2019-05-24_01-54-00.wav,44100,16,60,1,ndsi,1024,1000,2000,2000,11000,0.944744532352293,NA 
rayol-farm2_2019-05-24_01-56-00.wav,44100,16,60,1,ndsi,1024,1000,2000,2000,11000,0.943987312212283,NA 
rayol-farm2_2019-05-24_02-00-00.wav,44100,16,60,1,ndsi,1024,1000,2000,2000,11000,0.943969857713762,NA 
rayol-farm2_2019-05-24_02-02-01.wav,44100,16,60,1,ndsi,1024,1000,2000,2000,11000,0.944573362259816,NA 
rayol-farm2_2019-05-24_02-04-01.wav,44100,16,60,1,ndsi,1024,1000,2000,2000,11000,0.943507027682847,NA 
rayol-farm2_2019-05-24_02-06-01.wav,44100,16,60,1,ndsi,1024,1000,2000,2000,11000,0.944085917081588,NA 
rayol-farm2_2019-05-24_02-08-01.wav,44100,16,60,1,ndsi,1024,1000,2000,2000,11000,0.944044361017347,NA 
rayol-farm2_2019-05-24_02-10-01.wav,44100,16,60,1,ndsi,1024,1000,2000,2000,11000,0.943653251937754,NA 
rayol-farm2_2019-05-24_02-14-01.wav,44100,16,60,1,ndsi,1024,1000,2000,2000,11000,0.943249323705249,NA 
rayol-farm2_2019-05-24_02-18-02.wav,44100,16,60,1,ndsi,1024,1000,2000,2000,11000,0.943857659456086,NA 
rayol-farm2_2019-05-24_02-20-02.wav,44100,16,60,1,ndsi,1024,1000,2000,2000,11000,0.944398901821207,NA 
rayol-farm2_2019-05-24_02-22-02.wav,44100,16,60,1,ndsi,1024,1000,2000,2000,11000,0.942966076427395,NA 
rayol-farm2_2019-05-24_02-24-02.wav,44100,16,60,1,ndsi,1024,1000,2000,2000,11000,0.943971340547933,NA 
rayol-farm2_2019-05-24_02-26-02.wav,44100,16,60,1,ndsi,1024,1000,2000,2000,11000,0.944110719473041,NA 
rayol-farm2_2019-05-24_02-28-02.wav,44100,16,60,1,ndsi,1024,1000,2000,2000,11000,0.944343511792653,NA 
rayol-farm2_2019-05-24_02-30-02.wav,44100,16,60,1,ndsi,1024,1000,2000,2000,11000,0.942371003417101,NA 
rayol-farm2_2019-05-24_02-32-02.wav,44100,16,60,1,ndsi,1024,1000,2000,2000,11000,0.943512143237256,NA 
rayol-farm2_2019-05-24_02-34-03.wav,44100,16,60,1,ndsi,1024,1000,2000,2000,11000,0.943851670095504,NA 
rayol-farm2_2019-05-24_02-36-03.wav,44100,16,60,1,ndsi,1024,1000,2000,2000,11000,0.94487801288179,NA 
rayol-farm2_2019-05-24_02-38-03.wav,44100,16,60,1,ndsi,1024,1000,2000,2000,11000,0.944648358283161,NA 
rayol-farm2_2019-05-24_02-40-03.wav,44100,16,60,1,ndsi,1024,1000,2000,2000,11000,0.944530142769537,NA 
rayol-farm2_2019-05-24_02-42-03.wav,44100,16,60,1,ndsi,1024,1000,2000,2000,11000,0.945617161124513,NA 
rayol-farm2_2019-05-24_02-44-03.wav,44100,16,60,1,ndsi,1024,1000,2000,2000,11000,0.944904854839422,NA 
rayol-farm2_2019-05-24_02-46-03.wav,44100,16,60,1,ndsi,1024,1000,2000,2000,11000,0.945166463688354,NA 
rayol-farm2_2019-05-24_02-50-04.wav,44100,16,60,1,ndsi,1024,1000,2000,2000,11000,0.944325441225043,NA 
rayol-farm2_2019-05-24_02-52-04.wav,44100,16,60,1,ndsi,1024,1000,2000,2000,11000,0.945532244492117,NA 
rayol-farm2_2019-05-24_02-54-04.wav,44100,16,60,1,ndsi,1024,1000,2000,2000,11000,0.944928380456943,NA 
rayol-farm2_2019-05-24_02-56-04.wav,44100,16,60,1,ndsi,1024,1000,2000,2000,11000,0.944961076304853,NA 
rayol-farm2_2019-05-24_02-58-04.wav,44100,16,60,1,ndsi,1024,1000,2000,2000,11000,0.944932056701309,NA 
rayol-farm2_2019-05-24_03-00-04.wav,44100,16,60,1,ndsi,1024,1000,2000,2000,11000,0.944216888309264,NA 
rayol-farm2_2019-05-24_03-02-04.wav,44100,16,60,1,ndsi,1024,1000,2000,2000,11000,0.946174038294924,NA 
rayol-farm2_2019-05-24_03-04-04.wav,44100,16,60,1,ndsi,1024,1000,2000,2000,11000,0.944593996316537,NA 
rayol-farm2_2019-05-24_03-08-05.wav,44100,16,60,1,ndsi,1024,1000,2000,2000,11000,0.944252918044531,NA 
rayol-farm2_2019-05-24_03-10-05.wav,44100,16,60,1,ndsi,1024,1000,2000,2000,11000,0.943236274456324,NA 
rayol-farm2_2019-05-24_03-12-05.wav,44100,16,60,1,ndsi,1024,1000,2000,2000,11000,0.945152110037312,NA 
rayol-farm2_2019-05-24_03-14-05.wav,44100,16,60,1,ndsi,1024,1000,2000,2000,11000,0.94493700117842,NA 
rayol-farm2_2019-05-24_03-18-05.wav,44100,16,60,1,ndsi,1024,1000,2000,2000,11000,0.944714003324177,NA 
rayol-farm2_2019-05-24_03-20-05.wav,44100,16,60,1,ndsi,1024,1000,2000,2000,11000,0.943960672508349,NA 
rayol-farm2_2019-05-24_03-22-06.wav,44100,16,60,1,ndsi,1024,1000,2000,2000,11000,0.944896222783067,NA 
rayol-farm2_2019-05-24_03-26-06.wav,44100,16,60,1,ndsi,1024,1000,2000,2000,11000,0.944457562995906,NA 
rayol-farm2_2019-05-24_03-28-06.wav,44100,16,60,1,ndsi,1024,1000,2000,2000,11000,0.944652627029551,NA 
rayol-farm2_2019-05-24_03-30-06.wav,44100,16,60,1,ndsi,1024,1000,2000,2000,11000,0.944396515543895,NA 
rayol-farm2_2019-05-24_03-32-06.wav,44100,16,60,1,ndsi,1024,1000,2000,2000,11000,0.942061254979247,NA 
rayol-farm2_2019-05-24_03-34-06.wav,44100,16,60,1,ndsi,1024,1000,2000,2000,11000,0.944380384628506,NA 
rayol-farm2_2019-05-24_03-36-06.wav,44100,16,60,1,ndsi,1024,1000,2000,2000,11000,0.944585983422118,NA 
rayol-farm2_2019-05-24_03-38-06.wav,44100,16,60,1,ndsi,1024,1000,2000,2000,11000,0.944421002448645,NA 
rayol-farm2_2019-05-24_03-40-07.wav,44100,16,60,1,ndsi,1024,1000,2000,2000,11000,0.940709158174974,NA 
rayol-farm2_2019-05-24_03-42-07.wav,44100,16,60,1,ndsi,1024,1000,2000,2000,11000,0.944778373421636,NA 
rayol-farm2_2019-05-24_03-44-07.wav,44100,16,60,1,ndsi,1024,1000,2000,2000,11000,0.944052274103252,NA 
rayol-farm2_2019-05-24_03-46-07.wav,44100,16,60,1,ndsi,1024,1000,2000,2000,11000,0.944169524390456,NA 
rayol-farm2_2019-05-24_03-48-07.wav,44100,16,60,1,ndsi,1024,1000,2000,2000,11000,0.944877719684081,NA 
rayol-farm2_2019-05-24_03-50-07.wav,44100,16,59.92,1,ndsi,1024,1000,2000,2000,11000,0.944189114409983,NA 
rayol-farm2_2019-05-24_03-54-07.wav,44100,16,60,1,ndsi,1024,1000,2000,2000,11000,0.942855858073483,NA 
rayol-farm2_2019-05-24_03-56-08.wav,44100,16,60,1,ndsi,1024,1000,2000,2000,11000,0.944332958852432,NA 
rayol-farm2_2019-05-24_03-58-08.wav,44100,16,60,1,ndsi,1024,1000,2000,2000,11000,0.944375473356803,NA 
rayol-farm2_2019-05-24_04-00-08.wav,44100,16,60,1,ndsi,1024,1000,2000,2000,11000,0.943633667769067,NA 
rayol-farm2_2019-05-24_04-02-08.wav,44100,16,60,1,ndsi,1024,1000,2000,2000,11000,0.944054435361038,NA 
rayol-farm2_2019-05-24_04-04-08.wav,44100,16,60,1,ndsi,1024,1000,2000,2000,11000,0.943584204043738,NA 
rayol-farm2_2019-05-24_04-06-08.wav,44100,16,60,1,ndsi,1024,1000,2000,2000,11000,0.943466045501648,NA 
rayol-farm2_2019-05-24_04-08-08.wav,44100,16,60,1,ndsi,1024,1000,2000,2000,11000,0.944735519513826,NA 
rayol-farm2_2019-05-24_04-10-08.wav,44100,16,60,1,ndsi,1024,1000,2000,2000,11000,0.944018439838257,NA 
rayol-farm2_2019-05-24_04-12-09.wav,44100,16,60,1,ndsi,1024,1000,2000,2000,11000,0.943587446064552,NA 
rayol-farm2_2019-05-24_04-16-09.wav,44100,16,60,1,ndsi,1024,1000,2000,2000,11000,0.944249063660934,NA 
rayol-farm2_2019-05-24_04-18-09.wav,44100,16,60,1,ndsi,1024,1000,2000,2000,11000,0.943111673970613,NA 
rayol-farm2_2019-05-24_04-22-09.wav,44100,16,60,1,ndsi,1024,1000,2000,2000,11000,0.944813212725743,NA 
rayol-farm2_2019-05-24_04-24-09.wav,44100,16,60,1,ndsi,1024,1000,2000,2000,11000,0.939326601843935,NA 
rayol-farm2_2019-05-24_04-26-09.wav,44100,16,60,1,ndsi,1024,1000,2000,2000,11000,0.939137662124585,NA 
rayol-farm2_2019-05-24_04-28-10.wav,44100,16,60,1,ndsi,1024,1000,2000,2000,11000,0.94507342750846,NA 
rayol-farm2_2019-05-24_04-30-10.wav,44100,16,60,1,ndsi,1024,1000,2000,2000,11000,0.942766396628188,NA 
rayol-farm2_2019-05-24_04-34-10.wav,44100,16,60,1,ndsi,1024,1000,2000,2000,11000,0.943521493709686,NA 
rayol-farm2_2019-05-24_04-36-10.wav,44100,16,60,1,ndsi,1024,1000,2000,2000,11000,0.94380978980503,NA 
rayol-farm2_2019-05-24_04-38-10.wav,44100,16,60,1,ndsi,1024,1000,2000,2000,11000,0.944306983584137,NA 
rayol-farm2_2019-05-24_04-40-10.wav,44100,16,60,1,ndsi,1024,1000,2000,2000,11000,0.943532955704446,NA 
rayol-farm2_2019-05-24_04-42-10.wav,44100,16,60,1,ndsi,1024,1000,2000,2000,11000,0.943231642447673,NA 
rayol-farm2_2019-05-24_04-44-11.wav,44100,16,60,1,ndsi,1024,1000,2000,2000,11000,0.945307905774199,NA 
rayol-farm2_2019-05-24_04-46-11.wav,44100,16,60,1,ndsi,1024,1000,2000,2000,11000,0.941396667866331,NA 
rayol-farm2_2019-05-24_04-48-11.wav,44100,16,60,1,ndsi,1024,1000,2000,2000,11000,0.943416722398115,NA 
rayol-farm2_2019-05-24_04-50-11.wav,44100,16,60,1,ndsi,1024,1000,2000,2000,11000,0.944378497346093,NA 
rayol-farm2_2019-05-24_04-52-11.wav,44100,16,60,1,ndsi,1024,1000,2000,2000,11000,0.944561879138464,NA 
rayol-farm2_2019-05-24_04-54-11.wav,44100,16,60,1,ndsi,1024,1000,2000,2000,11000,0.945728261087488,NA 
rayol-farm2_2019-05-24_04-58-11.wav,44100,16,60,1,ndsi,1024,1000,2000,2000,11000,0.943113278402007,NA 
rayol-farm2_2019-05-24_05-00-12.wav,44100,16,60,1,ndsi,1024,1000,2000,2000,11000,0.946296110387854,NA 
rayol-farm2_2019-05-24_05-02-12.wav,44100,16,60,1,ndsi,1024,1000,2000,2000,11000,0.94206233678463,NA 
rayol-farm2_2019-05-24_05-04-12.wav,44100,16,60,1,ndsi,1024,1000,2000,2000,11000,0.947044239363319,NA 
rayol-farm2_2019-05-24_05-06-12.wav,44100,16,60,1,ndsi,1024,1000,2000,2000,11000,0.945757095180902,NA 
rayol-farm2_2019-05-24_05-10-12.wav,44100,16,60,1,ndsi,1024,1000,2000,2000,11000,0.943783476806677,NA 
rayol-farm2_2019-05-24_05-12-12.wav,44100,16,60,1,ndsi,1024,1000,2000,2000,11000,0.229657846455338,NA 
rayol-farm2_2019-05-24_05-14-12.wav,44100,16,60,1,ndsi,1024,1000,2000,2000,11000,0.878837604530039,NA 
rayol-farm2_2019-05-24_05-16-12.wav,44100,16,60,1,ndsi,1024,1000,2000,2000,11000,0.884941564484689,NA 
rayol-farm2_2019-05-24_05-18-13.wav,44100,16,60,1,ndsi,1024,1000,2000,2000,11000,0.93600560679704,NA 
rayol-farm2_2019-05-24_05-20-13.wav,44100,16,60,1,ndsi,1024,1000,2000,2000,11000,0.927763648439209,NA 
rayol-farm2_2019-05-24_05-24-13.wav,44100,16,60,1,ndsi,1024,1000,2000,2000,11000,0.937837602256729,NA 
rayol-farm2_2019-05-24_05-26-13.wav,44100,16,60,1,ndsi,1024,1000,2000,2000,11000,0.926154739345404,NA 
rayol-farm2_2019-05-24_05-30-13.wav,44100,16,60,1,ndsi,1024,1000,2000,2000,11000,0.94464282702818,NA 
rayol-farm2_2019-05-24_05-32-13.wav,44100,16,60,1,ndsi,1024,1000,2000,2000,11000,0.913548146688305,NA 
rayol-farm2_2019-05-24_05-34-14.wav,44100,16,60,1,ndsi,1024,1000,2000,2000,11000,0.20526785344742,NA 
rayol-farm2_2019-05-24_05-36-14.wav,44100,16,60,1,ndsi,1024,1000,2000,2000,11000,0.93333994782034,NA 
rayol-farm2_2019-05-24_05-38-14.wav,44100,16,60,1,ndsi,1024,1000,2000,2000,11000,0.935769110663469,NA 
rayol-farm2_2019-05-24_05-40-14.wav,44100,16,60,1,ndsi,1024,1000,2000,2000,11000,0.944198179722684,NA 
rayol-farm2_2019-05-24_05-42-14.wav,44100,16,60,1,ndsi,1024,1000,2000,2000,11000,0.94533977291181,NA 
rayol-farm2_2019-05-24_05-44-14.wav,44100,16,60,1,ndsi,1024,1000,2000,2000,11000,0.942455785767486,NA 
rayol-farm2_2019-05-24_05-46-14.wav,44100,16,60,1,ndsi,1024,1000,2000,2000,11000,0.949333674688315,NA 
rayol-farm2_2019-05-24_05-48-14.wav,44100,16,60,1,ndsi,1024,1000,2000,2000,11000,0.951930778479736,NA 
rayol-farm2_2019-05-24_05-50-15.wav,44100,16,60,1,ndsi,1024,1000,2000,2000,11000,0.949302355836808,NA 
rayol-farm2_2019-05-24_05-52-15.wav,44100,16,60,1,ndsi,1024,1000,2000,2000,11000,0.952401052378293,NA 
rayol-farm2_2019-05-24_05-54-15.wav,44100,16,60,1,ndsi,1024,1000,2000,2000,11000,0.947550042427285,NA 
rayol-farm2_2019-05-24_05-56-15.wav,44100,16,60,1,ndsi,1024,1000,2000,2000,11000,0.963652881203148,NA 
rayol-farm2_2019-05-24_05-58-15.wav,44100,16,60,1,ndsi,1024,1000,2000,2000,11000,0.965705021186821,NA 
rayol-farm2_2019-05-24_06-02-15.wav,44100,16,60,1,ndsi,1024,1000,2000,2000,11000,0.949930096232281,NA 
rayol-farm2_2019-05-24_06-04-15.wav,44100,16,60,1,ndsi,1024,1000,2000,2000,11000,0.944977315077822,NA 
rayol-farm2_2019-05-24_06-06-16.wav,44100,16,60,1,ndsi,1024,1000,2000,2000,11000,0.938245491694241,NA 
rayol-farm2_2019-05-24_06-08-16.wav,44100,16,60,1,ndsi,1024,1000,2000,2000,11000,0.942178461791406,NA 
rayol-farm2_2019-05-24_06-10-16.wav,44100,16,60,1,ndsi,1024,1000,2000,2000,11000,0.943421968709045,NA 
rayol-farm2_2019-05-24_06-12-16.wav,44100,16,60,1,ndsi,1024,1000,2000,2000,11000,0.936464582033069,NA 
rayol-farm2_2019-05-24_06-14-16.wav,44100,16,60,1,ndsi,1024,1000,2000,2000,11000,0.946506087700746,NA 
rayol-farm2_2019-05-24_06-18-16.wav,44100,16,60,1,ndsi,1024,1000,2000,2000,11000,0.882850526779783,NA 
rayol-farm2_2019-05-24_06-20-16.wav,44100,16,60,1,ndsi,1024,1000,2000,2000,11000,0.857009490027225,NA 
rayol-farm2_2019-05-24_06-22-17.wav,44100,16,60,1,ndsi,1024,1000,2000,2000,11000,0.876326791173997,NA 
rayol-farm2_2019-05-24_06-24-17.wav,44100,16,60,1,ndsi,1024,1000,2000,2000,11000,0.94376296643445,NA 
rayol-farm2_2019-05-24_06-26-17.wav,44100,16,60,1,ndsi,1024,1000,2000,2000,11000,0.943983965592488,NA 
rayol-farm2_2019-05-24_06-30-17.wav,44100,16,60,1,ndsi,1024,1000,2000,2000,11000,0.947517072039392,NA 
rayol-farm2_2019-05-24_06-34-17.wav,44100,16,60,1,ndsi,1024,1000,2000,2000,11000,0.944431996850692,NA 
rayol-farm2_2019-05-24_06-36-17.wav,44100,16,60,1,ndsi,1024,1000,2000,2000,11000,0.941421116827109,NA 
rayol-farm2_2019-05-24_06-38-18.wav,44100,16,60,1,ndsi,1024,1000,2000,2000,11000,0.927163545417514,NA 
rayol-farm2_2019-05-24_06-40-18.wav,44100,16,60,1,ndsi,1024,1000,2000,2000,11000,0.908747453963848,NA 
rayol-farm2_2019-05-24_06-44-18.wav,44100,16,60,1,ndsi,1024,1000,2000,2000,11000,0.908948988954509,NA 
rayol-farm2_2019-05-24_06-46-18.wav,44100,16,60,1,ndsi,1024,1000,2000,2000,11000,0.941353737382246,NA 
rayol-farm2_2019-05-24_06-48-18.wav,44100,16,60,1,ndsi,1024,1000,2000,2000,11000,0.932395564865598,NA 
rayol-farm2_2019-05-24_06-50-18.wav,44100,16,60,1,ndsi,1024,1000,2000,2000,11000,0.918051220981282,NA 
rayol-farm2_2019-05-24_06-52-18.wav,44100,16,60,1,ndsi,1024,1000,2000,2000,11000,0.929589240847395,NA 
rayol-farm2_2019-05-24_06-54-18.wav,44100,16,60,1,ndsi,1024,1000,2000,2000,11000,0.939923517741274,NA 
rayol-farm2_2019-05-24_06-56-19.wav,44100,16,60,1,ndsi,1024,1000,2000,2000,11000,0.954980672246412,NA 
rayol-farm2_2019-05-24_06-58-19.wav,44100,16,60,1,ndsi,1024,1000,2000,2000,11000,0.962563390656433,NA 
rayol-farm2_2019-05-24_07-00-19.wav,44100,16,60,1,ndsi,1024,1000,2000,2000,11000,0.95088045928624,NA 
rayol-farm2_2019-05-24_07-02-19.wav,44100,16,60,1,ndsi,1024,1000,2000,2000,11000,0.936123792643687,NA 
rayol-farm2_2019-05-24_07-04-19.wav,44100,16,60,1,ndsi,1024,1000,2000,2000,11000,0.939623098663034,NA 
rayol-farm2_2019-05-24_07-08-19.wav,44100,16,60,1,ndsi,1024,1000,2000,2000,11000,0.955800197865151,NA 
rayol-farm2_2019-05-24_07-10-19.wav,44100,16,60,1,ndsi,1024,1000,2000,2000,11000,0.937344053249963,NA 
rayol-farm2_2019-05-24_07-12-20.wav,44100,16,60,1,ndsi,1024,1000,2000,2000,11000,0.941761452762944,NA 
rayol-farm2_2019-05-24_07-16-20.wav,44100,16,60,1,ndsi,1024,1000,2000,2000,11000,0.832995540669942,NA 
rayol-farm2_2019-05-24_07-18-20.wav,44100,16,60,1,ndsi,1024,1000,2000,2000,11000,0.935511755705926,NA 
rayol-farm2_2019-05-24_07-20-20.wav,44100,16,60,1,ndsi,1024,1000,2000,2000,11000,0.919970887006679,NA 
rayol-farm2_2019-05-24_07-22-20.wav,44100,16,60,1,ndsi,1024,1000,2000,2000,11000,0.938722463862256,NA 
rayol-farm2_2019-05-24_07-26-20.wav,44100,16,60,1,ndsi,1024,1000,2000,2000,11000,0.948916733014142,NA 
rayol-farm2_2019-05-24_07-28-21.wav,44100,16,60,1,ndsi,1024,1000,2000,2000,11000,0.965779668449199,NA 
rayol-farm2_2019-05-24_07-30-21.wav,44100,16,60,1,ndsi,1024,1000,2000,2000,11000,0.935554392026331,NA 
rayol-farm2_2019-05-24_07-32-21.wav,44100,16,60,1,ndsi,1024,1000,2000,2000,11000,0.933680031395839,NA 
rayol-farm2_2019-05-24_07-34-21.wav,44100,16,60,1,ndsi,1024,1000,2000,2000,11000,0.675586150413501,NA 
rayol-farm2_2019-05-24_07-38-21.wav,44100,16,60,1,ndsi,1024,1000,2000,2000,11000,0.947236343944016,NA 
rayol-farm2_2019-05-24_07-42-21.wav,44100,16,60,1,ndsi,1024,1000,2000,2000,11000,0.950705157406551,NA 
rayol-farm2_2019-05-24_07-44-22.wav,44100,16,60,1,ndsi,1024,1000,2000,2000,11000,0.944080439156198,NA 
rayol-farm2_2019-05-24_07-46-22.wav,44100,16,60,1,ndsi,1024,1000,2000,2000,11000,0.94559869303543,NA 
rayol-farm2_2019-05-24_07-48-22.wav,44100,16,60,1,ndsi,1024,1000,2000,2000,11000,0.950722437820812,NA 
rayol-farm2_2019-05-24_07-52-22.wav,44100,16,60,1,ndsi,1024,1000,2000,2000,11000,0.950884141958357,NA 
rayol-farm2_2019-05-24_07-54-22.wav,44100,16,60,1,ndsi,1024,1000,2000,2000,11000,0.951208821102304,NA 
rayol-farm2_2019-05-24_07-56-22.wav,44100,16,60,1,ndsi,1024,1000,2000,2000,11000,0.942243821507123,NA 
rayol-farm2_2019-05-24_07-58-22.wav,44100,16,60,1,ndsi,1024,1000,2000,2000,11000,0.894254203368375,NA 
rayol-farm2_2019-05-24_08-00-23.wav,44100,16,60,1,ndsi,1024,1000,2000,2000,11000,0.906821221325882,NA 
rayol-farm2_2019-05-24_08-02-23.wav,44100,16,60,1,ndsi,1024,1000,2000,2000,11000,0.931355379031674,NA 
rayol-farm2_2019-05-24_08-04-23.wav,44100,16,60,1,ndsi,1024,1000,2000,2000,11000,0.952847612255937,NA 
rayol-farm2_2019-05-24_08-06-23.wav,44100,16,60,1,ndsi,1024,1000,2000,2000,11000,0.941512312073576,NA 
rayol-farm2_2019-05-24_08-08-23.wav,44100,16,60,1,ndsi,1024,1000,2000,2000,11000,0.940606732101376,NA 
rayol-farm2_2019-05-24_08-10-23.wav,44100,16,60,1,ndsi,1024,1000,2000,2000,11000,0.886709924665184,NA 
rayol-farm2_2019-05-24_08-12-23.wav,44100,16,60,1,ndsi,1024,1000,2000,2000,11000,0.936482004278799,NA 
rayol-farm2_2019-05-24_08-14-23.wav,44100,16,60,1,ndsi,1024,1000,2000,2000,11000,0.865678246984294,NA 
rayol-farm2_2019-05-24_08-16-24.wav,44100,16,60,1,ndsi,1024,1000,2000,2000,11000,0.948534105883454,NA 
rayol-farm2_2019-05-24_08-18-24.wav,44100,16,60,1,ndsi,1024,1000,2000,2000,11000,0.945078384078375,NA 
rayol-farm2_2019-05-24_08-20-24.wav,44100,16,60,1,ndsi,1024,1000,2000,2000,11000,0.856738518815403,NA 
rayol-farm2_2019-05-24_08-22-24.wav,44100,16,60,1,ndsi,1024,1000,2000,2000,11000,0.941075145041519,NA 
rayol-farm2_2019-05-24_08-24-24.wav,44100,16,60,1,ndsi,1024,1000,2000,2000,11000,0.95233807388952,NA 
rayol-farm2_2019-05-24_08-26-24.wav,44100,16,60,1,ndsi,1024,1000,2000,2000,11000,0.870249059637475,NA 
rayol-farm2_2019-05-24_08-28-24.wav,44100,16,60,1,ndsi,1024,1000,2000,2000,11000,0.415049226685445,NA 
rayol-farm2_2019-05-24_08-30-24.wav,44100,16,60,1,ndsi,1024,1000,2000,2000,11000,0.826585904548382,NA 
rayol-farm2_2019-05-24_08-32-25.wav,44100,16,60,1,ndsi,1024,1000,2000,2000,11000,0.938162578547991,NA 
rayol-farm2_2019-05-24_08-34-25.wav,44100,16,60,1,ndsi,1024,1000,2000,2000,11000,0.938646978368569,NA 
rayol-farm2_2019-05-24_08-36-25.wav,44100,16,60,1,ndsi,1024,1000,2000,2000,11000,0.947897451015219,NA 
rayol-farm2_2019-05-24_08-38-25.wav,44100,16,60,1,ndsi,1024,1000,2000,2000,11000,0.942410840550588,NA 
rayol-farm2_2019-05-24_08-40-25.wav,44100,16,60,1,ndsi,1024,1000,2000,2000,11000,0.945224497585625,NA 
rayol-farm2_2019-05-24_08-42-25.wav,44100,16,60,1,ndsi,1024,1000,2000,2000,11000,0.948432518875674,NA 
rayol-farm2_2019-05-24_08-44-25.wav,44100,16,60,1,ndsi,1024,1000,2000,2000,11000,0.947173864828152,NA 
rayol-farm2_2019-05-24_08-46-25.wav,44100,16,60,1,ndsi,1024,1000,2000,2000,11000,0.945755149491119,NA 
rayol-farm2_2019-05-24_08-48-26.wav,44100,16,60,1,ndsi,1024,1000,2000,2000,11000,0.9554857677242,NA 
rayol-farm2_2019-05-24_08-50-26.wav,44100,16,60,1,ndsi,1024,1000,2000,2000,11000,0.953406081765206,NA 
rayol-farm2_2019-05-24_08-52-26.wav,44100,16,60,1,ndsi,1024,1000,2000,2000,11000,0.948909460204059,NA 
rayol-farm2_2019-05-24_08-54-26.wav,44100,16,60,1,ndsi,1024,1000,2000,2000,11000,0.948179625970286,NA 
rayol-farm2_2019-05-24_08-56-26.wav,44100,16,60,1,ndsi,1024,1000,2000,2000,11000,0.951577108453749,NA 
rayol-farm2_2019-05-24_08-58-26.wav,44100,16,60,1,ndsi,1024,1000,2000,2000,11000,0.945798524602153,NA 
rayol-farm2_2019-05-24_09-00-26.wav,44100,16,60,1,ndsi,1024,1000,2000,2000,11000,0.94781135516547,NA 
rayol-farm2_2019-05-24_09-02-26.wav,44100,16,60,1,ndsi,1024,1000,2000,2000,11000,0.922238123028931,NA 
rayol-farm2_2019-05-24_09-04-27.wav,44100,16,60,1,ndsi,1024,1000,2000,2000,11000,0.902870205815175,NA 
rayol-farm2_2019-05-24_09-06-27.wav,44100,16,60,1,ndsi,1024,1000,2000,2000,11000,0.413459013609589,NA 
rayol-farm2_2019-05-24_09-08-27.wav,44100,16,60,1,ndsi,1024,1000,2000,2000,11000,0.939319290374757,NA 
rayol-farm2_2019-05-24_09-10-27.wav,44100,16,60,1,ndsi,1024,1000,2000,2000,11000,0.943430447299901,NA 
rayol-farm2_2019-05-24_09-12-27.wav,44100,16,60,1,ndsi,1024,1000,2000,2000,11000,0.94711129420392,NA 
rayol-farm2_2019-05-24_09-14-27.wav,44100,16,60,1,ndsi,1024,1000,2000,2000,11000,0.949353490762159,NA 
rayol-farm2_2019-05-24_09-16-27.wav,44100,16,60,1,ndsi,1024,1000,2000,2000,11000,0.415669573625316,NA 
rayol-farm2_2019-05-24_09-18-27.wav,44100,16,60,1,ndsi,1024,1000,2000,2000,11000,0.800729037518203,NA 
rayol-farm2_2019-05-24_09-20-27.wav,44100,16,60,1,ndsi,1024,1000,2000,2000,11000,0.9160827870031,NA 
rayol-farm2_2019-05-24_09-22-28.wav,44100,16,60,1,ndsi,1024,1000,2000,2000,11000,0.901290302476014,NA 
rayol-farm2_2019-05-24_09-24-28.wav,44100,16,60,1,ndsi,1024,1000,2000,2000,11000,0.928315230405739,NA 
rayol-farm2_2019-05-24_09-26-28.wav,44100,16,60,1,ndsi,1024,1000,2000,2000,11000,0.934717657020607,NA 
rayol-farm2_2019-05-24_09-28-28.wav,44100,16,60,1,ndsi,1024,1000,2000,2000,11000,0.904359724846867,NA 
rayol-farm2_2019-05-24_09-30-28.wav,44100,16,60,1,ndsi,1024,1000,2000,2000,11000,0.899106672043542,NA 
rayol-farm2_2019-05-24_09-32-28.wav,44100,16,60,1,ndsi,1024,1000,2000,2000,11000,0.683814827354613,NA 
rayol-farm2_2019-05-24_09-34-28.wav,44100,16,60,1,ndsi,1024,1000,2000,2000,11000,0.163072238582022,NA 
rayol-farm2_2019-05-24_09-36-28.wav,44100,16,60,1,ndsi,1024,1000,2000,2000,11000,0.927689837897211,NA 
rayol-farm2_2019-05-24_09-38-29.wav,44100,16,60,1,ndsi,1024,1000,2000,2000,11000,0.892868306556402,NA 
rayol-farm2_2019-05-24_09-40-29.wav,44100,16,60,1,ndsi,1024,1000,2000,2000,11000,0.919702074032617,NA 
rayol-farm2_2019-05-24_09-42-29.wav,44100,16,60,1,ndsi,1024,1000,2000,2000,11000,0.926496160001008,NA 
rayol-farm2_2019-05-24_09-44-29.wav,44100,16,60,1,ndsi,1024,1000,2000,2000,11000,0.949896799303191,NA 
rayol-farm2_2019-05-24_09-46-29.wav,44100,16,60,1,ndsi,1024,1000,2000,2000,11000,0.946209857908961,NA 
rayol-farm2_2019-05-24_09-48-29.wav,44100,16,60,1,ndsi,1024,1000,2000,2000,11000,0.958304684848779,NA 
rayol-farm2_2019-05-24_09-50-29.wav,44100,16,60,1,ndsi,1024,1000,2000,2000,11000,0.954460954606796,NA 
rayol-farm2_2019-05-24_09-52-29.wav,44100,16,60,1,ndsi,1024,1000,2000,2000,11000,0.940207000681072,NA 
rayol-farm2_2019-05-24_09-54-30.wav,44100,16,60,1,ndsi,1024,1000,2000,2000,11000,0.945859528655269,NA 
rayol-farm2_2019-05-24_09-56-30.wav,44100,16,60,1,ndsi,1024,1000,2000,2000,11000,0.918449237722402,NA 
rayol-farm2_2019-05-24_09-58-30.wav,44100,16,60,1,ndsi,1024,1000,2000,2000,11000,0.949864370811072,NA 
rayol-farm2_2019-05-24_10-00-30.wav,44100,16,60,1,ndsi,1024,1000,2000,2000,11000,0.94193112648462,NA 
rayol-farm2_2019-05-24_10-02-30.wav,44100,16,60,1,ndsi,1024,1000,2000,2000,11000,0.942119912285339,NA 
rayol-farm2_2019-05-24_10-04-30.wav,44100,16,60,1,ndsi,1024,1000,2000,2000,11000,0.939067776554427,NA 
rayol-farm2_2019-05-24_10-06-30.wav,44100,16,60,1,ndsi,1024,1000,2000,2000,11000,0.916635634986716,NA 
rayol-farm2_2019-05-24_10-08-30.wav,44100,16,60,1,ndsi,1024,1000,2000,2000,11000,0.91736387699725,NA 
rayol-farm2_2019-05-24_10-10-31.wav,44100,16,60,1,ndsi,1024,1000,2000,2000,11000,0.926473529579913,NA 
rayol-farm2_2019-05-24_10-12-31.wav,44100,16,60,1,ndsi,1024,1000,2000,2000,11000,0.951686237021575,NA 
rayol-farm2_2019-05-24_10-14-31.wav,44100,16,60,1,ndsi,1024,1000,2000,2000,11000,0.952906655772379,NA 
rayol-farm2_2019-05-24_10-16-31.wav,44100,16,60,1,ndsi,1024,1000,2000,2000,11000,0.950585781857217,NA 
rayol-farm2_2019-05-24_10-18-31.wav,44100,16,60,1,ndsi,1024,1000,2000,2000,11000,0.935746492992186,NA 
rayol-farm2_2019-05-24_10-20-31.wav,44100,16,60,1,ndsi,1024,1000,2000,2000,11000,0.923706798940434,NA 
rayol-farm2_2019-05-24_10-22-31.wav,44100,16,60,1,ndsi,1024,1000,2000,2000,11000,0.944546814796664,NA 
rayol-farm2_2019-05-24_10-24-31.wav,44100,16,60,1,ndsi,1024,1000,2000,2000,11000,0.937017966643786,NA 
rayol-farm2_2019-05-24_10-26-32.wav,44100,16,60,1,ndsi,1024,1000,2000,2000,11000,0.770564117916008,NA 
rayol-farm2_2019-05-24_10-28-32.wav,44100,16,60,1,ndsi,1024,1000,2000,2000,11000,0.886676874717406,NA 
rayol-farm2_2019-05-24_10-30-32.wav,44100,16,60,1,ndsi,1024,1000,2000,2000,11000,0.810919756891492,NA 
rayol-farm2_2019-05-24_10-32-32.wav,44100,16,60,1,ndsi,1024,1000,2000,2000,11000,0.801635962765057,NA 
rayol-farm2_2019-05-24_10-34-32.wav,44100,16,60,1,ndsi,1024,1000,2000,2000,11000,0.768074210526738,NA 
rayol-farm2_2019-05-24_10-36-32.wav,44100,16,60,1,ndsi,1024,1000,2000,2000,11000,0.930146113854825,NA 
rayol-farm2_2019-05-24_10-38-32.wav,44100,16,60,1,ndsi,1024,1000,2000,2000,11000,0.622032644759487,NA 
rayol-farm2_2019-05-24_10-40-32.wav,44100,16,60,1,ndsi,1024,1000,2000,2000,11000,0.937663967161404,NA 
rayol-farm2_2019-05-24_10-42-32.wav,44100,16,60,1,ndsi,1024,1000,2000,2000,11000,0.897105468096578,NA 
rayol-farm2_2019-05-24_10-44-33.wav,44100,16,60,1,ndsi,1024,1000,2000,2000,11000,0.928672659748135,NA 
rayol-farm2_2019-05-24_10-46-33.wav,44100,16,60,1,ndsi,1024,1000,2000,2000,11000,0.243648855236503,NA 
rayol-farm2_2019-05-24_10-48-33.wav,44100,16,60,1,ndsi,1024,1000,2000,2000,11000,0.24239794123289,NA 
rayol-farm2_2019-05-24_10-50-33.wav,44100,16,60,1,ndsi,1024,1000,2000,2000,11000,0.395035888488807,NA 
rayol-farm2_2019-05-24_10-52-33.wav,44100,16,60,1,ndsi,1024,1000,2000,2000,11000,0.897206222313237,NA 
rayol-farm2_2019-05-24_10-54-33.wav,44100,16,60,1,ndsi,1024,1000,2000,2000,11000,0.910745345661125,NA 
rayol-farm2_2019-05-24_10-56-33.wav,44100,16,60,1,ndsi,1024,1000,2000,2000,11000,0.942992914144724,NA 
rayol-farm2_2019-05-24_10-58-33.wav,44100,16,60,1,ndsi,1024,1000,2000,2000,11000,0.898898337920405,NA 
rayol-farm2_2019-05-24_11-00-34.wav,44100,16,60,1,ndsi,1024,1000,2000,2000,11000,0.936440783718761,NA 
rayol-farm2_2019-05-24_11-02-34.wav,44100,16,60,1,ndsi,1024,1000,2000,2000,11000,0.914646018535301,NA 
rayol-farm2_2019-05-24_11-04-34.wav,44100,16,60,1,ndsi,1024,1000,2000,2000,11000,0.920798988612658,NA 
rayol-farm2_2019-05-24_11-06-34.wav,44100,16,60,1,ndsi,1024,1000,2000,2000,11000,0.891396767716688,NA 
rayol-farm2_2019-05-24_11-08-34.wav,44100,16,60,1,ndsi,1024,1000,2000,2000,11000,0.93676835322133,NA 
rayol-farm2_2019-05-24_11-10-34.wav,44100,16,60,1,ndsi,1024,1000,2000,2000,11000,0.933238948741828,NA 
rayol-farm2_2019-05-24_11-12-34.wav,44100,16,60,1,ndsi,1024,1000,2000,2000,11000,0.9202083721078,NA 
rayol-farm2_2019-05-24_11-14-34.wav,44100,16,60,1,ndsi,1024,1000,2000,2000,11000,0.884168600409206,NA 
rayol-farm2_2019-05-24_11-16-35.wav,44100,16,60,1,ndsi,1024,1000,2000,2000,11000,0.90970217447541,NA 
rayol-farm2_2019-05-24_11-18-35.wav,44100,16,60,1,ndsi,1024,1000,2000,2000,11000,0.917098275007514,NA 
rayol-farm2_2019-05-24_11-20-35.wav,44100,16,60,1,ndsi,1024,1000,2000,2000,11000,0.90485583884733,NA 
rayol-farm2_2019-05-24_11-22-35.wav,44100,16,60,1,ndsi,1024,1000,2000,2000,11000,0.834097059893664,NA 
rayol-farm2_2019-05-24_11-24-35.wav,44100,16,60,1,ndsi,1024,1000,2000,2000,11000,0.897301898695932,NA 
rayol-farm2_2019-05-24_11-26-35.wav,44100,16,60,1,ndsi,1024,1000,2000,2000,11000,0.816870833292101,NA 
rayol-farm2_2019-05-24_11-28-35.wav,44100,16,60,1,ndsi,1024,1000,2000,2000,11000,0.921900653354866,NA 
rayol-farm2_2019-05-24_11-30-35.wav,44100,16,60,1,ndsi,1024,1000,2000,2000,11000,0.927672009270473,NA 
rayol-farm2_2019-05-24_11-32-36.wav,44100,16,60,1,ndsi,1024,1000,2000,2000,11000,0.914211539196771,NA 
rayol-farm2_2019-05-24_11-34-36.wav,44100,16,60,1,ndsi,1024,1000,2000,2000,11000,0.842512895226049,NA 
rayol-farm2_2019-05-24_11-36-36.wav,44100,16,60,1,ndsi,1024,1000,2000,2000,11000,0.905567863243099,NA 
rayol-farm2_2019-05-24_11-38-36.wav,44100,16,60,1,ndsi,1024,1000,2000,2000,11000,0.754436153186633,NA 
rayol-farm2_2019-05-24_11-40-36.wav,44100,16,60,1,ndsi,1024,1000,2000,2000,11000,0.895574058241782,NA 
rayol-farm2_2019-05-24_11-42-36.wav,44100,16,60,1,ndsi,1024,1000,2000,2000,11000,0.75831701695156,NA 
rayol-farm2_2019-05-24_11-44-36.wav,44100,16,60,1,ndsi,1024,1000,2000,2000,11000,0.912961370451706,NA 
rayol-farm2_2019-05-24_11-46-36.wav,44100,16,60,1,ndsi,1024,1000,2000,2000,11000,0.915653665047032,NA 
rayol-farm2_2019-05-24_11-48-37.wav,44100,16,60,1,ndsi,1024,1000,2000,2000,11000,0.40220003536056,NA 
rayol-farm2_2019-05-24_11-50-37.wav,44100,16,60,1,ndsi,1024,1000,2000,2000,11000,0.904629743749567,NA 
rayol-farm2_2019-05-24_11-52-37.wav,44100,16,60,1,ndsi,1024,1000,2000,2000,11000,0.687936235998262,NA 
rayol-farm2_2019-05-24_11-54-37.wav,44100,16,60,1,ndsi,1024,1000,2000,2000,11000,0.830300327401359,NA 
rayol-farm2_2019-05-24_11-56-37.wav,44100,16,60,1,ndsi,1024,1000,2000,2000,11000,0.626969001483723,NA 
rayol-farm2_2019-05-24_11-58-37.wav,44100,16,60,1,ndsi,1024,1000,2000,2000,11000,0.39542905230706,NA 
rayol-farm2_2019-05-24_12-00-37.wav,44100,16,60,1,ndsi,1024,1000,2000,2000,11000,0.655131775009232,NA 
rayol-farm2_2019-05-24_12-02-37.wav,44100,16,60,1,ndsi,1024,1000,2000,2000,11000,0.824052238158131,NA 
rayol-farm2_2019-05-24_12-04-37.wav,44100,16,60,1,ndsi,1024,1000,2000,2000,11000,0.605034073350824,NA 
rayol-farm2_2019-05-24_12-06-38.wav,44100,16,60,1,ndsi,1024,1000,2000,2000,11000,0.775956562441723,NA 
rayol-farm2_2019-05-24_12-08-38.wav,44100,16,60,1,ndsi,1024,1000,2000,2000,11000,0.700040124343301,NA 
rayol-farm2_2019-05-24_12-10-38.wav,44100,16,60,1,ndsi,1024,1000,2000,2000,11000,0.859018679020468,NA 
rayol-farm2_2019-05-24_12-12-38.wav,44100,16,60,1,ndsi,1024,1000,2000,2000,11000,0.828251320144937,NA 
rayol-farm2_2019-05-24_12-14-38.wav,44100,16,60,1,ndsi,1024,1000,2000,2000,11000,0.870824236189012,NA 
rayol-farm2_2019-05-24_12-16-38.wav,44100,16,60,1,ndsi,1024,1000,2000,2000,11000,0.882153010410312,NA 
rayol-farm2_2019-05-24_12-18-38.wav,44100,16,60,1,ndsi,1024,1000,2000,2000,11000,0.832613401688409,NA 
rayol-farm2_2019-05-24_12-20-38.wav,44100,16,60,1,ndsi,1024,1000,2000,2000,11000,0.757109661786392,NA 
rayol-farm2_2019-05-24_12-22-39.wav,44100,16,60,1,ndsi,1024,1000,2000,2000,11000,0.744290475219885,NA 
rayol-farm2_2019-05-24_12-24-39.wav,44100,16,60,1,ndsi,1024,1000,2000,2000,11000,0.760932095941681,NA 
rayol-farm2_2019-05-24_12-26-39.wav,44100,16,60,1,ndsi,1024,1000,2000,2000,11000,0.777090149592984,NA 
rayol-farm2_2019-05-24_12-28-39.wav,44100,16,60,1,ndsi,1024,1000,2000,2000,11000,0.798482703014803,NA 
rayol-farm2_2019-05-24_12-30-39.wav,44100,16,60,1,ndsi,1024,1000,2000,2000,11000,0.844847098750856,NA 
rayol-farm2_2019-05-24_12-32-39.wav,44100,16,60,1,ndsi,1024,1000,2000,2000,11000,0.753607601601802,NA 
rayol-farm2_2019-05-24_12-34-39.wav,44100,16,60,1,ndsi,1024,1000,2000,2000,11000,0.859187317267119,NA 
rayol-farm2_2019-05-24_12-36-39.wav,44100,16,60,1,ndsi,1024,1000,2000,2000,11000,0.797502911814186,NA 
rayol-farm2_2019-05-24_12-38-40.wav,44100,16,60,1,ndsi,1024,1000,2000,2000,11000,0.772792354201911,NA 
rayol-farm2_2019-05-24_12-40-40.wav,44100,16,60,1,ndsi,1024,1000,2000,2000,11000,0.865830956705698,NA 
rayol-farm2_2019-05-24_12-42-40.wav,44100,16,60,1,ndsi,1024,1000,2000,2000,11000,0.621936482998839,NA 
rayol-farm2_2019-05-24_12-44-40.wav,44100,16,60,1,ndsi,1024,1000,2000,2000,11000,0.777843422392855,NA 
rayol-farm2_2019-05-24_12-46-40.wav,44100,16,60,1,ndsi,1024,1000,2000,2000,11000,0.691122088994352,NA 
rayol-farm2_2019-05-24_12-48-40.wav,44100,16,60,1,ndsi,1024,1000,2000,2000,11000,0.797906115390918,NA 
rayol-farm2_2019-05-24_12-50-40.wav,44100,16,60,1,ndsi,1024,1000,2000,2000,11000,0.726402277283259,NA 
rayol-farm2_2019-05-24_12-52-40.wav,44100,16,60,1,ndsi,1024,1000,2000,2000,11000,0.798904578194456,NA 
rayol-farm2_2019-05-24_12-54-41.wav,44100,16,60,1,ndsi,1024,1000,2000,2000,11000,0.540717821271901,NA 
rayol-farm2_2019-05-24_12-56-41.wav,44100,16,60,1,ndsi,1024,1000,2000,2000,11000,0.122936845688739,NA 
rayol-farm2_2019-05-24_12-58-41.wav,44100,16,60,1,ndsi,1024,1000,2000,2000,11000,0.601293621256093,NA 
rayol-farm2_2019-05-24_13-00-41.wav,44100,16,60,1,ndsi,1024,1000,2000,2000,11000,0.63745253579464,NA 
rayol-farm2_2019-05-24_13-02-41.wav,44100,16,60,1,ndsi,1024,1000,2000,2000,11000,0.583834502736053,NA 
rayol-farm2_2019-05-24_13-04-41.wav,44100,16,60,1,ndsi,1024,1000,2000,2000,11000,0.704608794513471,NA 
rayol-farm2_2019-05-24_13-06-41.wav,44100,16,60,1,ndsi,1024,1000,2000,2000,11000,0.79544517746864,NA 
rayol-farm2_2019-05-24_13-08-41.wav,44100,16,60,1,ndsi,1024,1000,2000,2000,11000,0.703246859229227,NA 
rayol-farm2_2019-05-24_13-10-42.wav,44100,16,60,1,ndsi,1024,1000,2000,2000,11000,0.19815720606103,NA 
rayol-farm2_2019-05-24_13-12-42.wav,44100,16,60,1,ndsi,1024,1000,2000,2000,11000,0.296373731461067,NA 
rayol-farm2_2019-05-24_13-14-42.wav,44100,16,60,1,ndsi,1024,1000,2000,2000,11000,0.423893107936918,NA 
rayol-farm2_2019-05-24_13-16-42.wav,44100,16,60,1,ndsi,1024,1000,2000,2000,11000,-0.157463292869132,NA 
rayol-farm2_2019-05-24_13-18-42.wav,44100,16,60,1,ndsi,1024,1000,2000,2000,11000,-0.142594710777678,NA 
rayol-farm2_2019-05-24_13-20-42.wav,44100,16,60,1,ndsi,1024,1000,2000,2000,11000,0.192519767518556,NA 
rayol-farm2_2019-05-24_13-22-42.wav,44100,16,60,1,ndsi,1024,1000,2000,2000,11000,0.401138519961357,NA 
rayol-farm2_2019-05-24_13-24-42.wav,44100,16,60,1,ndsi,1024,1000,2000,2000,11000,0.875131921014601,NA 
rayol-farm2_2019-05-24_13-26-42.wav,44100,16,60,1,ndsi,1024,1000,2000,2000,11000,0.567494617900242,NA 
rayol-farm2_2019-05-24_13-28-43.wav,44100,16,60,1,ndsi,1024,1000,2000,2000,11000,0.579387998779399,NA 
rayol-farm2_2019-05-24_13-30-43.wav,44100,16,60,1,ndsi,1024,1000,2000,2000,11000,0.848178411301161,NA 
rayol-farm2_2019-05-24_13-32-43.wav,44100,16,60,1,ndsi,1024,1000,2000,2000,11000,0.895828023362198,NA 
rayol-farm2_2019-05-24_13-34-43.wav,44100,16,60,1,ndsi,1024,1000,2000,2000,11000,0.813706937759033,NA 
rayol-farm2_2019-05-24_13-36-43.wav,44100,16,60,1,ndsi,1024,1000,2000,2000,11000,0.911062489720654,NA 
rayol-farm2_2019-05-24_13-38-43.wav,44100,16,60,1,ndsi,1024,1000,2000,2000,11000,0.913708267479924,NA 
rayol-farm2_2019-05-24_13-40-43.wav,44100,16,60,1,ndsi,1024,1000,2000,2000,11000,0.889733905040634,NA 
rayol-farm2_2019-05-24_13-42-43.wav,44100,16,60,1,ndsi,1024,1000,2000,2000,11000,0.856910357269125,NA 
rayol-farm2_2019-05-24_13-44-44.wav,44100,16,60,1,ndsi,1024,1000,2000,2000,11000,0.582947306653654,NA 
rayol-farm2_2019-05-24_13-46-44.wav,44100,16,60,1,ndsi,1024,1000,2000,2000,11000,0.481649297510761,NA 
rayol-farm2_2019-05-24_13-48-44.wav,44100,16,60,1,ndsi,1024,1000,2000,2000,11000,0.262788320952807,NA 
rayol-farm2_2019-05-24_13-50-44.wav,44100,16,60,1,ndsi,1024,1000,2000,2000,11000,0.838504057538784,NA 
rayol-farm2_2019-05-24_13-52-44.wav,44100,16,60,1,ndsi,1024,1000,2000,2000,11000,0.70506575384742,NA 
rayol-farm2_2019-05-24_13-54-44.wav,44100,16,60,1,ndsi,1024,1000,2000,2000,11000,0.64946108324487,NA 
rayol-farm2_2019-05-24_13-56-44.wav,44100,16,60,1,ndsi,1024,1000,2000,2000,11000,0.426287493309524,NA 
rayol-farm2_2019-05-24_13-58-44.wav,44100,16,60,1,ndsi,1024,1000,2000,2000,11000,0.679096928563123,NA 
rayol-farm2_2019-05-24_14-00-45.wav,44100,16,60,1,ndsi,1024,1000,2000,2000,11000,0.494856582354162,NA 
rayol-farm2_2019-05-24_14-02-45.wav,44100,16,60,1,ndsi,1024,1000,2000,2000,11000,0.900380816628067,NA 
rayol-farm2_2019-05-24_14-04-45.wav,44100,16,60,1,ndsi,1024,1000,2000,2000,11000,0.896593857923981,NA 
rayol-farm2_2019-05-24_14-06-45.wav,44100,16,60,1,ndsi,1024,1000,2000,2000,11000,0.828574864406873,NA 
rayol-farm2_2019-05-24_14-08-45.wav,44100,16,60,1,ndsi,1024,1000,2000,2000,11000,0.838685419018847,NA 
rayol-farm2_2019-05-24_14-10-45.wav,44100,16,60,1,ndsi,1024,1000,2000,2000,11000,0.87033590948769,NA 
rayol-farm2_2019-05-24_14-12-45.wav,44100,16,60,1,ndsi,1024,1000,2000,2000,11000,0.851898337139601,NA 
rayol-farm2_2019-05-24_14-14-45.wav,44100,16,60,1,ndsi,1024,1000,2000,2000,11000,0.90920699219317,NA 
rayol-farm2_2019-05-24_14-16-46.wav,44100,16,60,1,ndsi,1024,1000,2000,2000,11000,0.346993813328315,NA 
rayol-farm2_2019-05-24_14-18-46.wav,44100,16,60,1,ndsi,1024,1000,2000,2000,11000,0.663228093003166,NA 
rayol-farm2_2019-05-24_14-20-46.wav,44100,16,60,1,ndsi,1024,1000,2000,2000,11000,0.775893387430039,NA 
rayol-farm2_2019-05-24_14-22-46.wav,44100,16,60,1,ndsi,1024,1000,2000,2000,11000,0.836907655447056,NA 
rayol-farm2_2019-05-24_14-24-46.wav,44100,16,60,1,ndsi,1024,1000,2000,2000,11000,0.864528746992251,NA 
rayol-farm2_2019-05-24_14-26-46.wav,44100,16,60,1,ndsi,1024,1000,2000,2000,11000,0.863447579378589,NA 
rayol-farm2_2019-05-24_14-28-46.wav,44100,16,60,1,ndsi,1024,1000,2000,2000,11000,0.844075733936318,NA 
rayol-farm2_2019-05-24_14-30-46.wav,44100,16,60,1,ndsi,1024,1000,2000,2000,11000,0.796913640674529,NA 
rayol-farm2_2019-05-24_14-32-46.wav,44100,16,60,1,ndsi,1024,1000,2000,2000,11000,0.8637817152879,NA 
rayol-farm2_2019-05-24_14-34-47.wav,44100,16,60,1,ndsi,1024,1000,2000,2000,11000,0.818502777283051,NA 
rayol-farm2_2019-05-24_14-36-47.wav,44100,16,60,1,ndsi,1024,1000,2000,2000,11000,0.849810371431103,NA 
rayol-farm2_2019-05-24_14-38-47.wav,44100,16,60,1,ndsi,1024,1000,2000,2000,11000,0.578824310896909,NA 
rayol-farm2_2019-05-24_14-40-47.wav,44100,16,60,1,ndsi,1024,1000,2000,2000,11000,0.900942300145037,NA 
rayol-farm2_2019-05-24_14-42-47.wav,44100,16,60,1,ndsi,1024,1000,2000,2000,11000,0.883263416045584,NA 
rayol-farm2_2019-05-24_14-44-47.wav,44100,16,60,1,ndsi,1024,1000,2000,2000,11000,0.864930063353059,NA 
rayol-farm2_2019-05-24_14-46-47.wav,44100,16,60,1,ndsi,1024,1000,2000,2000,11000,0.762613649472531,NA 
rayol-farm2_2019-05-24_14-48-47.wav,44100,16,60,1,ndsi,1024,1000,2000,2000,11000,0.886619989288698,NA 
rayol-farm2_2019-05-24_14-50-48.wav,44100,16,60,1,ndsi,1024,1000,2000,2000,11000,0.508605130430534,NA 
rayol-farm2_2019-05-24_14-52-48.wav,44100,16,60,1,ndsi,1024,1000,2000,2000,11000,0.799682020348071,NA 
rayol-farm2_2019-05-24_14-54-48.wav,44100,16,60,1,ndsi,1024,1000,2000,2000,11000,0.908171389220225,NA 
rayol-farm2_2019-05-24_14-56-48.wav,44100,16,60,1,ndsi,1024,1000,2000,2000,11000,0.87317804795075,NA 
rayol-farm2_2019-05-24_14-58-48.wav,44100,16,60,1,ndsi,1024,1000,2000,2000,11000,0.887338711262306,NA 
rayol-farm2_2019-05-24_15-00-48.wav,44100,16,60,1,ndsi,1024,1000,2000,2000,11000,0.87333105163843,NA 
rayol-farm2_2019-05-24_15-02-48.wav,44100,16,60,1,ndsi,1024,1000,2000,2000,11000,0.817868894388946,NA 
rayol-farm2_2019-05-24_15-04-48.wav,44100,16,60,1,ndsi,1024,1000,2000,2000,11000,0.905894671381112,NA 
rayol-farm2_2019-05-24_15-06-49.wav,44100,16,60,1,ndsi,1024,1000,2000,2000,11000,0.894172100512124,NA 
rayol-farm2_2019-05-24_15-08-49.wav,44100,16,60,1,ndsi,1024,1000,2000,2000,11000,0.839023568958399,NA 
rayol-farm2_2019-05-24_15-10-49.wav,44100,16,60,1,ndsi,1024,1000,2000,2000,11000,0.48043267004241,NA 
rayol-farm2_2019-05-24_15-12-49.wav,44100,16,60,1,ndsi,1024,1000,2000,2000,11000,0.843574156291742,NA 
rayol-farm2_2019-05-24_15-14-49.wav,44100,16,60,1,ndsi,1024,1000,2000,2000,11000,0.857255331118411,NA 
rayol-farm2_2019-05-24_15-16-49.wav,44100,16,60,1,ndsi,1024,1000,2000,2000,11000,0.367817416211862,NA 
rayol-farm2_2019-05-24_15-18-49.wav,44100,16,60,1,ndsi,1024,1000,2000,2000,11000,0.677627468298871,NA 
rayol-farm2_2019-05-24_15-20-49.wav,44100,16,60,1,ndsi,1024,1000,2000,2000,11000,0.925004810002462,NA 
rayol-farm2_2019-05-24_15-22-50.wav,44100,16,60,1,ndsi,1024,1000,2000,2000,11000,0.759970975173117,NA 
rayol-farm2_2019-05-24_15-24-50.wav,44100,16,60,1,ndsi,1024,1000,2000,2000,11000,0.841173121399212,NA 
rayol-farm2_2019-05-24_15-26-50.wav,44100,16,60,1,ndsi,1024,1000,2000,2000,11000,0.903897078946241,NA 
rayol-farm2_2019-05-24_15-28-50.wav,44100,16,60,1,ndsi,1024,1000,2000,2000,11000,0.247185764016747,NA 
rayol-farm2_2019-05-24_15-30-50.wav,44100,16,60,1,ndsi,1024,1000,2000,2000,11000,0.716189540218381,NA 
rayol-farm2_2019-05-24_15-32-50.wav,44100,16,60,1,ndsi,1024,1000,2000,2000,11000,0.615770123345607,NA 
rayol-farm2_2019-05-24_15-34-50.wav,44100,16,60,1,ndsi,1024,1000,2000,2000,11000,0.919971418940821,NA 
rayol-farm2_2019-05-24_15-36-50.wav,44100,16,60,1,ndsi,1024,1000,2000,2000,11000,0.749353305083767,NA 
rayol-farm2_2019-05-24_15-38-51.wav,44100,16,60,1,ndsi,1024,1000,2000,2000,11000,0.494576171412294,NA 
rayol-farm2_2019-05-24_15-40-51.wav,44100,16,60,1,ndsi,1024,1000,2000,2000,11000,0.888032964922599,NA 
rayol-farm2_2019-05-24_15-42-51.wav,44100,16,60,1,ndsi,1024,1000,2000,2000,11000,0.900814870951171,NA 
rayol-farm2_2019-05-24_15-44-51.wav,44100,16,60,1,ndsi,1024,1000,2000,2000,11000,0.897170464202836,NA 
rayol-farm2_2019-05-24_15-46-51.wav,44100,16,60,1,ndsi,1024,1000,2000,2000,11000,0.791108633257813,NA 
rayol-farm2_2019-05-24_15-48-51.wav,44100,16,60,1,ndsi,1024,1000,2000,2000,11000,0.892188655596453,NA 
rayol-farm2_2019-05-24_15-50-51.wav,44100,16,60,1,ndsi,1024,1000,2000,2000,11000,0.600056873568756,NA 
rayol-farm2_2019-05-24_15-52-51.wav,44100,16,60,1,ndsi,1024,1000,2000,2000,11000,0.254729119619876,NA 
rayol-farm2_2019-05-24_15-54-52.wav,44100,16,60,1,ndsi,1024,1000,2000,2000,11000,0.210634014108819,NA 
rayol-farm2_2019-05-24_15-56-52.wav,44100,16,60,1,ndsi,1024,1000,2000,2000,11000,0.624587782200031,NA 
rayol-farm2_2019-05-24_15-58-52.wav,44100,16,60,1,ndsi,1024,1000,2000,2000,11000,0.911736225185339,NA 
rayol-farm2_2019-05-24_16-00-52.wav,44100,16,60,1,ndsi,1024,1000,2000,2000,11000,0.795935125977439,NA 
rayol-farm2_2019-05-24_16-02-52.wav,44100,16,60,1,ndsi,1024,1000,2000,2000,11000,0.859231746468897,NA 
rayol-farm2_2019-05-24_16-04-52.wav,44100,16,60,1,ndsi,1024,1000,2000,2000,11000,0.854068186690148,NA 
rayol-farm2_2019-05-24_16-06-52.wav,44100,16,60,1,ndsi,1024,1000,2000,2000,11000,0.88715009482757,NA 
rayol-farm2_2019-05-24_16-08-52.wav,44100,16,60,1,ndsi,1024,1000,2000,2000,11000,0.864710228436054,NA 
rayol-farm2_2019-05-24_16-10-53.wav,44100,16,60,1,ndsi,1024,1000,2000,2000,11000,0.882340904016986,NA 
rayol-farm2_2019-05-24_16-12-53.wav,44100,16,60,1,ndsi,1024,1000,2000,2000,11000,0.845802531226025,NA 
rayol-farm2_2019-05-24_16-14-53.wav,44100,16,60,1,ndsi,1024,1000,2000,2000,11000,0.904172459043308,NA 
rayol-farm2_2019-05-24_16-16-53.wav,44100,16,60,1,ndsi,1024,1000,2000,2000,11000,0.669205447934511,NA 
rayol-farm2_2019-05-24_16-18-53.wav,44100,16,60,1,ndsi,1024,1000,2000,2000,11000,0.911431184545337,NA 
rayol-farm2_2019-05-24_16-20-53.wav,44100,16,60,1,ndsi,1024,1000,2000,2000,11000,0.819172241614379,NA 
rayol-farm2_2019-05-24_16-22-53.wav,44100,16,60,1,ndsi,1024,1000,2000,2000,11000,0.920601204067202,NA 
rayol-farm2_2019-05-24_16-24-53.wav,44100,16,60,1,ndsi,1024,1000,2000,2000,11000,0.868565743518739,NA 
rayol-farm2_2019-05-24_16-26-53.wav,44100,16,60,1,ndsi,1024,1000,2000,2000,11000,0.90712872851982,NA 
rayol-farm2_2019-05-24_16-28-54.wav,44100,16,60,1,ndsi,1024,1000,2000,2000,11000,0.880979997718364,NA 
rayol-farm2_2019-05-24_16-30-54.wav,44100,16,60,1,ndsi,1024,1000,2000,2000,11000,0.920710472856134,NA 
rayol-farm2_2019-05-24_16-32-54.wav,44100,16,60,1,ndsi,1024,1000,2000,2000,11000,0.884847943743756,NA 
rayol-farm2_2019-05-24_16-34-54.wav,44100,16,60,1,ndsi,1024,1000,2000,2000,11000,0.888195711176921,NA 
rayol-farm2_2019-05-24_16-36-54.wav,44100,16,60,1,ndsi,1024,1000,2000,2000,11000,0.924480633952182,NA 
rayol-farm2_2019-05-24_16-38-54.wav,44100,16,60,1,ndsi,1024,1000,2000,2000,11000,0.869092276240277,NA 
rayol-farm2_2019-05-24_16-40-54.wav,44100,16,60,1,ndsi,1024,1000,2000,2000,11000,0.929323558620706,NA 
rayol-farm2_2019-05-24_16-42-54.wav,44100,16,60,1,ndsi,1024,1000,2000,2000,11000,0.889643135921351,NA 
rayol-farm2_2019-05-24_16-44-55.wav,44100,16,60,1,ndsi,1024,1000,2000,2000,11000,0.215582073178299,NA 
rayol-farm2_2019-05-24_16-46-55.wav,44100,16,60,1,ndsi,1024,1000,2000,2000,11000,0.582108625056984,NA 
rayol-farm2_2019-05-24_16-48-55.wav,44100,16,60,1,ndsi,1024,1000,2000,2000,11000,0.853594809109771,NA 
rayol-farm2_2019-05-24_16-50-55.wav,44100,16,60,1,ndsi,1024,1000,2000,2000,11000,0.907061274074366,NA 
rayol-farm2_2019-05-24_16-52-55.wav,44100,16,60,1,ndsi,1024,1000,2000,2000,11000,0.917666094644069,NA 
rayol-farm2_2019-05-24_16-54-55.wav,44100,16,60,1,ndsi,1024,1000,2000,2000,11000,0.895115233789518,NA 
rayol-farm2_2019-05-24_16-56-55.wav,44100,16,60,1,ndsi,1024,1000,2000,2000,11000,0.931774592656433,NA 
rayol-farm2_2019-05-24_16-58-55.wav,44100,16,60,1,ndsi,1024,1000,2000,2000,11000,0.925495132361465,NA 
rayol-farm2_2019-05-24_17-00-56.wav,44100,16,60,1,ndsi,1024,1000,2000,2000,11000,0.873452788287112,NA 
rayol-farm2_2019-05-24_17-02-56.wav,44100,16,60,1,ndsi,1024,1000,2000,2000,11000,0.930238479981234,NA 
rayol-farm2_2019-05-24_17-04-56.wav,44100,16,60,1,ndsi,1024,1000,2000,2000,11000,0.373389967439021,NA 
rayol-farm2_2019-05-24_17-06-56.wav,44100,16,60,1,ndsi,1024,1000,2000,2000,11000,0.935903450448409,NA 
rayol-farm2_2019-05-24_17-08-56.wav,44100,16,60,1,ndsi,1024,1000,2000,2000,11000,0.818328101428141,NA 
rayol-farm2_2019-05-24_17-10-56.wav,44100,16,60,1,ndsi,1024,1000,2000,2000,11000,0.929966255093742,NA 
rayol-farm2_2019-05-24_17-12-56.wav,44100,16,60,1,ndsi,1024,1000,2000,2000,11000,0.933469323481312,NA 
rayol-farm2_2019-05-24_17-14-56.wav,44100,16,60,1,ndsi,1024,1000,2000,2000,11000,0.927304463061286,NA 
rayol-farm2_2019-05-24_17-16-57.wav,44100,16,60,1,ndsi,1024,1000,2000,2000,11000,0.94704501167823,NA 
rayol-farm2_2019-05-24_17-18-57.wav,44100,16,60,1,ndsi,1024,1000,2000,2000,11000,0.947251755115025,NA 
rayol-farm2_2019-05-24_17-20-57.wav,44100,16,60,1,ndsi,1024,1000,2000,2000,11000,0.933018980242427,NA 
rayol-farm2_2019-05-24_17-22-57.wav,44100,16,60,1,ndsi,1024,1000,2000,2000,11000,0.946760603901308,NA 
rayol-farm2_2019-05-24_17-24-57.wav,44100,16,60,1,ndsi,1024,1000,2000,2000,11000,0.927925566558277,NA 
rayol-farm2_2019-05-24_17-26-57.wav,44100,16,60,1,ndsi,1024,1000,2000,2000,11000,0.941659825320948,NA 
rayol-farm2_2019-05-24_17-28-57.wav,44100,16,60,1,ndsi,1024,1000,2000,2000,11000,0.943742129122727,NA 
rayol-farm2_2019-05-24_17-30-57.wav,44100,16,60,1,ndsi,1024,1000,2000,2000,11000,0.938224367442456,NA 
rayol-farm2_2019-05-24_17-32-57.wav,44100,16,60,1,ndsi,1024,1000,2000,2000,11000,0.935274410024093,NA 
rayol-farm2_2019-05-24_17-34-58.wav,44100,16,60,1,ndsi,1024,1000,2000,2000,11000,0.940085599194252,NA 
rayol-farm2_2019-05-24_17-36-58.wav,44100,16,60,1,ndsi,1024,1000,2000,2000,11000,0.907574122842353,NA 
rayol-farm2_2019-05-24_17-38-58.wav,44100,16,60,1,ndsi,1024,1000,2000,2000,11000,0.936708135498588,NA 
rayol-farm2_2019-05-24_17-40-58.wav,44100,16,60,1,ndsi,1024,1000,2000,2000,11000,0.931129892030192,NA 
rayol-farm2_2019-05-24_17-42-58.wav,44100,16,60,1,ndsi,1024,1000,2000,2000,11000,0.938268518279038,NA 
rayol-farm2_2019-05-24_17-44-58.wav,44100,16,60,1,ndsi,1024,1000,2000,2000,11000,0.935446211553512,NA 
rayol-farm2_2019-05-24_17-46-58.wav,44100,16,60,1,ndsi,1024,1000,2000,2000,11000,0.933516419653882,NA 
rayol-farm2_2019-05-24_17-48-58.wav,44100,16,60,1,ndsi,1024,1000,2000,2000,11000,0.930033959022053,NA 
rayol-farm2_2019-05-24_17-50-59.wav,44100,16,60,1,ndsi,1024,1000,2000,2000,11000,0.902254057224912,NA 
rayol-farm2_2019-05-24_17-52-59.wav,44100,16,60,1,ndsi,1024,1000,2000,2000,11000,0.922997153393823,NA 
rayol-farm2_2019-05-24_17-54-59.wav,44100,16,60,1,ndsi,1024,1000,2000,2000,11000,0.947037646776121,NA 
rayol-farm2_2019-05-24_17-56-59.wav,44100,16,60,1,ndsi,1024,1000,2000,2000,11000,0.947928106496065,NA 
rayol-farm2_2019-05-24_17-58-59.wav,44100,16,60,1,ndsi,1024,1000,2000,2000,11000,0.938202456530037,NA 
rayol-farm2_2019-05-24_18-00-59.wav,44100,16,60,1,ndsi,1024,1000,2000,2000,11000,0.944212448893149,NA 
rayol-farm2_2019-05-24_18-02-59.wav,44100,16,60,1,ndsi,1024,1000,2000,2000,11000,0.946508155028273,NA 
rayol-farm2_2019-05-24_18-04-59.wav,44100,16,60,1,ndsi,1024,1000,2000,2000,11000,0.942620544747629,NA 
rayol-farm2_2019-05-24_18-07-00.wav,44100,16,60,1,ndsi,1024,1000,2000,2000,11000,0.941389351639853,NA 
rayol-farm2_2019-05-24_18-09-00.wav,44100,16,60,1,ndsi,1024,1000,2000,2000,11000,0.948603487824898,NA 
rayol-farm2_2019-05-24_18-11-00.wav,44100,16,60,1,ndsi,1024,1000,2000,2000,11000,0.947775847459147,NA 
rayol-farm2_2019-05-24_18-13-00.wav,44100,16,60,1,ndsi,1024,1000,2000,2000,11000,0.948304759901518,NA 
rayol-farm2_2019-05-24_18-15-00.wav,44100,16,60,1,ndsi,1024,1000,2000,2000,11000,0.935413933840506,NA 
rayol-farm2_2019-05-24_18-17-00.wav,44100,16,60,1,ndsi,1024,1000,2000,2000,11000,0.946862399332433,NA 
rayol-farm2_2019-05-24_18-19-00.wav,44100,16,60,1,ndsi,1024,1000,2000,2000,11000,0.961391416277233,NA 
rayol-farm2_2019-05-24_18-21-00.wav,44100,16,60,1,ndsi,1024,1000,2000,2000,11000,0.945640345528616,NA 
rayol-farm2_2019-05-24_18-23-01.wav,44100,16,60,1,ndsi,1024,1000,2000,2000,11000,0.946500426106326,NA 
rayol-farm2_2019-05-24_18-25-01.wav,44100,16,60,1,ndsi,1024,1000,2000,2000,11000,0.943223166756093,NA 
rayol-farm2_2019-05-24_18-27-01.wav,44100,16,60,1,ndsi,1024,1000,2000,2000,11000,0.942405839034898,NA 
rayol-farm2_2019-05-24_18-29-01.wav,44100,16,60,1,ndsi,1024,1000,2000,2000,11000,0.944533990560073,NA 
rayol-farm2_2019-05-24_18-31-01.wav,44100,16,60,1,ndsi,1024,1000,2000,2000,11000,0.948794460777286,NA 
rayol-farm2_2019-05-24_18-33-01.wav,44100,16,60,1,ndsi,1024,1000,2000,2000,11000,0.94350290437465,NA 
rayol-farm2_2019-05-24_18-35-01.wav,44100,16,60,1,ndsi,1024,1000,2000,2000,11000,0.941687423364076,NA 
rayol-farm2_2019-05-24_18-37-01.wav,44100,16,60,1,ndsi,1024,1000,2000,2000,11000,0.947042517774475,NA 
rayol-farm2_2019-05-24_18-39-01.wav,44100,16,60,1,ndsi,1024,1000,2000,2000,11000,0.946059345517683,NA 
rayol-farm2_2019-05-24_18-41-02.wav,44100,16,60,1,ndsi,1024,1000,2000,2000,11000,0.939552284010838,NA 
rayol-farm2_2019-05-24_18-43-02.wav,44100,16,60,1,ndsi,1024,1000,2000,2000,11000,0.948697998002762,NA 
rayol-farm2_2019-05-24_18-45-02.wav,44100,16,60,1,ndsi,1024,1000,2000,2000,11000,0.949505832889349,NA 
rayol-farm2_2019-05-24_18-47-02.wav,44100,16,60,1,ndsi,1024,1000,2000,2000,11000,0.951051287239367,NA 
rayol-farm2_2019-05-24_18-49-02.wav,44100,16,60,1,ndsi,1024,1000,2000,2000,11000,0.95326282446856,NA 
rayol-farm2_2019-05-24_18-51-02.wav,44100,16,60,1,ndsi,1024,1000,2000,2000,11000,0.958120673022413,NA 
rayol-farm2_2019-05-24_18-53-02.wav,44100,16,60,1,ndsi,1024,1000,2000,2000,11000,0.92484655982657,NA 
rayol-farm2_2019-05-24_18-55-02.wav,44100,16,60,1,ndsi,1024,1000,2000,2000,11000,0.941818433269991,NA 
rayol-farm2_2019-05-24_18-57-03.wav,44100,16,60,1,ndsi,1024,1000,2000,2000,11000,0.945791469919323,NA 
rayol-farm2_2019-05-24_18-59-03.wav,44100,16,60,1,ndsi,1024,1000,2000,2000,11000,0.91474891179416,NA 
rayol-farm2_2019-05-24_19-01-03.wav,44100,16,60,1,ndsi,1024,1000,2000,2000,11000,0.946408901235178,NA 
rayol-farm2_2019-05-24_19-03-03.wav,44100,16,60,1,ndsi,1024,1000,2000,2000,11000,0.949265741131884,NA 
rayol-farm2_2019-05-24_19-05-03.wav,44100,16,60,1,ndsi,1024,1000,2000,2000,11000,0.942350301211775,NA 
rayol-farm2_2019-05-24_19-07-03.wav,44100,16,60,1,ndsi,1024,1000,2000,2000,11000,0.944266631203566,NA 
rayol-farm2_2019-05-24_19-09-03.wav,44100,16,60,1,ndsi,1024,1000,2000,2000,11000,0.94631178238979,NA 
rayol-farm2_2019-05-24_19-11-03.wav,44100,16,60,1,ndsi,1024,1000,2000,2000,11000,0.948194821820492,NA 
rayol-farm2_2019-05-24_19-13-04.wav,44100,16,60,1,ndsi,1024,1000,2000,2000,11000,0.92090746114886,NA 
rayol-farm2_2019-05-24_19-15-04.wav,44100,16,60,1,ndsi,1024,1000,2000,2000,11000,0.911321370852921,NA 
rayol-farm2_2019-05-24_19-17-04.wav,44100,16,60,1,ndsi,1024,1000,2000,2000,11000,0.931723326371102,NA 
rayol-farm2_2019-05-24_19-19-04.wav,44100,16,60,1,ndsi,1024,1000,2000,2000,11000,0.948577646630599,NA 
rayol-farm2_2019-05-24_19-21-04.wav,44100,16,60,1,ndsi,1024,1000,2000,2000,11000,0.951371369138506,NA 
rayol-farm2_2019-05-24_19-23-04.wav,44100,16,60,1,ndsi,1024,1000,2000,2000,11000,0.946860954411293,NA 
rayol-farm2_2019-05-24_19-25-04.wav,44100,16,60,1,ndsi,1024,1000,2000,2000,11000,0.946721698801439,NA 
rayol-farm2_2019-05-24_19-27-04.wav,44100,16,60,1,ndsi,1024,1000,2000,2000,11000,0.946880656101793,NA 
rayol-farm2_2019-05-24_19-29-05.wav,44100,16,60,1,ndsi,1024,1000,2000,2000,11000,0.945526889408537,NA 
rayol-farm2_2019-05-24_19-31-05.wav,44100,16,60,1,ndsi,1024,1000,2000,2000,11000,0.952703113571525,NA 
rayol-farm2_2019-05-24_19-33-05.wav,44100,16,60,1,ndsi,1024,1000,2000,2000,11000,0.966828042374477,NA 
rayol-farm2_2019-05-24_19-35-05.wav,44100,16,60,1,ndsi,1024,1000,2000,2000,11000,0.947154607753851,NA 
rayol-farm2_2019-05-24_19-37-05.wav,44100,16,60,1,ndsi,1024,1000,2000,2000,11000,0.955668231129805,NA 
rayol-farm2_2019-05-24_19-39-05.wav,44100,16,60,1,ndsi,1024,1000,2000,2000,11000,0.945314819384686,NA 
rayol-farm2_2019-05-24_19-41-05.wav,44100,16,60,1,ndsi,1024,1000,2000,2000,11000,0.950784372766615,NA 
rayol-farm2_2019-05-24_19-43-05.wav,44100,16,60,1,ndsi,1024,1000,2000,2000,11000,0.957798905299316,NA 
rayol-farm2_2019-05-24_19-45-05.wav,44100,16,60,1,ndsi,1024,1000,2000,2000,11000,0.942394858565921,NA 
rayol-farm2_2019-05-24_19-47-06.wav,44100,16,60,1,ndsi,1024,1000,2000,2000,11000,0.916312605760987,NA 
rayol-farm2_2019-05-24_19-49-06.wav,44100,16,60,1,ndsi,1024,1000,2000,2000,11000,0.943579362401257,NA 
rayol-farm2_2019-05-24_19-51-06.wav,44100,16,60,1,ndsi,1024,1000,2000,2000,11000,0.92257830182261,NA 
rayol-farm2_2019-05-24_19-53-06.wav,44100,16,60,1,ndsi,1024,1000,2000,2000,11000,0.933963066565824,NA 
rayol-farm2_2019-05-24_19-55-06.wav,44100,16,60,1,ndsi,1024,1000,2000,2000,11000,0.930068842804855,NA 
rayol-farm2_2019-05-24_19-57-06.wav,44100,16,60,1,ndsi,1024,1000,2000,2000,11000,0.924203197040429,NA 
rayol-farm2_2019-05-24_19-59-06.wav,44100,16,60,1,ndsi,1024,1000,2000,2000,11000,0.932721541381379,NA 
rayol-farm2_2019-05-24_20-01-06.wav,44100,16,60,1,ndsi,1024,1000,2000,2000,11000,0.929153702133125,NA 
rayol-farm2_2019-05-24_20-03-07.wav,44100,16,60,1,ndsi,1024,1000,2000,2000,11000,0.939808035863745,NA 
rayol-farm2_2019-05-24_20-05-07.wav,44100,16,60,1,ndsi,1024,1000,2000,2000,11000,0.949154911575859,NA 
rayol-farm2_2019-05-24_20-07-07.wav,44100,16,60,1,ndsi,1024,1000,2000,2000,11000,0.944099459221025,NA 
rayol-farm2_2019-05-24_20-09-07.wav,44100,16,60,1,ndsi,1024,1000,2000,2000,11000,0.934964928533049,NA 
rayol-farm2_2019-05-24_20-11-07.wav,44100,16,60,1,ndsi,1024,1000,2000,2000,11000,0.946435820965138,NA 
rayol-farm2_2019-05-24_20-13-07.wav,44100,16,60,1,ndsi,1024,1000,2000,2000,11000,0.944016370064292,NA 
rayol-farm2_2019-05-24_20-15-07.wav,44100,16,60,1,ndsi,1024,1000,2000,2000,11000,0.942703491237896,NA 
rayol-farm2_2019-05-24_20-17-07.wav,44100,16,60,1,ndsi,1024,1000,2000,2000,11000,0.917717794242986,NA 
rayol-farm2_2019-05-24_20-19-08.wav,44100,16,60,1,ndsi,1024,1000,2000,2000,11000,0.928101433476777,NA 
rayol-farm2_2019-05-24_20-21-08.wav,44100,16,60,1,ndsi,1024,1000,2000,2000,11000,0.916885786535606,NA
