FILENAME,SAMPLINGRATE,BIT,DURATION,CHANNELS,INDEX,FFT_W,ANTHRO_MIN,ANTHRO_MAX,BIO_MIN,BIO_MAX,LEFT_CHANNEL,RIGHT_CHANNEL
rayol-farm2_2019-05-02_00-00-25.wav,44100,16,60,1,ndsi,1024,1000,2000,2000,11000,0.912906687892644,NA 
rayol-farm2_2019-05-02_00-02-25.wav,44100,16,60,1,ndsi,1024,1000,2000,2000,11000,0.912449012942776,NA 
rayol-farm2_2019-05-02_00-04-26.wav,44100,16,60,1,ndsi,1024,1000,2000,2000,11000,0.913795731774671,NA 
rayol-farm2_2019-05-02_00-06-26.wav,44100,16,60,1,ndsi,1024,1000,2000,2000,11000,0.911154015866057,NA 
rayol-farm2_2019-05-02_00-08-26.wav,44100,16,60,1,ndsi,1024,1000,2000,2000,11000,0.912638639023756,NA 
rayol-farm2_2019-05-02_00-10-26.wav,44100,16,60,1,ndsi,1024,1000,2000,2000,11000,0.905568257880671,NA 
rayol-farm2_2019-05-02_00-12-26.wav,44100,16,60,1,ndsi,1024,1000,2000,2000,11000,0.91067503979291,NA 
rayol-farm2_2019-05-02_00-14-26.wav,44100,16,60,1,ndsi,1024,1000,2000,2000,11000,0.909857452553209,NA 
rayol-farm2_2019-05-02_00-16-26.wav,44100,16,60,1,ndsi,1024,1000,2000,2000,11000,0.910461779349199,NA 
rayol-farm2_2019-05-02_00-18-26.wav,44100,16,60,1,ndsi,1024,1000,2000,2000,11000,0.910329598358956,NA 
rayol-farm2_2019-05-02_00-20-27.wav,44100,16,60,1,ndsi,1024,1000,2000,2000,11000,0.911372005286538,NA 
rayol-farm2_2019-05-02_00-22-27.wav,44100,16,60,1,ndsi,1024,1000,2000,2000,11000,0.911375941849022,NA 
rayol-farm2_2019-05-02_00-24-27.wav,44100,16,60,1,ndsi,1024,1000,2000,2000,11000,0.910964150565667,NA 
rayol-farm2_2019-05-02_00-26-27.wav,44100,16,60,1,ndsi,1024,1000,2000,2000,11000,0.911148280763867,NA 
rayol-farm2_2019-05-02_00-28-27.wav,44100,16,60,1,ndsi,1024,1000,2000,2000,11000,0.916048845120767,NA 
rayol-farm2_2019-05-02_00-30-27.wav,44100,16,60,1,ndsi,1024,1000,2000,2000,11000,0.911989364144936,NA 
rayol-farm2_2019-05-02_00-32-27.wav,44100,16,60,1,ndsi,1024,1000,2000,2000,11000,0.919118869732746,NA 
rayol-farm2_2019-05-02_00-34-27.wav,44100,16,60,1,ndsi,1024,1000,2000,2000,11000,0.918840961062879,NA 
rayol-farm2_2019-05-02_00-36-27.wav,44100,16,60,1,ndsi,1024,1000,2000,2000,11000,0.923699202585323,NA 
rayol-farm2_2019-05-02_00-38-28.wav,44100,16,60,1,ndsi,1024,1000,2000,2000,11000,0.921038057664618,NA 
rayol-farm2_2019-05-02_00-40-28.wav,44100,16,60,1,ndsi,1024,1000,2000,2000,11000,0.926692042045488,NA 
rayol-farm2_2019-05-02_00-42-28.wav,44100,16,60,1,ndsi,1024,1000,2000,2000,11000,0.920482626301628,NA 
rayol-farm2_2019-05-02_00-44-28.wav,44100,16,60,1,ndsi,1024,1000,2000,2000,11000,0.922904569549219,NA 
rayol-farm2_2019-05-02_00-46-28.wav,44100,16,60,1,ndsi,1024,1000,2000,2000,11000,0.925980947217699,NA 
rayol-farm2_2019-05-02_00-48-28.wav,44100,16,60,1,ndsi,1024,1000,2000,2000,11000,0.919724805061577,NA 
rayol-farm2_2019-05-02_00-50-28.wav,44100,16,60,1,ndsi,1024,1000,2000,2000,11000,0.922779087753233,NA 
rayol-farm2_2019-05-02_00-52-28.wav,44100,16,60,1,ndsi,1024,1000,2000,2000,11000,0.925306655715782,NA 
rayol-farm2_2019-05-02_00-54-29.wav,44100,16,60,1,ndsi,1024,1000,2000,2000,11000,0.918514915453347,NA 
rayol-farm2_2019-05-02_00-56-29.wav,44100,16,60,1,ndsi,1024,1000,2000,2000,11000,0.920937292696744,NA 
rayol-farm2_2019-05-02_00-58-29.wav,44100,16,60,1,ndsi,1024,1000,2000,2000,11000,0.924595676048034,NA 
rayol-farm2_2019-05-02_01-00-29.wav,44100,16,60,1,ndsi,1024,1000,2000,2000,11000,0.923072641506819,NA 
rayol-farm2_2019-05-02_01-02-29.wav,44100,16,60,1,ndsi,1024,1000,2000,2000,11000,0.92298852357511,NA 
rayol-farm2_2019-05-02_01-04-29.wav,44100,16,60,1,ndsi,1024,1000,2000,2000,11000,0.92084343366234,NA 
rayol-farm2_2019-05-02_01-06-29.wav,44100,16,60,1,ndsi,1024,1000,2000,2000,11000,0.925845226783777,NA 
rayol-farm2_2019-05-02_01-08-29.wav,44100,16,60,1,ndsi,1024,1000,2000,2000,11000,0.919224567837348,NA 
rayol-farm2_2019-05-02_01-10-30.wav,44100,16,60,1,ndsi,1024,1000,2000,2000,11000,0.923022912665442,NA 
rayol-farm2_2019-05-02_01-12-30.wav,44100,16,60,1,ndsi,1024,1000,2000,2000,11000,0.931398464738779,NA 
rayol-farm2_2019-05-02_01-14-30.wav,44100,16,60,1,ndsi,1024,1000,2000,2000,11000,0.927612560108701,NA 
rayol-farm2_2019-05-02_01-16-30.wav,44100,16,60,1,ndsi,1024,1000,2000,2000,11000,0.925121590219878,NA 
rayol-farm2_2019-05-02_01-18-30.wav,44100,16,60,1,ndsi,1024,1000,2000,2000,11000,0.922671303150304,NA 
rayol-farm2_2019-05-02_01-20-30.wav,44100,16,60,1,ndsi,1024,1000,2000,2000,11000,0.909074123607369,NA 
rayol-farm2_2019-05-02_01-22-30.wav,44100,16,60,1,ndsi,1024,1000,2000,2000,11000,0.914145047418635,NA 
rayol-farm2_2019-05-02_01-24-30.wav,44100,16,60,1,ndsi,1024,1000,2000,2000,11000,0.919041306458009,NA 
rayol-farm2_2019-05-02_01-26-31.wav,44100,16,60,1,ndsi,1024,1000,2000,2000,11000,0.921782286262882,NA 
rayol-farm2_2019-05-02_01-28-31.wav,44100,16,60,1,ndsi,1024,1000,2000,2000,11000,0.922898392819069,NA 
rayol-farm2_2019-05-02_01-30-31.wav,44100,16,60,1,ndsi,1024,1000,2000,2000,11000,0.919428970400303,NA 
rayol-farm2_2019-05-02_01-32-31.wav,44100,16,60,1,ndsi,1024,1000,2000,2000,11000,0.914900056027388,NA 
rayol-farm2_2019-05-02_01-34-31.wav,44100,16,60,1,ndsi,1024,1000,2000,2000,11000,0.924187791747194,NA 
rayol-farm2_2019-05-02_01-36-31.wav,44100,16,60,1,ndsi,1024,1000,2000,2000,11000,0.9285186014286,NA 
rayol-farm2_2019-05-02_01-38-31.wav,44100,16,60,1,ndsi,1024,1000,2000,2000,11000,0.92405863117754,NA 
rayol-farm2_2019-05-02_01-40-31.wav,44100,16,60,1,ndsi,1024,1000,2000,2000,11000,0.922313617516448,NA 
rayol-farm2_2019-05-02_01-42-31.wav,44100,16,60,1,ndsi,1024,1000,2000,2000,11000,0.923266655966539,NA 
rayol-farm2_2019-05-02_01-44-32.wav,44100,16,60,1,ndsi,1024,1000,2000,2000,11000,0.918076611234575,NA 
rayol-farm2_2019-05-02_01-46-32.wav,44100,16,60,1,ndsi,1024,1000,2000,2000,11000,0.923543067097819,NA 
rayol-farm2_2019-05-02_01-48-32.wav,44100,16,60,1,ndsi,1024,1000,2000,2000,11000,0.920369095939998,NA 
rayol-farm2_2019-05-02_01-50-32.wav,44100,16,60,1,ndsi,1024,1000,2000,2000,11000,0.916681238898789,NA 
rayol-farm2_2019-05-02_01-52-32.wav,44100,16,60,1,ndsi,1024,1000,2000,2000,11000,0.924178902531429,NA 
rayol-farm2_2019-05-02_01-54-32.wav,44100,16,60,1,ndsi,1024,1000,2000,2000,11000,0.913454720859008,NA 
rayol-farm2_2019-05-02_01-56-32.wav,44100,16,60,1,ndsi,1024,1000,2000,2000,11000,0.917860646871636,NA 
rayol-farm2_2019-05-02_01-58-32.wav,44100,16,60,1,ndsi,1024,1000,2000,2000,11000,0.928072696883431,NA 
rayol-farm2_2019-05-02_02-00-33.wav,44100,16,60,1,ndsi,1024,1000,2000,2000,11000,0.915376830857085,NA 
rayol-farm2_2019-05-02_02-02-33.wav,44100,16,60,1,ndsi,1024,1000,2000,2000,11000,0.926425457602331,NA 
rayol-farm2_2019-05-02_02-04-33.wav,44100,16,60,1,ndsi,1024,1000,2000,2000,11000,0.929450331435248,NA 
rayol-farm2_2019-05-02_02-06-33.wav,44100,16,60,1,ndsi,1024,1000,2000,2000,11000,0.925764085354927,NA 
rayol-farm2_2019-05-02_02-08-33.wav,44100,16,60,1,ndsi,1024,1000,2000,2000,11000,0.92833532749604,NA 
rayol-farm2_2019-05-02_02-10-33.wav,44100,16,60,1,ndsi,1024,1000,2000,2000,11000,0.9322061363638,NA 
rayol-farm2_2019-05-02_02-12-33.wav,44100,16,60,1,ndsi,1024,1000,2000,2000,11000,0.924265836889546,NA 
rayol-farm2_2019-05-02_02-14-33.wav,44100,16,60,1,ndsi,1024,1000,2000,2000,11000,0.922917224222852,NA 
rayol-farm2_2019-05-02_02-16-34.wav,44100,16,60,1,ndsi,1024,1000,2000,2000,11000,0.931038167730747,NA 
rayol-farm2_2019-05-02_02-18-34.wav,44100,16,60,1,ndsi,1024,1000,2000,2000,11000,0.930513281489905,NA 
rayol-farm2_2019-05-02_02-20-34.wav,44100,16,60,1,ndsi,1024,1000,2000,2000,11000,0.930013142911874,NA 
rayol-farm2_2019-05-02_02-22-34.wav,44100,16,60,1,ndsi,1024,1000,2000,2000,11000,0.919948044084491,NA 
rayol-farm2_2019-05-02_02-24-34.wav,44100,16,60,1,ndsi,1024,1000,2000,2000,11000,0.915479468568682,NA 
rayol-farm2_2019-05-02_02-26-34.wav,44100,16,60,1,ndsi,1024,1000,2000,2000,11000,0.919771074534987,NA 
rayol-farm2_2019-05-02_02-28-34.wav,44100,16,60,1,ndsi,1024,1000,2000,2000,11000,0.917786125001354,NA 
rayol-farm2_2019-05-02_02-30-34.wav,44100,16,60,1,ndsi,1024,1000,2000,2000,11000,0.921753710626549,NA 
rayol-farm2_2019-05-02_02-32-35.wav,44100,16,60,1,ndsi,1024,1000,2000,2000,11000,0.917331799762235,NA 
rayol-farm2_2019-05-02_02-34-35.wav,44100,16,60,1,ndsi,1024,1000,2000,2000,11000,0.921164916925064,NA 
rayol-farm2_2019-05-02_02-36-35.wav,44100,16,60,1,ndsi,1024,1000,2000,2000,11000,0.916601878832516,NA 
rayol-farm2_2019-05-02_02-38-35.wav,44100,16,60,1,ndsi,1024,1000,2000,2000,11000,0.919422113452986,NA 
rayol-farm2_2019-05-02_02-40-35.wav,44100,16,60,1,ndsi,1024,1000,2000,2000,11000,0.919020400753227,NA 
rayol-farm2_2019-05-02_02-42-35.wav,44100,16,60,1,ndsi,1024,1000,2000,2000,11000,0.919585743364648,NA 
rayol-farm2_2019-05-02_02-44-35.wav,44100,16,60,1,ndsi,1024,1000,2000,2000,11000,0.927080326137545,NA 
rayol-farm2_2019-05-02_02-46-35.wav,44100,16,60,1,ndsi,1024,1000,2000,2000,11000,0.92232600550042,NA 
rayol-farm2_2019-05-02_02-48-35.wav,44100,16,60,1,ndsi,1024,1000,2000,2000,11000,0.919312110180498,NA 
rayol-farm2_2019-05-02_02-50-36.wav,44100,16,60,1,ndsi,1024,1000,2000,2000,11000,0.905420517578729,NA 
rayol-farm2_2019-05-02_02-52-36.wav,44100,16,60,1,ndsi,1024,1000,2000,2000,11000,0.918863740529274,NA 
rayol-farm2_2019-05-02_02-54-36.wav,44100,16,60,1,ndsi,1024,1000,2000,2000,11000,0.919807664329197,NA 
rayol-farm2_2019-05-02_02-56-36.wav,44100,16,60,1,ndsi,1024,1000,2000,2000,11000,0.928697729970437,NA 
rayol-farm2_2019-05-02_02-58-36.wav,44100,16,60,1,ndsi,1024,1000,2000,2000,11000,0.919995784443061,NA 
rayol-farm2_2019-05-02_03-00-36.wav,44100,16,60,1,ndsi,1024,1000,2000,2000,11000,0.922183681662321,NA 
rayol-farm2_2019-05-02_03-02-36.wav,44100,16,60,1,ndsi,1024,1000,2000,2000,11000,0.91795313894401,NA 
rayol-farm2_2019-05-02_03-04-36.wav,44100,16,60,1,ndsi,1024,1000,2000,2000,11000,0.922746005237481,NA 
rayol-farm2_2019-05-02_03-06-37.wav,44100,16,60,1,ndsi,1024,1000,2000,2000,11000,0.915859843725381,NA 
rayol-farm2_2019-05-02_03-08-37.wav,44100,16,60,1,ndsi,1024,1000,2000,2000,11000,0.921794505221714,NA 
rayol-farm2_2019-05-02_03-10-37.wav,44100,16,60,1,ndsi,1024,1000,2000,2000,11000,0.923187012827414,NA 
rayol-farm2_2019-05-02_03-12-37.wav,44100,16,60,1,ndsi,1024,1000,2000,2000,11000,0.929624171828762,NA 
rayol-farm2_2019-05-02_03-14-37.wav,44100,16,60,1,ndsi,1024,1000,2000,2000,11000,0.916939983839236,NA 
rayol-farm2_2019-05-02_03-16-37.wav,44100,16,60,1,ndsi,1024,1000,2000,2000,11000,0.920748556379234,NA 
rayol-farm2_2019-05-02_03-18-37.wav,44100,16,60,1,ndsi,1024,1000,2000,2000,11000,0.920151554155969,NA 
rayol-farm2_2019-05-02_03-20-37.wav,44100,16,60,1,ndsi,1024,1000,2000,2000,11000,0.91833269464239,NA 
rayol-farm2_2019-05-02_03-22-38.wav,44100,16,60,1,ndsi,1024,1000,2000,2000,11000,0.917352918622612,NA 
rayol-farm2_2019-05-02_03-24-38.wav,44100,16,60,1,ndsi,1024,1000,2000,2000,11000,0.918222396285726,NA 
rayol-farm2_2019-05-02_03-26-38.wav,44100,16,60,1,ndsi,1024,1000,2000,2000,11000,0.919804160021323,NA 
rayol-farm2_2019-05-02_03-28-38.wav,44100,16,60,1,ndsi,1024,1000,2000,2000,11000,0.921241872864709,NA 
rayol-farm2_2019-05-02_03-30-38.wav,44100,16,60,1,ndsi,1024,1000,2000,2000,11000,0.923025368591758,NA 
rayol-farm2_2019-05-02_03-32-38.wav,44100,16,60,1,ndsi,1024,1000,2000,2000,11000,0.925761749565431,NA 
rayol-farm2_2019-05-02_03-34-38.wav,44100,16,60,1,ndsi,1024,1000,2000,2000,11000,0.917233873906109,NA 
rayol-farm2_2019-05-02_03-36-38.wav,44100,16,60,1,ndsi,1024,1000,2000,2000,11000,0.926282280750264,NA 
rayol-farm2_2019-05-02_03-38-39.wav,44100,16,60,1,ndsi,1024,1000,2000,2000,11000,0.924867873804459,NA 
rayol-farm2_2019-05-02_03-40-39.wav,44100,16,60,1,ndsi,1024,1000,2000,2000,11000,0.925434177456146,NA 
rayol-farm2_2019-05-02_03-42-39.wav,44100,16,60,1,ndsi,1024,1000,2000,2000,11000,0.917118790355746,NA 
rayol-farm2_2019-05-02_03-44-39.wav,44100,16,60,1,ndsi,1024,1000,2000,2000,11000,0.924214218102898,NA 
rayol-farm2_2019-05-02_03-46-39.wav,44100,16,60,1,ndsi,1024,1000,2000,2000,11000,0.922821796768103,NA 
rayol-farm2_2019-05-02_03-48-39.wav,44100,16,60,1,ndsi,1024,1000,2000,2000,11000,0.923360218967748,NA 
rayol-farm2_2019-05-02_03-50-39.wav,44100,16,60,1,ndsi,1024,1000,2000,2000,11000,0.922266096399116,NA 
rayol-farm2_2019-05-02_03-52-39.wav,44100,16,60,1,ndsi,1024,1000,2000,2000,11000,0.915453772189463,NA 
rayol-farm2_2019-05-02_03-54-39.wav,44100,16,60,1,ndsi,1024,1000,2000,2000,11000,0.916525752638376,NA 
rayol-farm2_2019-05-02_03-56-40.wav,44100,16,60,1,ndsi,1024,1000,2000,2000,11000,0.919952633949092,NA 
rayol-farm2_2019-05-02_03-58-40.wav,44100,16,60,1,ndsi,1024,1000,2000,2000,11000,0.917960362507299,NA 
rayol-farm2_2019-05-02_04-00-40.wav,44100,16,60,1,ndsi,1024,1000,2000,2000,11000,0.916836398993841,NA 
rayol-farm2_2019-05-02_04-02-40.wav,44100,16,60,1,ndsi,1024,1000,2000,2000,11000,0.916584047766029,NA 
rayol-farm2_2019-05-02_04-04-40.wav,44100,16,60,1,ndsi,1024,1000,2000,2000,11000,0.922475875809086,NA 
rayol-farm2_2019-05-02_04-06-40.wav,44100,16,60,1,ndsi,1024,1000,2000,2000,11000,0.923485854224644,NA 
rayol-farm2_2019-05-02_04-08-40.wav,44100,16,60,1,ndsi,1024,1000,2000,2000,11000,0.918849770635621,NA 
rayol-farm2_2019-05-02_04-10-40.wav,44100,16,60,1,ndsi,1024,1000,2000,2000,11000,0.920961273616088,NA 
rayol-farm2_2019-05-02_04-12-41.wav,44100,16,60,1,ndsi,1024,1000,2000,2000,11000,0.919801150482008,NA 
rayol-farm2_2019-05-02_04-14-41.wav,44100,16,60,1,ndsi,1024,1000,2000,2000,11000,0.915570856765548,NA 
rayol-farm2_2019-05-02_04-16-41.wav,44100,16,60,1,ndsi,1024,1000,2000,2000,11000,0.915772018886523,NA 
rayol-farm2_2019-05-02_04-18-41.wav,44100,16,60,1,ndsi,1024,1000,2000,2000,11000,0.913647168455931,NA 
rayol-farm2_2019-05-02_04-20-41.wav,44100,16,60,1,ndsi,1024,1000,2000,2000,11000,0.91393257520952,NA 
rayol-farm2_2019-05-02_04-22-41.wav,44100,16,60,1,ndsi,1024,1000,2000,2000,11000,0.917378239663323,NA 
rayol-farm2_2019-05-02_04-24-41.wav,44100,16,60,1,ndsi,1024,1000,2000,2000,11000,0.923774107938434,NA 
rayol-farm2_2019-05-02_04-26-41.wav,44100,16,60,1,ndsi,1024,1000,2000,2000,11000,0.914938466923,NA 
rayol-farm2_2019-05-02_04-28-42.wav,44100,16,60,1,ndsi,1024,1000,2000,2000,11000,0.92115285420689,NA 
rayol-farm2_2019-05-02_04-30-42.wav,44100,16,60,1,ndsi,1024,1000,2000,2000,11000,0.921234175782331,NA 
rayol-farm2_2019-05-02_04-32-42.wav,44100,16,60,1,ndsi,1024,1000,2000,2000,11000,0.916812199181263,NA 
rayol-farm2_2019-05-02_04-34-42.wav,44100,16,60,1,ndsi,1024,1000,2000,2000,11000,0.923440042362334,NA 
rayol-farm2_2019-05-02_04-36-42.wav,44100,16,60,1,ndsi,1024,1000,2000,2000,11000,0.91797536799677,NA 
rayol-farm2_2019-05-02_04-38-42.wav,44100,16,60,1,ndsi,1024,1000,2000,2000,11000,0.919117814856382,NA 
rayol-farm2_2019-05-02_04-40-42.wav,44100,16,60,1,ndsi,1024,1000,2000,2000,11000,0.920008758706136,NA 
rayol-farm2_2019-05-02_04-42-42.wav,44100,16,60,1,ndsi,1024,1000,2000,2000,11000,0.917391072156643,NA 
rayol-farm2_2019-05-02_04-44-42.wav,44100,16,60,1,ndsi,1024,1000,2000,2000,11000,0.921735445538254,NA 
rayol-farm2_2019-05-02_04-46-43.wav,44100,16,60,1,ndsi,1024,1000,2000,2000,11000,0.913907102270445,NA 
rayol-farm2_2019-05-02_04-48-43.wav,44100,16,60,1,ndsi,1024,1000,2000,2000,11000,0.917922282698532,NA 
rayol-farm2_2019-05-02_04-50-43.wav,44100,16,60,1,ndsi,1024,1000,2000,2000,11000,0.915298601617794,NA 
rayol-farm2_2019-05-02_04-52-43.wav,44100,16,60,1,ndsi,1024,1000,2000,2000,11000,0.917698899623461,NA 
rayol-farm2_2019-05-02_04-54-43.wav,44100,16,60,1,ndsi,1024,1000,2000,2000,11000,0.921434467172199,NA 
rayol-farm2_2019-05-02_04-56-43.wav,44100,16,60,1,ndsi,1024,1000,2000,2000,11000,0.918635749662349,NA 
rayol-farm2_2019-05-02_04-58-43.wav,44100,16,60,1,ndsi,1024,1000,2000,2000,11000,0.916721425707171,NA 
rayol-farm2_2019-05-02_05-00-43.wav,44100,16,60,1,ndsi,1024,1000,2000,2000,11000,0.90858800726178,NA 
rayol-farm2_2019-05-02_05-02-44.wav,44100,16,60,1,ndsi,1024,1000,2000,2000,11000,0.912135079916405,NA 
rayol-farm2_2019-05-02_05-04-44.wav,44100,16,60,1,ndsi,1024,1000,2000,2000,11000,0.923109104272235,NA 
rayol-farm2_2019-05-02_05-06-44.wav,44100,16,60,1,ndsi,1024,1000,2000,2000,11000,0.922562473033116,NA 
rayol-farm2_2019-05-02_05-08-44.wav,44100,16,60,1,ndsi,1024,1000,2000,2000,11000,0.919655652639991,NA 
rayol-farm2_2019-05-02_05-10-44.wav,44100,16,60,1,ndsi,1024,1000,2000,2000,11000,0.91963894807305,NA 
rayol-farm2_2019-05-02_05-12-44.wav,44100,16,60,1,ndsi,1024,1000,2000,2000,11000,0.921651023659671,NA 
rayol-farm2_2019-05-02_05-14-44.wav,44100,16,60,1,ndsi,1024,1000,2000,2000,11000,0.918260041515998,NA 
rayol-farm2_2019-05-02_05-16-44.wav,44100,16,60,1,ndsi,1024,1000,2000,2000,11000,0.914822081210769,NA 
rayol-farm2_2019-05-02_05-18-45.wav,44100,16,60,1,ndsi,1024,1000,2000,2000,11000,0.917875394188672,NA 
rayol-farm2_2019-05-02_05-20-45.wav,44100,16,60,1,ndsi,1024,1000,2000,2000,11000,0.911792981138066,NA 
rayol-farm2_2019-05-02_05-22-45.wav,44100,16,60,1,ndsi,1024,1000,2000,2000,11000,0.911489885865325,NA 
rayol-farm2_2019-05-02_05-24-45.wav,44100,16,60,1,ndsi,1024,1000,2000,2000,11000,0.912051346422372,NA 
rayol-farm2_2019-05-02_05-26-45.wav,44100,16,60,1,ndsi,1024,1000,2000,2000,11000,0.291928650908956,NA 
rayol-farm2_2019-05-02_05-28-45.wav,44100,16,60,1,ndsi,1024,1000,2000,2000,11000,0.697022420381098,NA 
rayol-farm2_2019-05-02_05-30-45.wav,44100,16,60,1,ndsi,1024,1000,2000,2000,11000,0.405523314224092,NA 
rayol-farm2_2019-05-02_05-32-45.wav,44100,16,60,1,ndsi,1024,1000,2000,2000,11000,0.925218547313226,NA 
rayol-farm2_2019-05-02_05-34-45.wav,44100,16,60,1,ndsi,1024,1000,2000,2000,11000,0.920211549849232,NA 
rayol-farm2_2019-05-02_05-36-46.wav,44100,16,60,1,ndsi,1024,1000,2000,2000,11000,0.904583491342124,NA 
rayol-farm2_2019-05-02_05-38-46.wav,44100,16,60,1,ndsi,1024,1000,2000,2000,11000,0.918497291195973,NA 
rayol-farm2_2019-05-02_05-40-46.wav,44100,16,60,1,ndsi,1024,1000,2000,2000,11000,0.881956092036555,NA 
rayol-farm2_2019-05-02_05-42-46.wav,44100,16,60,1,ndsi,1024,1000,2000,2000,11000,0.903461164649306,NA 
rayol-farm2_2019-05-02_05-44-46.wav,44100,16,60,1,ndsi,1024,1000,2000,2000,11000,0.921338166437566,NA 
rayol-farm2_2019-05-02_05-46-46.wav,44100,16,60,1,ndsi,1024,1000,2000,2000,11000,0.916268247978111,NA 
rayol-farm2_2019-05-02_05-48-46.wav,44100,16,60,1,ndsi,1024,1000,2000,2000,11000,0.924901857921791,NA 
rayol-farm2_2019-05-02_05-50-46.wav,44100,16,60,1,ndsi,1024,1000,2000,2000,11000,0.901028656276997,NA 
rayol-farm2_2019-05-02_05-52-47.wav,44100,16,60,1,ndsi,1024,1000,2000,2000,11000,0.730656355965799,NA 
rayol-farm2_2019-05-02_05-54-47.wav,44100,16,60,1,ndsi,1024,1000,2000,2000,11000,0.887128221746155,NA 
rayol-farm2_2019-05-02_05-56-47.wav,44100,16,60,1,ndsi,1024,1000,2000,2000,11000,0.906592778839734,NA 
rayol-farm2_2019-05-02_05-58-47.wav,44100,16,60,1,ndsi,1024,1000,2000,2000,11000,0.91466414553727,NA 
rayol-farm2_2019-05-02_06-00-47.wav,44100,16,60,1,ndsi,1024,1000,2000,2000,11000,0.927405907481786,NA 
rayol-farm2_2019-05-02_06-02-47.wav,44100,16,60,1,ndsi,1024,1000,2000,2000,11000,0.922228494623356,NA 
rayol-farm2_2019-05-02_06-04-47.wav,44100,16,60,1,ndsi,1024,1000,2000,2000,11000,0.954109856834962,NA 
rayol-farm2_2019-05-02_06-06-47.wav,44100,16,60,1,ndsi,1024,1000,2000,2000,11000,0.958284382052863,NA 
rayol-farm2_2019-05-02_06-08-48.wav,44100,16,60,1,ndsi,1024,1000,2000,2000,11000,0.961848905132357,NA 
rayol-farm2_2019-05-02_06-10-48.wav,44100,16,60,1,ndsi,1024,1000,2000,2000,11000,0.949350303008496,NA 
rayol-farm2_2019-05-02_06-12-48.wav,44100,16,60,1,ndsi,1024,1000,2000,2000,11000,0.94392059889854,NA 
rayol-farm2_2019-05-02_06-14-48.wav,44100,16,60,1,ndsi,1024,1000,2000,2000,11000,0.952620691656123,NA 
rayol-farm2_2019-05-02_06-16-48.wav,44100,16,60,1,ndsi,1024,1000,2000,2000,11000,0.927903277034619,NA 
rayol-farm2_2019-05-02_06-18-48.wav,44100,16,60,1,ndsi,1024,1000,2000,2000,11000,0.926029830254444,NA 
rayol-farm2_2019-05-02_06-20-48.wav,44100,16,60,1,ndsi,1024,1000,2000,2000,11000,0.925677341049802,NA 
rayol-farm2_2019-05-02_06-22-48.wav,44100,16,60,1,ndsi,1024,1000,2000,2000,11000,0.928385436718318,NA 
rayol-farm2_2019-05-02_06-24-48.wav,44100,16,60,1,ndsi,1024,1000,2000,2000,11000,0.915472469823355,NA 
rayol-farm2_2019-05-02_06-26-49.wav,44100,16,60,1,ndsi,1024,1000,2000,2000,11000,0.916946155628076,NA 
rayol-farm2_2019-05-02_06-28-49.wav,44100,16,60,1,ndsi,1024,1000,2000,2000,11000,0.929543282456695,NA 
rayol-farm2_2019-05-02_06-30-49.wav,44100,16,60,1,ndsi,1024,1000,2000,2000,11000,0.928485120028583,NA 
rayol-farm2_2019-05-02_06-32-49.wav,44100,16,60,1,ndsi,1024,1000,2000,2000,11000,0.921719167523866,NA 
rayol-farm2_2019-05-02_06-34-49.wav,44100,16,60,1,ndsi,1024,1000,2000,2000,11000,0.918659195427594,NA 
rayol-farm2_2019-05-02_06-36-49.wav,44100,16,60,1,ndsi,1024,1000,2000,2000,11000,0.942459603545138,NA 
rayol-farm2_2019-05-02_06-38-49.wav,44100,16,60,1,ndsi,1024,1000,2000,2000,11000,0.921337244628182,NA 
rayol-farm2_2019-05-02_06-40-49.wav,44100,16,60,1,ndsi,1024,1000,2000,2000,11000,0.941917376847017,NA 
rayol-farm2_2019-05-02_06-42-50.wav,44100,16,60,1,ndsi,1024,1000,2000,2000,11000,0.941552839615527,NA 
rayol-farm2_2019-05-02_06-44-50.wav,44100,16,60,1,ndsi,1024,1000,2000,2000,11000,0.940568163394655,NA 
rayol-farm2_2019-05-02_06-46-50.wav,44100,16,60,1,ndsi,1024,1000,2000,2000,11000,0.934341049122963,NA 
rayol-farm2_2019-05-02_06-48-50.wav,44100,16,60,1,ndsi,1024,1000,2000,2000,11000,0.927036759852909,NA 
rayol-farm2_2019-05-02_06-50-50.wav,44100,16,60,1,ndsi,1024,1000,2000,2000,11000,0.927799872018119,NA 
rayol-farm2_2019-05-02_06-52-50.wav,44100,16,60,1,ndsi,1024,1000,2000,2000,11000,0.931925667303004,NA 
rayol-farm2_2019-05-02_06-54-50.wav,44100,16,60,1,ndsi,1024,1000,2000,2000,11000,0.938137556212874,NA 
rayol-farm2_2019-05-02_06-56-50.wav,44100,16,60,1,ndsi,1024,1000,2000,2000,11000,0.909356968121373,NA 
rayol-farm2_2019-05-02_06-58-50.wav,44100,16,60,1,ndsi,1024,1000,2000,2000,11000,0.913860534375179,NA 
rayol-farm2_2019-05-02_07-00-51.wav,44100,16,60,1,ndsi,1024,1000,2000,2000,11000,0.854668916589523,NA 
rayol-farm2_2019-05-02_07-02-51.wav,44100,16,60,1,ndsi,1024,1000,2000,2000,11000,0.91296897367437,NA 
rayol-farm2_2019-05-02_07-04-51.wav,44100,16,60,1,ndsi,1024,1000,2000,2000,11000,0.927276202953969,NA 
rayol-farm2_2019-05-02_07-06-51.wav,44100,16,60,1,ndsi,1024,1000,2000,2000,11000,0.920219080606928,NA 
rayol-farm2_2019-05-02_07-08-51.wav,44100,16,60,1,ndsi,1024,1000,2000,2000,11000,0.915450399649082,NA 
rayol-farm2_2019-05-02_07-10-51.wav,44100,16,60,1,ndsi,1024,1000,2000,2000,11000,0.934093305174934,NA 
rayol-farm2_2019-05-02_07-12-51.wav,44100,16,60,1,ndsi,1024,1000,2000,2000,11000,0.915021616094813,NA 
rayol-farm2_2019-05-02_07-14-51.wav,44100,16,60,1,ndsi,1024,1000,2000,2000,11000,0.898534914835655,NA 
rayol-farm2_2019-05-02_07-16-52.wav,44100,16,60,1,ndsi,1024,1000,2000,2000,11000,0.914612210121325,NA 
rayol-farm2_2019-05-02_07-18-52.wav,44100,16,60,1,ndsi,1024,1000,2000,2000,11000,0.914467670425809,NA 
rayol-farm2_2019-05-02_07-20-52.wav,44100,16,60,1,ndsi,1024,1000,2000,2000,11000,0.928695965775301,NA 
rayol-farm2_2019-05-02_07-22-52.wav,44100,16,60,1,ndsi,1024,1000,2000,2000,11000,0.895953475349001,NA 
rayol-farm2_2019-05-02_07-24-52.wav,44100,16,60,1,ndsi,1024,1000,2000,2000,11000,0.918734783403256,NA 
rayol-farm2_2019-05-02_07-26-52.wav,44100,16,60,1,ndsi,1024,1000,2000,2000,11000,0.908695193783392,NA 
rayol-farm2_2019-05-02_07-28-52.wav,44100,16,60,1,ndsi,1024,1000,2000,2000,11000,0.384314687333611,NA 
rayol-farm2_2019-05-02_07-30-52.wav,44100,16,60,1,ndsi,1024,1000,2000,2000,11000,0.90381967234225,NA 
rayol-farm2_2019-05-02_07-32-53.wav,44100,16,60,1,ndsi,1024,1000,2000,2000,11000,0.924297995923262,NA 
rayol-farm2_2019-05-02_07-34-53.wav,44100,16,60,1,ndsi,1024,1000,2000,2000,11000,0.928290086043026,NA 
rayol-farm2_2019-05-02_07-36-53.wav,44100,16,60,1,ndsi,1024,1000,2000,2000,11000,0.925497469482312,NA 
rayol-farm2_2019-05-02_07-38-53.wav,44100,16,60,1,ndsi,1024,1000,2000,2000,11000,0.859341124478808,NA 
rayol-farm2_2019-05-02_07-40-53.wav,44100,16,60,1,ndsi,1024,1000,2000,2000,11000,0.882600894225976,NA 
rayol-farm2_2019-05-02_07-42-53.wav,44100,16,60,1,ndsi,1024,1000,2000,2000,11000,0.858606555121223,NA 
rayol-farm2_2019-05-02_07-44-53.wav,44100,16,60,1,ndsi,1024,1000,2000,2000,11000,0.940501143701419,NA 
rayol-farm2_2019-05-02_07-46-53.wav,44100,16,60,1,ndsi,1024,1000,2000,2000,11000,0.920494829402841,NA 
rayol-farm2_2019-05-02_07-48-53.wav,44100,16,60,1,ndsi,1024,1000,2000,2000,11000,0.939672844689309,NA 
rayol-farm2_2019-05-02_07-50-54.wav,44100,16,60,1,ndsi,1024,1000,2000,2000,11000,0.944800394377063,NA 
rayol-farm2_2019-05-02_07-52-54.wav,44100,16,60,1,ndsi,1024,1000,2000,2000,11000,0.922967124286535,NA 
rayol-farm2_2019-05-02_07-54-54.wav,44100,16,60,1,ndsi,1024,1000,2000,2000,11000,0.899310754598337,NA 
rayol-farm2_2019-05-02_07-56-54.wav,44100,16,60,1,ndsi,1024,1000,2000,2000,11000,0.951016316856395,NA 
rayol-farm2_2019-05-02_07-58-54.wav,44100,16,60,1,ndsi,1024,1000,2000,2000,11000,0.923996610584908,NA 
rayol-farm2_2019-05-02_08-00-54.wav,44100,16,60,1,ndsi,1024,1000,2000,2000,11000,0.8847079576607,NA 
rayol-farm2_2019-05-02_08-02-54.wav,44100,16,60,1,ndsi,1024,1000,2000,2000,11000,0.924635583773873,NA 
rayol-farm2_2019-05-02_08-04-54.wav,44100,16,60,1,ndsi,1024,1000,2000,2000,11000,0.948762544298033,NA 
rayol-farm2_2019-05-02_08-06-55.wav,44100,16,60,1,ndsi,1024,1000,2000,2000,11000,0.926642769022492,NA 
rayol-farm2_2019-05-02_08-08-55.wav,44100,16,60,1,ndsi,1024,1000,2000,2000,11000,0.924169443842603,NA 
rayol-farm2_2019-05-02_08-10-55.wav,44100,16,60,1,ndsi,1024,1000,2000,2000,11000,0.957770723350687,NA 
rayol-farm2_2019-05-02_08-12-55.wav,44100,16,60,1,ndsi,1024,1000,2000,2000,11000,0.940260507697082,NA 
rayol-farm2_2019-05-02_08-14-55.wav,44100,16,60,1,ndsi,1024,1000,2000,2000,11000,0.931895508486152,NA 
rayol-farm2_2019-05-02_08-16-55.wav,44100,16,60,1,ndsi,1024,1000,2000,2000,11000,0.957488485256542,NA 
rayol-farm2_2019-05-02_08-18-55.wav,44100,16,60,1,ndsi,1024,1000,2000,2000,11000,0.919786501876019,NA 
rayol-farm2_2019-05-02_08-20-55.wav,44100,16,60,1,ndsi,1024,1000,2000,2000,11000,0.893888217284191,NA 
rayol-farm2_2019-05-02_08-22-55.wav,44100,16,60,1,ndsi,1024,1000,2000,2000,11000,0.94654870938919,NA 
rayol-farm2_2019-05-02_08-24-56.wav,44100,16,60,1,ndsi,1024,1000,2000,2000,11000,0.947706573415616,NA 
rayol-farm2_2019-05-02_08-26-56.wav,44100,16,60,1,ndsi,1024,1000,2000,2000,11000,0.918993553509477,NA 
rayol-farm2_2019-05-02_08-28-56.wav,44100,16,60,1,ndsi,1024,1000,2000,2000,11000,0.88922185057677,NA 
rayol-farm2_2019-05-02_08-30-56.wav,44100,16,60,1,ndsi,1024,1000,2000,2000,11000,0.915533664220746,NA 
rayol-farm2_2019-05-02_08-32-56.wav,44100,16,60,1,ndsi,1024,1000,2000,2000,11000,0.91882905241773,NA 
rayol-farm2_2019-05-02_08-34-56.wav,44100,16,60,1,ndsi,1024,1000,2000,2000,11000,0.882934286031511,NA 
rayol-farm2_2019-05-02_08-36-56.wav,44100,16,60,1,ndsi,1024,1000,2000,2000,11000,0.921808607743336,NA 
rayol-farm2_2019-05-02_08-38-56.wav,44100,16,60,1,ndsi,1024,1000,2000,2000,11000,0.91761917172446,NA 
rayol-farm2_2019-05-02_08-40-57.wav,44100,16,60,1,ndsi,1024,1000,2000,2000,11000,0.888064076852298,NA 
rayol-farm2_2019-05-02_08-42-57.wav,44100,16,60,1,ndsi,1024,1000,2000,2000,11000,0.911398356157498,NA 
rayol-farm2_2019-05-02_08-44-57.wav,44100,16,60,1,ndsi,1024,1000,2000,2000,11000,0.928769889965839,NA 
rayol-farm2_2019-05-02_08-46-57.wav,44100,16,60,1,ndsi,1024,1000,2000,2000,11000,0.925394913599738,NA 
rayol-farm2_2019-05-02_08-48-57.wav,44100,16,60,1,ndsi,1024,1000,2000,2000,11000,0.923065407147173,NA 
rayol-farm2_2019-05-02_08-50-57.wav,44100,16,60,1,ndsi,1024,1000,2000,2000,11000,0.919641975767137,NA 
rayol-farm2_2019-05-02_08-52-57.wav,44100,16,60,1,ndsi,1024,1000,2000,2000,11000,0.91639763570242,NA 
rayol-farm2_2019-05-02_08-54-57.wav,44100,16,60,1,ndsi,1024,1000,2000,2000,11000,0.924047879083382,NA 
rayol-farm2_2019-05-02_08-56-58.wav,44100,16,60,1,ndsi,1024,1000,2000,2000,11000,0.926666703239225,NA 
rayol-farm2_2019-05-02_08-58-58.wav,44100,16,60,1,ndsi,1024,1000,2000,2000,11000,0.929079348885275,NA 
rayol-farm2_2019-05-02_09-00-58.wav,44100,16,60,1,ndsi,1024,1000,2000,2000,11000,0.175025943289685,NA 
rayol-farm2_2019-05-02_09-02-58.wav,44100,16,60,1,ndsi,1024,1000,2000,2000,11000,0.160930691500231,NA 
rayol-farm2_2019-05-02_09-04-58.wav,44100,16,60,1,ndsi,1024,1000,2000,2000,11000,0.912895061950118,NA 
rayol-farm2_2019-05-02_09-06-58.wav,44100,16,60,1,ndsi,1024,1000,2000,2000,11000,0.907755117990828,NA 
rayol-farm2_2019-05-02_09-08-58.wav,44100,16,60,1,ndsi,1024,1000,2000,2000,11000,0.919044927984233,NA 
rayol-farm2_2019-05-02_09-10-58.wav,44100,16,60,1,ndsi,1024,1000,2000,2000,11000,0.910972279791963,NA 
rayol-farm2_2019-05-02_09-12-58.wav,44100,16,60,1,ndsi,1024,1000,2000,2000,11000,0.848733743797442,NA 
rayol-farm2_2019-05-02_09-14-59.wav,44100,16,60,1,ndsi,1024,1000,2000,2000,11000,0.314584583300264,NA 
rayol-farm2_2019-05-02_09-16-59.wav,44100,16,60,1,ndsi,1024,1000,2000,2000,11000,0.464545276628717,NA 
rayol-farm2_2019-05-02_09-18-59.wav,44100,16,60,1,ndsi,1024,1000,2000,2000,11000,0.880368756272214,NA 
rayol-farm2_2019-05-02_09-20-59.wav,44100,16,60,1,ndsi,1024,1000,2000,2000,11000,0.132222423094131,NA 
rayol-farm2_2019-05-02_09-22-59.wav,44100,16,60,1,ndsi,1024,1000,2000,2000,11000,0.759785374637153,NA 
rayol-farm2_2019-05-02_09-24-59.wav,44100,16,60,1,ndsi,1024,1000,2000,2000,11000,0.782300631162863,NA 
rayol-farm2_2019-05-02_09-26-59.wav,44100,16,60,1,ndsi,1024,1000,2000,2000,11000,0.722564867109081,NA 
rayol-farm2_2019-05-02_09-28-59.wav,44100,16,60,1,ndsi,1024,1000,2000,2000,11000,0.894898276950125,NA 
rayol-farm2_2019-05-02_09-31-00.wav,44100,16,60,1,ndsi,1024,1000,2000,2000,11000,0.887396611372808,NA 
rayol-farm2_2019-05-02_09-33-00.wav,44100,16,60,1,ndsi,1024,1000,2000,2000,11000,0.832317312613816,NA 
rayol-farm2_2019-05-02_09-35-00.wav,44100,16,60,1,ndsi,1024,1000,2000,2000,11000,0.720942534570724,NA 
rayol-farm2_2019-05-02_09-37-00.wav,44100,16,60,1,ndsi,1024,1000,2000,2000,11000,0.921578942205289,NA 
rayol-farm2_2019-05-02_09-39-00.wav,44100,16,60,1,ndsi,1024,1000,2000,2000,11000,0.870548979496419,NA 
rayol-farm2_2019-05-02_09-41-00.wav,44100,16,60,1,ndsi,1024,1000,2000,2000,11000,0.89174848936265,NA 
rayol-farm2_2019-05-02_09-43-00.wav,44100,16,60,1,ndsi,1024,1000,2000,2000,11000,0.849432933097359,NA 
rayol-farm2_2019-05-02_09-45-00.wav,44100,16,60,1,ndsi,1024,1000,2000,2000,11000,0.905790074342861,NA 
rayol-farm2_2019-05-02_09-47-01.wav,44100,16,60,1,ndsi,1024,1000,2000,2000,11000,0.8380579374262,NA 
rayol-farm2_2019-05-02_09-49-01.wav,44100,16,60,1,ndsi,1024,1000,2000,2000,11000,0.827773330674997,NA 
rayol-farm2_2019-05-02_09-51-01.wav,44100,16,60,1,ndsi,1024,1000,2000,2000,11000,0.846497940171024,NA 
rayol-farm2_2019-05-02_09-53-01.wav,44100,16,60,1,ndsi,1024,1000,2000,2000,11000,0.875517454560491,NA 
rayol-farm2_2019-05-02_09-55-01.wav,44100,16,60,1,ndsi,1024,1000,2000,2000,11000,0.86316234274848,NA 
rayol-farm2_2019-05-02_09-57-01.wav,44100,16,60,1,ndsi,1024,1000,2000,2000,11000,0.681292142906568,NA 
rayol-farm2_2019-05-02_09-59-01.wav,44100,16,60,1,ndsi,1024,1000,2000,2000,11000,0.879003654144878,NA 
rayol-farm2_2019-05-02_10-01-01.wav,44100,16,60,1,ndsi,1024,1000,2000,2000,11000,0.893023474172505,NA 
rayol-farm2_2019-05-02_10-03-02.wav,44100,16,60,1,ndsi,1024,1000,2000,2000,11000,0.929661229819754,NA 
rayol-farm2_2019-05-02_10-05-02.wav,44100,16,60,1,ndsi,1024,1000,2000,2000,11000,0.917981233871886,NA 
rayol-farm2_2019-05-02_10-07-02.wav,44100,16,60,1,ndsi,1024,1000,2000,2000,11000,0.865491908160815,NA 
rayol-farm2_2019-05-02_10-09-02.wav,44100,16,60,1,ndsi,1024,1000,2000,2000,11000,0.848054096552281,NA 
rayol-farm2_2019-05-02_10-11-02.wav,44100,16,60,1,ndsi,1024,1000,2000,2000,11000,0.920059158838596,NA 
rayol-farm2_2019-05-02_10-13-02.wav,44100,16,60,1,ndsi,1024,1000,2000,2000,11000,0.760920413711039,NA 
rayol-farm2_2019-05-02_10-15-02.wav,44100,16,60,1,ndsi,1024,1000,2000,2000,11000,0.916495577032385,NA 
rayol-farm2_2019-05-02_10-17-02.wav,44100,16,60,1,ndsi,1024,1000,2000,2000,11000,0.914929525688892,NA 
rayol-farm2_2019-05-02_10-19-02.wav,44100,16,60,1,ndsi,1024,1000,2000,2000,11000,0.916036881494184,NA 
rayol-farm2_2019-05-02_10-21-03.wav,44100,16,60,1,ndsi,1024,1000,2000,2000,11000,0.916448912227833,NA 
rayol-farm2_2019-05-02_10-23-03.wav,44100,16,60,1,ndsi,1024,1000,2000,2000,11000,0.919908863921718,NA 
rayol-farm2_2019-05-02_10-25-03.wav,44100,16,60,1,ndsi,1024,1000,2000,2000,11000,0.917111588355826,NA 
rayol-farm2_2019-05-02_10-27-03.wav,44100,16,60,1,ndsi,1024,1000,2000,2000,11000,0.87959342163562,NA 
rayol-farm2_2019-05-02_10-29-03.wav,44100,16,60,1,ndsi,1024,1000,2000,2000,11000,0.901121870106092,NA 
rayol-farm2_2019-05-02_10-31-03.wav,44100,16,60,1,ndsi,1024,1000,2000,2000,11000,0.887776246918478,NA 
rayol-farm2_2019-05-02_10-33-03.wav,44100,16,60,1,ndsi,1024,1000,2000,2000,11000,0.757666513583527,NA 
rayol-farm2_2019-05-02_10-35-03.wav,44100,16,60,1,ndsi,1024,1000,2000,2000,11000,0.890002487875276,NA 
rayol-farm2_2019-05-02_10-37-04.wav,44100,16,60,1,ndsi,1024,1000,2000,2000,11000,-0.0261080886561291,NA 
rayol-farm2_2019-05-02_10-39-04.wav,44100,16,60,1,ndsi,1024,1000,2000,2000,11000,0.882530042001134,NA 
rayol-farm2_2019-05-02_10-41-04.wav,44100,16,60,1,ndsi,1024,1000,2000,2000,11000,0.878173038652566,NA 
rayol-farm2_2019-05-02_10-43-04.wav,44100,16,60,1,ndsi,1024,1000,2000,2000,11000,0.889562792290107,NA 
rayol-farm2_2019-05-02_10-45-04.wav,44100,16,60,1,ndsi,1024,1000,2000,2000,11000,0.917429312389347,NA 
rayol-farm2_2019-05-02_10-47-04.wav,44100,16,60,1,ndsi,1024,1000,2000,2000,11000,0.851129237201152,NA 
rayol-farm2_2019-05-02_10-49-04.wav,44100,16,60,1,ndsi,1024,1000,2000,2000,11000,0.907599065976196,NA 
rayol-farm2_2019-05-02_10-51-04.wav,44100,16,60,1,ndsi,1024,1000,2000,2000,11000,0.924792147320626,NA 
rayol-farm2_2019-05-02_10-53-05.wav,44100,16,60,1,ndsi,1024,1000,2000,2000,11000,0.923755473315629,NA 
rayol-farm2_2019-05-02_10-55-05.wav,44100,16,60,1,ndsi,1024,1000,2000,2000,11000,0.667400371732748,NA 
rayol-farm2_2019-05-02_10-57-05.wav,44100,16,60,1,ndsi,1024,1000,2000,2000,11000,0.571528267746289,NA 
rayol-farm2_2019-05-02_10-59-05.wav,44100,16,60,1,ndsi,1024,1000,2000,2000,11000,0.876371284999123,NA 
rayol-farm2_2019-05-02_11-01-05.wav,44100,16,60,1,ndsi,1024,1000,2000,2000,11000,0.727005467286333,NA 
rayol-farm2_2019-05-02_11-03-05.wav,44100,16,60,1,ndsi,1024,1000,2000,2000,11000,0.826860071316995,NA 
rayol-farm2_2019-05-02_11-05-05.wav,44100,16,60,1,ndsi,1024,1000,2000,2000,11000,0.819805135581427,NA 
rayol-farm2_2019-05-02_11-07-05.wav,44100,16,60,1,ndsi,1024,1000,2000,2000,11000,0.729646776887641,NA 
rayol-farm2_2019-05-02_11-09-05.wav,44100,16,60,1,ndsi,1024,1000,2000,2000,11000,0.550829205327468,NA 
rayol-farm2_2019-05-02_11-11-06.wav,44100,16,60,1,ndsi,1024,1000,2000,2000,11000,0.799854820120215,NA 
rayol-farm2_2019-05-02_11-13-06.wav,44100,16,60,1,ndsi,1024,1000,2000,2000,11000,0.880272554633959,NA 
rayol-farm2_2019-05-02_11-15-06.wav,44100,16,60,1,ndsi,1024,1000,2000,2000,11000,0.883977818017831,NA 
rayol-farm2_2019-05-02_11-17-06.wav,44100,16,60,1,ndsi,1024,1000,2000,2000,11000,0.853775998646779,NA 
rayol-farm2_2019-05-02_11-19-06.wav,44100,16,60,1,ndsi,1024,1000,2000,2000,11000,0.919320056325475,NA 
rayol-farm2_2019-05-02_11-21-06.wav,44100,16,60,1,ndsi,1024,1000,2000,2000,11000,0.863952642707358,NA 
rayol-farm2_2019-05-02_11-23-06.wav,44100,16,60,1,ndsi,1024,1000,2000,2000,11000,0.900281721701677,NA 
rayol-farm2_2019-05-02_11-25-06.wav,44100,16,60,1,ndsi,1024,1000,2000,2000,11000,0.622014135652821,NA 
rayol-farm2_2019-05-02_11-27-07.wav,44100,16,60,1,ndsi,1024,1000,2000,2000,11000,0.781245290573742,NA 
rayol-farm2_2019-05-02_11-29-07.wav,44100,16,60,1,ndsi,1024,1000,2000,2000,11000,0.58175445621652,NA 
rayol-farm2_2019-05-02_11-31-07.wav,44100,16,60,1,ndsi,1024,1000,2000,2000,11000,0.911876127276166,NA 
rayol-farm2_2019-05-02_11-33-07.wav,44100,16,60,1,ndsi,1024,1000,2000,2000,11000,0.838873082507969,NA 
rayol-farm2_2019-05-02_11-35-07.wav,44100,16,60,1,ndsi,1024,1000,2000,2000,11000,0.47918125788409,NA 
rayol-farm2_2019-05-02_11-37-07.wav,44100,16,60,1,ndsi,1024,1000,2000,2000,11000,0.866284287238348,NA 
rayol-farm2_2019-05-02_11-39-07.wav,44100,16,60,1,ndsi,1024,1000,2000,2000,11000,0.866384031842347,NA 
rayol-farm2_2019-05-02_11-41-07.wav,44100,16,60,1,ndsi,1024,1000,2000,2000,11000,0.799022042630512,NA 
rayol-farm2_2019-05-02_11-43-08.wav,44100,16,60,1,ndsi,1024,1000,2000,2000,11000,0.907157624488278,NA 
rayol-farm2_2019-05-02_11-45-08.wav,44100,16,60,1,ndsi,1024,1000,2000,2000,11000,0.665590965790869,NA 
rayol-farm2_2019-05-02_11-47-08.wav,44100,16,60,1,ndsi,1024,1000,2000,2000,11000,0.829265301546326,NA 
rayol-farm2_2019-05-02_11-49-08.wav,44100,16,60,1,ndsi,1024,1000,2000,2000,11000,0.972516924407536,NA 
rayol-farm2_2019-05-02_11-51-08.wav,44100,16,60,1,ndsi,1024,1000,2000,2000,11000,0.709199324787827,NA 
rayol-farm2_2019-05-02_11-53-08.wav,44100,16,60,1,ndsi,1024,1000,2000,2000,11000,0.902671489541098,NA 
rayol-farm2_2019-05-02_11-55-08.wav,44100,16,60,1,ndsi,1024,1000,2000,2000,11000,0.0527689037879809,NA 
rayol-farm2_2019-05-02_11-57-08.wav,44100,16,60,1,ndsi,1024,1000,2000,2000,11000,0.608178211934007,NA 
rayol-farm2_2019-05-02_11-59-09.wav,44100,16,60,1,ndsi,1024,1000,2000,2000,11000,0.590701983619072,NA 
rayol-farm2_2019-05-02_12-01-09.wav,44100,16,60,1,ndsi,1024,1000,2000,2000,11000,0.483531235406721,NA 
rayol-farm2_2019-05-02_12-03-09.wav,44100,16,60,1,ndsi,1024,1000,2000,2000,11000,0.0352931530955236,NA 
rayol-farm2_2019-05-02_12-05-09.wav,44100,16,60,1,ndsi,1024,1000,2000,2000,11000,0.70551206760328,NA 
rayol-farm2_2019-05-02_12-07-09.wav,44100,16,60,1,ndsi,1024,1000,2000,2000,11000,0.834187080949445,NA 
rayol-farm2_2019-05-02_12-09-09.wav,44100,16,60,1,ndsi,1024,1000,2000,2000,11000,0.815394553734595,NA 
rayol-farm2_2019-05-02_12-11-09.wav,44100,16,60,1,ndsi,1024,1000,2000,2000,11000,0.624668956341071,NA 
rayol-farm2_2019-05-02_12-13-09.wav,44100,16,60,1,ndsi,1024,1000,2000,2000,11000,0.850561526142054,NA 
rayol-farm2_2019-05-02_12-15-09.wav,44100,16,60,1,ndsi,1024,1000,2000,2000,11000,0.788043826958672,NA 
rayol-farm2_2019-05-02_12-17-10.wav,44100,16,60,1,ndsi,1024,1000,2000,2000,11000,0.664442498502557,NA 
rayol-farm2_2019-05-02_12-19-10.wav,44100,16,60,1,ndsi,1024,1000,2000,2000,11000,0.572984205191669,NA 
rayol-farm2_2019-05-02_12-21-10.wav,44100,16,60,1,ndsi,1024,1000,2000,2000,11000,0.750783864720813,NA 
rayol-farm2_2019-05-02_12-23-10.wav,44100,16,60,1,ndsi,1024,1000,2000,2000,11000,0.805902867672914,NA 
rayol-farm2_2019-05-02_12-25-10.wav,44100,16,60,1,ndsi,1024,1000,2000,2000,11000,0.851321897469373,NA 
rayol-farm2_2019-05-02_12-27-10.wav,44100,16,60,1,ndsi,1024,1000,2000,2000,11000,0.862871030142697,NA 
rayol-farm2_2019-05-02_12-29-10.wav,44100,16,60,1,ndsi,1024,1000,2000,2000,11000,0.791695334076875,NA 
rayol-farm2_2019-05-02_12-31-10.wav,44100,16,60,1,ndsi,1024,1000,2000,2000,11000,0.771544956806885,NA 
rayol-farm2_2019-05-02_12-33-11.wav,44100,16,60,1,ndsi,1024,1000,2000,2000,11000,0.769938502936806,NA 
rayol-farm2_2019-05-02_12-35-11.wav,44100,16,60,1,ndsi,1024,1000,2000,2000,11000,0.762918579224341,NA 
rayol-farm2_2019-05-02_12-37-11.wav,44100,16,60,1,ndsi,1024,1000,2000,2000,11000,0.798510392155866,NA 
rayol-farm2_2019-05-02_12-39-11.wav,44100,16,60,1,ndsi,1024,1000,2000,2000,11000,0.845751533728286,NA 
rayol-farm2_2019-05-02_12-41-11.wav,44100,16,60,1,ndsi,1024,1000,2000,2000,11000,0.825913819248462,NA 
rayol-farm2_2019-05-02_12-43-11.wav,44100,16,60,1,ndsi,1024,1000,2000,2000,11000,0.860359438330744,NA 
rayol-farm2_2019-05-02_12-45-11.wav,44100,16,60,1,ndsi,1024,1000,2000,2000,11000,0.787315778482629,NA 
rayol-farm2_2019-05-02_12-47-11.wav,44100,16,60,1,ndsi,1024,1000,2000,2000,11000,0.862861117122953,NA 
rayol-farm2_2019-05-02_12-49-12.wav,44100,16,60,1,ndsi,1024,1000,2000,2000,11000,0.842235048355165,NA 
rayol-farm2_2019-05-02_12-51-12.wav,44100,16,60,1,ndsi,1024,1000,2000,2000,11000,0.734938807925994,NA 
rayol-farm2_2019-05-02_12-53-12.wav,44100,16,60,1,ndsi,1024,1000,2000,2000,11000,0.254198753641937,NA 
rayol-farm2_2019-05-02_12-55-12.wav,44100,16,60,1,ndsi,1024,1000,2000,2000,11000,0.336708397344524,NA 
rayol-farm2_2019-05-02_12-57-12.wav,44100,16,60,1,ndsi,1024,1000,2000,2000,11000,0.32864310834056,NA 
rayol-farm2_2019-05-02_12-59-12.wav,44100,16,60,1,ndsi,1024,1000,2000,2000,11000,0.443628259377062,NA 
rayol-farm2_2019-05-02_13-01-12.wav,44100,16,60,1,ndsi,1024,1000,2000,2000,11000,0.715811088933114,NA 
rayol-farm2_2019-05-02_13-03-12.wav,44100,16,60,1,ndsi,1024,1000,2000,2000,11000,0.366978312771995,NA 
rayol-farm2_2019-05-02_13-05-12.wav,44100,16,60,1,ndsi,1024,1000,2000,2000,11000,0.724220627703841,NA 
rayol-farm2_2019-05-02_13-07-13.wav,44100,16,60,1,ndsi,1024,1000,2000,2000,11000,0.529947106653744,NA 
rayol-farm2_2019-05-02_13-09-13.wav,44100,16,60,1,ndsi,1024,1000,2000,2000,11000,0.7355299074081,NA 
rayol-farm2_2019-05-02_13-11-13.wav,44100,16,60,1,ndsi,1024,1000,2000,2000,11000,0.425194036210771,NA 
rayol-farm2_2019-05-02_13-13-13.wav,44100,16,60,1,ndsi,1024,1000,2000,2000,11000,0.308627399647207,NA 
rayol-farm2_2019-05-02_13-15-13.wav,44100,16,60,1,ndsi,1024,1000,2000,2000,11000,0.680558723971145,NA 
rayol-farm2_2019-05-02_13-17-13.wav,44100,16,60,1,ndsi,1024,1000,2000,2000,11000,0.47631327976376,NA 
rayol-farm2_2019-05-02_13-19-13.wav,44100,16,60,1,ndsi,1024,1000,2000,2000,11000,0.394567657705121,NA 
rayol-farm2_2019-05-02_13-21-13.wav,44100,16,60,1,ndsi,1024,1000,2000,2000,11000,0.815291389701772,NA 
rayol-farm2_2019-05-02_13-23-14.wav,44100,16,60,1,ndsi,1024,1000,2000,2000,11000,0.547268047107299,NA 
rayol-farm2_2019-05-02_13-25-14.wav,44100,16,60,1,ndsi,1024,1000,2000,2000,11000,0.686081408951056,NA 
rayol-farm2_2019-05-02_13-27-14.wav,44100,16,60,1,ndsi,1024,1000,2000,2000,11000,0.735384963483998,NA 
rayol-farm2_2019-05-02_13-29-14.wav,44100,16,60,1,ndsi,1024,1000,2000,2000,11000,0.475903253621728,NA 
rayol-farm2_2019-05-02_13-31-14.wav,44100,16,60,1,ndsi,1024,1000,2000,2000,11000,0.641466578378387,NA 
rayol-farm2_2019-05-02_13-33-14.wav,44100,16,60,1,ndsi,1024,1000,2000,2000,11000,0.754789947884847,NA 
rayol-farm2_2019-05-02_13-35-14.wav,44100,16,60,1,ndsi,1024,1000,2000,2000,11000,0.813043346321399,NA 
rayol-farm2_2019-05-02_13-37-14.wav,44100,16,60,1,ndsi,1024,1000,2000,2000,11000,0.69385869148236,NA 
rayol-farm2_2019-05-02_13-39-15.wav,44100,16,60,1,ndsi,1024,1000,2000,2000,11000,0.754673750951251,NA 
rayol-farm2_2019-05-02_13-41-15.wav,44100,16,60,1,ndsi,1024,1000,2000,2000,11000,0.764754924952823,NA 
rayol-farm2_2019-05-02_13-43-15.wav,44100,16,60,1,ndsi,1024,1000,2000,2000,11000,0.725146659972544,NA 
rayol-farm2_2019-05-02_13-45-15.wav,44100,16,60,1,ndsi,1024,1000,2000,2000,11000,0.564231445929545,NA 
rayol-farm2_2019-05-02_13-47-15.wav,44100,16,60,1,ndsi,1024,1000,2000,2000,11000,0.765103545473156,NA 
rayol-farm2_2019-05-02_13-49-15.wav,44100,16,60,1,ndsi,1024,1000,2000,2000,11000,0.780798502175277,NA 
rayol-farm2_2019-05-02_13-51-15.wav,44100,16,60,1,ndsi,1024,1000,2000,2000,11000,0.137929262074095,NA 
rayol-farm2_2019-05-02_13-53-15.wav,44100,16,60,1,ndsi,1024,1000,2000,2000,11000,0.693771014885053,NA 
rayol-farm2_2019-05-02_13-55-16.wav,44100,16,60,1,ndsi,1024,1000,2000,2000,11000,0.549861579011853,NA 
rayol-farm2_2019-05-02_13-57-16.wav,44100,16,60,1,ndsi,1024,1000,2000,2000,11000,0.860188876584782,NA 
rayol-farm2_2019-05-02_13-59-16.wav,44100,16,60,1,ndsi,1024,1000,2000,2000,11000,0.744271502574351,NA 
rayol-farm2_2019-05-02_14-01-16.wav,44100,16,60,1,ndsi,1024,1000,2000,2000,11000,0.706871441269958,NA 
rayol-farm2_2019-05-02_14-03-16.wav,44100,16,60,1,ndsi,1024,1000,2000,2000,11000,0.802974348906211,NA 
rayol-farm2_2019-05-02_14-05-16.wav,44100,16,60,1,ndsi,1024,1000,2000,2000,11000,0.932002507985858,NA 
rayol-farm2_2019-05-02_14-07-16.wav,44100,16,60,1,ndsi,1024,1000,2000,2000,11000,0.955270801296413,NA 
rayol-farm2_2019-05-02_14-09-16.wav,44100,16,60,1,ndsi,1024,1000,2000,2000,11000,0.875054099895352,NA 
rayol-farm2_2019-05-02_14-11-17.wav,44100,16,60,1,ndsi,1024,1000,2000,2000,11000,0.931506990449187,NA 
rayol-farm2_2019-05-02_14-13-17.wav,44100,16,60,1,ndsi,1024,1000,2000,2000,11000,0.94363997252562,NA 
rayol-farm2_2019-05-02_14-15-17.wav,44100,16,60,1,ndsi,1024,1000,2000,2000,11000,0.974819872658736,NA 
rayol-farm2_2019-05-02_14-17-17.wav,44100,16,60,1,ndsi,1024,1000,2000,2000,11000,0.581429232487789,NA 
rayol-farm2_2019-05-02_14-19-17.wav,44100,16,60,1,ndsi,1024,1000,2000,2000,11000,0.569973822731313,NA 
rayol-farm2_2019-05-02_14-21-17.wav,44100,16,60,1,ndsi,1024,1000,2000,2000,11000,0.579323613791234,NA 
rayol-farm2_2019-05-02_14-23-17.wav,44100,16,60,1,ndsi,1024,1000,2000,2000,11000,0.491768910868604,NA 
rayol-farm2_2019-05-02_14-25-17.wav,44100,16,60,1,ndsi,1024,1000,2000,2000,11000,0.498378836717674,NA 
rayol-farm2_2019-05-02_14-27-17.wav,44100,16,60,1,ndsi,1024,1000,2000,2000,11000,0.169094733935069,NA 
rayol-farm2_2019-05-02_14-29-18.wav,44100,16,60,1,ndsi,1024,1000,2000,2000,11000,0.597795133517692,NA 
rayol-farm2_2019-05-02_14-31-18.wav,44100,16,60,1,ndsi,1024,1000,2000,2000,11000,0.575980723502796,NA 
rayol-farm2_2019-05-02_14-33-18.wav,44100,16,60,1,ndsi,1024,1000,2000,2000,11000,0.608144760968712,NA 
rayol-farm2_2019-05-02_14-35-18.wav,44100,16,60,1,ndsi,1024,1000,2000,2000,11000,0.791221495801134,NA 
rayol-farm2_2019-05-02_14-37-18.wav,44100,16,60,1,ndsi,1024,1000,2000,2000,11000,0.698508881584985,NA 
rayol-farm2_2019-05-02_14-39-18.wav,44100,16,60,1,ndsi,1024,1000,2000,2000,11000,0.797257113751101,NA 
rayol-farm2_2019-05-02_14-41-18.wav,44100,16,60,1,ndsi,1024,1000,2000,2000,11000,0.794966849433091,NA 
rayol-farm2_2019-05-02_14-43-18.wav,44100,16,60,1,ndsi,1024,1000,2000,2000,11000,0.837295108021312,NA 
rayol-farm2_2019-05-02_14-45-19.wav,44100,16,60,1,ndsi,1024,1000,2000,2000,11000,0.864165581478982,NA 
rayol-farm2_2019-05-02_14-47-19.wav,44100,16,60,1,ndsi,1024,1000,2000,2000,11000,0.84572158159326,NA 
rayol-farm2_2019-05-02_14-49-19.wav,44100,16,60,1,ndsi,1024,1000,2000,2000,11000,0.710807373946974,NA 
rayol-farm2_2019-05-02_14-51-19.wav,44100,16,60,1,ndsi,1024,1000,2000,2000,11000,0.788002573089369,NA 
rayol-farm2_2019-05-02_14-53-19.wav,44100,16,60,1,ndsi,1024,1000,2000,2000,11000,0.546262418247959,NA 
rayol-farm2_2019-05-02_14-55-19.wav,44100,16,60,1,ndsi,1024,1000,2000,2000,11000,0.901151632121624,NA 
rayol-farm2_2019-05-02_14-57-19.wav,44100,16,60,1,ndsi,1024,1000,2000,2000,11000,0.930345254740729,NA 
rayol-farm2_2019-05-02_14-59-19.wav,44100,16,60,1,ndsi,1024,1000,2000,2000,11000,0.383130437534574,NA 
rayol-farm2_2019-05-02_15-01-20.wav,44100,16,60,1,ndsi,1024,1000,2000,2000,11000,0.903490896872221,NA 
rayol-farm2_2019-05-02_15-03-20.wav,44100,16,60,1,ndsi,1024,1000,2000,2000,11000,0.815873780590009,NA 
rayol-farm2_2019-05-02_15-05-20.wav,44100,16,60,1,ndsi,1024,1000,2000,2000,11000,0.524231495804666,NA 
rayol-farm2_2019-05-02_15-07-20.wav,44100,16,60,1,ndsi,1024,1000,2000,2000,11000,0.878866859873723,NA 
rayol-farm2_2019-05-02_15-09-20.wav,44100,16,60,1,ndsi,1024,1000,2000,2000,11000,0.782695153595922,NA 
rayol-farm2_2019-05-02_15-11-20.wav,44100,16,60,1,ndsi,1024,1000,2000,2000,11000,0.844873922706752,NA 
rayol-farm2_2019-05-02_15-13-20.wav,44100,16,60,1,ndsi,1024,1000,2000,2000,11000,0.890975254944603,NA 
rayol-farm2_2019-05-02_15-15-20.wav,44100,16,60,1,ndsi,1024,1000,2000,2000,11000,0.911788075189563,NA 
rayol-farm2_2019-05-02_15-17-20.wav,44100,16,60,1,ndsi,1024,1000,2000,2000,11000,0.858566860575542,NA 
rayol-farm2_2019-05-02_15-19-21.wav,44100,16,60,1,ndsi,1024,1000,2000,2000,11000,0.921116143748976,NA 
rayol-farm2_2019-05-02_15-21-21.wav,44100,16,60,1,ndsi,1024,1000,2000,2000,11000,0.917695105493914,NA 
rayol-farm2_2019-05-02_15-23-21.wav,44100,16,60,1,ndsi,1024,1000,2000,2000,11000,0.896150260500766,NA 
rayol-farm2_2019-05-02_15-25-21.wav,44100,16,60,1,ndsi,1024,1000,2000,2000,11000,0.927222140490678,NA 
rayol-farm2_2019-05-02_15-27-21.wav,44100,16,60,1,ndsi,1024,1000,2000,2000,11000,0.811829719431173,NA 
rayol-farm2_2019-05-02_15-29-21.wav,44100,16,60,1,ndsi,1024,1000,2000,2000,11000,0.942318301446243,NA 
rayol-farm2_2019-05-02_15-31-21.wav,44100,16,60,1,ndsi,1024,1000,2000,2000,11000,0.918498784585723,NA 
rayol-farm2_2019-05-02_15-33-21.wav,44100,16,60,1,ndsi,1024,1000,2000,2000,11000,0.934426148684964,NA 
rayol-farm2_2019-05-02_15-35-22.wav,44100,16,60,1,ndsi,1024,1000,2000,2000,11000,0.903257472871252,NA 
rayol-farm2_2019-05-02_15-37-22.wav,44100,16,60,1,ndsi,1024,1000,2000,2000,11000,0.942991467311432,NA 
rayol-farm2_2019-05-02_15-39-22.wav,44100,16,60,1,ndsi,1024,1000,2000,2000,11000,0.920825287255167,NA 
rayol-farm2_2019-05-02_15-41-22.wav,44100,16,60,1,ndsi,1024,1000,2000,2000,11000,0.947248740284833,NA 
rayol-farm2_2019-05-02_15-43-22.wav,44100,16,60,1,ndsi,1024,1000,2000,2000,11000,0.903575360650247,NA 
rayol-farm2_2019-05-02_15-45-22.wav,44100,16,60,1,ndsi,1024,1000,2000,2000,11000,0.942964879484994,NA 
rayol-farm2_2019-05-02_15-47-22.wav,44100,16,60,1,ndsi,1024,1000,2000,2000,11000,0.631665773953415,NA 
rayol-farm2_2019-05-02_15-49-22.wav,44100,16,60,1,ndsi,1024,1000,2000,2000,11000,0.528435821097885,NA 
rayol-farm2_2019-05-02_15-51-23.wav,44100,16,60,1,ndsi,1024,1000,2000,2000,11000,0.13859154915552,NA 
rayol-farm2_2019-05-02_15-53-23.wav,44100,16,60,1,ndsi,1024,1000,2000,2000,11000,0.815106181908302,NA 
rayol-farm2_2019-05-02_15-55-23.wav,44100,16,60,1,ndsi,1024,1000,2000,2000,11000,0.808043757090579,NA 
rayol-farm2_2019-05-02_15-57-23.wav,44100,16,60,1,ndsi,1024,1000,2000,2000,11000,0.864103509749272,NA 
rayol-farm2_2019-05-02_15-59-23.wav,44100,16,60,1,ndsi,1024,1000,2000,2000,11000,0.474173051732283,NA 
rayol-farm2_2019-05-02_16-01-23.wav,44100,16,60,1,ndsi,1024,1000,2000,2000,11000,0.837318937550139,NA 
rayol-farm2_2019-05-02_16-03-23.wav,44100,16,60,1,ndsi,1024,1000,2000,2000,11000,0.848668515593085,NA 
rayol-farm2_2019-05-02_16-05-23.wav,44100,16,60,1,ndsi,1024,1000,2000,2000,11000,0.478157675729577,NA 
rayol-farm2_2019-05-02_16-07-24.wav,44100,16,60,1,ndsi,1024,1000,2000,2000,11000,0.909790101069912,NA 
rayol-farm2_2019-05-02_16-09-24.wav,44100,16,60,1,ndsi,1024,1000,2000,2000,11000,0.943744620955,NA 
rayol-farm2_2019-05-02_16-11-24.wav,44100,16,60,1,ndsi,1024,1000,2000,2000,11000,0.894885801375209,NA 
rayol-farm2_2019-05-02_16-13-24.wav,44100,16,60,1,ndsi,1024,1000,2000,2000,11000,0.947583672073244,NA 
rayol-farm2_2019-05-02_16-15-24.wav,44100,16,60,1,ndsi,1024,1000,2000,2000,11000,0.945248575791857,NA 
rayol-farm2_2019-05-02_16-17-24.wav,44100,16,60,1,ndsi,1024,1000,2000,2000,11000,0.513329991188951,NA 
rayol-farm2_2019-05-02_16-19-24.wav,44100,16,60,1,ndsi,1024,1000,2000,2000,11000,0.924281536880049,NA 
rayol-farm2_2019-05-02_16-21-24.wav,44100,16,60,1,ndsi,1024,1000,2000,2000,11000,0.70636931689409,NA 
rayol-farm2_2019-05-02_16-23-24.wav,44100,16,60,1,ndsi,1024,1000,2000,2000,11000,0.672889469095391,NA 
rayol-farm2_2019-05-02_16-25-25.wav,44100,16,60,1,ndsi,1024,1000,2000,2000,11000,0.940035576346428,NA 
rayol-farm2_2019-05-02_16-27-25.wav,44100,16,60,1,ndsi,1024,1000,2000,2000,11000,0.379547747413383,NA 
rayol-farm2_2019-05-02_16-29-25.wav,44100,16,60,1,ndsi,1024,1000,2000,2000,11000,0.930863668999612,NA 
rayol-farm2_2019-05-02_16-31-25.wav,44100,16,60,1,ndsi,1024,1000,2000,2000,11000,0.917921624744453,NA 
rayol-farm2_2019-05-02_16-33-25.wav,44100,16,60,1,ndsi,1024,1000,2000,2000,11000,0.913426681015152,NA 
rayol-farm2_2019-05-02_16-35-25.wav,44100,16,60,1,ndsi,1024,1000,2000,2000,11000,0.790777983068408,NA 
rayol-farm2_2019-05-02_16-37-25.wav,44100,16,60,1,ndsi,1024,1000,2000,2000,11000,0.930139486403153,NA 
rayol-farm2_2019-05-02_16-39-25.wav,44100,16,60,1,ndsi,1024,1000,2000,2000,11000,0.708005741191136,NA 
rayol-farm2_2019-05-02_16-41-26.wav,44100,16,60,1,ndsi,1024,1000,2000,2000,11000,0.873492040844198,NA 
rayol-farm2_2019-05-02_16-43-26.wav,44100,16,60,1,ndsi,1024,1000,2000,2000,11000,0.793624407316359,NA 
rayol-farm2_2019-05-02_16-45-26.wav,44100,16,60,1,ndsi,1024,1000,2000,2000,11000,0.755177023297233,NA 
rayol-farm2_2019-05-02_16-47-26.wav,44100,16,60,1,ndsi,1024,1000,2000,2000,11000,0.528382018458083,NA 
rayol-farm2_2019-05-02_16-49-26.wav,44100,16,60,1,ndsi,1024,1000,2000,2000,11000,0.637997933814127,NA 
rayol-farm2_2019-05-02_16-51-26.wav,44100,16,60,1,ndsi,1024,1000,2000,2000,11000,0.933915979109006,NA 
rayol-farm2_2019-05-02_16-53-26.wav,44100,16,60,1,ndsi,1024,1000,2000,2000,11000,0.913853435848537,NA 
rayol-farm2_2019-05-02_16-55-26.wav,44100,16,60,1,ndsi,1024,1000,2000,2000,11000,0.900981442998183,NA 
rayol-farm2_2019-05-02_16-57-27.wav,44100,16,60,1,ndsi,1024,1000,2000,2000,11000,0.931696662608464,NA 
rayol-farm2_2019-05-02_16-59-27.wav,44100,16,60,1,ndsi,1024,1000,2000,2000,11000,0.779452314084659,NA 
rayol-farm2_2019-05-02_17-01-27.wav,44100,16,60,1,ndsi,1024,1000,2000,2000,11000,0.939311717118948,NA 
rayol-farm2_2019-05-02_17-03-27.wav,44100,16,60,1,ndsi,1024,1000,2000,2000,11000,0.714349923522362,NA 
rayol-farm2_2019-05-02_17-05-27.wav,44100,16,60,1,ndsi,1024,1000,2000,2000,11000,0.919379295019338,NA 
rayol-farm2_2019-05-02_17-07-27.wav,44100,16,60,1,ndsi,1024,1000,2000,2000,11000,0.88401064342231,NA 
rayol-farm2_2019-05-02_17-09-27.wav,44100,16,60,1,ndsi,1024,1000,2000,2000,11000,0.8425268457642,NA 
rayol-farm2_2019-05-02_17-11-27.wav,44100,16,60,1,ndsi,1024,1000,2000,2000,11000,0.933115334639814,NA 
rayol-farm2_2019-05-02_17-13-28.wav,44100,16,60,1,ndsi,1024,1000,2000,2000,11000,0.935516686596366,NA 
rayol-farm2_2019-05-02_17-15-28.wav,44100,16,60,1,ndsi,1024,1000,2000,2000,11000,0.920119042670559,NA 
rayol-farm2_2019-05-02_17-17-28.wav,44100,16,60,1,ndsi,1024,1000,2000,2000,11000,0.818430296151562,NA 
rayol-farm2_2019-05-02_17-19-28.wav,44100,16,60,1,ndsi,1024,1000,2000,2000,11000,0.826668341228045,NA 
rayol-farm2_2019-05-02_17-21-28.wav,44100,16,60,1,ndsi,1024,1000,2000,2000,11000,0.94433786892077,NA 
rayol-farm2_2019-05-02_17-23-28.wav,44100,16,60,1,ndsi,1024,1000,2000,2000,11000,0.92019039765227,NA 
rayol-farm2_2019-05-02_17-25-28.wav,44100,16,60,1,ndsi,1024,1000,2000,2000,11000,0.941559527998673,NA 
rayol-farm2_2019-05-02_17-27-28.wav,44100,16,60,1,ndsi,1024,1000,2000,2000,11000,0.936259644418888,NA 
rayol-farm2_2019-05-02_17-29-28.wav,44100,16,60,1,ndsi,1024,1000,2000,2000,11000,0.929660538254714,NA 
rayol-farm2_2019-05-02_17-31-29.wav,44100,16,60,1,ndsi,1024,1000,2000,2000,11000,0.946486911646048,NA 
rayol-farm2_2019-05-02_17-33-29.wav,44100,16,60,1,ndsi,1024,1000,2000,2000,11000,0.918765148725286,NA 
rayol-farm2_2019-05-02_17-35-29.wav,44100,16,60,1,ndsi,1024,1000,2000,2000,11000,0.94681538598962,NA 
rayol-farm2_2019-05-02_17-37-29.wav,44100,16,60,1,ndsi,1024,1000,2000,2000,11000,0.937349825893232,NA 
rayol-farm2_2019-05-02_17-39-29.wav,44100,16,60,1,ndsi,1024,1000,2000,2000,11000,0.933421933596204,NA 
rayol-farm2_2019-05-02_17-41-29.wav,44100,16,60,1,ndsi,1024,1000,2000,2000,11000,0.947303989223123,NA 
rayol-farm2_2019-05-02_17-43-29.wav,44100,16,60,1,ndsi,1024,1000,2000,2000,11000,0.915931159385401,NA 
rayol-farm2_2019-05-02_17-45-29.wav,44100,16,60,1,ndsi,1024,1000,2000,2000,11000,0.918706353797114,NA 
rayol-farm2_2019-05-02_17-47-30.wav,44100,16,60,1,ndsi,1024,1000,2000,2000,11000,0.942321789016832,NA 
rayol-farm2_2019-05-02_17-49-30.wav,44100,16,60,1,ndsi,1024,1000,2000,2000,11000,0.927451578966937,NA 
rayol-farm2_2019-05-02_17-51-30.wav,44100,16,60,1,ndsi,1024,1000,2000,2000,11000,0.945116974064242,NA 
rayol-farm2_2019-05-02_17-53-30.wav,44100,16,60,1,ndsi,1024,1000,2000,2000,11000,0.804054177884942,NA 
rayol-farm2_2019-05-02_17-55-30.wav,44100,16,60,1,ndsi,1024,1000,2000,2000,11000,0.608176745724354,NA 
rayol-farm2_2019-05-02_17-57-30.wav,44100,16,60,1,ndsi,1024,1000,2000,2000,11000,0.869987777022591,NA 
rayol-farm2_2019-05-02_17-59-30.wav,44100,16,60,1,ndsi,1024,1000,2000,2000,11000,0.942031055516811,NA 
rayol-farm2_2019-05-02_18-01-30.wav,44100,16,60,1,ndsi,1024,1000,2000,2000,11000,0.938162247040284,NA 
rayol-farm2_2019-05-02_18-03-31.wav,44100,16,60,1,ndsi,1024,1000,2000,2000,11000,0.938859109489176,NA 
rayol-farm2_2019-05-02_18-05-31.wav,44100,16,60,1,ndsi,1024,1000,2000,2000,11000,0.930468709279728,NA 
rayol-farm2_2019-05-02_18-07-31.wav,44100,16,60,1,ndsi,1024,1000,2000,2000,11000,0.938518866427714,NA 
rayol-farm2_2019-05-02_18-09-31.wav,44100,16,60,1,ndsi,1024,1000,2000,2000,11000,0.933977846366145,NA 
rayol-farm2_2019-05-02_18-11-31.wav,44100,16,60,1,ndsi,1024,1000,2000,2000,11000,0.946419633342375,NA 
rayol-farm2_2019-05-02_18-13-31.wav,44100,16,60,1,ndsi,1024,1000,2000,2000,11000,0.942796816632082,NA 
rayol-farm2_2019-05-02_18-15-31.wav,44100,16,60,1,ndsi,1024,1000,2000,2000,11000,0.941682660991446,NA 
rayol-farm2_2019-05-02_18-17-31.wav,44100,16,60,1,ndsi,1024,1000,2000,2000,11000,0.927550655121903,NA 
rayol-farm2_2019-05-02_18-19-32.wav,44100,16,60,1,ndsi,1024,1000,2000,2000,11000,0.918172884743177,NA 
rayol-farm2_2019-05-02_18-21-32.wav,44100,16,60,1,ndsi,1024,1000,2000,2000,11000,0.940521041474955,NA 
rayol-farm2_2019-05-02_18-23-32.wav,44100,16,60,1,ndsi,1024,1000,2000,2000,11000,0.942979965867541,NA 
rayol-farm2_2019-05-02_18-25-32.wav,44100,16,60,1,ndsi,1024,1000,2000,2000,11000,0.942483154174597,NA 
rayol-farm2_2019-05-02_18-27-32.wav,44100,16,60,1,ndsi,1024,1000,2000,2000,11000,0.943065450733572,NA 
rayol-farm2_2019-05-02_18-29-32.wav,44100,16,60,1,ndsi,1024,1000,2000,2000,11000,0.94546863884692,NA 
rayol-farm2_2019-05-02_18-31-32.wav,44100,16,60,1,ndsi,1024,1000,2000,2000,11000,0.945784648019222,NA 
rayol-farm2_2019-05-02_18-33-32.wav,44100,16,60,1,ndsi,1024,1000,2000,2000,11000,0.941305570094611,NA 
rayol-farm2_2019-05-02_18-35-33.wav,44100,16,60,1,ndsi,1024,1000,2000,2000,11000,0.945168953700854,NA 
rayol-farm2_2019-05-02_18-37-33.wav,44100,16,60,1,ndsi,1024,1000,2000,2000,11000,0.942252226045092,NA 
rayol-farm2_2019-05-02_18-39-33.wav,44100,16,60,1,ndsi,1024,1000,2000,2000,11000,0.943216406058135,NA 
rayol-farm2_2019-05-02_18-41-33.wav,44100,16,60,1,ndsi,1024,1000,2000,2000,11000,0.943579752754348,NA 
rayol-farm2_2019-05-02_18-43-33.wav,44100,16,60,1,ndsi,1024,1000,2000,2000,11000,0.923453197813121,NA 
rayol-farm2_2019-05-02_18-45-33.wav,44100,16,60,1,ndsi,1024,1000,2000,2000,11000,0.942526411446951,NA 
rayol-farm2_2019-05-02_18-47-33.wav,44100,16,60,1,ndsi,1024,1000,2000,2000,11000,0.932084021356903,NA 
rayol-farm2_2019-05-02_18-49-33.wav,44100,16,60,1,ndsi,1024,1000,2000,2000,11000,0.903282562889418,NA 
rayol-farm2_2019-05-02_18-51-33.wav,44100,16,60,1,ndsi,1024,1000,2000,2000,11000,0.907053850096782,NA 
rayol-farm2_2019-05-02_18-53-34.wav,44100,16,60,1,ndsi,1024,1000,2000,2000,11000,0.895278068377308,NA 
rayol-farm2_2019-05-02_18-55-34.wav,44100,16,60,1,ndsi,1024,1000,2000,2000,11000,0.904669416704938,NA 
rayol-farm2_2019-05-02_18-57-34.wav,44100,16,60,1,ndsi,1024,1000,2000,2000,11000,0.887354900662609,NA 
rayol-farm2_2019-05-02_18-59-34.wav,44100,16,60,1,ndsi,1024,1000,2000,2000,11000,0.880199889962612,NA 
rayol-farm2_2019-05-02_19-01-34.wav,44100,16,60,1,ndsi,1024,1000,2000,2000,11000,0.930856261568474,NA 
rayol-farm2_2019-05-02_19-03-34.wav,44100,16,60,1,ndsi,1024,1000,2000,2000,11000,0.921751200175378,NA 
rayol-farm2_2019-05-02_19-05-34.wav,44100,16,60,1,ndsi,1024,1000,2000,2000,11000,0.919775450823,NA 
rayol-farm2_2019-05-02_19-07-34.wav,44100,16,60,1,ndsi,1024,1000,2000,2000,11000,0.890960212266753,NA 
rayol-farm2_2019-05-02_19-09-35.wav,44100,16,60,1,ndsi,1024,1000,2000,2000,11000,0.92029577866155,NA 
rayol-farm2_2019-05-02_19-11-35.wav,44100,16,60,1,ndsi,1024,1000,2000,2000,11000,0.910391257686612,NA 
rayol-farm2_2019-05-02_19-13-35.wav,44100,16,60,1,ndsi,1024,1000,2000,2000,11000,0.869659221544122,NA 
rayol-farm2_2019-05-02_19-15-35.wav,44100,16,60,1,ndsi,1024,1000,2000,2000,11000,0.803305829177183,NA 
rayol-farm2_2019-05-02_19-17-35.wav,44100,16,60,1,ndsi,1024,1000,2000,2000,11000,0.832490544330477,NA 
rayol-farm2_2019-05-02_19-19-35.wav,44100,16,60,1,ndsi,1024,1000,2000,2000,11000,0.862705681038688,NA 
rayol-farm2_2019-05-02_19-21-35.wav,44100,16,60,1,ndsi,1024,1000,2000,2000,11000,0.830881204556749,NA 
rayol-farm2_2019-05-02_19-23-35.wav,44100,16,60,1,ndsi,1024,1000,2000,2000,11000,0.848550256143832,NA 
rayol-farm2_2019-05-02_19-25-36.wav,44100,16,60,1,ndsi,1024,1000,2000,2000,11000,0.840911079428822,NA 
rayol-farm2_2019-05-02_19-27-36.wav,44100,16,60,1,ndsi,1024,1000,2000,2000,11000,0.838205539024245,NA 
rayol-farm2_2019-05-02_19-29-36.wav,44100,16,60,1,ndsi,1024,1000,2000,2000,11000,0.871180751940002,NA 
rayol-farm2_2019-05-02_19-31-36.wav,44100,16,60,1,ndsi,1024,1000,2000,2000,11000,0.84316871705984,NA 
rayol-farm2_2019-05-02_19-33-36.wav,44100,16,60,1,ndsi,1024,1000,2000,2000,11000,0.805572605807312,NA 
rayol-farm2_2019-05-02_19-35-36.wav,44100,16,60,1,ndsi,1024,1000,2000,2000,11000,0.859994961146596,NA 
rayol-farm2_2019-05-02_19-37-36.wav,44100,16,60,1,ndsi,1024,1000,2000,2000,11000,0.868342000063355,NA 
rayol-farm2_2019-05-02_19-39-36.wav,44100,16,60,1,ndsi,1024,1000,2000,2000,11000,0.83353856881387,NA 
rayol-farm2_2019-05-02_19-41-37.wav,44100,16,60,1,ndsi,1024,1000,2000,2000,11000,0.833400373293984,NA 
rayol-farm2_2019-05-02_19-43-37.wav,44100,16,60,1,ndsi,1024,1000,2000,2000,11000,0.823755249866425,NA 
rayol-farm2_2019-05-02_19-45-37.wav,44100,16,60,1,ndsi,1024,1000,2000,2000,11000,0.869999636428025,NA 
rayol-farm2_2019-05-02_19-47-37.wav,44100,16,60,1,ndsi,1024,1000,2000,2000,11000,0.883385352143651,NA 
rayol-farm2_2019-05-02_19-49-37.wav,44100,16,60,1,ndsi,1024,1000,2000,2000,11000,0.889698288993332,NA 
rayol-farm2_2019-05-02_19-51-37.wav,44100,16,60,1,ndsi,1024,1000,2000,2000,11000,0.83918056020957,NA 
rayol-farm2_2019-05-02_19-53-37.wav,44100,16,60,1,ndsi,1024,1000,2000,2000,11000,0.896313839909056,NA 
rayol-farm2_2019-05-02_19-55-37.wav,44100,16,60,1,ndsi,1024,1000,2000,2000,11000,0.901487265458795,NA 
rayol-farm2_2019-05-02_19-57-37.wav,44100,16,60,1,ndsi,1024,1000,2000,2000,11000,0.887166577762922,NA 
rayol-farm2_2019-05-02_19-59-38.wav,44100,16,60,1,ndsi,1024,1000,2000,2000,11000,0.889876920076526,NA 
rayol-farm2_2019-05-02_20-01-38.wav,44100,16,60,1,ndsi,1024,1000,2000,2000,11000,0.872676649438408,NA 
rayol-farm2_2019-05-02_20-03-38.wav,44100,16,60,1,ndsi,1024,1000,2000,2000,11000,0.885919761709233,NA 
rayol-farm2_2019-05-02_20-05-38.wav,44100,16,60,1,ndsi,1024,1000,2000,2000,11000,0.872258020906167,NA 
rayol-farm2_2019-05-02_20-07-38.wav,44100,16,60,1,ndsi,1024,1000,2000,2000,11000,0.879255976301793,NA 
rayol-farm2_2019-05-02_20-09-38.wav,44100,16,60,1,ndsi,1024,1000,2000,2000,11000,0.86968099313753,NA 
rayol-farm2_2019-05-02_20-11-38.wav,44100,16,60,1,ndsi,1024,1000,2000,2000,11000,0.89434270902767,NA 
rayol-farm2_2019-05-02_20-13-38.wav,44100,16,60,1,ndsi,1024,1000,2000,2000,11000,0.881081358292479,NA 
rayol-farm2_2019-05-02_20-15-39.wav,44100,16,60,1,ndsi,1024,1000,2000,2000,11000,0.881819745245673,NA 
rayol-farm2_2019-05-02_20-17-39.wav,44100,16,60,1,ndsi,1024,1000,2000,2000,11000,0.890090779555876,NA 
rayol-farm2_2019-05-02_20-19-39.wav,44100,16,60,1,ndsi,1024,1000,2000,2000,11000,0.89332334244755,NA 
rayol-farm2_2019-05-02_20-21-39.wav,44100,16,60,1,ndsi,1024,1000,2000,2000,11000,0.888237415761094,NA 
rayol-farm2_2019-05-02_20-23-39.wav,44100,16,60,1,ndsi,1024,1000,2000,2000,11000,0.882464821268741,NA 
rayol-farm2_2019-05-02_20-25-39.wav,44100,16,60,1,ndsi,1024,1000,2000,2000,11000,0.881742296080795,NA 
rayol-farm2_2019-05-02_20-27-39.wav,44100,16,60,1,ndsi,1024,1000,2000,2000,11000,0.880708030799968,NA 
rayol-farm2_2019-05-02_20-29-39.wav,44100,16,60,1,ndsi,1024,1000,2000,2000,11000,0.889392834872707,NA 
rayol-farm2_2019-05-02_20-31-40.wav,44100,16,60,1,ndsi,1024,1000,2000,2000,11000,0.877235870774375,NA 
rayol-farm2_2019-05-02_20-33-40.wav,44100,16,60,1,ndsi,1024,1000,2000,2000,11000,0.885271042028731,NA 
rayol-farm2_2019-05-02_20-35-40.wav,44100,16,60,1,ndsi,1024,1000,2000,2000,11000,0.889762701805445,NA 
rayol-farm2_2019-05-02_20-37-40.wav,44100,16,60,1,ndsi,1024,1000,2000,2000,11000,0.895475936764137,NA 
rayol-farm2_2019-05-02_20-39-40.wav,44100,16,60,1,ndsi,1024,1000,2000,2000,11000,0.896448558754278,NA 
rayol-farm2_2019-05-02_20-41-40.wav,44100,16,60,1,ndsi,1024,1000,2000,2000,11000,0.86465914443657,NA 
rayol-farm2_2019-05-02_20-43-40.wav,44100,16,60,1,ndsi,1024,1000,2000,2000,11000,0.87923161342539,NA 
rayol-farm2_2019-05-02_20-45-40.wav,44100,16,60,1,ndsi,1024,1000,2000,2000,11000,0.884095538887377,NA 
rayol-farm2_2019-05-02_20-47-41.wav,44100,16,60,1,ndsi,1024,1000,2000,2000,11000,0.889058926482242,NA 
rayol-farm2_2019-05-02_20-49-41.wav,44100,16,60,1,ndsi,1024,1000,2000,2000,11000,0.873445539083297,NA 
rayol-farm2_2019-05-02_20-51-41.wav,44100,16,60,1,ndsi,1024,1000,2000,2000,11000,0.882123465693616,NA 
rayol-farm2_2019-05-02_20-53-41.wav,44100,16,60,1,ndsi,1024,1000,2000,2000,11000,0.890082178551134,NA 
rayol-farm2_2019-05-02_20-55-41.wav,44100,16,60,1,ndsi,1024,1000,2000,2000,11000,0.897269941080647,NA 
rayol-farm2_2019-05-02_20-57-41.wav,44100,16,60,1,ndsi,1024,1000,2000,2000,11000,0.896344237929977,NA 
rayol-farm2_2019-05-02_20-59-41.wav,44100,16,60,1,ndsi,1024,1000,2000,2000,11000,0.908623166350729,NA 
rayol-farm2_2019-05-02_21-01-41.wav,44100,16,60,1,ndsi,1024,1000,2000,2000,11000,0.902388460418643,NA 
rayol-farm2_2019-05-02_21-03-42.wav,44100,16,60,1,ndsi,1024,1000,2000,2000,11000,0.90635878686136,NA 
rayol-farm2_2019-05-02_21-05-42.wav,44100,16,60,1,ndsi,1024,1000,2000,2000,11000,0.89325017093824,NA 
rayol-farm2_2019-05-02_21-07-42.wav,44100,16,60,1,ndsi,1024,1000,2000,2000,11000,0.904380372284692,NA 
rayol-farm2_2019-05-02_21-09-42.wav,44100,16,60,1,ndsi,1024,1000,2000,2000,11000,0.908076264751783,NA 
rayol-farm2_2019-05-02_21-11-42.wav,44100,16,60,1,ndsi,1024,1000,2000,2000,11000,0.909249088237903,NA 
rayol-farm2_2019-05-02_21-13-42.wav,44100,16,60,1,ndsi,1024,1000,2000,2000,11000,0.903527397453689,NA 
rayol-farm2_2019-05-02_21-15-42.wav,44100,16,60,1,ndsi,1024,1000,2000,2000,11000,0.907598002548605,NA 
rayol-farm2_2019-05-02_21-17-42.wav,44100,16,60,1,ndsi,1024,1000,2000,2000,11000,0.910769093928613,NA 
rayol-farm2_2019-05-02_21-19-42.wav,44100,16,60,1,ndsi,1024,1000,2000,2000,11000,0.906860972393599,NA 
rayol-farm2_2019-05-02_21-21-43.wav,44100,16,60,1,ndsi,1024,1000,2000,2000,11000,0.905311545031719,NA 
rayol-farm2_2019-05-02_21-23-43.wav,44100,16,60,1,ndsi,1024,1000,2000,2000,11000,0.906997667611869,NA 
rayol-farm2_2019-05-02_21-25-43.wav,44100,16,60,1,ndsi,1024,1000,2000,2000,11000,0.908756931322501,NA 
rayol-farm2_2019-05-02_21-27-43.wav,44100,16,60,1,ndsi,1024,1000,2000,2000,11000,0.908536325805369,NA 
rayol-farm2_2019-05-02_21-29-43.wav,44100,16,60,1,ndsi,1024,1000,2000,2000,11000,0.909501008984378,NA 
rayol-farm2_2019-05-02_21-31-43.wav,44100,16,60,1,ndsi,1024,1000,2000,2000,11000,0.909272016848413,NA 
rayol-farm2_2019-05-02_21-33-43.wav,44100,16,60,1,ndsi,1024,1000,2000,2000,11000,0.909187652395904,NA 
rayol-farm2_2019-05-02_21-35-43.wav,44100,16,60,1,ndsi,1024,1000,2000,2000,11000,0.908539957825277,NA 
rayol-farm2_2019-05-02_21-37-44.wav,44100,16,60,1,ndsi,1024,1000,2000,2000,11000,0.911928306791505,NA 
rayol-farm2_2019-05-02_21-39-44.wav,44100,16,60,1,ndsi,1024,1000,2000,2000,11000,0.911139162412236,NA 
rayol-farm2_2019-05-02_21-41-44.wav,44100,16,60,1,ndsi,1024,1000,2000,2000,11000,0.910754907298146,NA 
rayol-farm2_2019-05-02_21-43-44.wav,44100,16,60,1,ndsi,1024,1000,2000,2000,11000,0.910043532838484,NA 
rayol-farm2_2019-05-02_21-45-44.wav,44100,16,60,1,ndsi,1024,1000,2000,2000,11000,0.906061386365785,NA 
rayol-farm2_2019-05-02_21-47-44.wav,44100,16,60,1,ndsi,1024,1000,2000,2000,11000,0.909726705797839,NA 
rayol-farm2_2019-05-02_21-49-44.wav,44100,16,60,1,ndsi,1024,1000,2000,2000,11000,0.909504189348914,NA 
rayol-farm2_2019-05-02_21-51-44.wav,44100,16,60,1,ndsi,1024,1000,2000,2000,11000,0.909647395990194,NA 
rayol-farm2_2019-05-02_21-53-45.wav,44100,16,60,1,ndsi,1024,1000,2000,2000,11000,0.910363177568852,NA 
rayol-farm2_2019-05-02_21-55-45.wav,44100,16,60,1,ndsi,1024,1000,2000,2000,11000,0.909907990871595,NA 
rayol-farm2_2019-05-02_21-57-45.wav,44100,16,60,1,ndsi,1024,1000,2000,2000,11000,0.908558445836655,NA 
rayol-farm2_2019-05-02_21-59-45.wav,44100,16,60,1,ndsi,1024,1000,2000,2000,11000,0.908410732566401,NA 
rayol-farm2_2019-05-02_22-01-45.wav,44100,16,60,1,ndsi,1024,1000,2000,2000,11000,0.9104827607675,NA 
rayol-farm2_2019-05-02_22-03-45.wav,44100,16,60,1,ndsi,1024,1000,2000,2000,11000,0.908824048079086,NA 
rayol-farm2_2019-05-02_22-05-45.wav,44100,16,60,1,ndsi,1024,1000,2000,2000,11000,0.909356285218033,NA 
rayol-farm2_2019-05-02_22-07-45.wav,44100,16,60,1,ndsi,1024,1000,2000,2000,11000,0.909319972097584,NA 
rayol-farm2_2019-05-02_22-09-46.wav,44100,16,60,1,ndsi,1024,1000,2000,2000,11000,0.912778220204796,NA 
rayol-farm2_2019-05-02_22-11-46.wav,44100,16,60,1,ndsi,1024,1000,2000,2000,11000,0.910550204053301,NA 
rayol-farm2_2019-05-02_22-13-46.wav,44100,16,60,1,ndsi,1024,1000,2000,2000,11000,0.90896147180971,NA 
rayol-farm2_2019-05-02_22-15-46.wav,44100,16,60,1,ndsi,1024,1000,2000,2000,11000,0.912095754286359,NA 
rayol-farm2_2019-05-02_22-17-46.wav,44100,16,60,1,ndsi,1024,1000,2000,2000,11000,0.91128343370999,NA 
rayol-farm2_2019-05-02_22-19-46.wav,44100,16,60,1,ndsi,1024,1000,2000,2000,11000,0.907987192520263,NA 
rayol-farm2_2019-05-02_22-21-46.wav,44100,16,60,1,ndsi,1024,1000,2000,2000,11000,0.909484606277625,NA 
rayol-farm2_2019-05-02_22-23-46.wav,44100,16,60,1,ndsi,1024,1000,2000,2000,11000,0.91096856394443,NA 
rayol-farm2_2019-05-02_22-25-47.wav,44100,16,60,1,ndsi,1024,1000,2000,2000,11000,0.907781032718439,NA 
rayol-farm2_2019-05-02_22-27-47.wav,44100,16,60,1,ndsi,1024,1000,2000,2000,11000,0.912430450250062,NA 
rayol-farm2_2019-05-02_22-29-47.wav,44100,16,60,1,ndsi,1024,1000,2000,2000,11000,0.912632491914751,NA 
rayol-farm2_2019-05-02_22-31-47.wav,44100,16,60,1,ndsi,1024,1000,2000,2000,11000,0.913784351383524,NA 
rayol-farm2_2019-05-02_22-33-47.wav,44100,16,60,1,ndsi,1024,1000,2000,2000,11000,0.911108176679322,NA 
rayol-farm2_2019-05-02_22-35-47.wav,44100,16,60,1,ndsi,1024,1000,2000,2000,11000,0.9119997443916,NA 
rayol-farm2_2019-05-02_22-37-47.wav,44100,16,60,1,ndsi,1024,1000,2000,2000,11000,0.910088254187374,NA 
rayol-farm2_2019-05-02_22-39-47.wav,44100,16,60,1,ndsi,1024,1000,2000,2000,11000,0.91099420932857,NA 
rayol-farm2_2019-05-02_22-41-47.wav,44100,16,60,1,ndsi,1024,1000,2000,2000,11000,0.909926137909623,NA 
rayol-farm2_2019-05-02_22-43-48.wav,44100,16,60,1,ndsi,1024,1000,2000,2000,11000,0.91114198666384,NA 
rayol-farm2_2019-05-02_22-45-48.wav,44100,16,60,1,ndsi,1024,1000,2000,2000,11000,0.912720330468876,NA 
rayol-farm2_2019-05-02_22-47-48.wav,44100,16,60,1,ndsi,1024,1000,2000,2000,11000,0.911758802461025,NA 
rayol-farm2_2019-05-02_22-49-48.wav,44100,16,60,1,ndsi,1024,1000,2000,2000,11000,0.911307272136492,NA 
rayol-farm2_2019-05-02_22-51-48.wav,44100,16,60,1,ndsi,1024,1000,2000,2000,11000,0.912410697211738,NA 
rayol-farm2_2019-05-02_22-53-48.wav,44100,16,60,1,ndsi,1024,1000,2000,2000,11000,0.908516309940287,NA 
rayol-farm2_2019-05-02_22-55-48.wav,44100,16,60,1,ndsi,1024,1000,2000,2000,11000,0.911749474413324,NA 
rayol-farm2_2019-05-02_22-57-48.wav,44100,16,60,1,ndsi,1024,1000,2000,2000,11000,0.911662401480804,NA 
rayol-farm2_2019-05-02_22-59-49.wav,44100,16,60,1,ndsi,1024,1000,2000,2000,11000,0.912342810969962,NA 
rayol-farm2_2019-05-02_23-01-49.wav,44100,16,60,1,ndsi,1024,1000,2000,2000,11000,0.910924115155981,NA 
rayol-farm2_2019-05-02_23-03-49.wav,44100,16,60,1,ndsi,1024,1000,2000,2000,11000,0.91190628983052,NA 
rayol-farm2_2019-05-02_23-05-49.wav,44100,16,60,1,ndsi,1024,1000,2000,2000,11000,0.91195373123692,NA 
rayol-farm2_2019-05-02_23-07-49.wav,44100,16,60,1,ndsi,1024,1000,2000,2000,11000,0.911479172739038,NA 
rayol-farm2_2019-05-02_23-09-49.wav,44100,16,60,1,ndsi,1024,1000,2000,2000,11000,0.911573655773735,NA 
rayol-farm2_2019-05-02_23-11-49.wav,44100,16,60,1,ndsi,1024,1000,2000,2000,11000,0.883219773871445,NA 
rayol-farm2_2019-05-02_23-13-49.wav,44100,16,60,1,ndsi,1024,1000,2000,2000,11000,0.911207694242213,NA 
rayol-farm2_2019-05-02_23-15-50.wav,44100,16,60,1,ndsi,1024,1000,2000,2000,11000,0.911988197841779,NA 
rayol-farm2_2019-05-02_23-17-50.wav,44100,16,60,1,ndsi,1024,1000,2000,2000,11000,0.912859237852191,NA 
rayol-farm2_2019-05-02_23-19-50.wav,44100,16,60,1,ndsi,1024,1000,2000,2000,11000,0.909619146439148,NA 
rayol-farm2_2019-05-02_23-21-50.wav,44100,16,60,1,ndsi,1024,1000,2000,2000,11000,0.908778450437453,NA 
rayol-farm2_2019-05-02_23-23-50.wav,44100,16,60,1,ndsi,1024,1000,2000,2000,11000,0.910935456216441,NA 
rayol-farm2_2019-05-02_23-25-50.wav,44100,16,60,1,ndsi,1024,1000,2000,2000,11000,0.911015497741355,NA 
rayol-farm2_2019-05-02_23-27-50.wav,44100,16,60,1,ndsi,1024,1000,2000,2000,11000,0.909773682444564,NA 
rayol-farm2_2019-05-02_23-29-50.wav,44100,16,60,1,ndsi,1024,1000,2000,2000,11000,0.942247058643627,NA 
rayol-farm2_2019-05-02_23-31-51.wav,44100,16,60,1,ndsi,1024,1000,2000,2000,11000,0.93985393734625,NA 
rayol-farm2_2019-05-02_23-33-51.wav,44100,16,60,1,ndsi,1024,1000,2000,2000,11000,0.942423131503486,NA 
rayol-farm2_2019-05-02_23-35-51.wav,44100,16,60,1,ndsi,1024,1000,2000,2000,11000,0.941690111007021,NA 
rayol-farm2_2019-05-02_23-37-51.wav,44100,16,60,1,ndsi,1024,1000,2000,2000,11000,0.941814257557221,NA 
rayol-farm2_2019-05-02_23-39-51.wav,44100,16,60,1,ndsi,1024,1000,2000,2000,11000,0.940960541244877,NA 
rayol-farm2_2019-05-02_23-41-51.wav,44100,16,60,1,ndsi,1024,1000,2000,2000,11000,0.940516614862585,NA 
rayol-farm2_2019-05-02_23-43-51.wav,44100,16,60,1,ndsi,1024,1000,2000,2000,11000,0.94247877914262,NA 
rayol-farm2_2019-05-02_23-45-51.wav,44100,16,60,1,ndsi,1024,1000,2000,2000,11000,0.942025838879811,NA 
rayol-farm2_2019-05-02_23-47-51.wav,44100,16,60,1,ndsi,1024,1000,2000,2000,11000,0.942432681439078,NA 
rayol-farm2_2019-05-02_23-49-52.wav,44100,16,60,1,ndsi,1024,1000,2000,2000,11000,0.940801326854038,NA 
rayol-farm2_2019-05-02_23-51-52.wav,44100,16,60,1,ndsi,1024,1000,2000,2000,11000,0.941449325649891,NA 
rayol-farm2_2019-05-02_23-53-52.wav,44100,16,60,1,ndsi,1024,1000,2000,2000,11000,0.94089489301459,NA 
rayol-farm2_2019-05-02_23-55-52.wav,44100,16,60,1,ndsi,1024,1000,2000,2000,11000,0.940334047529402,NA 
rayol-farm2_2019-05-02_23-57-52.wav,44100,16,60,1,ndsi,1024,1000,2000,2000,11000,0.940037414619603,NA 
rayol-farm2_2019-05-02_23-59-52.wav,44100,16,60,1,ndsi,1024,1000,2000,2000,11000,0.940258962898032,NA
