FILENAME,SAMPLINGRATE,BIT,DURATION,CHANNELS,INDEX,FFT_W,MIN_FREQ,MAX_FREQ,LEFT_CHANNEL,RIGHT_CHANNEL
rayol-farm2_2019-05-07_00-01-40.wav,44100,16,60,1,bioacoustic_index,512,2000,8000,1.23634480937008,NA 
rayol-farm2_2019-05-07_00-03-40.wav,44100,16,60,1,bioacoustic_index,512,2000,8000,1.28564976077167,NA 
rayol-farm2_2019-05-07_00-05-40.wav,44100,16,60,1,bioacoustic_index,512,2000,8000,1.29223364595203,NA 
rayol-farm2_2019-05-07_00-07-41.wav,44100,16,60,1,bioacoustic_index,512,2000,8000,1.19399363298632,NA 
rayol-farm2_2019-05-07_00-09-41.wav,44100,16,60,1,bioacoustic_index,512,2000,8000,1.25121635300768,NA 
rayol-farm2_2019-05-07_00-11-41.wav,44100,16,60,1,bioacoustic_index,512,2000,8000,1.17822153353073,NA 
rayol-farm2_2019-05-07_00-13-41.wav,44100,16,60,1,bioacoustic_index,512,2000,8000,1.22177693375768,NA 
rayol-farm2_2019-05-07_00-15-41.wav,44100,16,60,1,bioacoustic_index,512,2000,8000,1.32953741627402,NA 
rayol-farm2_2019-05-07_00-17-41.wav,44100,16,60,1,bioacoustic_index,512,2000,8000,1.22794654840205,NA 
rayol-farm2_2019-05-07_00-19-41.wav,44100,16,60,1,bioacoustic_index,512,2000,8000,1.20825899503462,NA 
rayol-farm2_2019-05-07_00-21-41.wav,44100,16,60,1,bioacoustic_index,512,2000,8000,1.49188960145999,NA 
rayol-farm2_2019-05-07_00-23-42.wav,44100,16,60,1,bioacoustic_index,512,2000,8000,1.29939532179715,NA 
rayol-farm2_2019-05-07_00-25-42.wav,44100,16,60,1,bioacoustic_index,512,2000,8000,1.20091188917273,NA 
rayol-farm2_2019-05-07_00-27-42.wav,44100,16,60,1,bioacoustic_index,512,2000,8000,1.21299013452853,NA 
rayol-farm2_2019-05-07_00-29-42.wav,44100,16,60,1,bioacoustic_index,512,2000,8000,1.25641781671358,NA 
rayol-farm2_2019-05-07_00-31-42.wav,44100,16,60,1,bioacoustic_index,512,2000,8000,1.21981655288945,NA 
rayol-farm2_2019-05-07_00-33-42.wav,44100,16,60,1,bioacoustic_index,512,2000,8000,1.31731476799044,NA 
rayol-farm2_2019-05-07_00-35-42.wav,44100,16,60,1,bioacoustic_index,512,2000,8000,1.25364135600794,NA 
rayol-farm2_2019-05-07_00-37-42.wav,44100,16,60,1,bioacoustic_index,512,2000,8000,1.50998206212831,NA 
rayol-farm2_2019-05-07_00-39-42.wav,44100,16,60,1,bioacoustic_index,512,2000,8000,1.22324705367394,NA 
rayol-farm2_2019-05-07_00-41-43.wav,44100,16,60,1,bioacoustic_index,512,2000,8000,1.30918252593637,NA 
rayol-farm2_2019-05-07_00-43-43.wav,44100,16,60,1,bioacoustic_index,512,2000,8000,1.23832971361449,NA 
rayol-farm2_2019-05-07_00-45-43.wav,44100,16,60,1,bioacoustic_index,512,2000,8000,1.29040362755781,NA 
rayol-farm2_2019-05-07_00-47-43.wav,44100,16,60,1,bioacoustic_index,512,2000,8000,1.393863671234,NA 
rayol-farm2_2019-05-07_00-49-43.wav,44100,16,60,1,bioacoustic_index,512,2000,8000,1.26959055125121,NA 
rayol-farm2_2019-05-07_00-51-43.wav,44100,16,60,1,bioacoustic_index,512,2000,8000,1.28988631030909,NA 
rayol-farm2_2019-05-07_00-53-43.wav,44100,16,60,1,bioacoustic_index,512,2000,8000,1.24352924999609,NA 
rayol-farm2_2019-05-07_00-55-43.wav,44100,16,60,1,bioacoustic_index,512,2000,8000,1.32444940170099,NA 
rayol-farm2_2019-05-07_00-57-44.wav,44100,16,60,1,bioacoustic_index,512,2000,8000,1.29249314847266,NA 
rayol-farm2_2019-05-07_00-59-44.wav,44100,16,60,1,bioacoustic_index,512,2000,8000,1.31160401986913,NA 
rayol-farm2_2019-05-07_01-01-44.wav,44100,16,60,1,bioacoustic_index,512,2000,8000,1.29881878664033,NA 
rayol-farm2_2019-05-07_01-03-44.wav,44100,16,60,1,bioacoustic_index,512,2000,8000,1.30490922468914,NA 
rayol-farm2_2019-05-07_01-05-44.wav,44100,16,60,1,bioacoustic_index,512,2000,8000,1.34638945725479,NA 
rayol-farm2_2019-05-07_01-07-44.wav,44100,16,60,1,bioacoustic_index,512,2000,8000,1.53025509628917,NA 
rayol-farm2_2019-05-07_01-09-44.wav,44100,16,60,1,bioacoustic_index,512,2000,8000,1.27249845938094,NA 
rayol-farm2_2019-05-07_01-11-44.wav,44100,16,60,1,bioacoustic_index,512,2000,8000,1.35803913983782,NA 
rayol-farm2_2019-05-07_01-13-45.wav,44100,16,60,1,bioacoustic_index,512,2000,8000,1.32796701814484,NA 
rayol-farm2_2019-05-07_01-15-45.wav,44100,16,60,1,bioacoustic_index,512,2000,8000,1.33687072942005,NA 
rayol-farm2_2019-05-07_01-17-45.wav,44100,16,60,1,bioacoustic_index,512,2000,8000,1.36525234092931,NA 
rayol-farm2_2019-05-07_01-19-45.wav,44100,16,60,1,bioacoustic_index,512,2000,8000,1.33195021829736,NA 
rayol-farm2_2019-05-07_01-21-45.wav,44100,16,60,1,bioacoustic_index,512,2000,8000,1.36378357593887,NA 
rayol-farm2_2019-05-07_01-23-45.wav,44100,16,60,1,bioacoustic_index,512,2000,8000,1.35189699596756,NA 
rayol-farm2_2019-05-07_01-25-45.wav,44100,16,60,1,bioacoustic_index,512,2000,8000,1.36513479335106,NA 
rayol-farm2_2019-05-07_01-27-45.wav,44100,16,60,1,bioacoustic_index,512,2000,8000,1.36566947510117,NA 
rayol-farm2_2019-05-07_01-29-46.wav,44100,16,60,1,bioacoustic_index,512,2000,8000,1.25653105123892,NA 
rayol-farm2_2019-05-07_01-31-46.wav,44100,16,60,1,bioacoustic_index,512,2000,8000,1.33454691765895,NA 
rayol-farm2_2019-05-07_01-33-46.wav,44100,16,60,1,bioacoustic_index,512,2000,8000,1.29951868233841,NA 
rayol-farm2_2019-05-07_01-35-46.wav,44100,16,60,1,bioacoustic_index,512,2000,8000,1.35124242139487,NA 
rayol-farm2_2019-05-07_01-37-46.wav,44100,16,60,1,bioacoustic_index,512,2000,8000,1.32747498982795,NA 
rayol-farm2_2019-05-07_01-39-46.wav,44100,16,60,1,bioacoustic_index,512,2000,8000,1.30133582885637,NA 
rayol-farm2_2019-05-07_01-41-46.wav,44100,16,60,1,bioacoustic_index,512,2000,8000,1.27043887678167,NA 
rayol-farm2_2019-05-07_01-43-46.wav,44100,16,60,1,bioacoustic_index,512,2000,8000,1.23968704909251,NA 
rayol-farm2_2019-05-07_01-45-46.wav,44100,16,60,1,bioacoustic_index,512,2000,8000,1.24240945587418,NA 
rayol-farm2_2019-05-07_01-47-47.wav,44100,16,60,1,bioacoustic_index,512,2000,8000,1.26477575759558,NA 
rayol-farm2_2019-05-07_01-49-47.wav,44100,16,60,1,bioacoustic_index,512,2000,8000,1.27158331400857,NA 
rayol-farm2_2019-05-07_01-51-47.wav,44100,16,60,1,bioacoustic_index,512,2000,8000,1.24366541342918,NA 
rayol-farm2_2019-05-07_01-53-47.wav,44100,16,60,1,bioacoustic_index,512,2000,8000,1.30442897977,NA 
rayol-farm2_2019-05-07_01-55-47.wav,44100,16,60,1,bioacoustic_index,512,2000,8000,1.27920958011225,NA 
rayol-farm2_2019-05-07_01-57-47.wav,44100,16,60,1,bioacoustic_index,512,2000,8000,1.24348638621924,NA 
rayol-farm2_2019-05-07_01-59-47.wav,44100,16,60,1,bioacoustic_index,512,2000,8000,1.27771005079435,NA 
rayol-farm2_2019-05-07_02-01-47.wav,44100,16,60,1,bioacoustic_index,512,2000,8000,1.27906548538746,NA 
rayol-farm2_2019-05-07_02-03-48.wav,44100,16,60,1,bioacoustic_index,512,2000,8000,1.25623082084356,NA 
rayol-farm2_2019-05-07_02-05-48.wav,44100,16,60,1,bioacoustic_index,512,2000,8000,1.24789178662027,NA 
rayol-farm2_2019-05-07_02-07-48.wav,44100,16,60,1,bioacoustic_index,512,2000,8000,1.41509910529496,NA 
rayol-farm2_2019-05-07_02-09-48.wav,44100,16,60,1,bioacoustic_index,512,2000,8000,1.33833084077133,NA 
rayol-farm2_2019-05-07_02-11-48.wav,44100,16,60,1,bioacoustic_index,512,2000,8000,1.1992149945146,NA 
rayol-farm2_2019-05-07_02-13-48.wav,44100,16,60,1,bioacoustic_index,512,2000,8000,1.24723526827939,NA 
rayol-farm2_2019-05-07_02-15-48.wav,44100,16,60,1,bioacoustic_index,512,2000,8000,1.26033546375158,NA 
rayol-farm2_2019-05-07_02-17-48.wav,44100,16,60,1,bioacoustic_index,512,2000,8000,1.30308546194566,NA 
rayol-farm2_2019-05-07_02-19-49.wav,44100,16,60,1,bioacoustic_index,512,2000,8000,1.25728878114809,NA 
rayol-farm2_2019-05-07_02-21-49.wav,44100,16,60,1,bioacoustic_index,512,2000,8000,1.32977774952923,NA 
rayol-farm2_2019-05-07_02-23-49.wav,44100,16,60,1,bioacoustic_index,512,2000,8000,1.45092757736189,NA 
rayol-farm2_2019-05-07_02-25-49.wav,44100,16,60,1,bioacoustic_index,512,2000,8000,1.25265350609195,NA 
rayol-farm2_2019-05-07_02-27-49.wav,44100,16,60,1,bioacoustic_index,512,2000,8000,1.3160146066762,NA 
rayol-farm2_2019-05-07_02-29-49.wav,44100,16,60,1,bioacoustic_index,512,2000,8000,1.27148751619624,NA 
rayol-farm2_2019-05-07_02-31-49.wav,44100,16,60,1,bioacoustic_index,512,2000,8000,1.25850645307576,NA 
rayol-farm2_2019-05-07_02-33-49.wav,44100,16,60,1,bioacoustic_index,512,2000,8000,1.32702210069497,NA 
rayol-farm2_2019-05-07_02-35-50.wav,44100,16,60,1,bioacoustic_index,512,2000,8000,1.25705317724683,NA 
rayol-farm2_2019-05-07_02-37-50.wav,44100,16,60,1,bioacoustic_index,512,2000,8000,1.25511172018254,NA 
rayol-farm2_2019-05-07_02-39-50.wav,44100,16,60,1,bioacoustic_index,512,2000,8000,1.71060031474105,NA 
rayol-farm2_2019-05-07_02-41-50.wav,44100,16,60,1,bioacoustic_index,512,2000,8000,1.2729500229442,NA 
rayol-farm2_2019-05-07_02-43-50.wav,44100,16,60,1,bioacoustic_index,512,2000,8000,1.26233379025065,NA 
rayol-farm2_2019-05-07_02-45-50.wav,44100,16,60,1,bioacoustic_index,512,2000,8000,1.33933387858807,NA 
rayol-farm2_2019-05-07_02-47-50.wav,44100,16,60,1,bioacoustic_index,512,2000,8000,1.30418997273769,NA 
rayol-farm2_2019-05-07_02-49-50.wav,44100,16,60,1,bioacoustic_index,512,2000,8000,1.92566944442456,NA 
rayol-farm2_2019-05-07_02-51-51.wav,44100,16,60,1,bioacoustic_index,512,2000,8000,1.27938520826966,NA 
rayol-farm2_2019-05-07_02-53-51.wav,44100,16,60,1,bioacoustic_index,512,2000,8000,1.37429723590788,NA 
rayol-farm2_2019-05-07_02-55-51.wav,44100,16,60,1,bioacoustic_index,512,2000,8000,1.29065953851987,NA 
rayol-farm2_2019-05-07_02-57-51.wav,44100,16,60,1,bioacoustic_index,512,2000,8000,1.21093441872244,NA 
rayol-farm2_2019-05-07_02-59-51.wav,44100,16,60,1,bioacoustic_index,512,2000,8000,1.25696866119685,NA 
rayol-farm2_2019-05-07_03-01-51.wav,44100,16,60,1,bioacoustic_index,512,2000,8000,1.29412300542872,NA 
rayol-farm2_2019-05-07_03-03-51.wav,44100,16,60,1,bioacoustic_index,512,2000,8000,1.25988443494288,NA 
rayol-farm2_2019-05-07_03-05-51.wav,44100,16,60,1,bioacoustic_index,512,2000,8000,1.24442917043563,NA 
rayol-farm2_2019-05-07_03-07-52.wav,44100,16,60,1,bioacoustic_index,512,2000,8000,1.25801034226575,NA 
rayol-farm2_2019-05-07_03-09-52.wav,44100,16,60,1,bioacoustic_index,512,2000,8000,1.26304499907992,NA 
rayol-farm2_2019-05-07_03-11-52.wav,44100,16,60,1,bioacoustic_index,512,2000,8000,1.2690267043682,NA 
rayol-farm2_2019-05-07_03-13-52.wav,44100,16,60,1,bioacoustic_index,512,2000,8000,1.40556022783247,NA 
rayol-farm2_2019-05-07_03-15-52.wav,44100,16,60,1,bioacoustic_index,512,2000,8000,1.26443230174421,NA 
rayol-farm2_2019-05-07_03-17-52.wav,44100,16,60,1,bioacoustic_index,512,2000,8000,1.2651556447637,NA 
rayol-farm2_2019-05-07_03-19-52.wav,44100,16,60,1,bioacoustic_index,512,2000,8000,1.28723945589839,NA 
rayol-farm2_2019-05-07_03-21-52.wav,44100,16,60,1,bioacoustic_index,512,2000,8000,1.24928572596956,NA 
rayol-farm2_2019-05-07_03-23-53.wav,44100,16,60,1,bioacoustic_index,512,2000,8000,1.21183610668858,NA 
rayol-farm2_2019-05-07_03-25-53.wav,44100,16,60,1,bioacoustic_index,512,2000,8000,1.29175341535786,NA 
rayol-farm2_2019-05-07_03-27-53.wav,44100,16,60,1,bioacoustic_index,512,2000,8000,1.2424920863418,NA 
rayol-farm2_2019-05-07_03-29-53.wav,44100,16,60,1,bioacoustic_index,512,2000,8000,1.25548456961487,NA 
rayol-farm2_2019-05-07_03-31-53.wav,44100,16,60,1,bioacoustic_index,512,2000,8000,1.26870079628724,NA 
rayol-farm2_2019-05-07_03-33-53.wav,44100,16,60,1,bioacoustic_index,512,2000,8000,1.24137470321306,NA 
rayol-farm2_2019-05-07_03-35-53.wav,44100,16,60,1,bioacoustic_index,512,2000,8000,1.22040389547442,NA 
rayol-farm2_2019-05-07_03-37-53.wav,44100,16,60,1,bioacoustic_index,512,2000,8000,1.44116610603858,NA 
rayol-farm2_2019-05-07_03-39-54.wav,44100,16,60,1,bioacoustic_index,512,2000,8000,1.29846284398521,NA 
rayol-farm2_2019-05-07_03-41-54.wav,44100,16,60,1,bioacoustic_index,512,2000,8000,1.22446761989767,NA 
rayol-farm2_2019-05-07_03-43-54.wav,44100,16,60,1,bioacoustic_index,512,2000,8000,1.2582096429942,NA 
rayol-farm2_2019-05-07_03-45-54.wav,44100,16,60,1,bioacoustic_index,512,2000,8000,1.2527744875466,NA 
rayol-farm2_2019-05-07_03-47-54.wav,44100,16,60,1,bioacoustic_index,512,2000,8000,1.2715681470561,NA 
rayol-farm2_2019-05-07_03-49-54.wav,44100,16,60,1,bioacoustic_index,512,2000,8000,1.17996537569839,NA 
rayol-farm2_2019-05-07_03-51-54.wav,44100,16,60,1,bioacoustic_index,512,2000,8000,1.20686263036229,NA 
rayol-farm2_2019-05-07_03-53-54.wav,44100,16,60,1,bioacoustic_index,512,2000,8000,1.20151367780499,NA 
rayol-farm2_2019-05-07_03-55-54.wav,44100,16,60,1,bioacoustic_index,512,2000,8000,1.26200457957542,NA 
rayol-farm2_2019-05-07_03-57-55.wav,44100,16,60,1,bioacoustic_index,512,2000,8000,1.39643253729978,NA 
rayol-farm2_2019-05-07_03-59-55.wav,44100,16,60,1,bioacoustic_index,512,2000,8000,1.28802223077815,NA 
rayol-farm2_2019-05-07_04-01-55.wav,44100,16,60,1,bioacoustic_index,512,2000,8000,1.21572697318551,NA 
rayol-farm2_2019-05-07_04-03-55.wav,44100,16,60,1,bioacoustic_index,512,2000,8000,1.24347394081667,NA 
rayol-farm2_2019-05-07_04-05-55.wav,44100,16,60,1,bioacoustic_index,512,2000,8000,1.23268210869079,NA 
rayol-farm2_2019-05-07_04-07-55.wav,44100,16,60,1,bioacoustic_index,512,2000,8000,1.26098194275305,NA 
rayol-farm2_2019-05-07_04-09-55.wav,44100,16,60,1,bioacoustic_index,512,2000,8000,1.22939608177392,NA 
rayol-farm2_2019-05-07_04-11-55.wav,44100,16,60,1,bioacoustic_index,512,2000,8000,1.26085415233252,NA 
rayol-farm2_2019-05-07_04-13-56.wav,44100,16,60,1,bioacoustic_index,512,2000,8000,1.26974476635844,NA 
rayol-farm2_2019-05-07_04-15-56.wav,44100,16,60,1,bioacoustic_index,512,2000,8000,1.2978253946385,NA 
rayol-farm2_2019-05-07_04-17-56.wav,44100,16,60,1,bioacoustic_index,512,2000,8000,1.19361979108214,NA 
rayol-farm2_2019-05-07_04-19-56.wav,44100,16,60,1,bioacoustic_index,512,2000,8000,1.21337487772006,NA 
rayol-farm2_2019-05-07_04-21-56.wav,44100,16,60,1,bioacoustic_index,512,2000,8000,1.66179644457347,NA 
rayol-farm2_2019-05-07_04-23-56.wav,44100,16,60,1,bioacoustic_index,512,2000,8000,1.2668736853242,NA 
rayol-farm2_2019-05-07_04-25-56.wav,44100,16,60,1,bioacoustic_index,512,2000,8000,1.26675966490727,NA 
rayol-farm2_2019-05-07_04-27-56.wav,44100,16,60,1,bioacoustic_index,512,2000,8000,1.49595910243179,NA 
rayol-farm2_2019-05-07_04-29-57.wav,44100,16,60,1,bioacoustic_index,512,2000,8000,1.22308256380091,NA 
rayol-farm2_2019-05-07_04-31-57.wav,44100,16,60,1,bioacoustic_index,512,2000,8000,1.2626598224059,NA 
rayol-farm2_2019-05-07_04-33-57.wav,44100,16,60,1,bioacoustic_index,512,2000,8000,1.25305509539918,NA 
rayol-farm2_2019-05-07_04-35-57.wav,44100,16,60,1,bioacoustic_index,512,2000,8000,1.30252575923664,NA 
rayol-farm2_2019-05-07_04-37-57.wav,44100,16,60,1,bioacoustic_index,512,2000,8000,1.27204636976185,NA 
rayol-farm2_2019-05-07_04-39-57.wav,44100,16,60,1,bioacoustic_index,512,2000,8000,1.32046262203492,NA 
rayol-farm2_2019-05-07_04-41-57.wav,44100,16,60,1,bioacoustic_index,512,2000,8000,1.30618696299199,NA 
rayol-farm2_2019-05-07_04-43-57.wav,44100,16,60,1,bioacoustic_index,512,2000,8000,1.69033575107539,NA 
rayol-farm2_2019-05-07_04-45-58.wav,44100,16,60,1,bioacoustic_index,512,2000,8000,1.33742618503192,NA 
rayol-farm2_2019-05-07_04-47-58.wav,44100,16,60,1,bioacoustic_index,512,2000,8000,1.28741155346088,NA 
rayol-farm2_2019-05-07_04-49-58.wav,44100,16,60,1,bioacoustic_index,512,2000,8000,1.21773175773776,NA 
rayol-farm2_2019-05-07_04-51-58.wav,44100,16,60,1,bioacoustic_index,512,2000,8000,1.26615891074923,NA 
rayol-farm2_2019-05-07_04-53-58.wav,44100,16,60,1,bioacoustic_index,512,2000,8000,1.20475551107404,NA 
rayol-farm2_2019-05-07_04-55-58.wav,44100,16,60,1,bioacoustic_index,512,2000,8000,1.28732895076033,NA 
rayol-farm2_2019-05-07_04-57-58.wav,44100,16,60,1,bioacoustic_index,512,2000,8000,1.23620890373188,NA 
rayol-farm2_2019-05-07_04-59-58.wav,44100,16,60,1,bioacoustic_index,512,2000,8000,1.19068946696019,NA 
rayol-farm2_2019-05-07_05-01-58.wav,44100,16,60,1,bioacoustic_index,512,2000,8000,1.19580802396748,NA 
rayol-farm2_2019-05-07_05-03-59.wav,44100,16,60,1,bioacoustic_index,512,2000,8000,1.55941104023541,NA 
rayol-farm2_2019-05-07_05-05-59.wav,44100,16,60,1,bioacoustic_index,512,2000,8000,5.86339845220479,NA 
rayol-farm2_2019-05-07_05-07-59.wav,44100,16,60,1,bioacoustic_index,512,2000,8000,3.57543349730912,NA 
rayol-farm2_2019-05-07_05-09-59.wav,44100,16,60,1,bioacoustic_index,512,2000,8000,2.71194900314755,NA 
rayol-farm2_2019-05-07_05-11-59.wav,44100,16,60,1,bioacoustic_index,512,2000,8000,2.99961381875467,NA 
rayol-farm2_2019-05-07_05-13-59.wav,44100,16,60,1,bioacoustic_index,512,2000,8000,2.89302595328998,NA 
rayol-farm2_2019-05-07_05-15-59.wav,44100,16,60,1,bioacoustic_index,512,2000,8000,2.08422971224002,NA 
rayol-farm2_2019-05-07_05-17-59.wav,44100,16,60,1,bioacoustic_index,512,2000,8000,2.59765475239923,NA 
rayol-farm2_2019-05-07_05-20-00.wav,44100,16,60,1,bioacoustic_index,512,2000,8000,2.41102878074899,NA 
rayol-farm2_2019-05-07_05-22-00.wav,44100,16,60,1,bioacoustic_index,512,2000,8000,2.81064195936795,NA 
rayol-farm2_2019-05-07_05-24-00.wav,44100,16,60,1,bioacoustic_index,512,2000,8000,2.74328852534213,NA 
rayol-farm2_2019-05-07_05-26-00.wav,44100,16,60,1,bioacoustic_index,512,2000,8000,2.20232518255723,NA 
rayol-farm2_2019-05-07_05-28-00.wav,44100,16,60,1,bioacoustic_index,512,2000,8000,2.69902417377689,NA 
rayol-farm2_2019-05-07_05-30-00.wav,44100,16,60,1,bioacoustic_index,512,2000,8000,2.76141388555148,NA 
rayol-farm2_2019-05-07_05-32-00.wav,44100,16,60,1,bioacoustic_index,512,2000,8000,2.90036142735471,NA 
rayol-farm2_2019-05-07_05-34-00.wav,44100,16,60,1,bioacoustic_index,512,2000,8000,3.07266767792171,NA 
rayol-farm2_2019-05-07_05-36-01.wav,44100,16,60,1,bioacoustic_index,512,2000,8000,2.35034018855485,NA 
rayol-farm2_2019-05-07_05-38-01.wav,44100,16,60,1,bioacoustic_index,512,2000,8000,3.03938548000096,NA 
rayol-farm2_2019-05-07_05-40-01.wav,44100,16,60,1,bioacoustic_index,512,2000,8000,4.74841893845012,NA 
rayol-farm2_2019-05-07_05-42-01.wav,44100,16,60,1,bioacoustic_index,512,2000,8000,4.14617432941717,NA 
rayol-farm2_2019-05-07_05-44-01.wav,44100,16,60,1,bioacoustic_index,512,2000,8000,4.30375140008115,NA 
rayol-farm2_2019-05-07_05-46-01.wav,44100,16,60,1,bioacoustic_index,512,2000,8000,4.26629165668781,NA 
rayol-farm2_2019-05-07_05-48-01.wav,44100,16,60,1,bioacoustic_index,512,2000,8000,3.81525788776551,NA 
rayol-farm2_2019-05-07_05-50-01.wav,44100,16,60,1,bioacoustic_index,512,2000,8000,4.13400378876364,NA 
rayol-farm2_2019-05-07_05-52-02.wav,44100,16,60,1,bioacoustic_index,512,2000,8000,4.11689287046033,NA 
rayol-farm2_2019-05-07_05-54-02.wav,44100,16,60,1,bioacoustic_index,512,2000,8000,2.87795881418417,NA 
rayol-farm2_2019-05-07_05-56-02.wav,44100,16,60,1,bioacoustic_index,512,2000,8000,2.76925145073234,NA 
rayol-farm2_2019-05-07_05-58-02.wav,44100,16,60,1,bioacoustic_index,512,2000,8000,3.08408195171615,NA 
rayol-farm2_2019-05-07_06-00-02.wav,44100,16,60,1,bioacoustic_index,512,2000,8000,4.1497262066535,NA 
rayol-farm2_2019-05-07_06-02-02.wav,44100,16,60,1,bioacoustic_index,512,2000,8000,4.33650575985446,NA 
rayol-farm2_2019-05-07_06-04-02.wav,44100,16,60,1,bioacoustic_index,512,2000,8000,2.90218189781456,NA 
rayol-farm2_2019-05-07_06-06-02.wav,44100,16,60,1,bioacoustic_index,512,2000,8000,3.32524369649455,NA 
rayol-farm2_2019-05-07_06-08-02.wav,44100,16,60,1,bioacoustic_index,512,2000,8000,3.50070977048983,NA 
rayol-farm2_2019-05-07_06-10-03.wav,44100,16,60,1,bioacoustic_index,512,2000,8000,3.99265779521753,NA 
rayol-farm2_2019-05-07_06-12-03.wav,44100,16,60,1,bioacoustic_index,512,2000,8000,2.44841267982776,NA 
rayol-farm2_2019-05-07_06-14-03.wav,44100,16,60,1,bioacoustic_index,512,2000,8000,3.48974572962035,NA 
rayol-farm2_2019-05-07_06-16-03.wav,44100,16,60,1,bioacoustic_index,512,2000,8000,4.16424720204557,NA 
rayol-farm2_2019-05-07_06-18-03.wav,44100,16,60,1,bioacoustic_index,512,2000,8000,3.03549617345849,NA 
rayol-farm2_2019-05-07_06-20-03.wav,44100,16,60,1,bioacoustic_index,512,2000,8000,2.42638022006731,NA 
rayol-farm2_2019-05-07_06-22-03.wav,44100,16,60,1,bioacoustic_index,512,2000,8000,2.50508913664556,NA 
rayol-farm2_2019-05-07_06-24-03.wav,44100,16,60,1,bioacoustic_index,512,2000,8000,2.32819023442174,NA 
rayol-farm2_2019-05-07_06-26-04.wav,44100,16,60,1,bioacoustic_index,512,2000,8000,2.86407090947044,NA 
rayol-farm2_2019-05-07_06-28-04.wav,44100,16,60,1,bioacoustic_index,512,2000,8000,3.3836487404913,NA 
rayol-farm2_2019-05-07_06-30-04.wav,44100,16,60,1,bioacoustic_index,512,2000,8000,1.81681617207588,NA 
rayol-farm2_2019-05-07_06-32-04.wav,44100,16,60,1,bioacoustic_index,512,2000,8000,1.86826612218063,NA 
rayol-farm2_2019-05-07_06-34-04.wav,44100,16,60,1,bioacoustic_index,512,2000,8000,2.47305124084421,NA 
rayol-farm2_2019-05-07_06-36-04.wav,44100,16,60,1,bioacoustic_index,512,2000,8000,2.22644714663813,NA 
rayol-farm2_2019-05-07_06-38-04.wav,44100,16,60,1,bioacoustic_index,512,2000,8000,3.98892890150192,NA 
rayol-farm2_2019-05-07_06-40-04.wav,44100,16,60,1,bioacoustic_index,512,2000,8000,2.06214077101661,NA 
rayol-farm2_2019-05-07_06-42-05.wav,44100,16,60,1,bioacoustic_index,512,2000,8000,1.64350369512185,NA 
rayol-farm2_2019-05-07_06-44-05.wav,44100,16,60,1,bioacoustic_index,512,2000,8000,1.69455716073338,NA 
rayol-farm2_2019-05-07_06-46-05.wav,44100,16,60,1,bioacoustic_index,512,2000,8000,1.67250673361403,NA 
rayol-farm2_2019-05-07_06-48-05.wav,44100,16,60,1,bioacoustic_index,512,2000,8000,1.82697434544151,NA 
rayol-farm2_2019-05-07_06-50-05.wav,44100,16,60,1,bioacoustic_index,512,2000,8000,1.6975596825069,NA 
rayol-farm2_2019-05-07_06-52-05.wav,44100,16,60,1,bioacoustic_index,512,2000,8000,1.81386402824929,NA 
rayol-farm2_2019-05-07_06-54-05.wav,44100,16,60,1,bioacoustic_index,512,2000,8000,1.7345107676523,NA 
rayol-farm2_2019-05-07_06-56-05.wav,44100,16,60,1,bioacoustic_index,512,2000,8000,1.83162244662349,NA 
rayol-farm2_2019-05-07_06-58-06.wav,44100,16,60,1,bioacoustic_index,512,2000,8000,2.0466876319987,NA 
rayol-farm2_2019-05-07_07-00-06.wav,44100,16,60,1,bioacoustic_index,512,2000,8000,1.79451784880888,NA 
rayol-farm2_2019-05-07_07-02-06.wav,44100,16,60,1,bioacoustic_index,512,2000,8000,1.36516476171338,NA 
rayol-farm2_2019-05-07_07-04-06.wav,44100,16,60,1,bioacoustic_index,512,2000,8000,2.53755593923719,NA 
rayol-farm2_2019-05-07_07-06-06.wav,44100,16,60,1,bioacoustic_index,512,2000,8000,3.12785033967296,NA 
rayol-farm2_2019-05-07_07-08-06.wav,44100,16,60,1,bioacoustic_index,512,2000,8000,2.27077916218548,NA 
rayol-farm2_2019-05-07_07-10-06.wav,44100,16,60,1,bioacoustic_index,512,2000,8000,2.1401032073194,NA 
rayol-farm2_2019-05-07_07-12-06.wav,44100,16,60,1,bioacoustic_index,512,2000,8000,1.86914222136458,NA 
rayol-farm2_2019-05-07_07-14-07.wav,44100,16,60,1,bioacoustic_index,512,2000,8000,2.67629159110639,NA 
rayol-farm2_2019-05-07_07-16-07.wav,44100,16,60,1,bioacoustic_index,512,2000,8000,2.60968669278737,NA 
rayol-farm2_2019-05-07_07-18-07.wav,44100,16,60,1,bioacoustic_index,512,2000,8000,2.15750349140358,NA 
rayol-farm2_2019-05-07_07-20-07.wav,44100,16,60,1,bioacoustic_index,512,2000,8000,2.16892008420304,NA 
rayol-farm2_2019-05-07_07-22-07.wav,44100,16,60,1,bioacoustic_index,512,2000,8000,2.73535258394895,NA 
rayol-farm2_2019-05-07_07-24-07.wav,44100,16,60,1,bioacoustic_index,512,2000,8000,3.31920716644989,NA 
rayol-farm2_2019-05-07_07-26-07.wav,44100,16,60,1,bioacoustic_index,512,2000,8000,2.76698678131422,NA 
rayol-farm2_2019-05-07_07-28-07.wav,44100,16,60,1,bioacoustic_index,512,2000,8000,2.76896512359227,NA 
rayol-farm2_2019-05-07_07-30-07.wav,44100,16,60,1,bioacoustic_index,512,2000,8000,3.06283932959347,NA 
rayol-farm2_2019-05-07_07-32-08.wav,44100,16,60,1,bioacoustic_index,512,2000,8000,3.04312366410793,NA 
rayol-farm2_2019-05-07_07-34-08.wav,44100,16,60,1,bioacoustic_index,512,2000,8000,2.58441124410703,NA 
rayol-farm2_2019-05-07_07-36-08.wav,44100,16,60,1,bioacoustic_index,512,2000,8000,2.57040213867988,NA 
rayol-farm2_2019-05-07_07-38-08.wav,44100,16,60,1,bioacoustic_index,512,2000,8000,2.83912299983335,NA 
rayol-farm2_2019-05-07_07-40-08.wav,44100,16,60,1,bioacoustic_index,512,2000,8000,2.32819619928791,NA 
rayol-farm2_2019-05-07_07-42-08.wav,44100,16,60,1,bioacoustic_index,512,2000,8000,1.85365161903831,NA 
rayol-farm2_2019-05-07_07-44-08.wav,44100,16,60,1,bioacoustic_index,512,2000,8000,2.40757847411293,NA 
rayol-farm2_2019-05-07_07-46-08.wav,44100,16,60,1,bioacoustic_index,512,2000,8000,2.04452299515608,NA 
rayol-farm2_2019-05-07_07-48-09.wav,44100,16,60,1,bioacoustic_index,512,2000,8000,2.2875247697879,NA 
rayol-farm2_2019-05-07_07-50-09.wav,44100,16,60,1,bioacoustic_index,512,2000,8000,2.1973464066781,NA 
rayol-farm2_2019-05-07_07-52-09.wav,44100,16,60,1,bioacoustic_index,512,2000,8000,2.24808237591305,NA 
rayol-farm2_2019-05-07_07-54-09.wav,44100,16,60,1,bioacoustic_index,512,2000,8000,2.53005877882956,NA 
rayol-farm2_2019-05-07_07-56-09.wav,44100,16,60,1,bioacoustic_index,512,2000,8000,2.23939218019244,NA 
rayol-farm2_2019-05-07_07-58-09.wav,44100,16,60,1,bioacoustic_index,512,2000,8000,2.11154100208029,NA 
rayol-farm2_2019-05-07_08-00-09.wav,44100,16,60,1,bioacoustic_index,512,2000,8000,2.27699553582943,NA 
rayol-farm2_2019-05-07_08-02-09.wav,44100,16,60,1,bioacoustic_index,512,2000,8000,3.64081480517688,NA 
rayol-farm2_2019-05-07_08-04-10.wav,44100,16,60,1,bioacoustic_index,512,2000,8000,5.26477118965037,NA 
rayol-farm2_2019-05-07_08-06-10.wav,44100,16,60,1,bioacoustic_index,512,2000,8000,2.4524844799226,NA 
rayol-farm2_2019-05-07_08-08-10.wav,44100,16,60,1,bioacoustic_index,512,2000,8000,2.545966374557,NA 
rayol-farm2_2019-05-07_08-10-10.wav,44100,16,60,1,bioacoustic_index,512,2000,8000,2.8375254052947,NA 
rayol-farm2_2019-05-07_08-12-10.wav,44100,16,60,1,bioacoustic_index,512,2000,8000,1.9961295101132,NA 
rayol-farm2_2019-05-07_08-14-10.wav,44100,16,60,1,bioacoustic_index,512,2000,8000,1.81298243057409,NA 
rayol-farm2_2019-05-07_08-16-10.wav,44100,16,60,1,bioacoustic_index,512,2000,8000,1.78988982149183,NA 
rayol-farm2_2019-05-07_08-18-10.wav,44100,16,60,1,bioacoustic_index,512,2000,8000,1.67351768275862,NA 
rayol-farm2_2019-05-07_08-20-10.wav,44100,16,60,1,bioacoustic_index,512,2000,8000,1.84514190851053,NA 
rayol-farm2_2019-05-07_08-22-11.wav,44100,16,60,1,bioacoustic_index,512,2000,8000,2.46888266332785,NA 
rayol-farm2_2019-05-07_08-24-11.wav,44100,16,60,1,bioacoustic_index,512,2000,8000,1.97256505404932,NA 
rayol-farm2_2019-05-07_08-26-11.wav,44100,16,60,1,bioacoustic_index,512,2000,8000,1.76487890391754,NA 
rayol-farm2_2019-05-07_08-28-11.wav,44100,16,60,1,bioacoustic_index,512,2000,8000,1.95934433288682,NA 
rayol-farm2_2019-05-07_08-30-11.wav,44100,16,60,1,bioacoustic_index,512,2000,8000,1.83405279149753,NA 
rayol-farm2_2019-05-07_08-32-11.wav,44100,16,60,1,bioacoustic_index,512,2000,8000,1.68454497206853,NA 
rayol-farm2_2019-05-07_08-34-11.wav,44100,16,60,1,bioacoustic_index,512,2000,8000,1.74642597589976,NA 
rayol-farm2_2019-05-07_08-36-11.wav,44100,16,60,1,bioacoustic_index,512,2000,8000,2.10913630795726,NA 
rayol-farm2_2019-05-07_08-38-12.wav,44100,16,60,1,bioacoustic_index,512,2000,8000,2.44374957798099,NA 
rayol-farm2_2019-05-07_08-40-12.wav,44100,16,60,1,bioacoustic_index,512,2000,8000,2.9058645464274,NA 
rayol-farm2_2019-05-07_08-42-12.wav,44100,16,60,1,bioacoustic_index,512,2000,8000,3.7481548368233,NA 
rayol-farm2_2019-05-07_08-44-12.wav,44100,16,60,1,bioacoustic_index,512,2000,8000,2.99419997633334,NA 
rayol-farm2_2019-05-07_08-46-12.wav,44100,16,60,1,bioacoustic_index,512,2000,8000,2.67475069025776,NA 
rayol-farm2_2019-05-07_08-48-12.wav,44100,16,60,1,bioacoustic_index,512,2000,8000,2.92385924099143,NA 
rayol-farm2_2019-05-07_08-50-12.wav,44100,16,60,1,bioacoustic_index,512,2000,8000,2.95229534287089,NA 
rayol-farm2_2019-05-07_08-52-12.wav,44100,16,60,1,bioacoustic_index,512,2000,8000,2.60692438384095,NA 
rayol-farm2_2019-05-07_08-54-13.wav,44100,16,60,1,bioacoustic_index,512,2000,8000,2.90462072317921,NA 
rayol-farm2_2019-05-07_08-56-13.wav,44100,16,60,1,bioacoustic_index,512,2000,8000,2.28483978277583,NA 
rayol-farm2_2019-05-07_08-58-13.wav,44100,16,60,1,bioacoustic_index,512,2000,8000,2.20726769027745,NA 
rayol-farm2_2019-05-07_09-00-13.wav,44100,16,60,1,bioacoustic_index,512,2000,8000,2.17649222249472,NA 
rayol-farm2_2019-05-07_09-02-13.wav,44100,16,60,1,bioacoustic_index,512,2000,8000,1.39961286017702,NA 
rayol-farm2_2019-05-07_09-04-13.wav,44100,16,60,1,bioacoustic_index,512,2000,8000,1.4309075089508,NA 
rayol-farm2_2019-05-07_09-06-13.wav,44100,16,60,1,bioacoustic_index,512,2000,8000,1.54622378009558,NA 
rayol-farm2_2019-05-07_09-08-13.wav,44100,16,60,1,bioacoustic_index,512,2000,8000,1.8609944690819,NA 
rayol-farm2_2019-05-07_09-10-14.wav,44100,16,60,1,bioacoustic_index,512,2000,8000,1.73901334774799,NA 
rayol-farm2_2019-05-07_09-12-14.wav,44100,16,60,1,bioacoustic_index,512,2000,8000,6.16655514711636,NA 
rayol-farm2_2019-05-07_09-14-14.wav,44100,16,60,1,bioacoustic_index,512,2000,8000,4.21642131065019,NA 
rayol-farm2_2019-05-07_09-16-14.wav,44100,16,60,1,bioacoustic_index,512,2000,8000,1.74617427237216,NA 
rayol-farm2_2019-05-07_09-18-14.wav,44100,16,60,1,bioacoustic_index,512,2000,8000,1.95526600399609,NA 
rayol-farm2_2019-05-07_09-20-14.wav,44100,16,60,1,bioacoustic_index,512,2000,8000,2.60043678027414,NA 
rayol-farm2_2019-05-07_09-22-14.wav,44100,16,60,1,bioacoustic_index,512,2000,8000,2.55425373741096,NA 
rayol-farm2_2019-05-07_09-24-14.wav,44100,16,60,1,bioacoustic_index,512,2000,8000,2.20196954360043,NA 
rayol-farm2_2019-05-07_09-26-14.wav,44100,16,60,1,bioacoustic_index,512,2000,8000,2.12632666012193,NA 
rayol-farm2_2019-05-07_09-28-15.wav,44100,16,60,1,bioacoustic_index,512,2000,8000,1.86223389336993,NA 
rayol-farm2_2019-05-07_09-30-15.wav,44100,16,60,1,bioacoustic_index,512,2000,8000,1.91096606062417,NA 
rayol-farm2_2019-05-07_09-32-15.wav,44100,16,60,1,bioacoustic_index,512,2000,8000,2.02194281272451,NA 
rayol-farm2_2019-05-07_09-34-15.wav,44100,16,60,1,bioacoustic_index,512,2000,8000,2.57134987388476,NA 
rayol-farm2_2019-05-07_09-36-15.wav,44100,16,60,1,bioacoustic_index,512,2000,8000,2.42237731707623,NA 
rayol-farm2_2019-05-07_09-38-15.wav,44100,16,60,1,bioacoustic_index,512,2000,8000,2.05283367434268,NA 
rayol-farm2_2019-05-07_09-40-15.wav,44100,16,60,1,bioacoustic_index,512,2000,8000,3.05175594603031,NA 
rayol-farm2_2019-05-07_09-42-15.wav,44100,16,60,1,bioacoustic_index,512,2000,8000,4.05936962117124,NA 
rayol-farm2_2019-05-07_09-44-16.wav,44100,16,60,1,bioacoustic_index,512,2000,8000,4.16015671461546,NA 
rayol-farm2_2019-05-07_09-46-16.wav,44100,16,60,1,bioacoustic_index,512,2000,8000,3.93440564894762,NA 
rayol-farm2_2019-05-07_09-48-16.wav,44100,16,60,1,bioacoustic_index,512,2000,8000,3.6616718634343,NA 
rayol-farm2_2019-05-07_09-50-16.wav,44100,16,60,1,bioacoustic_index,512,2000,8000,2.22290974681426,NA 
rayol-farm2_2019-05-07_09-52-16.wav,44100,16,60,1,bioacoustic_index,512,2000,8000,1.58545436079853,NA 
rayol-farm2_2019-05-07_09-54-16.wav,44100,16,60,1,bioacoustic_index,512,2000,8000,2.26258976873873,NA 
rayol-farm2_2019-05-07_09-56-16.wav,44100,16,60,1,bioacoustic_index,512,2000,8000,1.63915239888489,NA 
rayol-farm2_2019-05-07_09-58-16.wav,44100,16,60,1,bioacoustic_index,512,2000,8000,1.71227872745444,NA 
rayol-farm2_2019-05-07_10-00-17.wav,44100,16,60,1,bioacoustic_index,512,2000,8000,1.92572446063365,NA 
rayol-farm2_2019-05-07_10-02-17.wav,44100,16,60,1,bioacoustic_index,512,2000,8000,1.87830665538166,NA 
rayol-farm2_2019-05-07_10-04-17.wav,44100,16,60,1,bioacoustic_index,512,2000,8000,1.89936113940677,NA 
rayol-farm2_2019-05-07_10-06-17.wav,44100,16,60,1,bioacoustic_index,512,2000,8000,1.621381316982,NA 
rayol-farm2_2019-05-07_10-08-17.wav,44100,16,60,1,bioacoustic_index,512,2000,8000,2.69721986162169,NA 
rayol-farm2_2019-05-07_10-10-17.wav,44100,16,60,1,bioacoustic_index,512,2000,8000,2.06041996611067,NA 
rayol-farm2_2019-05-07_10-12-17.wav,44100,16,60,1,bioacoustic_index,512,2000,8000,2.21118077116649,NA 
rayol-farm2_2019-05-07_10-14-17.wav,44100,16,60,1,bioacoustic_index,512,2000,8000,1.66953882868521,NA 
rayol-farm2_2019-05-07_10-16-18.wav,44100,16,60,1,bioacoustic_index,512,2000,8000,2.87186287424069,NA 
rayol-farm2_2019-05-07_10-18-18.wav,44100,16,60,1,bioacoustic_index,512,2000,8000,1.92653724514721,NA 
rayol-farm2_2019-05-07_10-20-18.wav,44100,16,60,1,bioacoustic_index,512,2000,8000,1.74128178630854,NA 
rayol-farm2_2019-05-07_10-22-18.wav,44100,16,60,1,bioacoustic_index,512,2000,8000,2.98490273917261,NA 
rayol-farm2_2019-05-07_10-24-18.wav,44100,16,60,1,bioacoustic_index,512,2000,8000,3.1985826002334,NA 
rayol-farm2_2019-05-07_10-26-18.wav,44100,16,60,1,bioacoustic_index,512,2000,8000,3.39503562211388,NA 
rayol-farm2_2019-05-07_10-28-18.wav,44100,16,60,1,bioacoustic_index,512,2000,8000,1.64996246924274,NA 
rayol-farm2_2019-05-07_10-30-18.wav,44100,16,60,1,bioacoustic_index,512,2000,8000,1.59354342273374,NA 
rayol-farm2_2019-05-07_10-32-19.wav,44100,16,60,1,bioacoustic_index,512,2000,8000,2.35948621832773,NA 
rayol-farm2_2019-05-07_10-34-19.wav,44100,16,60,1,bioacoustic_index,512,2000,8000,2.44731094682957,NA 
rayol-farm2_2019-05-07_10-36-19.wav,44100,16,60,1,bioacoustic_index,512,2000,8000,1.98567246082914,NA 
rayol-farm2_2019-05-07_10-38-19.wav,44100,16,60,1,bioacoustic_index,512,2000,8000,2.38372666264795,NA 
rayol-farm2_2019-05-07_10-40-19.wav,44100,16,60,1,bioacoustic_index,512,2000,8000,2.84959306340887,NA 
rayol-farm2_2019-05-07_10-42-19.wav,44100,16,60,1,bioacoustic_index,512,2000,8000,2.43520160282967,NA 
rayol-farm2_2019-05-07_10-44-19.wav,44100,16,60,1,bioacoustic_index,512,2000,8000,1.95791741372284,NA 
rayol-farm2_2019-05-07_10-46-19.wav,44100,16,60,1,bioacoustic_index,512,2000,8000,1.88439209241531,NA 
rayol-farm2_2019-05-07_10-48-19.wav,44100,16,60,1,bioacoustic_index,512,2000,8000,1.94615825546964,NA 
rayol-farm2_2019-05-07_10-50-20.wav,44100,16,60,1,bioacoustic_index,512,2000,8000,1.71500290130846,NA 
rayol-farm2_2019-05-07_10-52-20.wav,44100,16,60,1,bioacoustic_index,512,2000,8000,1.76284864777122,NA 
rayol-farm2_2019-05-07_10-54-20.wav,44100,16,60,1,bioacoustic_index,512,2000,8000,1.77054787678894,NA 
rayol-farm2_2019-05-07_10-56-20.wav,44100,16,60,1,bioacoustic_index,512,2000,8000,1.66271852758492,NA 
rayol-farm2_2019-05-07_10-58-20.wav,44100,16,60,1,bioacoustic_index,512,2000,8000,1.4765890698729,NA 
rayol-farm2_2019-05-07_11-00-20.wav,44100,16,60,1,bioacoustic_index,512,2000,8000,1.73034887825725,NA 
rayol-farm2_2019-05-07_11-02-20.wav,44100,16,60,1,bioacoustic_index,512,2000,8000,1.58720552417993,NA 
rayol-farm2_2019-05-07_11-04-20.wav,44100,16,60,1,bioacoustic_index,512,2000,8000,1.67742451815912,NA 
rayol-farm2_2019-05-07_11-06-21.wav,44100,16,60,1,bioacoustic_index,512,2000,8000,1.77960984863696,NA 
rayol-farm2_2019-05-07_11-08-21.wav,44100,16,60,1,bioacoustic_index,512,2000,8000,1.5954868453615,NA 
rayol-farm2_2019-05-07_11-10-21.wav,44100,16,60,1,bioacoustic_index,512,2000,8000,1.47457277004491,NA 
rayol-farm2_2019-05-07_11-12-21.wav,44100,16,60,1,bioacoustic_index,512,2000,8000,2.6167503677666,NA 
rayol-farm2_2019-05-07_11-14-21.wav,44100,16,60,1,bioacoustic_index,512,2000,8000,2.04769932763717,NA 
rayol-farm2_2019-05-07_11-16-21.wav,44100,16,60,1,bioacoustic_index,512,2000,8000,2.07455782776257,NA 
rayol-farm2_2019-05-07_11-18-21.wav,44100,16,60,1,bioacoustic_index,512,2000,8000,2.6634724096786,NA 
rayol-farm2_2019-05-07_11-20-21.wav,44100,16,60,1,bioacoustic_index,512,2000,8000,1.8751891616159,NA 
rayol-farm2_2019-05-07_11-22-22.wav,44100,16,60,1,bioacoustic_index,512,2000,8000,1.57817383359537,NA 
rayol-farm2_2019-05-07_11-24-22.wav,44100,16,60,1,bioacoustic_index,512,2000,8000,2.22820334417531,NA 
rayol-farm2_2019-05-07_11-26-22.wav,44100,16,60,1,bioacoustic_index,512,2000,8000,1.81844977743999,NA 
rayol-farm2_2019-05-07_11-28-22.wav,44100,16,60,1,bioacoustic_index,512,2000,8000,2.3367165671223,NA 
rayol-farm2_2019-05-07_11-30-22.wav,44100,16,60,1,bioacoustic_index,512,2000,8000,2.35967955193202,NA 
rayol-farm2_2019-05-07_11-32-22.wav,44100,16,60,1,bioacoustic_index,512,2000,8000,2.09225576869158,NA 
rayol-farm2_2019-05-07_11-34-22.wav,44100,16,60,1,bioacoustic_index,512,2000,8000,1.96021679089383,NA 
rayol-farm2_2019-05-07_11-36-22.wav,44100,16,60,1,bioacoustic_index,512,2000,8000,2.08848873395727,NA 
rayol-farm2_2019-05-07_11-38-23.wav,44100,16,60,1,bioacoustic_index,512,2000,8000,2.0126998681039,NA 
rayol-farm2_2019-05-07_11-40-23.wav,44100,16,60,1,bioacoustic_index,512,2000,8000,1.68563396475356,NA 
rayol-farm2_2019-05-07_11-42-23.wav,44100,16,60,1,bioacoustic_index,512,2000,8000,2.00281149026006,NA 
rayol-farm2_2019-05-07_11-44-23.wav,44100,16,60,1,bioacoustic_index,512,2000,8000,1.86866159677826,NA 
rayol-farm2_2019-05-07_11-46-23.wav,44100,16,60,1,bioacoustic_index,512,2000,8000,2.07532493333248,NA 
rayol-farm2_2019-05-07_11-48-23.wav,44100,16,60,1,bioacoustic_index,512,2000,8000,2.03183154812206,NA 
rayol-farm2_2019-05-07_11-50-23.wav,44100,16,60,1,bioacoustic_index,512,2000,8000,2.55768933193802,NA 
rayol-farm2_2019-05-07_11-52-23.wav,44100,16,60,1,bioacoustic_index,512,2000,8000,1.89692070912594,NA 
rayol-farm2_2019-05-07_11-54-24.wav,44100,16,60,1,bioacoustic_index,512,2000,8000,3.70931783370815,NA 
rayol-farm2_2019-05-07_11-56-24.wav,44100,16,60,1,bioacoustic_index,512,2000,8000,2.64106130820186,NA 
rayol-farm2_2019-05-07_11-58-24.wav,44100,16,60,1,bioacoustic_index,512,2000,8000,2.37003080282672,NA 
rayol-farm2_2019-05-07_12-00-24.wav,44100,16,60,1,bioacoustic_index,512,2000,8000,2.80610365525975,NA 
rayol-farm2_2019-05-07_12-02-24.wav,44100,16,60,1,bioacoustic_index,512,2000,8000,2.21049343752248,NA 
rayol-farm2_2019-05-07_12-04-24.wav,44100,16,60,1,bioacoustic_index,512,2000,8000,1.97345252743659,NA 
rayol-farm2_2019-05-07_12-06-24.wav,44100,16,60,1,bioacoustic_index,512,2000,8000,2.93763349168259,NA 
rayol-farm2_2019-05-07_12-08-24.wav,44100,16,60,1,bioacoustic_index,512,2000,8000,2.06507383624819,NA 
rayol-farm2_2019-05-07_12-10-25.wav,44100,16,60,1,bioacoustic_index,512,2000,8000,2.40754346300161,NA 
rayol-farm2_2019-05-07_12-12-25.wav,44100,16,60,1,bioacoustic_index,512,2000,8000,3.33423404722865,NA 
rayol-farm2_2019-05-07_12-14-25.wav,44100,16,60,1,bioacoustic_index,512,2000,8000,2.781973975976,NA 
rayol-farm2_2019-05-07_12-16-25.wav,44100,16,60,1,bioacoustic_index,512,2000,8000,1.92619194528651,NA 
rayol-farm2_2019-05-07_12-18-25.wav,44100,16,60,1,bioacoustic_index,512,2000,8000,2.66592451765742,NA 
rayol-farm2_2019-05-07_12-20-25.wav,44100,16,60,1,bioacoustic_index,512,2000,8000,3.02813834146803,NA 
rayol-farm2_2019-05-07_12-22-25.wav,44100,16,60,1,bioacoustic_index,512,2000,8000,4.11992494079747,NA 
rayol-farm2_2019-05-07_12-24-25.wav,44100,16,60,1,bioacoustic_index,512,2000,8000,3.32331922008225,NA 
rayol-farm2_2019-05-07_12-26-25.wav,44100,16,60,1,bioacoustic_index,512,2000,8000,2.53463984503403,NA 
rayol-farm2_2019-05-07_12-28-26.wav,44100,16,60,1,bioacoustic_index,512,2000,8000,3.41324209603223,NA 
rayol-farm2_2019-05-07_12-30-26.wav,44100,16,60,1,bioacoustic_index,512,2000,8000,3.03768796565147,NA 
rayol-farm2_2019-05-07_12-32-26.wav,44100,16,60,1,bioacoustic_index,512,2000,8000,2.50067321408088,NA 
rayol-farm2_2019-05-07_12-34-26.wav,44100,16,60,1,bioacoustic_index,512,2000,8000,2.2512228109296,NA 
rayol-farm2_2019-05-07_12-36-26.wav,44100,16,60,1,bioacoustic_index,512,2000,8000,3.99892590448984,NA 
rayol-farm2_2019-05-07_12-38-26.wav,44100,16,60,1,bioacoustic_index,512,2000,8000,1.82270143160471,NA 
rayol-farm2_2019-05-07_12-40-26.wav,44100,16,60,1,bioacoustic_index,512,2000,8000,1.96188015436674,NA 
rayol-farm2_2019-05-07_12-42-26.wav,44100,16,60,1,bioacoustic_index,512,2000,8000,2.07076071373585,NA 
rayol-farm2_2019-05-07_12-44-27.wav,44100,16,60,1,bioacoustic_index,512,2000,8000,2.24032371069364,NA 
rayol-farm2_2019-05-07_12-46-27.wav,44100,16,60,1,bioacoustic_index,512,2000,8000,2.23470265420287,NA 
rayol-farm2_2019-05-07_12-48-27.wav,44100,16,60,1,bioacoustic_index,512,2000,8000,2.59731324370343,NA 
rayol-farm2_2019-05-07_12-50-27.wav,44100,16,60,1,bioacoustic_index,512,2000,8000,2.2082629719879,NA 
rayol-farm2_2019-05-07_12-52-27.wav,44100,16,60,1,bioacoustic_index,512,2000,8000,2.06809287529603,NA 
rayol-farm2_2019-05-07_12-54-27.wav,44100,16,60,1,bioacoustic_index,512,2000,8000,1.75969427346944,NA 
rayol-farm2_2019-05-07_12-56-27.wav,44100,16,60,1,bioacoustic_index,512,2000,8000,1.88110938363696,NA 
rayol-farm2_2019-05-07_12-58-27.wav,44100,16,60,1,bioacoustic_index,512,2000,8000,1.93926953046557,NA 
rayol-farm2_2019-05-07_13-00-28.wav,44100,16,60,1,bioacoustic_index,512,2000,8000,1.78403905607408,NA 
rayol-farm2_2019-05-07_13-02-28.wav,44100,16,60,1,bioacoustic_index,512,2000,8000,1.69454187704422,NA 
rayol-farm2_2019-05-07_13-04-28.wav,44100,16,60,1,bioacoustic_index,512,2000,8000,2.73683487245076,NA 
rayol-farm2_2019-05-07_13-06-28.wav,44100,16,60,1,bioacoustic_index,512,2000,8000,1.8754273626354,NA 
rayol-farm2_2019-05-07_13-08-28.wav,44100,16,60,1,bioacoustic_index,512,2000,8000,2.05075317616519,NA 
rayol-farm2_2019-05-07_13-10-28.wav,44100,16,60,1,bioacoustic_index,512,2000,8000,1.66294037853333,NA 
rayol-farm2_2019-05-07_13-12-28.wav,44100,16,60,1,bioacoustic_index,512,2000,8000,1.78402372634571,NA 
rayol-farm2_2019-05-07_13-14-28.wav,44100,16,60,1,bioacoustic_index,512,2000,8000,1.84312463086563,NA 
rayol-farm2_2019-05-07_13-16-28.wav,44100,16,60,1,bioacoustic_index,512,2000,8000,2.0244875776595,NA 
rayol-farm2_2019-05-07_13-18-29.wav,44100,16,60,1,bioacoustic_index,512,2000,8000,1.93425395537543,NA 
rayol-farm2_2019-05-07_13-20-29.wav,44100,16,60,1,bioacoustic_index,512,2000,8000,2.5366194198253,NA 
rayol-farm2_2019-05-07_13-22-29.wav,44100,16,60,1,bioacoustic_index,512,2000,8000,2.01443078583396,NA 
rayol-farm2_2019-05-07_13-24-29.wav,44100,16,60,1,bioacoustic_index,512,2000,8000,1.87797384641269,NA 
rayol-farm2_2019-05-07_13-26-29.wav,44100,16,60,1,bioacoustic_index,512,2000,8000,2.28356040421074,NA 
rayol-farm2_2019-05-07_13-28-29.wav,44100,16,60,1,bioacoustic_index,512,2000,8000,1.60297177415731,NA 
rayol-farm2_2019-05-07_13-30-29.wav,44100,16,60,1,bioacoustic_index,512,2000,8000,1.58398501786032,NA 
rayol-farm2_2019-05-07_13-32-29.wav,44100,16,60,1,bioacoustic_index,512,2000,8000,1.73374264424363,NA 
rayol-farm2_2019-05-07_13-34-30.wav,44100,16,60,1,bioacoustic_index,512,2000,8000,2.4581595834063,NA 
rayol-farm2_2019-05-07_13-36-30.wav,44100,16,60,1,bioacoustic_index,512,2000,8000,1.58120491400199,NA 
rayol-farm2_2019-05-07_13-38-30.wav,44100,16,60,1,bioacoustic_index,512,2000,8000,1.96404323872663,NA 
rayol-farm2_2019-05-07_13-40-30.wav,44100,16,60,1,bioacoustic_index,512,2000,8000,1.52571542988071,NA 
rayol-farm2_2019-05-07_13-42-30.wav,44100,16,60,1,bioacoustic_index,512,2000,8000,2.47867852970127,NA 
rayol-farm2_2019-05-07_13-44-30.wav,44100,16,60,1,bioacoustic_index,512,2000,8000,2.56361408690597,NA 
rayol-farm2_2019-05-07_13-46-30.wav,44100,16,60,1,bioacoustic_index,512,2000,8000,1.88581278928725,NA 
rayol-farm2_2019-05-07_13-48-30.wav,44100,16,60,1,bioacoustic_index,512,2000,8000,1.9437286616605,NA 
rayol-farm2_2019-05-07_13-50-31.wav,44100,16,60,1,bioacoustic_index,512,2000,8000,2.27862199802018,NA 
rayol-farm2_2019-05-07_13-52-31.wav,44100,16,60,1,bioacoustic_index,512,2000,8000,1.94895594274502,NA 
rayol-farm2_2019-05-07_13-54-31.wav,44100,16,60,1,bioacoustic_index,512,2000,8000,2.51854255950943,NA 
rayol-farm2_2019-05-07_13-56-31.wav,44100,16,60,1,bioacoustic_index,512,2000,8000,1.74217557541018,NA 
rayol-farm2_2019-05-07_13-58-31.wav,44100,16,60,1,bioacoustic_index,512,2000,8000,2.26208096986453,NA 
rayol-farm2_2019-05-07_14-00-31.wav,44100,16,60,1,bioacoustic_index,512,2000,8000,2.0242661045362,NA 
rayol-farm2_2019-05-07_14-02-31.wav,44100,16,60,1,bioacoustic_index,512,2000,8000,1.42392468407343,NA 
rayol-farm2_2019-05-07_14-04-31.wav,44100,16,60,1,bioacoustic_index,512,2000,8000,2.03471981935934,NA 
rayol-farm2_2019-05-07_14-06-31.wav,44100,16,60,1,bioacoustic_index,512,2000,8000,1.61556801072556,NA 
rayol-farm2_2019-05-07_14-08-32.wav,44100,16,60,1,bioacoustic_index,512,2000,8000,1.48270464134979,NA 
rayol-farm2_2019-05-07_14-10-32.wav,44100,16,60,1,bioacoustic_index,512,2000,8000,1.39820850768119,NA 
rayol-farm2_2019-05-07_14-12-32.wav,44100,16,60,1,bioacoustic_index,512,2000,8000,1.44733019425605,NA 
rayol-farm2_2019-05-07_14-14-32.wav,44100,16,60,1,bioacoustic_index,512,2000,8000,1.6032873594234,NA 
rayol-farm2_2019-05-07_14-16-32.wav,44100,16,60,1,bioacoustic_index,512,2000,8000,2.11199415953109,NA 
rayol-farm2_2019-05-07_14-18-32.wav,44100,16,60,1,bioacoustic_index,512,2000,8000,2.73477473556383,NA 
rayol-farm2_2019-05-07_14-20-32.wav,44100,16,60,1,bioacoustic_index,512,2000,8000,1.88389359190049,NA 
rayol-farm2_2019-05-07_14-22-32.wav,44100,16,60,1,bioacoustic_index,512,2000,8000,1.45500957380425,NA 
rayol-farm2_2019-05-07_14-24-33.wav,44100,16,60,1,bioacoustic_index,512,2000,8000,1.56892894138995,NA 
rayol-farm2_2019-05-07_14-26-33.wav,44100,16,60,1,bioacoustic_index,512,2000,8000,1.29763720244378,NA 
rayol-farm2_2019-05-07_14-28-33.wav,44100,16,60,1,bioacoustic_index,512,2000,8000,1.45563432106135,NA 
rayol-farm2_2019-05-07_14-30-33.wav,44100,16,60,1,bioacoustic_index,512,2000,8000,1.77695528471495,NA 
rayol-farm2_2019-05-07_14-32-33.wav,44100,16,60,1,bioacoustic_index,512,2000,8000,1.69341252241693,NA 
rayol-farm2_2019-05-07_14-34-33.wav,44100,16,60,1,bioacoustic_index,512,2000,8000,1.62403708880257,NA 
rayol-farm2_2019-05-07_14-36-33.wav,44100,16,60,1,bioacoustic_index,512,2000,8000,1.54033184413837,NA 
rayol-farm2_2019-05-07_14-38-33.wav,44100,16,60,1,bioacoustic_index,512,2000,8000,2.54373337241071,NA 
rayol-farm2_2019-05-07_14-40-34.wav,44100,16,60,1,bioacoustic_index,512,2000,8000,1.49593831226069,NA 
rayol-farm2_2019-05-07_14-42-34.wav,44100,16,60,1,bioacoustic_index,512,2000,8000,1.65203178444111,NA 
rayol-farm2_2019-05-07_14-44-34.wav,44100,16,60,1,bioacoustic_index,512,2000,8000,1.43908620672543,NA 
rayol-farm2_2019-05-07_14-46-34.wav,44100,16,60,1,bioacoustic_index,512,2000,8000,1.75820867339049,NA 
rayol-farm2_2019-05-07_14-48-34.wav,44100,16,60,1,bioacoustic_index,512,2000,8000,1.84259985661437,NA 
rayol-farm2_2019-05-07_14-50-34.wav,44100,16,60,1,bioacoustic_index,512,2000,8000,2.26296709046155,NA 
rayol-farm2_2019-05-07_14-52-34.wav,44100,16,60,1,bioacoustic_index,512,2000,8000,2.27136888843474,NA 
rayol-farm2_2019-05-07_14-54-34.wav,44100,16,60,1,bioacoustic_index,512,2000,8000,1.30394553853446,NA 
rayol-farm2_2019-05-07_14-56-35.wav,44100,16,60,1,bioacoustic_index,512,2000,8000,1.6327696814653,NA 
rayol-farm2_2019-05-07_14-58-35.wav,44100,16,60,1,bioacoustic_index,512,2000,8000,1.69569218728165,NA 
rayol-farm2_2019-05-07_15-00-35.wav,44100,16,60,1,bioacoustic_index,512,2000,8000,1.57389924161448,NA 
rayol-farm2_2019-05-07_15-02-35.wav,44100,16,60,1,bioacoustic_index,512,2000,8000,2.12886870911233,NA 
rayol-farm2_2019-05-07_15-04-35.wav,44100,16,60,1,bioacoustic_index,512,2000,8000,1.63654275020496,NA 
rayol-farm2_2019-05-07_15-06-35.wav,44100,16,60,1,bioacoustic_index,512,2000,8000,3.14611657758652,NA 
rayol-farm2_2019-05-07_15-08-35.wav,44100,16,60,1,bioacoustic_index,512,2000,8000,1.66692251101834,NA 
rayol-farm2_2019-05-07_15-10-35.wav,44100,16,60,1,bioacoustic_index,512,2000,8000,1.94952221731911,NA 
rayol-farm2_2019-05-07_15-12-35.wav,44100,16,60,1,bioacoustic_index,512,2000,8000,1.46916687282596,NA 
rayol-farm2_2019-05-07_15-14-36.wav,44100,16,60,1,bioacoustic_index,512,2000,8000,2.35235447665685,NA 
rayol-farm2_2019-05-07_15-16-36.wav,44100,16,60,1,bioacoustic_index,512,2000,8000,1.28969325655438,NA 
rayol-farm2_2019-05-07_15-18-36.wav,44100,16,60,1,bioacoustic_index,512,2000,8000,1.66355150391579,NA 
rayol-farm2_2019-05-07_15-20-36.wav,44100,16,60,1,bioacoustic_index,512,2000,8000,2.16072321803602,NA 
rayol-farm2_2019-05-07_15-22-36.wav,44100,16,60,1,bioacoustic_index,512,2000,8000,2.45457608946706,NA 
rayol-farm2_2019-05-07_15-24-36.wav,44100,16,60,1,bioacoustic_index,512,2000,8000,1.97362975310597,NA 
rayol-farm2_2019-05-07_15-26-36.wav,44100,16,60,1,bioacoustic_index,512,2000,8000,3.09536322473813,NA 
rayol-farm2_2019-05-07_15-28-36.wav,44100,16,60,1,bioacoustic_index,512,2000,8000,2.23835461801858,NA 
rayol-farm2_2019-05-07_15-30-37.wav,44100,16,60,1,bioacoustic_index,512,2000,8000,2.40677792223725,NA 
rayol-farm2_2019-05-07_15-32-37.wav,44100,16,60,1,bioacoustic_index,512,2000,8000,2.90146224453244,NA 
rayol-farm2_2019-05-07_15-34-37.wav,44100,16,60,1,bioacoustic_index,512,2000,8000,1.9833165155552,NA 
rayol-farm2_2019-05-07_15-36-37.wav,44100,16,60,1,bioacoustic_index,512,2000,8000,2.60737829015383,NA 
rayol-farm2_2019-05-07_15-38-37.wav,44100,16,60,1,bioacoustic_index,512,2000,8000,1.44043198404931,NA 
rayol-farm2_2019-05-07_15-40-37.wav,44100,16,60,1,bioacoustic_index,512,2000,8000,1.76246150436403,NA 
rayol-farm2_2019-05-07_15-42-37.wav,44100,16,60,1,bioacoustic_index,512,2000,8000,1.87656615453333,NA 
rayol-farm2_2019-05-07_15-44-37.wav,44100,16,60,1,bioacoustic_index,512,2000,8000,1.76206846162912,NA 
rayol-farm2_2019-05-07_15-46-38.wav,44100,16,60,1,bioacoustic_index,512,2000,8000,1.83578556465671,NA 
rayol-farm2_2019-05-07_15-48-38.wav,44100,16,60,1,bioacoustic_index,512,2000,8000,1.83215273665525,NA 
rayol-farm2_2019-05-07_15-50-38.wav,44100,16,60,1,bioacoustic_index,512,2000,8000,2.60624163126468,NA 
rayol-farm2_2019-05-07_15-52-38.wav,44100,16,60,1,bioacoustic_index,512,2000,8000,1.37298104420419,NA 
rayol-farm2_2019-05-07_15-54-38.wav,44100,16,60,1,bioacoustic_index,512,2000,8000,1.58805175687041,NA 
rayol-farm2_2019-05-07_15-56-38.wav,44100,16,60,1,bioacoustic_index,512,2000,8000,1.72019443018641,NA 
rayol-farm2_2019-05-07_15-58-38.wav,44100,16,60,1,bioacoustic_index,512,2000,8000,3.53964048392066,NA 
rayol-farm2_2019-05-07_16-00-38.wav,44100,16,60,1,bioacoustic_index,512,2000,8000,1.52206217104389,NA 
rayol-farm2_2019-05-07_16-02-39.wav,44100,16,60,1,bioacoustic_index,512,2000,8000,1.4427874385077,NA 
rayol-farm2_2019-05-07_16-04-39.wav,44100,16,60,1,bioacoustic_index,512,2000,8000,1.65081681529303,NA 
rayol-farm2_2019-05-07_16-06-39.wav,44100,16,60,1,bioacoustic_index,512,2000,8000,1.41735706103346,NA 
rayol-farm2_2019-05-07_16-08-39.wav,44100,16,60,1,bioacoustic_index,512,2000,8000,1.52648024215191,NA 
rayol-farm2_2019-05-07_16-10-39.wav,44100,16,60,1,bioacoustic_index,512,2000,8000,3.35684356702175,NA 
rayol-farm2_2019-05-07_16-12-39.wav,44100,16,60,1,bioacoustic_index,512,2000,8000,1.57820254419811,NA 
rayol-farm2_2019-05-07_16-14-39.wav,44100,16,60,1,bioacoustic_index,512,2000,8000,1.94219379723172,NA 
rayol-farm2_2019-05-07_16-16-39.wav,44100,16,60,1,bioacoustic_index,512,2000,8000,1.87508469750937,NA 
rayol-farm2_2019-05-07_16-18-39.wav,44100,16,60,1,bioacoustic_index,512,2000,8000,1.49094001230078,NA 
rayol-farm2_2019-05-07_16-20-40.wav,44100,16,60,1,bioacoustic_index,512,2000,8000,1.43212364735479,NA 
rayol-farm2_2019-05-07_16-22-40.wav,44100,16,60,1,bioacoustic_index,512,2000,8000,1.66912885063258,NA 
rayol-farm2_2019-05-07_16-24-40.wav,44100,16,60,1,bioacoustic_index,512,2000,8000,1.48013831236944,NA 
rayol-farm2_2019-05-07_16-26-40.wav,44100,16,60,1,bioacoustic_index,512,2000,8000,1.42218151033929,NA 
rayol-farm2_2019-05-07_16-28-40.wav,44100,16,60,1,bioacoustic_index,512,2000,8000,1.71546738061429,NA 
rayol-farm2_2019-05-07_16-30-40.wav,44100,16,60,1,bioacoustic_index,512,2000,8000,1.5372148569626,NA 
rayol-farm2_2019-05-07_16-32-40.wav,44100,16,60,1,bioacoustic_index,512,2000,8000,1.539527753104,NA 
rayol-farm2_2019-05-07_16-34-40.wav,44100,16,60,1,bioacoustic_index,512,2000,8000,1.37897310841745,NA 
rayol-farm2_2019-05-07_16-36-41.wav,44100,16,60,1,bioacoustic_index,512,2000,8000,1.39261596263756,NA 
rayol-farm2_2019-05-07_16-38-41.wav,44100,16,60,1,bioacoustic_index,512,2000,8000,1.60508921400543,NA 
rayol-farm2_2019-05-07_16-40-41.wav,44100,16,60,1,bioacoustic_index,512,2000,8000,1.55892978045551,NA 
rayol-farm2_2019-05-07_16-42-41.wav,44100,16,60,1,bioacoustic_index,512,2000,8000,1.66246409916982,NA 
rayol-farm2_2019-05-07_16-44-41.wav,44100,16,60,1,bioacoustic_index,512,2000,8000,1.34725902545712,NA 
rayol-farm2_2019-05-07_16-46-41.wav,44100,16,60,1,bioacoustic_index,512,2000,8000,1.73512125787673,NA 
rayol-farm2_2019-05-07_16-48-41.wav,44100,16,60,1,bioacoustic_index,512,2000,8000,2.70234800444028,NA 
rayol-farm2_2019-05-07_16-50-41.wav,44100,16,60,1,bioacoustic_index,512,2000,8000,3.95696911034192,NA 
rayol-farm2_2019-05-07_16-52-42.wav,44100,16,60,1,bioacoustic_index,512,2000,8000,2.89010439797912,NA 
rayol-farm2_2019-05-07_16-54-42.wav,44100,16,60,1,bioacoustic_index,512,2000,8000,1.42550332832965,NA 
rayol-farm2_2019-05-07_16-56-42.wav,44100,16,60,1,bioacoustic_index,512,2000,8000,1.4543369146228,NA 
rayol-farm2_2019-05-07_16-58-42.wav,44100,16,60,1,bioacoustic_index,512,2000,8000,1.39767341886323,NA 
rayol-farm2_2019-05-07_17-00-42.wav,44100,16,60,1,bioacoustic_index,512,2000,8000,1.54893977914356,NA 
rayol-farm2_2019-05-07_17-02-42.wav,44100,16,60,1,bioacoustic_index,512,2000,8000,1.51040399217292,NA 
rayol-farm2_2019-05-07_17-04-42.wav,44100,16,60,1,bioacoustic_index,512,2000,8000,1.46237562860386,NA 
rayol-farm2_2019-05-07_17-06-42.wav,44100,16,60,1,bioacoustic_index,512,2000,8000,1.89103982312161,NA 
rayol-farm2_2019-05-07_17-08-43.wav,44100,16,60,1,bioacoustic_index,512,2000,8000,1.65788514647593,NA 
rayol-farm2_2019-05-07_17-10-43.wav,44100,16,60,1,bioacoustic_index,512,2000,8000,3.20339597818965,NA 
rayol-farm2_2019-05-07_17-12-43.wav,44100,16,60,1,bioacoustic_index,512,2000,8000,2.36121916910332,NA 
rayol-farm2_2019-05-07_17-14-43.wav,44100,16,60,1,bioacoustic_index,512,2000,8000,2.06620683279031,NA 
rayol-farm2_2019-05-07_17-16-43.wav,44100,16,60,1,bioacoustic_index,512,2000,8000,2.15810214241458,NA 
rayol-farm2_2019-05-07_17-18-43.wav,44100,16,60,1,bioacoustic_index,512,2000,8000,1.30766079322859,NA 
rayol-farm2_2019-05-07_17-20-43.wav,44100,16,60,1,bioacoustic_index,512,2000,8000,1.2299127152136,NA 
rayol-farm2_2019-05-07_17-22-43.wav,44100,16,60,1,bioacoustic_index,512,2000,8000,1.48532009453204,NA 
rayol-farm2_2019-05-07_17-24-43.wav,44100,16,60,1,bioacoustic_index,512,2000,8000,1.29363526928222,NA 
rayol-farm2_2019-05-07_17-26-44.wav,44100,16,60,1,bioacoustic_index,512,2000,8000,1.48761519450671,NA 
rayol-farm2_2019-05-07_17-28-44.wav,44100,16,60,1,bioacoustic_index,512,2000,8000,1.82556150888833,NA 
rayol-farm2_2019-05-07_17-30-44.wav,44100,16,60,1,bioacoustic_index,512,2000,8000,1.34849084916178,NA 
rayol-farm2_2019-05-07_17-32-44.wav,44100,16,60,1,bioacoustic_index,512,2000,8000,2.08513401941619,NA 
rayol-farm2_2019-05-07_17-34-44.wav,44100,16,60,1,bioacoustic_index,512,2000,8000,1.71154269709582,NA 
rayol-farm2_2019-05-07_17-36-44.wav,44100,16,60,1,bioacoustic_index,512,2000,8000,1.75431195893573,NA 
rayol-farm2_2019-05-07_17-38-44.wav,44100,16,60,1,bioacoustic_index,512,2000,8000,1.5038213972036,NA 
rayol-farm2_2019-05-07_17-40-44.wav,44100,16,60,1,bioacoustic_index,512,2000,8000,1.67172635699829,NA 
rayol-farm2_2019-05-07_17-42-45.wav,44100,16,60,1,bioacoustic_index,512,2000,8000,1.91965133200336,NA 
rayol-farm2_2019-05-07_17-44-45.wav,44100,16,60,1,bioacoustic_index,512,2000,8000,1.86562052314045,NA 
rayol-farm2_2019-05-07_17-46-45.wav,44100,16,60,1,bioacoustic_index,512,2000,8000,1.19908371875746,NA 
rayol-farm2_2019-05-07_17-48-45.wav,44100,16,60,1,bioacoustic_index,512,2000,8000,1.33887797684336,NA 
rayol-farm2_2019-05-07_17-50-45.wav,44100,16,60,1,bioacoustic_index,512,2000,8000,1.46953337075074,NA 
rayol-farm2_2019-05-07_17-52-45.wav,44100,16,60,1,bioacoustic_index,512,2000,8000,1.66769514865759,NA 
rayol-farm2_2019-05-07_17-54-45.wav,44100,16,60,1,bioacoustic_index,512,2000,8000,1.51385907754625,NA 
rayol-farm2_2019-05-07_17-56-45.wav,44100,16,60,1,bioacoustic_index,512,2000,8000,1.33658652093668,NA 
rayol-farm2_2019-05-07_17-58-46.wav,44100,16,60,1,bioacoustic_index,512,2000,8000,2.15381020846424,NA 
rayol-farm2_2019-05-07_18-00-46.wav,44100,16,60,1,bioacoustic_index,512,2000,8000,1.32852613062775,NA 
rayol-farm2_2019-05-07_18-02-46.wav,44100,16,60,1,bioacoustic_index,512,2000,8000,1.4332689678449,NA 
rayol-farm2_2019-05-07_18-04-46.wav,44100,16,60,1,bioacoustic_index,512,2000,8000,1.54092214990927,NA 
rayol-farm2_2019-05-07_18-06-46.wav,44100,16,60,1,bioacoustic_index,512,2000,8000,1.50991374653903,NA 
rayol-farm2_2019-05-07_18-08-46.wav,44100,16,60,1,bioacoustic_index,512,2000,8000,1.40923368830577,NA 
rayol-farm2_2019-05-07_18-10-46.wav,44100,16,60,1,bioacoustic_index,512,2000,8000,1.48437119001252,NA 
rayol-farm2_2019-05-07_18-12-46.wav,44100,16,60,1,bioacoustic_index,512,2000,8000,1.36814884605457,NA 
rayol-farm2_2019-05-07_18-14-47.wav,44100,16,60,1,bioacoustic_index,512,2000,8000,1.44342297685392,NA 
rayol-farm2_2019-05-07_18-16-47.wav,44100,16,60,1,bioacoustic_index,512,2000,8000,1.27955884684781,NA 
rayol-farm2_2019-05-07_18-18-47.wav,44100,16,60,1,bioacoustic_index,512,2000,8000,1.37778337778734,NA 
rayol-farm2_2019-05-07_18-20-47.wav,44100,16,60,1,bioacoustic_index,512,2000,8000,1.36982445004188,NA 
rayol-farm2_2019-05-07_18-22-47.wav,44100,16,60,1,bioacoustic_index,512,2000,8000,2.3148386063678,NA 
rayol-farm2_2019-05-07_18-24-47.wav,44100,16,60,1,bioacoustic_index,512,2000,8000,1.49669420139563,NA 
rayol-farm2_2019-05-07_18-26-47.wav,44100,16,60,1,bioacoustic_index,512,2000,8000,1.50054422290373,NA 
rayol-farm2_2019-05-07_18-28-47.wav,44100,16,60,1,bioacoustic_index,512,2000,8000,1.60705659428184,NA 
rayol-farm2_2019-05-07_18-30-47.wav,44100,16,60,1,bioacoustic_index,512,2000,8000,1.59217837386874,NA 
rayol-farm2_2019-05-07_18-32-48.wav,44100,16,60,1,bioacoustic_index,512,2000,8000,1.36632463679377,NA 
rayol-farm2_2019-05-07_18-34-48.wav,44100,16,60,1,bioacoustic_index,512,2000,8000,1.49912949181184,NA 
rayol-farm2_2019-05-07_18-36-48.wav,44100,16,60,1,bioacoustic_index,512,2000,8000,2.68523286275916,NA 
rayol-farm2_2019-05-07_18-38-48.wav,44100,16,60,1,bioacoustic_index,512,2000,8000,1.47411467941966,NA 
rayol-farm2_2019-05-07_18-40-48.wav,44100,16,60,1,bioacoustic_index,512,2000,8000,1.45881991268145,NA 
rayol-farm2_2019-05-07_18-42-48.wav,44100,16,60,1,bioacoustic_index,512,2000,8000,1.63296279116647,NA 
rayol-farm2_2019-05-07_18-44-48.wav,44100,16,60,1,bioacoustic_index,512,2000,8000,1.60078801738346,NA 
rayol-farm2_2019-05-07_18-46-48.wav,44100,16,60,1,bioacoustic_index,512,2000,8000,1.56546049028004,NA 
rayol-farm2_2019-05-07_18-48-49.wav,44100,16,60,1,bioacoustic_index,512,2000,8000,1.28181272969214,NA 
rayol-farm2_2019-05-07_18-50-49.wav,44100,16,60,1,bioacoustic_index,512,2000,8000,1.36766679220508,NA 
rayol-farm2_2019-05-07_18-52-49.wav,44100,16,60,1,bioacoustic_index,512,2000,8000,1.39848957692145,NA 
rayol-farm2_2019-05-07_18-54-49.wav,44100,16,60,1,bioacoustic_index,512,2000,8000,1.532369499829,NA 
rayol-farm2_2019-05-07_18-56-49.wav,44100,16,60,1,bioacoustic_index,512,2000,8000,1.26998934089729,NA 
rayol-farm2_2019-05-07_18-58-49.wav,44100,16,60,1,bioacoustic_index,512,2000,8000,1.21754632542034,NA 
rayol-farm2_2019-05-07_19-00-49.wav,44100,16,60,1,bioacoustic_index,512,2000,8000,1.54708462954863,NA 
rayol-farm2_2019-05-07_19-02-49.wav,44100,16,60,1,bioacoustic_index,512,2000,8000,1.72221753372074,NA 
rayol-farm2_2019-05-07_19-04-50.wav,44100,16,60,1,bioacoustic_index,512,2000,8000,1.61346801572318,NA 
rayol-farm2_2019-05-07_19-06-50.wav,44100,16,60,1,bioacoustic_index,512,2000,8000,1.63370291144416,NA 
rayol-farm2_2019-05-07_19-08-50.wav,44100,16,60,1,bioacoustic_index,512,2000,8000,1.42231177087009,NA 
rayol-farm2_2019-05-07_19-10-50.wav,44100,16,60,1,bioacoustic_index,512,2000,8000,1.27377018968682,NA 
rayol-farm2_2019-05-07_19-12-50.wav,44100,16,60,1,bioacoustic_index,512,2000,8000,1.30548561485581,NA 
rayol-farm2_2019-05-07_19-14-50.wav,44100,16,60,1,bioacoustic_index,512,2000,8000,1.33634167723051,NA 
rayol-farm2_2019-05-07_19-16-50.wav,44100,16,60,1,bioacoustic_index,512,2000,8000,1.42027627419922,NA 
rayol-farm2_2019-05-07_19-18-50.wav,44100,16,60,1,bioacoustic_index,512,2000,8000,1.32667263216116,NA 
rayol-farm2_2019-05-07_19-20-51.wav,44100,16,60,1,bioacoustic_index,512,2000,8000,1.29235939479728,NA 
rayol-farm2_2019-05-07_19-22-51.wav,44100,16,60,1,bioacoustic_index,512,2000,8000,1.88437238979474,NA 
rayol-farm2_2019-05-07_19-24-51.wav,44100,16,60,1,bioacoustic_index,512,2000,8000,1.45123920329939,NA 
rayol-farm2_2019-05-07_19-26-51.wav,44100,16,60,1,bioacoustic_index,512,2000,8000,1.48163028567647,NA 
rayol-farm2_2019-05-07_19-28-51.wav,44100,16,60,1,bioacoustic_index,512,2000,8000,1.48734028263852,NA 
rayol-farm2_2019-05-07_19-30-51.wav,44100,16,60,1,bioacoustic_index,512,2000,8000,1.31065862431071,NA 
rayol-farm2_2019-05-07_19-32-51.wav,44100,16,60,1,bioacoustic_index,512,2000,8000,1.31393924326318,NA 
rayol-farm2_2019-05-07_19-34-51.wav,44100,16,60,1,bioacoustic_index,512,2000,8000,1.32014662155698,NA 
rayol-farm2_2019-05-07_19-36-51.wav,44100,16,60,1,bioacoustic_index,512,2000,8000,1.71698664910189,NA 
rayol-farm2_2019-05-07_19-38-52.wav,44100,16,60,1,bioacoustic_index,512,2000,8000,1.87920609666149,NA 
rayol-farm2_2019-05-07_19-40-52.wav,44100,16,60,1,bioacoustic_index,512,2000,8000,1.66674985061751,NA 
rayol-farm2_2019-05-07_19-42-52.wav,44100,16,60,1,bioacoustic_index,512,2000,8000,1.89502530880709,NA 
rayol-farm2_2019-05-07_19-44-52.wav,44100,16,60,1,bioacoustic_index,512,2000,8000,1.81342867757259,NA 
rayol-farm2_2019-05-07_19-46-52.wav,44100,16,60,1,bioacoustic_index,512,2000,8000,1.92961585559976,NA 
rayol-farm2_2019-05-07_19-48-52.wav,44100,16,60,1,bioacoustic_index,512,2000,8000,1.94876934680303,NA 
rayol-farm2_2019-05-07_19-50-52.wav,44100,16,60,1,bioacoustic_index,512,2000,8000,1.79108988432656,NA 
rayol-farm2_2019-05-07_19-52-52.wav,44100,16,60,1,bioacoustic_index,512,2000,8000,1.50027656195486,NA 
rayol-farm2_2019-05-07_19-54-53.wav,44100,16,60,1,bioacoustic_index,512,2000,8000,1.48274191197037,NA 
rayol-farm2_2019-05-07_19-56-53.wav,44100,16,60,1,bioacoustic_index,512,2000,8000,1.24406851224682,NA 
rayol-farm2_2019-05-07_19-58-53.wav,44100,16,60,1,bioacoustic_index,512,2000,8000,1.31692495283964,NA 
rayol-farm2_2019-05-07_20-00-53.wav,44100,16,60,1,bioacoustic_index,512,2000,8000,1.24973142673093,NA 
rayol-farm2_2019-05-07_20-02-53.wav,44100,16,60,1,bioacoustic_index,512,2000,8000,1.27009914623045,NA 
rayol-farm2_2019-05-07_20-04-53.wav,44100,16,60,1,bioacoustic_index,512,2000,8000,1.45923664338878,NA 
rayol-farm2_2019-05-07_20-06-53.wav,44100,16,60,1,bioacoustic_index,512,2000,8000,1.29461457154111,NA 
rayol-farm2_2019-05-07_20-08-53.wav,44100,16,60,1,bioacoustic_index,512,2000,8000,1.35117244911799,NA 
rayol-farm2_2019-05-07_20-10-54.wav,44100,16,60,1,bioacoustic_index,512,2000,8000,1.26276617144372,NA 
rayol-farm2_2019-05-07_20-12-54.wav,44100,16,60,1,bioacoustic_index,512,2000,8000,1.70611964776638,NA 
rayol-farm2_2019-05-07_20-14-54.wav,44100,16,60,1,bioacoustic_index,512,2000,8000,1.91390274080736,NA 
rayol-farm2_2019-05-07_20-16-54.wav,44100,16,60,1,bioacoustic_index,512,2000,8000,1.57699418852734,NA 
rayol-farm2_2019-05-07_20-18-54.wav,44100,16,60,1,bioacoustic_index,512,2000,8000,1.94557253836881,NA 
rayol-farm2_2019-05-07_20-20-54.wav,44100,16,60,1,bioacoustic_index,512,2000,8000,1.70083839918657,NA 
rayol-farm2_2019-05-07_20-22-54.wav,44100,16,60,1,bioacoustic_index,512,2000,8000,1.56652048197959,NA 
rayol-farm2_2019-05-07_20-24-54.wav,44100,16,60,1,bioacoustic_index,512,2000,8000,1.73476118276549,NA 
rayol-farm2_2019-05-07_20-26-55.wav,44100,16,60,1,bioacoustic_index,512,2000,8000,1.44552012766707,NA 
rayol-farm2_2019-05-07_20-28-55.wav,44100,16,60,1,bioacoustic_index,512,2000,8000,1.5344789423027,NA 
rayol-farm2_2019-05-07_20-30-55.wav,44100,16,60,1,bioacoustic_index,512,2000,8000,1.56605116704943,NA 
rayol-farm2_2019-05-07_20-32-55.wav,44100,16,60,1,bioacoustic_index,512,2000,8000,1.54096704433794,NA 
rayol-farm2_2019-05-07_20-34-55.wav,44100,16,60,1,bioacoustic_index,512,2000,8000,1.61828131773146,NA 
rayol-farm2_2019-05-07_20-36-55.wav,44100,16,60,1,bioacoustic_index,512,2000,8000,1.4008426792889,NA 
rayol-farm2_2019-05-07_20-38-55.wav,44100,16,60,1,bioacoustic_index,512,2000,8000,1.87711829154847,NA 
rayol-farm2_2019-05-07_20-40-55.wav,44100,16,60,1,bioacoustic_index,512,2000,8000,1.58541686117485,NA 
rayol-farm2_2019-05-07_20-42-55.wav,44100,16,60,1,bioacoustic_index,512,2000,8000,1.70840708796625,NA 
rayol-farm2_2019-05-07_20-44-56.wav,44100,16,60,1,bioacoustic_index,512,2000,8000,1.65772855943196,NA 
rayol-farm2_2019-05-07_20-46-56.wav,44100,16,60,1,bioacoustic_index,512,2000,8000,1.97287266493003,NA 
rayol-farm2_2019-05-07_20-48-56.wav,44100,16,60,1,bioacoustic_index,512,2000,8000,1.95743926843101,NA 
rayol-farm2_2019-05-07_20-50-56.wav,44100,16,60,1,bioacoustic_index,512,2000,8000,1.60950176864935,NA 
rayol-farm2_2019-05-07_20-52-56.wav,44100,16,60,1,bioacoustic_index,512,2000,8000,1.40237669964054,NA 
rayol-farm2_2019-05-07_20-54-56.wav,44100,16,60,1,bioacoustic_index,512,2000,8000,1.61360936303962,NA 
rayol-farm2_2019-05-07_20-56-56.wav,44100,16,60,1,bioacoustic_index,512,2000,8000,1.71759502210389,NA 
rayol-farm2_2019-05-07_20-58-56.wav,44100,16,60,1,bioacoustic_index,512,2000,8000,2.39512016526548,NA 
rayol-farm2_2019-05-07_21-00-57.wav,44100,16,60,1,bioacoustic_index,512,2000,8000,2.52112074234795,NA 
rayol-farm2_2019-05-07_21-02-57.wav,44100,16,60,1,bioacoustic_index,512,2000,8000,2.81746738891016,NA 
rayol-farm2_2019-05-07_21-04-57.wav,44100,16,60,1,bioacoustic_index,512,2000,8000,2.1041696188248,NA 
rayol-farm2_2019-05-07_21-06-57.wav,44100,16,60,1,bioacoustic_index,512,2000,8000,1.79418899460148,NA 
rayol-farm2_2019-05-07_21-08-57.wav,44100,16,60,1,bioacoustic_index,512,2000,8000,1.83023686414767,NA 
rayol-farm2_2019-05-07_21-10-57.wav,44100,16,60,1,bioacoustic_index,512,2000,8000,2.35679367160385,NA 
rayol-farm2_2019-05-07_21-12-57.wav,44100,16,60,1,bioacoustic_index,512,2000,8000,1.33761762515604,NA 
rayol-farm2_2019-05-07_21-14-57.wav,44100,16,60,1,bioacoustic_index,512,2000,8000,1.41393796921416,NA 
rayol-farm2_2019-05-07_21-16-58.wav,44100,16,60,1,bioacoustic_index,512,2000,8000,1.3163291287466,NA 
rayol-farm2_2019-05-07_21-18-58.wav,44100,16,60,1,bioacoustic_index,512,2000,8000,1.37154534152516,NA 
rayol-farm2_2019-05-07_21-20-58.wav,44100,16,60,1,bioacoustic_index,512,2000,8000,1.4157444615794,NA 
rayol-farm2_2019-05-07_21-22-58.wav,44100,16,60,1,bioacoustic_index,512,2000,8000,1.34466381098576,NA 
rayol-farm2_2019-05-07_21-24-58.wav,44100,16,60,1,bioacoustic_index,512,2000,8000,1.29238476534157,NA 
rayol-farm2_2019-05-07_21-26-58.wav,44100,16,60,1,bioacoustic_index,512,2000,8000,1.47912047168606,NA 
rayol-farm2_2019-05-07_21-28-58.wav,44100,16,60,1,bioacoustic_index,512,2000,8000,1.47066110895612,NA 
rayol-farm2_2019-05-07_21-30-58.wav,44100,16,60,1,bioacoustic_index,512,2000,8000,1.32500891614737,NA 
rayol-farm2_2019-05-07_21-32-59.wav,44100,16,60,1,bioacoustic_index,512,2000,8000,1.25553579373007,NA 
rayol-farm2_2019-05-07_21-34-59.wav,44100,16,60,1,bioacoustic_index,512,2000,8000,1.33904417386953,NA 
rayol-farm2_2019-05-07_21-36-59.wav,44100,16,60,1,bioacoustic_index,512,2000,8000,1.33344422715522,NA 
rayol-farm2_2019-05-07_21-38-59.wav,44100,16,60,1,bioacoustic_index,512,2000,8000,1.36483008593568,NA 
rayol-farm2_2019-05-07_21-40-59.wav,44100,16,60,1,bioacoustic_index,512,2000,8000,1.46779627720507,NA 
rayol-farm2_2019-05-07_21-42-59.wav,44100,16,60,1,bioacoustic_index,512,2000,8000,1.24961668913569,NA 
rayol-farm2_2019-05-07_21-44-59.wav,44100,16,60,1,bioacoustic_index,512,2000,8000,1.32006641332686,NA 
rayol-farm2_2019-05-07_21-46-59.wav,44100,16,60,1,bioacoustic_index,512,2000,8000,1.32550728961942,NA 
rayol-farm2_2019-05-07_21-48-59.wav,44100,16,60,1,bioacoustic_index,512,2000,8000,1.35056813475365,NA 
rayol-farm2_2019-05-07_21-51-00.wav,44100,16,60,1,bioacoustic_index,512,2000,8000,1.31576569359368,NA 
rayol-farm2_2019-05-07_21-53-00.wav,44100,16,60,1,bioacoustic_index,512,2000,8000,1.28957166339091,NA 
rayol-farm2_2019-05-07_21-55-00.wav,44100,16,60,1,bioacoustic_index,512,2000,8000,1.36108052986726,NA 
rayol-farm2_2019-05-07_21-57-00.wav,44100,16,60,1,bioacoustic_index,512,2000,8000,1.51541761267922,NA 
rayol-farm2_2019-05-07_21-59-00.wav,44100,16,60,1,bioacoustic_index,512,2000,8000,1.38187093432769,NA 
rayol-farm2_2019-05-07_22-01-00.wav,44100,16,60,1,bioacoustic_index,512,2000,8000,1.33414441063555,NA 
rayol-farm2_2019-05-07_22-03-00.wav,44100,16,60,1,bioacoustic_index,512,2000,8000,1.26206353464336,NA 
rayol-farm2_2019-05-07_22-05-00.wav,44100,16,60,1,bioacoustic_index,512,2000,8000,1.37900144540146,NA 
rayol-farm2_2019-05-07_22-07-01.wav,44100,16,60,1,bioacoustic_index,512,2000,8000,1.30461805449641,NA 
rayol-farm2_2019-05-07_22-09-01.wav,44100,16,60,1,bioacoustic_index,512,2000,8000,1.2928412095164,NA 
rayol-farm2_2019-05-07_22-11-01.wav,44100,16,60,1,bioacoustic_index,512,2000,8000,1.35770410861196,NA 
rayol-farm2_2019-05-07_22-13-01.wav,44100,16,60,1,bioacoustic_index,512,2000,8000,1.31845525199579,NA 
rayol-farm2_2019-05-07_22-15-01.wav,44100,16,60,1,bioacoustic_index,512,2000,8000,1.31586060489582,NA 
rayol-farm2_2019-05-07_22-17-01.wav,44100,16,60,1,bioacoustic_index,512,2000,8000,1.3172844850609,NA 
rayol-farm2_2019-05-07_22-19-01.wav,44100,16,60,1,bioacoustic_index,512,2000,8000,1.31384051938086,NA 
rayol-farm2_2019-05-07_22-21-01.wav,44100,16,60,1,bioacoustic_index,512,2000,8000,1.33554884357089,NA 
rayol-farm2_2019-05-07_22-23-02.wav,44100,16,60,1,bioacoustic_index,512,2000,8000,1.30521227486681,NA 
rayol-farm2_2019-05-07_22-25-02.wav,44100,16,60,1,bioacoustic_index,512,2000,8000,1.41748825706425,NA 
rayol-farm2_2019-05-07_22-27-02.wav,44100,16,60,1,bioacoustic_index,512,2000,8000,1.29692046439421,NA 
rayol-farm2_2019-05-07_22-29-02.wav,44100,16,60,1,bioacoustic_index,512,2000,8000,1.28282683628695,NA 
rayol-farm2_2019-05-07_22-31-02.wav,44100,16,60,1,bioacoustic_index,512,2000,8000,1.28007440274122,NA 
rayol-farm2_2019-05-07_22-33-02.wav,44100,16,60,1,bioacoustic_index,512,2000,8000,1.27044669131811,NA 
rayol-farm2_2019-05-07_22-35-02.wav,44100,16,60,1,bioacoustic_index,512,2000,8000,1.3260270608305,NA 
rayol-farm2_2019-05-07_22-37-02.wav,44100,16,60,1,bioacoustic_index,512,2000,8000,1.34475462561102,NA 
rayol-farm2_2019-05-07_22-39-02.wav,44100,16,60,1,bioacoustic_index,512,2000,8000,1.3802377431597,NA 
rayol-farm2_2019-05-07_22-41-03.wav,44100,16,60,1,bioacoustic_index,512,2000,8000,1.38372458219975,NA 
rayol-farm2_2019-05-07_22-43-03.wav,44100,16,60,1,bioacoustic_index,512,2000,8000,1.32150965527833,NA 
rayol-farm2_2019-05-07_22-45-03.wav,44100,16,60,1,bioacoustic_index,512,2000,8000,1.26310668051733,NA 
rayol-farm2_2019-05-07_22-47-03.wav,44100,16,60,1,bioacoustic_index,512,2000,8000,1.33523614048432,NA 
rayol-farm2_2019-05-07_22-49-03.wav,44100,16,60,1,bioacoustic_index,512,2000,8000,1.35819790977693,NA 
rayol-farm2_2019-05-07_22-51-03.wav,44100,16,60,1,bioacoustic_index,512,2000,8000,1.29417254864785,NA 
rayol-farm2_2019-05-07_22-53-03.wav,44100,16,60,1,bioacoustic_index,512,2000,8000,1.31697516664676,NA 
rayol-farm2_2019-05-07_22-55-03.wav,44100,16,60,1,bioacoustic_index,512,2000,8000,1.32254026211665,NA 
rayol-farm2_2019-05-07_22-57-04.wav,44100,16,60,1,bioacoustic_index,512,2000,8000,1.61697888237281,NA 
rayol-farm2_2019-05-07_22-59-04.wav,44100,16,60,1,bioacoustic_index,512,2000,8000,1.35686699125951,NA 
rayol-farm2_2019-05-07_23-01-04.wav,44100,16,60,1,bioacoustic_index,512,2000,8000,1.31502369095656,NA 
rayol-farm2_2019-05-07_23-03-04.wav,44100,16,60,1,bioacoustic_index,512,2000,8000,1.3587751528072,NA 
rayol-farm2_2019-05-07_23-05-04.wav,44100,16,60,1,bioacoustic_index,512,2000,8000,1.30510002630253,NA 
rayol-farm2_2019-05-07_23-07-04.wav,44100,16,60,1,bioacoustic_index,512,2000,8000,1.37837670524117,NA 
rayol-farm2_2019-05-07_23-09-04.wav,44100,16,60,1,bioacoustic_index,512,2000,8000,1.33266411180478,NA 
rayol-farm2_2019-05-07_23-11-04.wav,44100,16,60,1,bioacoustic_index,512,2000,8000,1.30518828291467,NA 
rayol-farm2_2019-05-07_23-13-05.wav,44100,16,60,1,bioacoustic_index,512,2000,8000,1.32923688536954,NA 
rayol-farm2_2019-05-07_23-15-05.wav,44100,16,60,1,bioacoustic_index,512,2000,8000,1.26661967014367,NA 
rayol-farm2_2019-05-07_23-17-05.wav,44100,16,60,1,bioacoustic_index,512,2000,8000,1.3348270599308,NA 
rayol-farm2_2019-05-07_23-19-05.wav,44100,16,60,1,bioacoustic_index,512,2000,8000,1.30666639868333,NA 
rayol-farm2_2019-05-07_23-21-05.wav,44100,16,60,1,bioacoustic_index,512,2000,8000,1.29193490268201,NA 
rayol-farm2_2019-05-07_23-23-05.wav,44100,16,60,1,bioacoustic_index,512,2000,8000,1.27736403814992,NA 
rayol-farm2_2019-05-07_23-25-05.wav,44100,16,60,1,bioacoustic_index,512,2000,8000,1.56644567314285,NA 
rayol-farm2_2019-05-07_23-27-05.wav,44100,16,60,1,bioacoustic_index,512,2000,8000,1.29768699426058,NA 
rayol-farm2_2019-05-07_23-29-05.wav,44100,16,60,1,bioacoustic_index,512,2000,8000,1.35602210791249,NA 
rayol-farm2_2019-05-07_23-31-06.wav,44100,16,60,1,bioacoustic_index,512,2000,8000,1.35941791961766,NA 
rayol-farm2_2019-05-07_23-33-06.wav,44100,16,60,1,bioacoustic_index,512,2000,8000,1.34587764631042,NA 
rayol-farm2_2019-05-07_23-35-06.wav,44100,16,60,1,bioacoustic_index,512,2000,8000,1.35039533816372,NA 
rayol-farm2_2019-05-07_23-37-06.wav,44100,16,60,1,bioacoustic_index,512,2000,8000,1.30673838325248,NA 
rayol-farm2_2019-05-07_23-39-06.wav,44100,16,60,1,bioacoustic_index,512,2000,8000,1.30734411308122,NA 
rayol-farm2_2019-05-07_23-41-06.wav,44100,16,60,1,bioacoustic_index,512,2000,8000,1.28104056762321,NA 
rayol-farm2_2019-05-07_23-43-06.wav,44100,16,60,1,bioacoustic_index,512,2000,8000,1.26893941711433,NA 
rayol-farm2_2019-05-07_23-45-06.wav,44100,16,60,1,bioacoustic_index,512,2000,8000,1.31644981764242,NA 
rayol-farm2_2019-05-07_23-47-07.wav,44100,16,60,1,bioacoustic_index,512,2000,8000,1.33794696143482,NA 
rayol-farm2_2019-05-07_23-49-07.wav,44100,16,60,1,bioacoustic_index,512,2000,8000,1.33754150604116,NA 
rayol-farm2_2019-05-07_23-51-07.wav,44100,16,60,1,bioacoustic_index,512,2000,8000,1.31743299874111,NA 
rayol-farm2_2019-05-07_23-53-07.wav,44100,16,60,1,bioacoustic_index,512,2000,8000,1.81838595601153,NA 
rayol-farm2_2019-05-07_23-55-07.wav,44100,16,60,1,bioacoustic_index,512,2000,8000,1.30509890378586,NA 
rayol-farm2_2019-05-07_23-57-07.wav,44100,16,60,1,bioacoustic_index,512,2000,8000,1.28686907355497,NA 
rayol-farm2_2019-05-07_23-59-07.wav,44100,16,60,1,bioacoustic_index,512,2000,8000,1.32877569391292,NA
