FILENAME,SAMPLINGRATE,BIT,DURATION,CHANNELS,INDEX,FFT_W,ANTHRO_MIN,ANTHRO_MAX,BIO_MIN,BIO_MAX,LEFT_CHANNEL,RIGHT_CHANNEL
rayol-farm2_2019-05-08_00-01-07.wav,44100,16,60,1,ndsi,1024,1000,2000,2000,11000,0.913935967907035,NA 
rayol-farm2_2019-05-08_00-03-08.wav,44100,16,60,1,ndsi,1024,1000,2000,2000,11000,0.916040670731407,NA 
rayol-farm2_2019-05-08_00-05-08.wav,44100,16,60,1,ndsi,1024,1000,2000,2000,11000,0.915410939386212,NA 
rayol-farm2_2019-05-08_00-07-08.wav,44100,16,60,1,ndsi,1024,1000,2000,2000,11000,0.915338988089395,NA 
rayol-farm2_2019-05-08_00-09-08.wav,44100,16,60,1,ndsi,1024,1000,2000,2000,11000,0.916083276944264,NA 
rayol-farm2_2019-05-08_00-11-08.wav,44100,16,60,1,ndsi,1024,1000,2000,2000,11000,0.907735930534879,NA 
rayol-farm2_2019-05-08_00-13-08.wav,44100,16,60,1,ndsi,1024,1000,2000,2000,11000,0.915709336585243,NA 
rayol-farm2_2019-05-08_00-15-08.wav,44100,16,60,1,ndsi,1024,1000,2000,2000,11000,0.915443677752983,NA 
rayol-farm2_2019-05-08_00-17-08.wav,44100,16,60,1,ndsi,1024,1000,2000,2000,11000,0.915347181243248,NA 
rayol-farm2_2019-05-08_00-19-09.wav,44100,16,60,1,ndsi,1024,1000,2000,2000,11000,0.914556854169518,NA 
rayol-farm2_2019-05-08_00-21-09.wav,44100,16,60,1,ndsi,1024,1000,2000,2000,11000,0.916176769441156,NA 
rayol-farm2_2019-05-08_00-23-09.wav,44100,16,60,1,ndsi,1024,1000,2000,2000,11000,0.917888673128725,NA 
rayol-farm2_2019-05-08_00-25-09.wav,44100,16,60,1,ndsi,1024,1000,2000,2000,11000,0.916738185264571,NA 
rayol-farm2_2019-05-08_00-27-09.wav,44100,16,60,1,ndsi,1024,1000,2000,2000,11000,0.915792737594383,NA 
rayol-farm2_2019-05-08_00-29-09.wav,44100,16,60,1,ndsi,1024,1000,2000,2000,11000,0.916381361577709,NA 
rayol-farm2_2019-05-08_00-31-09.wav,44100,16,60,1,ndsi,1024,1000,2000,2000,11000,0.91591308970296,NA 
rayol-farm2_2019-05-08_00-33-09.wav,44100,16,60,1,ndsi,1024,1000,2000,2000,11000,0.915549465129615,NA 
rayol-farm2_2019-05-08_00-35-10.wav,44100,16,60,1,ndsi,1024,1000,2000,2000,11000,0.915860006902087,NA 
rayol-farm2_2019-05-08_00-37-10.wav,44100,16,60,1,ndsi,1024,1000,2000,2000,11000,0.91450698841134,NA 
rayol-farm2_2019-05-08_00-39-10.wav,44100,16,60,1,ndsi,1024,1000,2000,2000,11000,0.915675969873445,NA 
rayol-farm2_2019-05-08_00-41-10.wav,44100,16,60,1,ndsi,1024,1000,2000,2000,11000,0.914049928555344,NA 
rayol-farm2_2019-05-08_00-43-10.wav,44100,16,60,1,ndsi,1024,1000,2000,2000,11000,0.915721736699525,NA 
rayol-farm2_2019-05-08_00-45-10.wav,44100,16,60,1,ndsi,1024,1000,2000,2000,11000,0.91516805258651,NA 
rayol-farm2_2019-05-08_00-47-10.wav,44100,16,60,1,ndsi,1024,1000,2000,2000,11000,0.916108946676219,NA 
rayol-farm2_2019-05-08_00-49-10.wav,44100,16,60,1,ndsi,1024,1000,2000,2000,11000,0.914869151204886,NA 
rayol-farm2_2019-05-08_00-51-10.wav,44100,16,60,1,ndsi,1024,1000,2000,2000,11000,0.916001311967378,NA 
rayol-farm2_2019-05-08_00-53-11.wav,44100,16,60,1,ndsi,1024,1000,2000,2000,11000,0.916237365507418,NA 
rayol-farm2_2019-05-08_00-55-11.wav,44100,16,60,1,ndsi,1024,1000,2000,2000,11000,0.915702212811522,NA 
rayol-farm2_2019-05-08_00-57-11.wav,44100,16,60,1,ndsi,1024,1000,2000,2000,11000,0.916181449697875,NA 
rayol-farm2_2019-05-08_00-59-11.wav,44100,16,60,1,ndsi,1024,1000,2000,2000,11000,0.915853756416005,NA 
rayol-farm2_2019-05-08_01-01-11.wav,44100,16,60,1,ndsi,1024,1000,2000,2000,11000,0.915484722536337,NA 
rayol-farm2_2019-05-08_01-03-11.wav,44100,16,60,1,ndsi,1024,1000,2000,2000,11000,0.916160001049177,NA 
rayol-farm2_2019-05-08_01-05-11.wav,44100,16,60,1,ndsi,1024,1000,2000,2000,11000,0.915516986961434,NA 
rayol-farm2_2019-05-08_01-07-11.wav,44100,16,60,1,ndsi,1024,1000,2000,2000,11000,0.914814708794977,NA 
rayol-farm2_2019-05-08_01-09-12.wav,44100,16,60,1,ndsi,1024,1000,2000,2000,11000,0.912928955347498,NA 
rayol-farm2_2019-05-08_01-11-12.wav,44100,16,60,1,ndsi,1024,1000,2000,2000,11000,0.918216740839978,NA 
rayol-farm2_2019-05-08_01-13-12.wav,44100,16,60,1,ndsi,1024,1000,2000,2000,11000,0.915960425185389,NA 
rayol-farm2_2019-05-08_01-15-12.wav,44100,16,60,1,ndsi,1024,1000,2000,2000,11000,0.915922242101213,NA 
rayol-farm2_2019-05-08_01-17-12.wav,44100,16,60,1,ndsi,1024,1000,2000,2000,11000,0.915611773604241,NA 
rayol-farm2_2019-05-08_01-19-12.wav,44100,16,60,1,ndsi,1024,1000,2000,2000,11000,0.916493252138245,NA 
rayol-farm2_2019-05-08_01-21-12.wav,44100,16,60,1,ndsi,1024,1000,2000,2000,11000,0.916478588916372,NA 
rayol-farm2_2019-05-08_01-23-12.wav,44100,16,60,1,ndsi,1024,1000,2000,2000,11000,0.916544573385025,NA 
rayol-farm2_2019-05-08_01-25-13.wav,44100,16,60,1,ndsi,1024,1000,2000,2000,11000,0.915348669583355,NA 
rayol-farm2_2019-05-08_01-27-13.wav,44100,16,60,1,ndsi,1024,1000,2000,2000,11000,0.915339039178338,NA 
rayol-farm2_2019-05-08_01-29-13.wav,44100,16,60,1,ndsi,1024,1000,2000,2000,11000,0.915272909177802,NA 
rayol-farm2_2019-05-08_01-31-13.wav,44100,16,60,1,ndsi,1024,1000,2000,2000,11000,0.916040564132904,NA 
rayol-farm2_2019-05-08_01-33-13.wav,44100,16,60,1,ndsi,1024,1000,2000,2000,11000,0.915747674287302,NA 
rayol-farm2_2019-05-08_01-35-13.wav,44100,16,60,1,ndsi,1024,1000,2000,2000,11000,0.915186630906017,NA 
rayol-farm2_2019-05-08_01-37-13.wav,44100,16,60,1,ndsi,1024,1000,2000,2000,11000,0.914521305903268,NA 
rayol-farm2_2019-05-08_01-39-13.wav,44100,16,60,1,ndsi,1024,1000,2000,2000,11000,0.913688505733736,NA 
rayol-farm2_2019-05-08_01-41-14.wav,44100,16,60,1,ndsi,1024,1000,2000,2000,11000,0.915559931676342,NA 
rayol-farm2_2019-05-08_01-43-14.wav,44100,16,60,1,ndsi,1024,1000,2000,2000,11000,0.915048569907727,NA 
rayol-farm2_2019-05-08_01-45-14.wav,44100,16,60,1,ndsi,1024,1000,2000,2000,11000,0.916143890041459,NA 
rayol-farm2_2019-05-08_01-47-14.wav,44100,16,60,1,ndsi,1024,1000,2000,2000,11000,0.915985163515059,NA 
rayol-farm2_2019-05-08_01-49-14.wav,44100,16,60,1,ndsi,1024,1000,2000,2000,11000,0.915809580078583,NA 
rayol-farm2_2019-05-08_01-51-14.wav,44100,16,60,1,ndsi,1024,1000,2000,2000,11000,0.915758657955181,NA 
rayol-farm2_2019-05-08_01-53-14.wav,44100,16,60,1,ndsi,1024,1000,2000,2000,11000,0.943653237358062,NA 
rayol-farm2_2019-05-08_01-55-14.wav,44100,16,60,1,ndsi,1024,1000,2000,2000,11000,0.945073254345753,NA 
rayol-farm2_2019-05-08_01-57-14.wav,44100,16,60,1,ndsi,1024,1000,2000,2000,11000,0.946116868558073,NA 
rayol-farm2_2019-05-08_01-59-15.wav,44100,16,60,1,ndsi,1024,1000,2000,2000,11000,0.945933097274158,NA 
rayol-farm2_2019-05-08_02-01-15.wav,44100,16,60,1,ndsi,1024,1000,2000,2000,11000,0.945963165216295,NA 
rayol-farm2_2019-05-08_02-03-15.wav,44100,16,60,1,ndsi,1024,1000,2000,2000,11000,0.946226927049345,NA 
rayol-farm2_2019-05-08_02-05-15.wav,44100,16,60,1,ndsi,1024,1000,2000,2000,11000,0.945692390762119,NA 
rayol-farm2_2019-05-08_02-07-15.wav,44100,16,60,1,ndsi,1024,1000,2000,2000,11000,0.945257467240713,NA 
rayol-farm2_2019-05-08_02-09-15.wav,44100,16,60,1,ndsi,1024,1000,2000,2000,11000,0.945288870694367,NA 
rayol-farm2_2019-05-08_02-11-15.wav,44100,16,60,1,ndsi,1024,1000,2000,2000,11000,0.945856538577907,NA 
rayol-farm2_2019-05-08_02-13-15.wav,44100,16,60,1,ndsi,1024,1000,2000,2000,11000,0.945428104279998,NA 
rayol-farm2_2019-05-08_02-15-16.wav,44100,16,60,1,ndsi,1024,1000,2000,2000,11000,0.944774608139242,NA 
rayol-farm2_2019-05-08_02-17-16.wav,44100,16,60,1,ndsi,1024,1000,2000,2000,11000,0.945154108192563,NA 
rayol-farm2_2019-05-08_02-19-16.wav,44100,16,60,1,ndsi,1024,1000,2000,2000,11000,0.944861811746546,NA 
rayol-farm2_2019-05-08_02-21-16.wav,44100,16,60,1,ndsi,1024,1000,2000,2000,11000,0.94456382791773,NA 
rayol-farm2_2019-05-08_02-23-16.wav,44100,16,60,1,ndsi,1024,1000,2000,2000,11000,0.944770020156772,NA 
rayol-farm2_2019-05-08_02-25-16.wav,44100,16,60,1,ndsi,1024,1000,2000,2000,11000,0.944889093990064,NA 
rayol-farm2_2019-05-08_02-27-16.wav,44100,16,60,1,ndsi,1024,1000,2000,2000,11000,0.945041607559646,NA 
rayol-farm2_2019-05-08_02-29-16.wav,44100,16,60,1,ndsi,1024,1000,2000,2000,11000,0.945042680941369,NA 
rayol-farm2_2019-05-08_02-31-17.wav,44100,16,60,1,ndsi,1024,1000,2000,2000,11000,0.944254886304538,NA 
rayol-farm2_2019-05-08_02-33-17.wav,44100,16,60,1,ndsi,1024,1000,2000,2000,11000,0.945534505076734,NA 
rayol-farm2_2019-05-08_02-35-17.wav,44100,16,60,1,ndsi,1024,1000,2000,2000,11000,0.944824490405038,NA 
rayol-farm2_2019-05-08_02-37-17.wav,44100,16,60,1,ndsi,1024,1000,2000,2000,11000,0.945109131003819,NA 
rayol-farm2_2019-05-08_02-39-17.wav,44100,16,60,1,ndsi,1024,1000,2000,2000,11000,0.941874526665962,NA 
rayol-farm2_2019-05-08_02-41-17.wav,44100,16,60,1,ndsi,1024,1000,2000,2000,11000,0.937741788190905,NA 
rayol-farm2_2019-05-08_02-43-17.wav,44100,16,60,1,ndsi,1024,1000,2000,2000,11000,0.931991147986833,NA 
rayol-farm2_2019-05-08_02-45-17.wav,44100,16,60,1,ndsi,1024,1000,2000,2000,11000,0.922687049235129,NA 
rayol-farm2_2019-05-08_02-47-18.wav,44100,16,60,1,ndsi,1024,1000,2000,2000,11000,0.928189799630795,NA 
rayol-farm2_2019-05-08_02-49-18.wav,44100,16,60,1,ndsi,1024,1000,2000,2000,11000,0.939442692089422,NA 
rayol-farm2_2019-05-08_02-51-18.wav,44100,16,60,1,ndsi,1024,1000,2000,2000,11000,0.940964205015607,NA 
rayol-farm2_2019-05-08_02-53-18.wav,44100,16,60,1,ndsi,1024,1000,2000,2000,11000,0.938050701053331,NA 
rayol-farm2_2019-05-08_02-55-18.wav,44100,16,60,1,ndsi,1024,1000,2000,2000,11000,0.915381282701225,NA 
rayol-farm2_2019-05-08_02-57-18.wav,44100,16,60,1,ndsi,1024,1000,2000,2000,11000,0.913234850384555,NA 
rayol-farm2_2019-05-08_02-59-18.wav,44100,16,60,1,ndsi,1024,1000,2000,2000,11000,0.915433014597533,NA 
rayol-farm2_2019-05-08_03-01-18.wav,44100,16,60,1,ndsi,1024,1000,2000,2000,11000,0.915280295829759,NA 
rayol-farm2_2019-05-08_03-03-19.wav,44100,16,60,1,ndsi,1024,1000,2000,2000,11000,0.91460059764903,NA 
rayol-farm2_2019-05-08_03-05-19.wav,44100,16,60,1,ndsi,1024,1000,2000,2000,11000,0.915959263168058,NA 
rayol-farm2_2019-05-08_03-07-19.wav,44100,16,60,1,ndsi,1024,1000,2000,2000,11000,0.916569625402137,NA 
rayol-farm2_2019-05-08_03-09-19.wav,44100,16,60,1,ndsi,1024,1000,2000,2000,11000,0.914733351381819,NA 
rayol-farm2_2019-05-08_03-11-19.wav,44100,16,60,1,ndsi,1024,1000,2000,2000,11000,0.915125800904725,NA 
rayol-farm2_2019-05-08_03-13-19.wav,44100,16,60,1,ndsi,1024,1000,2000,2000,11000,0.914885988098764,NA 
rayol-farm2_2019-05-08_03-15-19.wav,44100,16,60,1,ndsi,1024,1000,2000,2000,11000,0.921016659502668,NA 
rayol-farm2_2019-05-08_03-17-19.wav,44100,16,60,1,ndsi,1024,1000,2000,2000,11000,0.927038836803645,NA 
rayol-farm2_2019-05-08_03-19-20.wav,44100,16,60,1,ndsi,1024,1000,2000,2000,11000,0.913872566229942,NA 
rayol-farm2_2019-05-08_03-21-20.wav,44100,16,60,1,ndsi,1024,1000,2000,2000,11000,0.915289223290429,NA 
rayol-farm2_2019-05-08_03-23-20.wav,44100,16,60,1,ndsi,1024,1000,2000,2000,11000,0.913810358254154,NA 
rayol-farm2_2019-05-08_03-25-20.wav,44100,16,60,1,ndsi,1024,1000,2000,2000,11000,0.915645750867432,NA 
rayol-farm2_2019-05-08_03-27-20.wav,44100,16,60,1,ndsi,1024,1000,2000,2000,11000,0.915045527398655,NA 
rayol-farm2_2019-05-08_03-29-20.wav,44100,16,60,1,ndsi,1024,1000,2000,2000,11000,0.914107543561603,NA 
rayol-farm2_2019-05-08_03-31-20.wav,44100,16,60,1,ndsi,1024,1000,2000,2000,11000,0.913898761995674,NA 
rayol-farm2_2019-05-08_03-33-20.wav,44100,16,60,1,ndsi,1024,1000,2000,2000,11000,0.915373698663051,NA 
rayol-farm2_2019-05-08_03-35-20.wav,44100,16,60,1,ndsi,1024,1000,2000,2000,11000,0.913607782382508,NA 
rayol-farm2_2019-05-08_03-37-21.wav,44100,16,60,1,ndsi,1024,1000,2000,2000,11000,0.915580090008197,NA 
rayol-farm2_2019-05-08_03-39-21.wav,44100,16,60,1,ndsi,1024,1000,2000,2000,11000,0.914960635795561,NA 
rayol-farm2_2019-05-08_03-41-21.wav,44100,16,60,1,ndsi,1024,1000,2000,2000,11000,0.914767499792185,NA 
rayol-farm2_2019-05-08_03-43-21.wav,44100,16,60,1,ndsi,1024,1000,2000,2000,11000,0.913405661222843,NA 
rayol-farm2_2019-05-08_03-45-21.wav,44100,16,60,1,ndsi,1024,1000,2000,2000,11000,0.915064771773722,NA 
rayol-farm2_2019-05-08_03-47-21.wav,44100,16,60,1,ndsi,1024,1000,2000,2000,11000,0.915151602011108,NA 
rayol-farm2_2019-05-08_03-49-21.wav,44100,16,60,1,ndsi,1024,1000,2000,2000,11000,0.914936847477277,NA 
rayol-farm2_2019-05-08_03-51-21.wav,44100,16,60,1,ndsi,1024,1000,2000,2000,11000,0.915176305394885,NA 
rayol-farm2_2019-05-08_03-53-22.wav,44100,16,60,1,ndsi,1024,1000,2000,2000,11000,0.916384085678704,NA 
rayol-farm2_2019-05-08_03-55-22.wav,44100,16,60,1,ndsi,1024,1000,2000,2000,11000,0.911439696281406,NA 
rayol-farm2_2019-05-08_03-57-22.wav,44100,16,60,1,ndsi,1024,1000,2000,2000,11000,0.912549905215277,NA 
rayol-farm2_2019-05-08_03-59-22.wav,44100,16,60,1,ndsi,1024,1000,2000,2000,11000,0.913654425987961,NA 
rayol-farm2_2019-05-08_04-01-22.wav,44100,16,60,1,ndsi,1024,1000,2000,2000,11000,0.914309713848937,NA 
rayol-farm2_2019-05-08_04-03-22.wav,44100,16,60,1,ndsi,1024,1000,2000,2000,11000,0.914410607482403,NA 
rayol-farm2_2019-05-08_04-05-22.wav,44100,16,60,1,ndsi,1024,1000,2000,2000,11000,0.915233569137867,NA 
rayol-farm2_2019-05-08_04-07-22.wav,44100,16,60,1,ndsi,1024,1000,2000,2000,11000,0.915363094703555,NA 
rayol-farm2_2019-05-08_04-09-23.wav,44100,16,60,1,ndsi,1024,1000,2000,2000,11000,0.910931458641257,NA 
rayol-farm2_2019-05-08_04-11-23.wav,44100,16,60,1,ndsi,1024,1000,2000,2000,11000,0.915466578714251,NA 
rayol-farm2_2019-05-08_04-13-23.wav,44100,16,60,1,ndsi,1024,1000,2000,2000,11000,0.914746487765145,NA 
rayol-farm2_2019-05-08_04-15-23.wav,44100,16,60,1,ndsi,1024,1000,2000,2000,11000,0.914351058458399,NA 
rayol-farm2_2019-05-08_04-17-23.wav,44100,16,60,1,ndsi,1024,1000,2000,2000,11000,0.913984383051737,NA 
rayol-farm2_2019-05-08_04-19-23.wav,44100,16,60,1,ndsi,1024,1000,2000,2000,11000,0.914931851947793,NA 
rayol-farm2_2019-05-08_04-21-23.wav,44100,16,60,1,ndsi,1024,1000,2000,2000,11000,0.915493753763388,NA 
rayol-farm2_2019-05-08_04-23-23.wav,44100,16,60,1,ndsi,1024,1000,2000,2000,11000,0.913973213136643,NA 
rayol-farm2_2019-05-08_04-25-24.wav,44100,16,60,1,ndsi,1024,1000,2000,2000,11000,0.916565226811426,NA 
rayol-farm2_2019-05-08_04-27-24.wav,44100,16,60,1,ndsi,1024,1000,2000,2000,11000,0.354465403225246,NA 
rayol-farm2_2019-05-08_04-29-24.wav,44100,16,60,1,ndsi,1024,1000,2000,2000,11000,0.30875192359195,NA 
rayol-farm2_2019-05-08_04-31-24.wav,44100,16,60,1,ndsi,1024,1000,2000,2000,11000,0.914606022346935,NA 
rayol-farm2_2019-05-08_04-33-24.wav,44100,16,60,1,ndsi,1024,1000,2000,2000,11000,0.914355618391886,NA 
rayol-farm2_2019-05-08_04-35-24.wav,44100,16,60,1,ndsi,1024,1000,2000,2000,11000,0.907658580788037,NA 
rayol-farm2_2019-05-08_04-37-24.wav,44100,16,60,1,ndsi,1024,1000,2000,2000,11000,0.916282426937303,NA 
rayol-farm2_2019-05-08_04-39-24.wav,44100,16,60,1,ndsi,1024,1000,2000,2000,11000,0.914405386238093,NA 
rayol-farm2_2019-05-08_04-41-25.wav,44100,16,60,1,ndsi,1024,1000,2000,2000,11000,0.917298185606852,NA 
rayol-farm2_2019-05-08_04-43-25.wav,44100,16,60,1,ndsi,1024,1000,2000,2000,11000,0.913069550913241,NA 
rayol-farm2_2019-05-08_04-45-25.wav,44100,16,60,1,ndsi,1024,1000,2000,2000,11000,0.911423912853028,NA 
rayol-farm2_2019-05-08_04-47-25.wav,44100,16,60,1,ndsi,1024,1000,2000,2000,11000,0.909899458452619,NA 
rayol-farm2_2019-05-08_04-49-25.wav,44100,16,60,1,ndsi,1024,1000,2000,2000,11000,0.91280884082866,NA 
rayol-farm2_2019-05-08_04-51-25.wav,44100,16,60,1,ndsi,1024,1000,2000,2000,11000,0.910607647007513,NA 
rayol-farm2_2019-05-08_04-53-25.wav,44100,16,60,1,ndsi,1024,1000,2000,2000,11000,0.914027154219402,NA 
rayol-farm2_2019-05-08_04-55-25.wav,44100,16,60,1,ndsi,1024,1000,2000,2000,11000,0.913028106849751,NA 
rayol-farm2_2019-05-08_04-57-26.wav,44100,16,60,1,ndsi,1024,1000,2000,2000,11000,0.914816675407189,NA 
rayol-farm2_2019-05-08_04-59-26.wav,44100,16,60,1,ndsi,1024,1000,2000,2000,11000,0.91180730345557,NA 
rayol-farm2_2019-05-08_05-01-26.wav,44100,16,60,1,ndsi,1024,1000,2000,2000,11000,0.914033261849831,NA 
rayol-farm2_2019-05-08_05-03-26.wav,44100,16,60,1,ndsi,1024,1000,2000,2000,11000,0.910965155630845,NA 
rayol-farm2_2019-05-08_05-05-26.wav,44100,16,60,1,ndsi,1024,1000,2000,2000,11000,0.911660901013966,NA 
rayol-farm2_2019-05-08_05-07-26.wav,44100,16,60,1,ndsi,1024,1000,2000,2000,11000,0.911142256881548,NA 
rayol-farm2_2019-05-08_05-09-26.wav,44100,16,60,1,ndsi,1024,1000,2000,2000,11000,0.915435806845288,NA 
rayol-farm2_2019-05-08_05-11-26.wav,44100,16,60,1,ndsi,1024,1000,2000,2000,11000,0.906519812014261,NA 
rayol-farm2_2019-05-08_05-13-26.wav,44100,16,60,1,ndsi,1024,1000,2000,2000,11000,0.943789249542904,NA 
rayol-farm2_2019-05-08_05-15-27.wav,44100,16,60,1,ndsi,1024,1000,2000,2000,11000,0.939768189597438,NA 
rayol-farm2_2019-05-08_05-17-27.wav,44100,16,60,1,ndsi,1024,1000,2000,2000,11000,0.944635651704517,NA 
rayol-farm2_2019-05-08_05-19-27.wav,44100,16,60,1,ndsi,1024,1000,2000,2000,11000,0.940409421896662,NA 
rayol-farm2_2019-05-08_05-21-27.wav,44100,16,60,1,ndsi,1024,1000,2000,2000,11000,0.943421190359664,NA 
rayol-farm2_2019-05-08_05-23-27.wav,44100,16,60,1,ndsi,1024,1000,2000,2000,11000,0.674346900734741,NA 
rayol-farm2_2019-05-08_05-25-27.wav,44100,16,60,1,ndsi,1024,1000,2000,2000,11000,0.941461199652257,NA 
rayol-farm2_2019-05-08_05-27-27.wav,44100,16,60,1,ndsi,1024,1000,2000,2000,11000,0.943685578649235,NA 
rayol-farm2_2019-05-08_05-29-27.wav,44100,16,60,1,ndsi,1024,1000,2000,2000,11000,0.941613468617087,NA 
rayol-farm2_2019-05-08_05-31-28.wav,44100,16,60,1,ndsi,1024,1000,2000,2000,11000,0.942949223467935,NA 
rayol-farm2_2019-05-08_05-33-28.wav,44100,16,60,1,ndsi,1024,1000,2000,2000,11000,0.944911445388379,NA 
rayol-farm2_2019-05-08_05-35-28.wav,44100,16,60,1,ndsi,1024,1000,2000,2000,11000,0.940775324032032,NA 
rayol-farm2_2019-05-08_05-37-28.wav,44100,16,60,1,ndsi,1024,1000,2000,2000,11000,0.942382970997713,NA 
rayol-farm2_2019-05-08_05-39-28.wav,44100,16,60,1,ndsi,1024,1000,2000,2000,11000,0.942951838434058,NA 
rayol-farm2_2019-05-08_05-41-28.wav,44100,16,60,1,ndsi,1024,1000,2000,2000,11000,0.943070253886371,NA 
rayol-farm2_2019-05-08_05-43-28.wav,44100,16,60,1,ndsi,1024,1000,2000,2000,11000,0.943204650624414,NA 
rayol-farm2_2019-05-08_05-45-28.wav,44100,16,60,1,ndsi,1024,1000,2000,2000,11000,0.938893505480133,NA 
rayol-farm2_2019-05-08_05-47-29.wav,44100,16,60,1,ndsi,1024,1000,2000,2000,11000,0.946785224257754,NA 
rayol-farm2_2019-05-08_05-49-29.wav,44100,16,60,1,ndsi,1024,1000,2000,2000,11000,0.955895814648652,NA 
rayol-farm2_2019-05-08_05-51-29.wav,44100,16,60,1,ndsi,1024,1000,2000,2000,11000,0.955968675306884,NA 
rayol-farm2_2019-05-08_05-53-29.wav,44100,16,60,1,ndsi,1024,1000,2000,2000,11000,0.927806327316086,NA 
rayol-farm2_2019-05-08_05-55-29.wav,44100,16,60,1,ndsi,1024,1000,2000,2000,11000,0.925034236706874,NA 
rayol-farm2_2019-05-08_05-57-29.wav,44100,16,60,1,ndsi,1024,1000,2000,2000,11000,0.96174978362696,NA 
rayol-farm2_2019-05-08_05-59-29.wav,44100,16,60,1,ndsi,1024,1000,2000,2000,11000,0.945417584213276,NA 
rayol-farm2_2019-05-08_06-01-29.wav,44100,16,60,1,ndsi,1024,1000,2000,2000,11000,0.928896021295329,NA 
rayol-farm2_2019-05-08_06-03-30.wav,44100,16,60,1,ndsi,1024,1000,2000,2000,11000,0.945673894542197,NA 
rayol-farm2_2019-05-08_06-05-30.wav,44100,16,60,1,ndsi,1024,1000,2000,2000,11000,0.864333470638536,NA 
rayol-farm2_2019-05-08_06-07-30.wav,44100,16,60,1,ndsi,1024,1000,2000,2000,11000,0.8959100390312,NA 
rayol-farm2_2019-05-08_06-09-30.wav,44100,16,60,1,ndsi,1024,1000,2000,2000,11000,0.912882363822888,NA 
rayol-farm2_2019-05-08_06-11-30.wav,44100,16,60,1,ndsi,1024,1000,2000,2000,11000,0.918074114164541,NA 
rayol-farm2_2019-05-08_06-13-30.wav,44100,16,60,1,ndsi,1024,1000,2000,2000,11000,0.923591955814211,NA 
rayol-farm2_2019-05-08_06-15-30.wav,44100,16,60,1,ndsi,1024,1000,2000,2000,11000,0.927583691988246,NA 
rayol-farm2_2019-05-08_06-17-30.wav,44100,16,60,1,ndsi,1024,1000,2000,2000,11000,0.925937947396124,NA 
rayol-farm2_2019-05-08_06-19-30.wav,44100,16,60,1,ndsi,1024,1000,2000,2000,11000,0.92687015263673,NA 
rayol-farm2_2019-05-08_06-21-31.wav,44100,16,60,1,ndsi,1024,1000,2000,2000,11000,0.922966864018297,NA 
rayol-farm2_2019-05-08_06-23-31.wav,44100,16,60,1,ndsi,1024,1000,2000,2000,11000,0.924379403238729,NA 
rayol-farm2_2019-05-08_06-25-31.wav,44100,16,60,1,ndsi,1024,1000,2000,2000,11000,0.924205445453366,NA 
rayol-farm2_2019-05-08_06-27-31.wav,44100,16,60,1,ndsi,1024,1000,2000,2000,11000,0.911713595430086,NA 
rayol-farm2_2019-05-08_06-29-31.wav,44100,16,60,1,ndsi,1024,1000,2000,2000,11000,0.916564885722157,NA 
rayol-farm2_2019-05-08_06-31-31.wav,44100,16,60,1,ndsi,1024,1000,2000,2000,11000,0.923156138804248,NA 
rayol-farm2_2019-05-08_06-33-31.wav,44100,16,60,1,ndsi,1024,1000,2000,2000,11000,0.916631498569264,NA 
rayol-farm2_2019-05-08_06-35-31.wav,44100,16,60,1,ndsi,1024,1000,2000,2000,11000,0.919927353891349,NA 
rayol-farm2_2019-05-08_06-37-32.wav,44100,16,60,1,ndsi,1024,1000,2000,2000,11000,-0.107803103385779,NA 
rayol-farm2_2019-05-08_06-39-32.wav,44100,16,60,1,ndsi,1024,1000,2000,2000,11000,-0.265532079594374,NA 
rayol-farm2_2019-05-08_06-41-32.wav,44100,16,60,1,ndsi,1024,1000,2000,2000,11000,0.0779508886653456,NA 
rayol-farm2_2019-05-08_06-43-32.wav,44100,16,60,1,ndsi,1024,1000,2000,2000,11000,0.920081048092939,NA 
rayol-farm2_2019-05-08_06-45-32.wav,44100,16,60,1,ndsi,1024,1000,2000,2000,11000,0.917871397128098,NA 
rayol-farm2_2019-05-08_06-47-32.wav,44100,16,60,1,ndsi,1024,1000,2000,2000,11000,0.912944945663204,NA 
rayol-farm2_2019-05-08_06-49-32.wav,44100,16,60,1,ndsi,1024,1000,2000,2000,11000,0.91707546693154,NA 
rayol-farm2_2019-05-08_06-51-32.wav,44100,16,60,1,ndsi,1024,1000,2000,2000,11000,0.912317200223526,NA 
rayol-farm2_2019-05-08_06-53-33.wav,44100,16,60,1,ndsi,1024,1000,2000,2000,11000,0.916110667630699,NA 
rayol-farm2_2019-05-08_06-55-33.wav,44100,16,60,1,ndsi,1024,1000,2000,2000,11000,0.914753474484539,NA 
rayol-farm2_2019-05-08_06-57-33.wav,44100,16,60,1,ndsi,1024,1000,2000,2000,11000,0.916624779163574,NA 
rayol-farm2_2019-05-08_06-59-33.wav,44100,16,60,1,ndsi,1024,1000,2000,2000,11000,0.915456579335712,NA 
rayol-farm2_2019-05-08_07-01-33.wav,44100,16,60,1,ndsi,1024,1000,2000,2000,11000,0.916883367029315,NA 
rayol-farm2_2019-05-08_07-03-33.wav,44100,16,60,1,ndsi,1024,1000,2000,2000,11000,0.916351159999309,NA 
rayol-farm2_2019-05-08_07-05-33.wav,44100,16,60,1,ndsi,1024,1000,2000,2000,11000,0.915692262894034,NA 
rayol-farm2_2019-05-08_07-07-33.wav,44100,16,60,1,ndsi,1024,1000,2000,2000,11000,0.917514646239546,NA 
rayol-farm2_2019-05-08_07-09-34.wav,44100,16,60,1,ndsi,1024,1000,2000,2000,11000,0.91867815999338,NA 
rayol-farm2_2019-05-08_07-11-34.wav,44100,16,60,1,ndsi,1024,1000,2000,2000,11000,0.91700338020376,NA 
rayol-farm2_2019-05-08_07-13-34.wav,44100,16,60,1,ndsi,1024,1000,2000,2000,11000,0.91748783852408,NA 
rayol-farm2_2019-05-08_07-15-34.wav,44100,16,60,1,ndsi,1024,1000,2000,2000,11000,0.916396370001694,NA 
rayol-farm2_2019-05-08_07-17-34.wav,44100,16,60,1,ndsi,1024,1000,2000,2000,11000,0.915873714751002,NA 
rayol-farm2_2019-05-08_07-19-34.wav,44100,16,60,1,ndsi,1024,1000,2000,2000,11000,0.918206415503976,NA 
rayol-farm2_2019-05-08_07-21-34.wav,44100,16,60,1,ndsi,1024,1000,2000,2000,11000,-0.343210421477593,NA 
rayol-farm2_2019-05-08_07-23-34.wav,44100,16,60,1,ndsi,1024,1000,2000,2000,11000,0.173531869633627,NA 
rayol-farm2_2019-05-08_07-25-35.wav,44100,16,60,1,ndsi,1024,1000,2000,2000,11000,0.924237773431173,NA 
rayol-farm2_2019-05-08_07-27-35.wav,44100,16,60,1,ndsi,1024,1000,2000,2000,11000,0.872491291183731,NA 
rayol-farm2_2019-05-08_07-29-35.wav,44100,16,60,1,ndsi,1024,1000,2000,2000,11000,0.907123829234173,NA 
rayol-farm2_2019-05-08_07-31-35.wav,44100,16,60,1,ndsi,1024,1000,2000,2000,11000,0.909531659064498,NA 
rayol-farm2_2019-05-08_07-33-35.wav,44100,16,60,1,ndsi,1024,1000,2000,2000,11000,0.912131369200115,NA 
rayol-farm2_2019-05-08_07-35-35.wav,44100,16,60,1,ndsi,1024,1000,2000,2000,11000,0.8889279039157,NA 
rayol-farm2_2019-05-08_07-37-35.wav,44100,16,60,1,ndsi,1024,1000,2000,2000,11000,0.921962661440207,NA 
rayol-farm2_2019-05-08_07-39-35.wav,44100,16,60,1,ndsi,1024,1000,2000,2000,11000,0.889459130157642,NA 
rayol-farm2_2019-05-08_07-41-35.wav,44100,16,60,1,ndsi,1024,1000,2000,2000,11000,0.895993477726512,NA 
rayol-farm2_2019-05-08_07-43-36.wav,44100,16,60,1,ndsi,1024,1000,2000,2000,11000,0.896891202705818,NA 
rayol-farm2_2019-05-08_07-45-36.wav,44100,16,60,1,ndsi,1024,1000,2000,2000,11000,0.906610878693167,NA 
rayol-farm2_2019-05-08_07-47-36.wav,44100,16,60,1,ndsi,1024,1000,2000,2000,11000,0.9001602045091,NA 
rayol-farm2_2019-05-08_07-49-36.wav,44100,16,60,1,ndsi,1024,1000,2000,2000,11000,0.894129925695845,NA 
rayol-farm2_2019-05-08_07-51-36.wav,44100,16,60,1,ndsi,1024,1000,2000,2000,11000,0.898541048205144,NA 
rayol-farm2_2019-05-08_07-53-36.wav,44100,16,60,1,ndsi,1024,1000,2000,2000,11000,0.877319539729012,NA 
rayol-farm2_2019-05-08_07-55-36.wav,44100,16,60,1,ndsi,1024,1000,2000,2000,11000,0.407577480639439,NA 
rayol-farm2_2019-05-08_07-57-36.wav,44100,16,60,1,ndsi,1024,1000,2000,2000,11000,0.888379220114459,NA 
rayol-farm2_2019-05-08_07-59-37.wav,44100,16,60,1,ndsi,1024,1000,2000,2000,11000,0.867871479873946,NA 
rayol-farm2_2019-05-08_08-01-37.wav,44100,16,60,1,ndsi,1024,1000,2000,2000,11000,0.886719264687118,NA 
rayol-farm2_2019-05-08_08-03-37.wav,44100,16,60,1,ndsi,1024,1000,2000,2000,11000,0.905789850617637,NA 
rayol-farm2_2019-05-08_08-05-37.wav,44100,16,60,1,ndsi,1024,1000,2000,2000,11000,-0.122594091480986,NA 
rayol-farm2_2019-05-08_08-07-37.wav,44100,16,60,1,ndsi,1024,1000,2000,2000,11000,0.93592027360523,NA 
rayol-farm2_2019-05-08_08-09-37.wav,44100,16,60,1,ndsi,1024,1000,2000,2000,11000,0.93283642679741,NA 
rayol-farm2_2019-05-08_08-11-37.wav,44100,16,60,1,ndsi,1024,1000,2000,2000,11000,0.942416672274849,NA 
rayol-farm2_2019-05-08_08-13-37.wav,44100,16,60,1,ndsi,1024,1000,2000,2000,11000,0.934033796117753,NA 
rayol-farm2_2019-05-08_08-15-38.wav,44100,16,60,1,ndsi,1024,1000,2000,2000,11000,0.933159190782167,NA 
rayol-farm2_2019-05-08_08-17-38.wav,44100,16,60,1,ndsi,1024,1000,2000,2000,11000,0.929759488579303,NA 
rayol-farm2_2019-05-08_08-19-38.wav,44100,16,60,1,ndsi,1024,1000,2000,2000,11000,0.940010668660865,NA 
rayol-farm2_2019-05-08_08-21-38.wav,44100,16,60,1,ndsi,1024,1000,2000,2000,11000,0.928068968964862,NA 
rayol-farm2_2019-05-08_08-23-38.wav,44100,16,60,1,ndsi,1024,1000,2000,2000,11000,0.935338695760513,NA 
rayol-farm2_2019-05-08_08-25-38.wav,44100,16,60,1,ndsi,1024,1000,2000,2000,11000,0.927198405726901,NA 
rayol-farm2_2019-05-08_08-27-38.wav,44100,16,60,1,ndsi,1024,1000,2000,2000,11000,0.917541991332309,NA 
rayol-farm2_2019-05-08_08-29-38.wav,44100,16,60,1,ndsi,1024,1000,2000,2000,11000,0.930391442298661,NA 
rayol-farm2_2019-05-08_08-31-38.wav,44100,16,60,1,ndsi,1024,1000,2000,2000,11000,0.930454367289019,NA 
rayol-farm2_2019-05-08_08-33-39.wav,44100,16,60,1,ndsi,1024,1000,2000,2000,11000,0.908456944205268,NA 
rayol-farm2_2019-05-08_08-35-39.wav,44100,16,60,1,ndsi,1024,1000,2000,2000,11000,0.927229414341571,NA 
rayol-farm2_2019-05-08_08-37-39.wav,44100,16,60,1,ndsi,1024,1000,2000,2000,11000,0.922427326595229,NA 
rayol-farm2_2019-05-08_08-39-39.wav,44100,16,60,1,ndsi,1024,1000,2000,2000,11000,0.922906836626622,NA 
rayol-farm2_2019-05-08_08-41-39.wav,44100,16,60,1,ndsi,1024,1000,2000,2000,11000,0.928704674117438,NA 
rayol-farm2_2019-05-08_08-43-39.wav,44100,16,60,1,ndsi,1024,1000,2000,2000,11000,0.936612285067805,NA 
rayol-farm2_2019-05-08_08-45-39.wav,44100,16,60,1,ndsi,1024,1000,2000,2000,11000,0.933477486700274,NA 
rayol-farm2_2019-05-08_08-47-39.wav,44100,16,60,1,ndsi,1024,1000,2000,2000,11000,0.937186087093047,NA 
rayol-farm2_2019-05-08_08-49-40.wav,44100,16,60,1,ndsi,1024,1000,2000,2000,11000,0.933651503349815,NA 
rayol-farm2_2019-05-08_08-51-40.wav,44100,16,60,1,ndsi,1024,1000,2000,2000,11000,0.927509654477577,NA 
rayol-farm2_2019-05-08_08-53-40.wav,44100,16,60,1,ndsi,1024,1000,2000,2000,11000,0.936745368377791,NA 
rayol-farm2_2019-05-08_08-55-40.wav,44100,16,60,1,ndsi,1024,1000,2000,2000,11000,0.947207754555941,NA 
rayol-farm2_2019-05-08_08-57-40.wav,44100,16,60,1,ndsi,1024,1000,2000,2000,11000,0.938038539711371,NA 
rayol-farm2_2019-05-08_08-59-40.wav,44100,16,60,1,ndsi,1024,1000,2000,2000,11000,0.912175610426112,NA 
rayol-farm2_2019-05-08_09-01-40.wav,44100,16,60,1,ndsi,1024,1000,2000,2000,11000,0.898562442190353,NA 
rayol-farm2_2019-05-08_09-03-40.wav,44100,16,60,1,ndsi,1024,1000,2000,2000,11000,0.933147313165668,NA 
rayol-farm2_2019-05-08_09-05-41.wav,44100,16,60,1,ndsi,1024,1000,2000,2000,11000,0.9244911884347,NA 
rayol-farm2_2019-05-08_09-07-41.wav,44100,16,60,1,ndsi,1024,1000,2000,2000,11000,0.915210318218137,NA 
rayol-farm2_2019-05-08_09-09-41.wav,44100,16,60,1,ndsi,1024,1000,2000,2000,11000,0.940984957886813,NA 
rayol-farm2_2019-05-08_09-11-41.wav,44100,16,60,1,ndsi,1024,1000,2000,2000,11000,0.939228060740017,NA 
rayol-farm2_2019-05-08_09-13-41.wav,44100,16,60,1,ndsi,1024,1000,2000,2000,11000,0.932900774061856,NA 
rayol-farm2_2019-05-08_09-15-41.wav,44100,16,60,1,ndsi,1024,1000,2000,2000,11000,0.941794489780407,NA 
rayol-farm2_2019-05-08_09-17-41.wav,44100,16,60,1,ndsi,1024,1000,2000,2000,11000,0.850527665555423,NA 
rayol-farm2_2019-05-08_09-19-41.wav,44100,16,60,1,ndsi,1024,1000,2000,2000,11000,0.939141375986332,NA 
rayol-farm2_2019-05-08_09-21-41.wav,44100,16,60,1,ndsi,1024,1000,2000,2000,11000,0.923189911714573,NA 
rayol-farm2_2019-05-08_09-23-42.wav,44100,16,60,1,ndsi,1024,1000,2000,2000,11000,0.923431792086114,NA 
rayol-farm2_2019-05-08_09-25-42.wav,44100,16,60,1,ndsi,1024,1000,2000,2000,11000,0.938669151678748,NA 
rayol-farm2_2019-05-08_09-27-42.wav,44100,16,60,1,ndsi,1024,1000,2000,2000,11000,0.8519686405752,NA 
rayol-farm2_2019-05-08_09-29-42.wav,44100,16,60,1,ndsi,1024,1000,2000,2000,11000,0.934543708011435,NA 
rayol-farm2_2019-05-08_09-31-42.wav,44100,16,60,1,ndsi,1024,1000,2000,2000,11000,0.933070186520148,NA 
rayol-farm2_2019-05-08_09-33-42.wav,44100,16,60,1,ndsi,1024,1000,2000,2000,11000,0.931987498295129,NA 
rayol-farm2_2019-05-08_09-35-42.wav,44100,16,60,1,ndsi,1024,1000,2000,2000,11000,0.935467433670411,NA 
rayol-farm2_2019-05-08_09-37-42.wav,44100,16,60,1,ndsi,1024,1000,2000,2000,11000,0.928190625217141,NA 
rayol-farm2_2019-05-08_09-39-43.wav,44100,16,60,1,ndsi,1024,1000,2000,2000,11000,0.929567326817055,NA 
rayol-farm2_2019-05-08_09-41-43.wav,44100,16,60,1,ndsi,1024,1000,2000,2000,11000,0.935807968984739,NA 
rayol-farm2_2019-05-08_09-43-43.wav,44100,16,60,1,ndsi,1024,1000,2000,2000,11000,0.9373447985165,NA 
rayol-farm2_2019-05-08_09-45-43.wav,44100,16,60,1,ndsi,1024,1000,2000,2000,11000,0.939673595439415,NA 
rayol-farm2_2019-05-08_09-47-43.wav,44100,16,60,1,ndsi,1024,1000,2000,2000,11000,0.942589059611667,NA 
rayol-farm2_2019-05-08_09-49-43.wav,44100,16,60,1,ndsi,1024,1000,2000,2000,11000,0.936115185122221,NA 
rayol-farm2_2019-05-08_09-51-43.wav,44100,16,60,1,ndsi,1024,1000,2000,2000,11000,0.945157019514472,NA 
rayol-farm2_2019-05-08_09-53-43.wav,44100,16,60,1,ndsi,1024,1000,2000,2000,11000,0.932330253369785,NA 
rayol-farm2_2019-05-08_09-55-44.wav,44100,16,60,1,ndsi,1024,1000,2000,2000,11000,0.936718917934157,NA 
rayol-farm2_2019-05-08_09-57-44.wav,44100,16,60,1,ndsi,1024,1000,2000,2000,11000,0.900700484780261,NA 
rayol-farm2_2019-05-08_09-59-44.wav,44100,16,60,1,ndsi,1024,1000,2000,2000,11000,0.948285740508507,NA 
rayol-farm2_2019-05-08_10-01-44.wav,44100,16,60,1,ndsi,1024,1000,2000,2000,11000,0.91416342263941,NA 
rayol-farm2_2019-05-08_10-03-44.wav,44100,16,60,1,ndsi,1024,1000,2000,2000,11000,0.912084059455096,NA 
rayol-farm2_2019-05-08_10-05-44.wav,44100,16,60,1,ndsi,1024,1000,2000,2000,11000,0.942230566002011,NA 
rayol-farm2_2019-05-08_10-07-44.wav,44100,16,60,1,ndsi,1024,1000,2000,2000,11000,0.94206935387996,NA 
rayol-farm2_2019-05-08_10-09-44.wav,44100,16,60,1,ndsi,1024,1000,2000,2000,11000,0.922786870989844,NA 
rayol-farm2_2019-05-08_10-11-44.wav,44100,16,60,1,ndsi,1024,1000,2000,2000,11000,0.920279554921373,NA 
rayol-farm2_2019-05-08_10-13-45.wav,44100,16,60,1,ndsi,1024,1000,2000,2000,11000,0.925074480627702,NA 
rayol-farm2_2019-05-08_10-15-45.wav,44100,16,60,1,ndsi,1024,1000,2000,2000,11000,0.923495745972554,NA 
rayol-farm2_2019-05-08_10-17-45.wav,44100,16,60,1,ndsi,1024,1000,2000,2000,11000,0.895303744478387,NA 
rayol-farm2_2019-05-08_10-19-45.wav,44100,16,60,1,ndsi,1024,1000,2000,2000,11000,0.911475007281475,NA 
rayol-farm2_2019-05-08_10-21-45.wav,44100,16,60,1,ndsi,1024,1000,2000,2000,11000,0.90834340141402,NA 
rayol-farm2_2019-05-08_10-23-45.wav,44100,16,60,1,ndsi,1024,1000,2000,2000,11000,0.913553443482843,NA 
rayol-farm2_2019-05-08_10-25-45.wav,44100,16,60,1,ndsi,1024,1000,2000,2000,11000,0.888015270548717,NA 
rayol-farm2_2019-05-08_10-27-45.wav,44100,16,60,1,ndsi,1024,1000,2000,2000,11000,0.814517967521914,NA 
rayol-farm2_2019-05-08_10-29-46.wav,44100,16,60,1,ndsi,1024,1000,2000,2000,11000,0.641042834709321,NA 
rayol-farm2_2019-05-08_10-31-46.wav,44100,16,60,1,ndsi,1024,1000,2000,2000,11000,0.89418884948766,NA 
rayol-farm2_2019-05-08_10-33-46.wav,44100,16,60,1,ndsi,1024,1000,2000,2000,11000,0.820674028188485,NA 
rayol-farm2_2019-05-08_10-35-46.wav,44100,16,60,1,ndsi,1024,1000,2000,2000,11000,0.932362033873746,NA 
rayol-farm2_2019-05-08_10-37-46.wav,44100,16,60,1,ndsi,1024,1000,2000,2000,11000,0.919025236448544,NA 
rayol-farm2_2019-05-08_10-39-46.wav,44100,16,60,1,ndsi,1024,1000,2000,2000,11000,0.932811818490217,NA 
rayol-farm2_2019-05-08_10-41-46.wav,44100,16,60,1,ndsi,1024,1000,2000,2000,11000,0.929609721074997,NA 
rayol-farm2_2019-05-08_10-43-46.wav,44100,16,60,1,ndsi,1024,1000,2000,2000,11000,0.896523315009821,NA 
rayol-farm2_2019-05-08_10-45-47.wav,44100,16,60,1,ndsi,1024,1000,2000,2000,11000,0.848604057649069,NA 
rayol-farm2_2019-05-08_10-47-47.wav,44100,16,60,1,ndsi,1024,1000,2000,2000,11000,0.932643510883249,NA 
rayol-farm2_2019-05-08_10-49-47.wav,44100,16,60,1,ndsi,1024,1000,2000,2000,11000,0.899348554701177,NA 
rayol-farm2_2019-05-08_10-51-47.wav,44100,16,60,1,ndsi,1024,1000,2000,2000,11000,0.925252691751626,NA 
rayol-farm2_2019-05-08_10-53-47.wav,44100,16,60,1,ndsi,1024,1000,2000,2000,11000,0.91678557024788,NA 
rayol-farm2_2019-05-08_10-55-47.wav,44100,16,60,1,ndsi,1024,1000,2000,2000,11000,0.931103582522208,NA 
rayol-farm2_2019-05-08_10-57-47.wav,44100,16,60,1,ndsi,1024,1000,2000,2000,11000,0.927606246756452,NA 
rayol-farm2_2019-05-08_10-59-47.wav,44100,16,60,1,ndsi,1024,1000,2000,2000,11000,0.93218334477716,NA 
rayol-farm2_2019-05-08_11-01-47.wav,44100,16,60,1,ndsi,1024,1000,2000,2000,11000,0.88503609250629,NA 
rayol-farm2_2019-05-08_11-03-48.wav,44100,16,60,1,ndsi,1024,1000,2000,2000,11000,0.906420842908928,NA 
rayol-farm2_2019-05-08_11-05-48.wav,44100,16,60,1,ndsi,1024,1000,2000,2000,11000,0.872886888251769,NA 
rayol-farm2_2019-05-08_11-07-48.wav,44100,16,60,1,ndsi,1024,1000,2000,2000,11000,0.916346488300434,NA 
rayol-farm2_2019-05-08_11-09-48.wav,44100,16,60,1,ndsi,1024,1000,2000,2000,11000,0.877789902694741,NA 
rayol-farm2_2019-05-08_11-11-48.wav,44100,16,60,1,ndsi,1024,1000,2000,2000,11000,0.920626256650761,NA 
rayol-farm2_2019-05-08_11-13-48.wav,44100,16,60,1,ndsi,1024,1000,2000,2000,11000,0.91154636764993,NA 
rayol-farm2_2019-05-08_11-15-48.wav,44100,16,60,1,ndsi,1024,1000,2000,2000,11000,0.879648528336268,NA 
rayol-farm2_2019-05-08_11-17-48.wav,44100,16,60,1,ndsi,1024,1000,2000,2000,11000,0.937324902129788,NA 
rayol-farm2_2019-05-08_11-19-49.wav,44100,16,60,1,ndsi,1024,1000,2000,2000,11000,0.924771415287295,NA 
rayol-farm2_2019-05-08_11-21-49.wav,44100,16,60,1,ndsi,1024,1000,2000,2000,11000,0.798226414336798,NA 
rayol-farm2_2019-05-08_11-23-49.wav,44100,16,60,1,ndsi,1024,1000,2000,2000,11000,0.871710275682706,NA 
rayol-farm2_2019-05-08_11-25-49.wav,44100,16,60,1,ndsi,1024,1000,2000,2000,11000,0.90613356368694,NA 
rayol-farm2_2019-05-08_11-27-49.wav,44100,16,60,1,ndsi,1024,1000,2000,2000,11000,0.901467720518892,NA 
rayol-farm2_2019-05-08_11-29-49.wav,44100,16,60,1,ndsi,1024,1000,2000,2000,11000,0.82406242839706,NA 
rayol-farm2_2019-05-08_11-31-49.wav,44100,16,60,1,ndsi,1024,1000,2000,2000,11000,0.817236127771414,NA 
rayol-farm2_2019-05-08_11-33-49.wav,44100,16,60,1,ndsi,1024,1000,2000,2000,11000,0.896788393306132,NA 
rayol-farm2_2019-05-08_11-35-50.wav,44100,16,60,1,ndsi,1024,1000,2000,2000,11000,0.889336058638001,NA 
rayol-farm2_2019-05-08_11-37-50.wav,44100,16,60,1,ndsi,1024,1000,2000,2000,11000,0.791498169739517,NA 
rayol-farm2_2019-05-08_11-39-50.wav,44100,16,60,1,ndsi,1024,1000,2000,2000,11000,0.903744024897442,NA 
rayol-farm2_2019-05-08_11-41-50.wav,44100,16,60,1,ndsi,1024,1000,2000,2000,11000,0.835541003028223,NA 
rayol-farm2_2019-05-08_11-43-50.wav,44100,16,60,1,ndsi,1024,1000,2000,2000,11000,0.889514172230502,NA 
rayol-farm2_2019-05-08_11-45-50.wav,44100,16,60,1,ndsi,1024,1000,2000,2000,11000,0.854754469968889,NA 
rayol-farm2_2019-05-08_11-47-50.wav,44100,16,60,1,ndsi,1024,1000,2000,2000,11000,0.89620867923341,NA 
rayol-farm2_2019-05-08_11-49-50.wav,44100,16,60,1,ndsi,1024,1000,2000,2000,11000,0.825476850591325,NA 
rayol-farm2_2019-05-08_11-51-50.wav,44100,16,60,1,ndsi,1024,1000,2000,2000,11000,0.896633657964014,NA 
rayol-farm2_2019-05-08_11-53-51.wav,44100,16,60,1,ndsi,1024,1000,2000,2000,11000,0.894346385500802,NA 
rayol-farm2_2019-05-08_11-55-51.wav,44100,16,60,1,ndsi,1024,1000,2000,2000,11000,0.754111949756761,NA 
rayol-farm2_2019-05-08_11-57-51.wav,44100,16,60,1,ndsi,1024,1000,2000,2000,11000,0.878373805804382,NA 
rayol-farm2_2019-05-08_11-59-51.wav,44100,16,60,1,ndsi,1024,1000,2000,2000,11000,0.888596783499717,NA 
rayol-farm2_2019-05-08_12-01-51.wav,44100,16,60,1,ndsi,1024,1000,2000,2000,11000,0.894965141895403,NA 
rayol-farm2_2019-05-08_12-03-51.wav,44100,16,60,1,ndsi,1024,1000,2000,2000,11000,0.844495086065134,NA 
rayol-farm2_2019-05-08_12-05-51.wav,44100,16,60,1,ndsi,1024,1000,2000,2000,11000,0.383947623121136,NA 
rayol-farm2_2019-05-08_12-07-51.wav,44100,16,60,1,ndsi,1024,1000,2000,2000,11000,0.836830592751676,NA 
rayol-farm2_2019-05-08_12-09-52.wav,44100,16,60,1,ndsi,1024,1000,2000,2000,11000,0.699868552657774,NA 
rayol-farm2_2019-05-08_12-11-52.wav,44100,16,60,1,ndsi,1024,1000,2000,2000,11000,0.896050465792923,NA 
rayol-farm2_2019-05-08_12-13-52.wav,44100,16,60,1,ndsi,1024,1000,2000,2000,11000,0.79618138734139,NA 
rayol-farm2_2019-05-08_12-15-52.wav,44100,16,60,1,ndsi,1024,1000,2000,2000,11000,0.889875962623198,NA 
rayol-farm2_2019-05-08_12-17-52.wav,44100,16,60,1,ndsi,1024,1000,2000,2000,11000,0.822444130951214,NA 
rayol-farm2_2019-05-08_12-19-52.wav,44100,16,60,1,ndsi,1024,1000,2000,2000,11000,0.90541507906514,NA 
rayol-farm2_2019-05-08_12-21-52.wav,44100,16,60,1,ndsi,1024,1000,2000,2000,11000,0.791863597520077,NA 
rayol-farm2_2019-05-08_12-23-52.wav,44100,16,60,1,ndsi,1024,1000,2000,2000,11000,0.898211113750729,NA 
rayol-farm2_2019-05-08_12-25-53.wav,44100,16,60,1,ndsi,1024,1000,2000,2000,11000,0.879404160884262,NA 
rayol-farm2_2019-05-08_12-27-53.wav,44100,16,60,1,ndsi,1024,1000,2000,2000,11000,0.845843099848907,NA 
rayol-farm2_2019-05-08_12-29-53.wav,44100,16,60,1,ndsi,1024,1000,2000,2000,11000,0.868882389563484,NA 
rayol-farm2_2019-05-08_12-31-53.wav,44100,16,60,1,ndsi,1024,1000,2000,2000,11000,0.845562542815889,NA 
rayol-farm2_2019-05-08_12-33-53.wav,44100,16,60,1,ndsi,1024,1000,2000,2000,11000,0.830440467052097,NA 
rayol-farm2_2019-05-08_12-35-53.wav,44100,16,60,1,ndsi,1024,1000,2000,2000,11000,0.924092385719273,NA 
rayol-farm2_2019-05-08_12-37-53.wav,44100,16,60,1,ndsi,1024,1000,2000,2000,11000,0.910878127030994,NA 
rayol-farm2_2019-05-08_12-39-53.wav,44100,16,60,1,ndsi,1024,1000,2000,2000,11000,0.888807072184222,NA 
rayol-farm2_2019-05-08_12-41-53.wav,44100,16,60,1,ndsi,1024,1000,2000,2000,11000,0.898306002688195,NA 
rayol-farm2_2019-05-08_12-43-54.wav,44100,16,60,1,ndsi,1024,1000,2000,2000,11000,0.833526916213316,NA 
rayol-farm2_2019-05-08_12-45-54.wav,44100,16,60,1,ndsi,1024,1000,2000,2000,11000,0.920795359827359,NA 
rayol-farm2_2019-05-08_12-47-54.wav,44100,16,60,1,ndsi,1024,1000,2000,2000,11000,0.911584241747266,NA 
rayol-farm2_2019-05-08_12-49-54.wav,44100,16,60,1,ndsi,1024,1000,2000,2000,11000,0.90888249483219,NA 
rayol-farm2_2019-05-08_12-51-54.wav,44100,16,60,1,ndsi,1024,1000,2000,2000,11000,0.903833746349134,NA 
rayol-farm2_2019-05-08_12-53-54.wav,44100,16,60,1,ndsi,1024,1000,2000,2000,11000,0.926851060666967,NA 
rayol-farm2_2019-05-08_12-55-54.wav,44100,16,60,1,ndsi,1024,1000,2000,2000,11000,0.870335201730283,NA 
rayol-farm2_2019-05-08_12-57-54.wav,44100,16,60,1,ndsi,1024,1000,2000,2000,11000,0.879766844513856,NA 
rayol-farm2_2019-05-08_12-59-55.wav,44100,16,60,1,ndsi,1024,1000,2000,2000,11000,0.87351157791786,NA 
rayol-farm2_2019-05-08_13-01-55.wav,44100,16,60,1,ndsi,1024,1000,2000,2000,11000,0.868767739258016,NA 
rayol-farm2_2019-05-08_13-03-55.wav,44100,16,60,1,ndsi,1024,1000,2000,2000,11000,0.845032906112467,NA 
rayol-farm2_2019-05-08_13-05-55.wav,44100,16,60,1,ndsi,1024,1000,2000,2000,11000,0.657484824903285,NA 
rayol-farm2_2019-05-08_13-07-55.wav,44100,16,60,1,ndsi,1024,1000,2000,2000,11000,0.883622626456959,NA 
rayol-farm2_2019-05-08_13-09-55.wav,44100,16,60,1,ndsi,1024,1000,2000,2000,11000,0.581137116339432,NA 
rayol-farm2_2019-05-08_13-11-55.wav,44100,16,60,1,ndsi,1024,1000,2000,2000,11000,0.907698992143252,NA 
rayol-farm2_2019-05-08_13-13-55.wav,44100,16,60,1,ndsi,1024,1000,2000,2000,11000,0.813219396598078,NA 
rayol-farm2_2019-05-08_13-15-56.wav,44100,16,60,1,ndsi,1024,1000,2000,2000,11000,0.379797994044841,NA 
rayol-farm2_2019-05-08_13-17-56.wav,44100,16,60,1,ndsi,1024,1000,2000,2000,11000,0.898974363016164,NA 
rayol-farm2_2019-05-08_13-19-56.wav,44100,16,60,1,ndsi,1024,1000,2000,2000,11000,0.892833823549117,NA 
rayol-farm2_2019-05-08_13-21-56.wav,44100,16,60,1,ndsi,1024,1000,2000,2000,11000,0.711032310760109,NA 
rayol-farm2_2019-05-08_13-23-56.wav,44100,16,60,1,ndsi,1024,1000,2000,2000,11000,0.910047910592337,NA 
rayol-farm2_2019-05-08_13-25-56.wav,44100,16,60,1,ndsi,1024,1000,2000,2000,11000,0.730312868233381,NA 
rayol-farm2_2019-05-08_13-27-56.wav,44100,16,60,1,ndsi,1024,1000,2000,2000,11000,0.406134758856324,NA 
rayol-farm2_2019-05-08_13-29-56.wav,44100,16,60,1,ndsi,1024,1000,2000,2000,11000,0.587786079560407,NA 
rayol-farm2_2019-05-08_13-31-56.wav,44100,16,60,1,ndsi,1024,1000,2000,2000,11000,0.899509846751109,NA 
rayol-farm2_2019-05-08_13-33-57.wav,44100,16,60,1,ndsi,1024,1000,2000,2000,11000,0.865762601163233,NA 
rayol-farm2_2019-05-08_13-35-57.wav,44100,16,60,1,ndsi,1024,1000,2000,2000,11000,0.8494921141701,NA 
rayol-farm2_2019-05-08_13-37-57.wav,44100,16,60,1,ndsi,1024,1000,2000,2000,11000,0.849042932216486,NA 
rayol-farm2_2019-05-08_13-39-57.wav,44100,16,60,1,ndsi,1024,1000,2000,2000,11000,0.907409085367585,NA 
rayol-farm2_2019-05-08_13-41-57.wav,44100,16,60,1,ndsi,1024,1000,2000,2000,11000,0.8906488074264,NA 
rayol-farm2_2019-05-08_13-43-57.wav,44100,16,60,1,ndsi,1024,1000,2000,2000,11000,0.807500008056369,NA 
rayol-farm2_2019-05-08_13-45-57.wav,44100,16,60,1,ndsi,1024,1000,2000,2000,11000,0.873666318753658,NA 
rayol-farm2_2019-05-08_13-47-57.wav,44100,16,60,1,ndsi,1024,1000,2000,2000,11000,0.877067480594118,NA 
rayol-farm2_2019-05-08_13-49-58.wav,44100,16,60,1,ndsi,1024,1000,2000,2000,11000,0.853379648942811,NA 
rayol-farm2_2019-05-08_13-51-58.wav,44100,16,60,1,ndsi,1024,1000,2000,2000,11000,0.831732502832729,NA 
rayol-farm2_2019-05-08_13-53-58.wav,44100,16,60,1,ndsi,1024,1000,2000,2000,11000,0.90239907368936,NA 
rayol-farm2_2019-05-08_13-55-58.wav,44100,16,60,1,ndsi,1024,1000,2000,2000,11000,0.877630150740135,NA 
rayol-farm2_2019-05-08_13-57-58.wav,44100,16,60,1,ndsi,1024,1000,2000,2000,11000,0.922081481404434,NA 
rayol-farm2_2019-05-08_13-59-58.wav,44100,16,60,1,ndsi,1024,1000,2000,2000,11000,0.927407200202686,NA 
rayol-farm2_2019-05-08_14-01-58.wav,44100,16,60,1,ndsi,1024,1000,2000,2000,11000,0.903850179775409,NA 
rayol-farm2_2019-05-08_14-03-58.wav,44100,16,60,1,ndsi,1024,1000,2000,2000,11000,0.923766060500603,NA 
rayol-farm2_2019-05-08_14-05-59.wav,44100,16,60,1,ndsi,1024,1000,2000,2000,11000,0.874657009600685,NA 
rayol-farm2_2019-05-08_14-07-59.wav,44100,16,60,1,ndsi,1024,1000,2000,2000,11000,0.934502210085906,NA 
rayol-farm2_2019-05-08_14-09-59.wav,44100,16,60,1,ndsi,1024,1000,2000,2000,11000,0.927714795680806,NA 
rayol-farm2_2019-05-08_14-11-59.wav,44100,16,60,1,ndsi,1024,1000,2000,2000,11000,0.933101417985292,NA 
rayol-farm2_2019-05-08_14-13-59.wav,44100,16,60,1,ndsi,1024,1000,2000,2000,11000,0.935891216288151,NA 
rayol-farm2_2019-05-08_14-15-59.wav,44100,16,60,1,ndsi,1024,1000,2000,2000,11000,0.775326195535219,NA 
rayol-farm2_2019-05-08_14-17-59.wav,44100,16,60,1,ndsi,1024,1000,2000,2000,11000,0.92261137839711,NA 
rayol-farm2_2019-05-08_14-19-59.wav,44100,16,60,1,ndsi,1024,1000,2000,2000,11000,0.934369413058008,NA 
rayol-farm2_2019-05-08_14-22-00.wav,44100,16,60,1,ndsi,1024,1000,2000,2000,11000,0.933082743518867,NA 
rayol-farm2_2019-05-08_14-24-00.wav,44100,16,60,1,ndsi,1024,1000,2000,2000,11000,0.931896333312977,NA 
rayol-farm2_2019-05-08_14-26-00.wav,44100,16,60,1,ndsi,1024,1000,2000,2000,11000,0.923088360020134,NA 
rayol-farm2_2019-05-08_14-28-00.wav,44100,16,60,1,ndsi,1024,1000,2000,2000,11000,0.904816409756263,NA 
rayol-farm2_2019-05-08_14-30-00.wav,44100,16,60,1,ndsi,1024,1000,2000,2000,11000,0.92752438380086,NA 
rayol-farm2_2019-05-08_14-32-00.wav,44100,16,60,1,ndsi,1024,1000,2000,2000,11000,0.895008581841817,NA 
rayol-farm2_2019-05-08_14-34-00.wav,44100,16,60,1,ndsi,1024,1000,2000,2000,11000,0.935938088785672,NA 
rayol-farm2_2019-05-08_14-36-00.wav,44100,16,60,1,ndsi,1024,1000,2000,2000,11000,0.806228084102109,NA 
rayol-farm2_2019-05-08_14-38-00.wav,44100,16,60,1,ndsi,1024,1000,2000,2000,11000,0.915767852942638,NA 
rayol-farm2_2019-05-08_14-40-01.wav,44100,16,60,1,ndsi,1024,1000,2000,2000,11000,0.880964240557723,NA 
rayol-farm2_2019-05-08_14-42-01.wav,44100,16,60,1,ndsi,1024,1000,2000,2000,11000,0.863841476543425,NA 
rayol-farm2_2019-05-08_14-44-01.wav,44100,16,60,1,ndsi,1024,1000,2000,2000,11000,0.926304655403971,NA 
rayol-farm2_2019-05-08_14-46-01.wav,44100,16,60,1,ndsi,1024,1000,2000,2000,11000,0.933983339074806,NA 
rayol-farm2_2019-05-08_14-48-01.wav,44100,16,60,1,ndsi,1024,1000,2000,2000,11000,0.920930311841117,NA 
rayol-farm2_2019-05-08_14-50-01.wav,44100,16,60,1,ndsi,1024,1000,2000,2000,11000,0.929993895935965,NA 
rayol-farm2_2019-05-08_14-52-01.wav,44100,16,60,1,ndsi,1024,1000,2000,2000,11000,0.942095833779842,NA 
rayol-farm2_2019-05-08_14-54-01.wav,44100,16,60,1,ndsi,1024,1000,2000,2000,11000,0.894846584068574,NA 
rayol-farm2_2019-05-08_14-56-02.wav,44100,16,60,1,ndsi,1024,1000,2000,2000,11000,0.873249697471962,NA 
rayol-farm2_2019-05-08_14-58-02.wav,44100,16,60,1,ndsi,1024,1000,2000,2000,11000,0.893651205796614,NA 
rayol-farm2_2019-05-08_15-00-02.wav,44100,16,60,1,ndsi,1024,1000,2000,2000,11000,0.894485619321104,NA 
rayol-farm2_2019-05-08_15-02-02.wav,44100,16,60,1,ndsi,1024,1000,2000,2000,11000,0.901203885589636,NA 
rayol-farm2_2019-05-08_15-04-02.wav,44100,16,60,1,ndsi,1024,1000,2000,2000,11000,0.910809753717549,NA 
rayol-farm2_2019-05-08_15-06-02.wav,44100,16,60,1,ndsi,1024,1000,2000,2000,11000,0.888838128238625,NA 
rayol-farm2_2019-05-08_15-08-02.wav,44100,16,60,1,ndsi,1024,1000,2000,2000,11000,0.925756747055704,NA 
rayol-farm2_2019-05-08_15-10-02.wav,44100,16,60,1,ndsi,1024,1000,2000,2000,11000,0.851710540170026,NA 
rayol-farm2_2019-05-08_15-12-03.wav,44100,16,60,1,ndsi,1024,1000,2000,2000,11000,0.921821077222402,NA 
rayol-farm2_2019-05-08_15-14-03.wav,44100,16,60,1,ndsi,1024,1000,2000,2000,11000,0.85078301284125,NA 
rayol-farm2_2019-05-08_15-16-03.wav,44100,16,60,1,ndsi,1024,1000,2000,2000,11000,0.817495065744564,NA 
rayol-farm2_2019-05-08_15-18-03.wav,44100,16,60,1,ndsi,1024,1000,2000,2000,11000,0.436815309799283,NA 
rayol-farm2_2019-05-08_15-20-03.wav,44100,16,60,1,ndsi,1024,1000,2000,2000,11000,0.934011621047497,NA 
rayol-farm2_2019-05-08_15-22-03.wav,44100,16,60,1,ndsi,1024,1000,2000,2000,11000,0.842420885568066,NA 
rayol-farm2_2019-05-08_15-24-03.wav,44100,16,60,1,ndsi,1024,1000,2000,2000,11000,0.915748495621566,NA 
rayol-farm2_2019-05-08_15-26-03.wav,44100,16,60,1,ndsi,1024,1000,2000,2000,11000,0.918806788527261,NA 
rayol-farm2_2019-05-08_15-28-04.wav,44100,16,60,1,ndsi,1024,1000,2000,2000,11000,0.917634385313038,NA 
rayol-farm2_2019-05-08_15-30-04.wav,44100,16,60,1,ndsi,1024,1000,2000,2000,11000,0.440624124581726,NA 
rayol-farm2_2019-05-08_15-32-04.wav,44100,16,60,1,ndsi,1024,1000,2000,2000,11000,0.902863515346027,NA 
rayol-farm2_2019-05-08_15-34-04.wav,44100,16,60,1,ndsi,1024,1000,2000,2000,11000,0.581256901512486,NA 
rayol-farm2_2019-05-08_15-36-04.wav,44100,16,60,1,ndsi,1024,1000,2000,2000,11000,0.917813726266018,NA 
rayol-farm2_2019-05-08_15-38-04.wav,44100,16,60,1,ndsi,1024,1000,2000,2000,11000,0.601806176395483,NA 
rayol-farm2_2019-05-08_15-40-04.wav,44100,16,60,1,ndsi,1024,1000,2000,2000,11000,0.864938155088839,NA 
rayol-farm2_2019-05-08_15-42-04.wav,44100,16,60,1,ndsi,1024,1000,2000,2000,11000,0.792068682831314,NA 
rayol-farm2_2019-05-08_15-44-04.wav,44100,16,60,1,ndsi,1024,1000,2000,2000,11000,0.798401579806364,NA 
rayol-farm2_2019-05-08_15-46-05.wav,44100,16,60,1,ndsi,1024,1000,2000,2000,11000,0.885921037871081,NA 
rayol-farm2_2019-05-08_15-48-05.wav,44100,16,60,1,ndsi,1024,1000,2000,2000,11000,0.764055381211631,NA 
rayol-farm2_2019-05-08_15-50-05.wav,44100,16,60,1,ndsi,1024,1000,2000,2000,11000,0.723806811164644,NA 
rayol-farm2_2019-05-08_15-52-05.wav,44100,16,60,1,ndsi,1024,1000,2000,2000,11000,-0.203197333235865,NA 
rayol-farm2_2019-05-08_15-54-05.wav,44100,16,60,1,ndsi,1024,1000,2000,2000,11000,0.23770522332773,NA 
rayol-farm2_2019-05-08_15-56-05.wav,44100,16,60,1,ndsi,1024,1000,2000,2000,11000,0.834703088284231,NA 
rayol-farm2_2019-05-08_15-58-05.wav,44100,16,60,1,ndsi,1024,1000,2000,2000,11000,0.571425645883374,NA 
rayol-farm2_2019-05-08_16-00-05.wav,44100,16,60,1,ndsi,1024,1000,2000,2000,11000,0.365312641628361,NA 
rayol-farm2_2019-05-08_16-02-06.wav,44100,16,60,1,ndsi,1024,1000,2000,2000,11000,0.349113264403116,NA 
rayol-farm2_2019-05-08_16-04-06.wav,44100,16,60,1,ndsi,1024,1000,2000,2000,11000,0.615659325916338,NA 
rayol-farm2_2019-05-08_16-06-06.wav,44100,16,60,1,ndsi,1024,1000,2000,2000,11000,0.403959847341643,NA 
rayol-farm2_2019-05-08_16-08-06.wav,44100,16,60,1,ndsi,1024,1000,2000,2000,11000,0.910811866424394,NA 
rayol-farm2_2019-05-08_16-10-06.wav,44100,16,60,1,ndsi,1024,1000,2000,2000,11000,0.877867545093669,NA 
rayol-farm2_2019-05-08_16-12-06.wav,44100,16,60,1,ndsi,1024,1000,2000,2000,11000,0.706786691672365,NA 
rayol-farm2_2019-05-08_16-14-06.wav,44100,16,60,1,ndsi,1024,1000,2000,2000,11000,0.846979282119129,NA 
rayol-farm2_2019-05-08_16-16-06.wav,44100,16,60,1,ndsi,1024,1000,2000,2000,11000,0.751169180847405,NA 
rayol-farm2_2019-05-08_16-18-07.wav,44100,16,60,1,ndsi,1024,1000,2000,2000,11000,0.807099183026493,NA 
rayol-farm2_2019-05-08_16-20-07.wav,44100,16,60,1,ndsi,1024,1000,2000,2000,11000,0.80582779314923,NA 
rayol-farm2_2019-05-08_16-22-07.wav,44100,16,60,1,ndsi,1024,1000,2000,2000,11000,0.899189471933831,NA 
rayol-farm2_2019-05-08_16-24-07.wav,44100,16,60,1,ndsi,1024,1000,2000,2000,11000,0.555948999035103,NA 
rayol-farm2_2019-05-08_16-26-07.wav,44100,16,60,1,ndsi,1024,1000,2000,2000,11000,0.884018899065114,NA 
rayol-farm2_2019-05-08_16-28-07.wav,44100,16,60,1,ndsi,1024,1000,2000,2000,11000,0.866466103516799,NA 
rayol-farm2_2019-05-08_16-30-07.wav,44100,16,60,1,ndsi,1024,1000,2000,2000,11000,0.519310769996369,NA 
rayol-farm2_2019-05-08_16-32-07.wav,44100,16,60,1,ndsi,1024,1000,2000,2000,11000,0.871879402116623,NA 
rayol-farm2_2019-05-08_16-34-08.wav,44100,16,60,1,ndsi,1024,1000,2000,2000,11000,0.903111056828105,NA 
rayol-farm2_2019-05-08_16-36-08.wav,44100,16,60,1,ndsi,1024,1000,2000,2000,11000,0.913317314305631,NA 
rayol-farm2_2019-05-08_16-38-08.wav,44100,16,60,1,ndsi,1024,1000,2000,2000,11000,0.882766670124713,NA 
rayol-farm2_2019-05-08_16-40-08.wav,44100,16,60,1,ndsi,1024,1000,2000,2000,11000,0.906847376825187,NA 
rayol-farm2_2019-05-08_16-42-08.wav,44100,16,60,1,ndsi,1024,1000,2000,2000,11000,0.882957166714086,NA 
rayol-farm2_2019-05-08_16-44-08.wav,44100,16,60,1,ndsi,1024,1000,2000,2000,11000,0.866229577155242,NA 
rayol-farm2_2019-05-08_16-46-08.wav,44100,16,60,1,ndsi,1024,1000,2000,2000,11000,0.839000206188644,NA 
rayol-farm2_2019-05-08_16-48-08.wav,44100,16,60,1,ndsi,1024,1000,2000,2000,11000,0.810837597840777,NA 
rayol-farm2_2019-05-08_16-50-08.wav,44100,16,60,1,ndsi,1024,1000,2000,2000,11000,0.826585697791663,NA 
rayol-farm2_2019-05-08_16-52-09.wav,44100,16,60,1,ndsi,1024,1000,2000,2000,11000,0.867225511983788,NA 
rayol-farm2_2019-05-08_16-54-09.wav,44100,16,60,1,ndsi,1024,1000,2000,2000,11000,0.824335856314365,NA 
rayol-farm2_2019-05-08_16-56-09.wav,44100,16,60,1,ndsi,1024,1000,2000,2000,11000,0.803840763510729,NA 
rayol-farm2_2019-05-08_16-58-09.wav,44100,16,60,1,ndsi,1024,1000,2000,2000,11000,0.811160181850199,NA 
rayol-farm2_2019-05-08_17-00-09.wav,44100,16,60,1,ndsi,1024,1000,2000,2000,11000,0.833161430558153,NA 
rayol-farm2_2019-05-08_17-02-09.wav,44100,16,60,1,ndsi,1024,1000,2000,2000,11000,0.758823571955776,NA 
rayol-farm2_2019-05-08_17-04-09.wav,44100,16,60,1,ndsi,1024,1000,2000,2000,11000,0.815053463712738,NA 
rayol-farm2_2019-05-08_17-06-09.wav,44100,16,60,1,ndsi,1024,1000,2000,2000,11000,0.876396149750813,NA 
rayol-farm2_2019-05-08_17-08-10.wav,44100,16,60,1,ndsi,1024,1000,2000,2000,11000,0.912411690796662,NA 
rayol-farm2_2019-05-08_17-10-10.wav,44100,16,60,1,ndsi,1024,1000,2000,2000,11000,0.90821190254434,NA 
rayol-farm2_2019-05-08_17-12-10.wav,44100,16,60,1,ndsi,1024,1000,2000,2000,11000,0.894733020291874,NA 
rayol-farm2_2019-05-08_17-14-10.wav,44100,16,60,1,ndsi,1024,1000,2000,2000,11000,0.808881234760052,NA 
rayol-farm2_2019-05-08_17-16-10.wav,44100,16,60,1,ndsi,1024,1000,2000,2000,11000,0.859976857735801,NA 
rayol-farm2_2019-05-08_17-18-10.wav,44100,16,60,1,ndsi,1024,1000,2000,2000,11000,0.875585429156381,NA 
rayol-farm2_2019-05-08_17-20-10.wav,44100,16,60,1,ndsi,1024,1000,2000,2000,11000,0.896393316524338,NA 
rayol-farm2_2019-05-08_17-22-10.wav,44100,16,60,1,ndsi,1024,1000,2000,2000,11000,0.912527931315176,NA 
rayol-farm2_2019-05-08_17-24-11.wav,44100,16,60,1,ndsi,1024,1000,2000,2000,11000,0.884168558899089,NA 
rayol-farm2_2019-05-08_17-26-11.wav,44100,16,60,1,ndsi,1024,1000,2000,2000,11000,0.902321759003368,NA 
rayol-farm2_2019-05-08_17-28-11.wav,44100,16,60,1,ndsi,1024,1000,2000,2000,11000,0.910904681310102,NA 
rayol-farm2_2019-05-08_17-30-11.wav,44100,16,60,1,ndsi,1024,1000,2000,2000,11000,0.917415406888682,NA 
rayol-farm2_2019-05-08_17-32-11.wav,44100,16,60,1,ndsi,1024,1000,2000,2000,11000,0.913300256364265,NA 
rayol-farm2_2019-05-08_17-34-11.wav,44100,16,60,1,ndsi,1024,1000,2000,2000,11000,0.869463498681387,NA 
rayol-farm2_2019-05-08_17-36-11.wav,44100,16,60,1,ndsi,1024,1000,2000,2000,11000,0.907208186936838,NA 
rayol-farm2_2019-05-08_17-38-11.wav,44100,16,60,1,ndsi,1024,1000,2000,2000,11000,0.857057897464148,NA 
rayol-farm2_2019-05-08_17-40-12.wav,44100,16,60,1,ndsi,1024,1000,2000,2000,11000,0.849586289208036,NA 
rayol-farm2_2019-05-08_17-42-12.wav,44100,16,60,1,ndsi,1024,1000,2000,2000,11000,0.905460830326684,NA 
rayol-farm2_2019-05-08_17-44-12.wav,44100,16,60,1,ndsi,1024,1000,2000,2000,11000,0.899341704678963,NA 
rayol-farm2_2019-05-08_17-46-12.wav,44100,16,60,1,ndsi,1024,1000,2000,2000,11000,0.480845184141632,NA 
rayol-farm2_2019-05-08_17-48-12.wav,44100,16,60,1,ndsi,1024,1000,2000,2000,11000,-0.405546926777149,NA 
rayol-farm2_2019-05-08_17-50-12.wav,44100,16,60,1,ndsi,1024,1000,2000,2000,11000,0.491537081871108,NA 
rayol-farm2_2019-05-08_17-52-12.wav,44100,16,60,1,ndsi,1024,1000,2000,2000,11000,0.922624444081311,NA 
rayol-farm2_2019-05-08_17-54-12.wav,44100,16,60,1,ndsi,1024,1000,2000,2000,11000,0.906390043291668,NA 
rayol-farm2_2019-05-08_17-56-13.wav,44100,16,60,1,ndsi,1024,1000,2000,2000,11000,0.916145238100791,NA 
rayol-farm2_2019-05-08_17-58-13.wav,44100,16,60,1,ndsi,1024,1000,2000,2000,11000,0.922452898607908,NA 
rayol-farm2_2019-05-08_18-00-13.wav,44100,16,60,1,ndsi,1024,1000,2000,2000,11000,0.90416827005651,NA 
rayol-farm2_2019-05-08_18-02-13.wav,44100,16,60,1,ndsi,1024,1000,2000,2000,11000,0.895788185166865,NA 
rayol-farm2_2019-05-08_18-04-13.wav,44100,16,60,1,ndsi,1024,1000,2000,2000,11000,0.911931826519347,NA 
rayol-farm2_2019-05-08_18-06-13.wav,44100,16,60,1,ndsi,1024,1000,2000,2000,11000,0.915178707598593,NA 
rayol-farm2_2019-05-08_18-08-13.wav,44100,16,60,1,ndsi,1024,1000,2000,2000,11000,0.888268185289965,NA 
rayol-farm2_2019-05-08_18-10-13.wav,44100,16,60,1,ndsi,1024,1000,2000,2000,11000,0.870814514561567,NA 
rayol-farm2_2019-05-08_18-12-13.wav,44100,16,60,1,ndsi,1024,1000,2000,2000,11000,0.908108773773481,NA 
rayol-farm2_2019-05-08_18-14-14.wav,44100,16,60,1,ndsi,1024,1000,2000,2000,11000,0.920520436893387,NA 
rayol-farm2_2019-05-08_18-16-14.wav,44100,16,60,1,ndsi,1024,1000,2000,2000,11000,0.922775178438432,NA 
rayol-farm2_2019-05-08_18-18-14.wav,44100,16,60,1,ndsi,1024,1000,2000,2000,11000,0.915303198085369,NA 
rayol-farm2_2019-05-08_18-20-14.wav,44100,16,60,1,ndsi,1024,1000,2000,2000,11000,0.925902264100235,NA 
rayol-farm2_2019-05-08_18-22-14.wav,44100,16,60,1,ndsi,1024,1000,2000,2000,11000,0.92587440350418,NA 
rayol-farm2_2019-05-08_18-24-14.wav,44100,16,60,1,ndsi,1024,1000,2000,2000,11000,0.930068186287352,NA 
rayol-farm2_2019-05-08_18-26-14.wav,44100,16,60,1,ndsi,1024,1000,2000,2000,11000,0.923682397310368,NA 
rayol-farm2_2019-05-08_18-28-14.wav,44100,16,60,1,ndsi,1024,1000,2000,2000,11000,0.930214449888903,NA 
rayol-farm2_2019-05-08_18-30-15.wav,44100,16,60,1,ndsi,1024,1000,2000,2000,11000,0.937686981998294,NA 
rayol-farm2_2019-05-08_18-32-15.wav,44100,16,60,1,ndsi,1024,1000,2000,2000,11000,0.923409549925402,NA 
rayol-farm2_2019-05-08_18-34-15.wav,44100,16,60,1,ndsi,1024,1000,2000,2000,11000,0.921137161039964,NA 
rayol-farm2_2019-05-08_18-36-15.wav,44100,16,60,1,ndsi,1024,1000,2000,2000,11000,0.932650937404952,NA 
rayol-farm2_2019-05-08_18-38-15.wav,44100,16,60,1,ndsi,1024,1000,2000,2000,11000,0.929415208149937,NA 
rayol-farm2_2019-05-08_18-40-15.wav,44100,16,60,1,ndsi,1024,1000,2000,2000,11000,0.925514234216469,NA 
rayol-farm2_2019-05-08_18-42-15.wav,44100,16,60,1,ndsi,1024,1000,2000,2000,11000,0.925952127144623,NA 
rayol-farm2_2019-05-08_18-44-15.wav,44100,16,60,1,ndsi,1024,1000,2000,2000,11000,0.931823644615394,NA 
rayol-farm2_2019-05-08_18-46-16.wav,44100,16,60,1,ndsi,1024,1000,2000,2000,11000,0.922585745737964,NA 
rayol-farm2_2019-05-08_18-48-16.wav,44100,16,60,1,ndsi,1024,1000,2000,2000,11000,0.936700605883726,NA 
rayol-farm2_2019-05-08_18-50-16.wav,44100,16,60,1,ndsi,1024,1000,2000,2000,11000,0.910296448756406,NA 
rayol-farm2_2019-05-08_18-52-16.wav,44100,16,60,1,ndsi,1024,1000,2000,2000,11000,0.928568911334628,NA 
rayol-farm2_2019-05-08_18-54-16.wav,44100,16,60,1,ndsi,1024,1000,2000,2000,11000,0.93877856681883,NA 
rayol-farm2_2019-05-08_18-56-16.wav,44100,16,60,1,ndsi,1024,1000,2000,2000,11000,0.933380118859361,NA 
rayol-farm2_2019-05-08_18-58-16.wav,44100,16,60,1,ndsi,1024,1000,2000,2000,11000,0.925740862703078,NA 
rayol-farm2_2019-05-08_19-00-16.wav,44100,16,60,1,ndsi,1024,1000,2000,2000,11000,0.915213060374487,NA 
rayol-farm2_2019-05-08_19-02-17.wav,44100,16,60,1,ndsi,1024,1000,2000,2000,11000,0.933251135072518,NA 
rayol-farm2_2019-05-08_19-04-17.wav,44100,16,60,1,ndsi,1024,1000,2000,2000,11000,0.933521933296212,NA 
rayol-farm2_2019-05-08_19-06-17.wav,44100,16,60,1,ndsi,1024,1000,2000,2000,11000,0.928087428105178,NA 
rayol-farm2_2019-05-08_19-08-17.wav,44100,16,60,1,ndsi,1024,1000,2000,2000,11000,0.902064499878789,NA 
rayol-farm2_2019-05-08_19-10-17.wav,44100,16,60,1,ndsi,1024,1000,2000,2000,11000,0.91843851871448,NA 
rayol-farm2_2019-05-08_19-12-17.wav,44100,16,60,1,ndsi,1024,1000,2000,2000,11000,0.91652733685934,NA 
rayol-farm2_2019-05-08_19-14-17.wav,44100,16,60,1,ndsi,1024,1000,2000,2000,11000,0.913196223445639,NA 
rayol-farm2_2019-05-08_19-16-17.wav,44100,16,60,1,ndsi,1024,1000,2000,2000,11000,0.874018860996385,NA 
rayol-farm2_2019-05-08_19-18-17.wav,44100,16,60,1,ndsi,1024,1000,2000,2000,11000,0.873915099613042,NA 
rayol-farm2_2019-05-08_19-20-18.wav,44100,16,60,1,ndsi,1024,1000,2000,2000,11000,0.828400027516421,NA 
rayol-farm2_2019-05-08_19-22-18.wav,44100,16,60,1,ndsi,1024,1000,2000,2000,11000,0.850463106973179,NA 
rayol-farm2_2019-05-08_19-24-18.wav,44100,16,60,1,ndsi,1024,1000,2000,2000,11000,0.863614024088473,NA 
rayol-farm2_2019-05-08_19-26-18.wav,44100,16,60,1,ndsi,1024,1000,2000,2000,11000,0.845656514040778,NA 
rayol-farm2_2019-05-08_19-28-18.wav,44100,16,60,1,ndsi,1024,1000,2000,2000,11000,0.897570012044125,NA 
rayol-farm2_2019-05-08_19-30-18.wav,44100,16,60,1,ndsi,1024,1000,2000,2000,11000,0.872906986597503,NA 
rayol-farm2_2019-05-08_19-32-18.wav,44100,16,60,1,ndsi,1024,1000,2000,2000,11000,0.698447879722049,NA 
rayol-farm2_2019-05-08_19-34-18.wav,44100,16,60,1,ndsi,1024,1000,2000,2000,11000,0.878578153238191,NA 
rayol-farm2_2019-05-08_19-36-19.wav,44100,16,60,1,ndsi,1024,1000,2000,2000,11000,0.894929295315984,NA 
rayol-farm2_2019-05-08_19-38-19.wav,44100,16,60,1,ndsi,1024,1000,2000,2000,11000,0.886226642882529,NA 
rayol-farm2_2019-05-08_19-40-19.wav,44100,16,60,1,ndsi,1024,1000,2000,2000,11000,0.875879367147062,NA 
rayol-farm2_2019-05-08_19-42-19.wav,44100,16,60,1,ndsi,1024,1000,2000,2000,11000,0.921650417468133,NA 
rayol-farm2_2019-05-08_19-44-19.wav,44100,16,60,1,ndsi,1024,1000,2000,2000,11000,0.938901411562891,NA 
rayol-farm2_2019-05-08_19-46-19.wav,44100,16,60,1,ndsi,1024,1000,2000,2000,11000,0.921879969345923,NA 
rayol-farm2_2019-05-08_19-48-19.wav,44100,16,60,1,ndsi,1024,1000,2000,2000,11000,0.93396160003042,NA 
rayol-farm2_2019-05-08_19-50-19.wav,44100,16,60,1,ndsi,1024,1000,2000,2000,11000,0.934973123118783,NA 
rayol-farm2_2019-05-08_19-52-20.wav,44100,16,60,1,ndsi,1024,1000,2000,2000,11000,0.938721438980973,NA 
rayol-farm2_2019-05-08_19-54-20.wav,44100,16,60,1,ndsi,1024,1000,2000,2000,11000,0.920425117677067,NA 
rayol-farm2_2019-05-08_19-56-20.wav,44100,16,60,1,ndsi,1024,1000,2000,2000,11000,0.927492377999551,NA 
rayol-farm2_2019-05-08_19-58-20.wav,44100,16,60,1,ndsi,1024,1000,2000,2000,11000,0.924287231137137,NA 
rayol-farm2_2019-05-08_20-00-20.wav,44100,16,60,1,ndsi,1024,1000,2000,2000,11000,0.929171741837901,NA 
rayol-farm2_2019-05-08_20-02-20.wav,44100,16,60,1,ndsi,1024,1000,2000,2000,11000,0.918357624898261,NA 
rayol-farm2_2019-05-08_20-04-20.wav,44100,16,60,1,ndsi,1024,1000,2000,2000,11000,0.88733928472898,NA 
rayol-farm2_2019-05-08_20-06-20.wav,44100,16,60,1,ndsi,1024,1000,2000,2000,11000,0.928404237068872,NA 
rayol-farm2_2019-05-08_20-08-21.wav,44100,16,60,1,ndsi,1024,1000,2000,2000,11000,0.901062070023555,NA 
rayol-farm2_2019-05-08_20-10-21.wav,44100,16,60,1,ndsi,1024,1000,2000,2000,11000,0.925971346004186,NA 
rayol-farm2_2019-05-08_20-12-21.wav,44100,16,60,1,ndsi,1024,1000,2000,2000,11000,0.931709931023121,NA 
rayol-farm2_2019-05-08_20-14-21.wav,44100,16,60,1,ndsi,1024,1000,2000,2000,11000,0.92902003355029,NA 
rayol-farm2_2019-05-08_20-16-21.wav,44100,16,60,1,ndsi,1024,1000,2000,2000,11000,0.908165879440057,NA 
rayol-farm2_2019-05-08_20-18-21.wav,44100,16,60,1,ndsi,1024,1000,2000,2000,11000,0.906917699744015,NA 
rayol-farm2_2019-05-08_20-20-21.wav,44100,16,60,1,ndsi,1024,1000,2000,2000,11000,0.930879690862936,NA 
rayol-farm2_2019-05-08_20-22-21.wav,44100,16,60,1,ndsi,1024,1000,2000,2000,11000,0.898322090117561,NA 
rayol-farm2_2019-05-08_20-24-21.wav,44100,16,60,1,ndsi,1024,1000,2000,2000,11000,0.877400100754034,NA 
rayol-farm2_2019-05-08_20-26-22.wav,44100,16,60,1,ndsi,1024,1000,2000,2000,11000,0.930342171357235,NA 
rayol-farm2_2019-05-08_20-28-22.wav,44100,16,60,1,ndsi,1024,1000,2000,2000,11000,0.921838417300694,NA 
rayol-farm2_2019-05-08_20-30-22.wav,44100,16,60,1,ndsi,1024,1000,2000,2000,11000,0.93527202639602,NA 
rayol-farm2_2019-05-08_20-32-22.wav,44100,16,60,1,ndsi,1024,1000,2000,2000,11000,0.929377515788679,NA 
rayol-farm2_2019-05-08_20-34-22.wav,44100,16,60,1,ndsi,1024,1000,2000,2000,11000,0.931387655570149,NA 
rayol-farm2_2019-05-08_20-36-22.wav,44100,16,60,1,ndsi,1024,1000,2000,2000,11000,0.932175976547224,NA 
rayol-farm2_2019-05-08_20-38-22.wav,44100,16,60,1,ndsi,1024,1000,2000,2000,11000,0.929414803813503,NA 
rayol-farm2_2019-05-08_20-40-22.wav,44100,16,60,1,ndsi,1024,1000,2000,2000,11000,0.925167176525077,NA 
rayol-farm2_2019-05-08_20-42-23.wav,44100,16,60,1,ndsi,1024,1000,2000,2000,11000,0.88723650530885,NA 
rayol-farm2_2019-05-08_20-44-23.wav,44100,16,60,1,ndsi,1024,1000,2000,2000,11000,0.916700892118694,NA 
rayol-farm2_2019-05-08_20-46-23.wav,44100,16,60,1,ndsi,1024,1000,2000,2000,11000,0.931600184813706,NA 
rayol-farm2_2019-05-08_20-48-23.wav,44100,16,60,1,ndsi,1024,1000,2000,2000,11000,0.931280552136623,NA 
rayol-farm2_2019-05-08_20-50-23.wav,44100,16,60,1,ndsi,1024,1000,2000,2000,11000,0.931834601348505,NA 
rayol-farm2_2019-05-08_20-52-23.wav,44100,16,60,1,ndsi,1024,1000,2000,2000,11000,0.919465995136332,NA 
rayol-farm2_2019-05-08_20-54-23.wav,44100,16,60,1,ndsi,1024,1000,2000,2000,11000,0.930355064621313,NA 
rayol-farm2_2019-05-08_20-56-23.wav,44100,16,60,1,ndsi,1024,1000,2000,2000,11000,0.925318439363924,NA 
rayol-farm2_2019-05-08_20-58-24.wav,44100,16,60,1,ndsi,1024,1000,2000,2000,11000,0.922673042771598,NA 
rayol-farm2_2019-05-08_21-00-24.wav,44100,16,60,1,ndsi,1024,1000,2000,2000,11000,0.930385206989846,NA 
rayol-farm2_2019-05-08_21-02-24.wav,44100,16,60,1,ndsi,1024,1000,2000,2000,11000,0.931274155024032,NA 
rayol-farm2_2019-05-08_21-04-24.wav,44100,16,60,1,ndsi,1024,1000,2000,2000,11000,0.927416971699025,NA 
rayol-farm2_2019-05-08_21-06-24.wav,44100,16,60,1,ndsi,1024,1000,2000,2000,11000,0.934443454818632,NA 
rayol-farm2_2019-05-08_21-08-24.wav,44100,16,60,1,ndsi,1024,1000,2000,2000,11000,0.926328088462778,NA 
rayol-farm2_2019-05-08_21-10-24.wav,44100,16,60,1,ndsi,1024,1000,2000,2000,11000,0.924444005792367,NA 
rayol-farm2_2019-05-08_21-12-24.wav,44100,16,60,1,ndsi,1024,1000,2000,2000,11000,0.925131019534856,NA 
rayol-farm2_2019-05-08_21-14-25.wav,44100,16,60,1,ndsi,1024,1000,2000,2000,11000,0.932359465136035,NA 
rayol-farm2_2019-05-08_21-16-25.wav,44100,16,60,1,ndsi,1024,1000,2000,2000,11000,0.928413850370595,NA 
rayol-farm2_2019-05-08_21-18-25.wav,44100,16,60,1,ndsi,1024,1000,2000,2000,11000,0.918323400364816,NA 
rayol-farm2_2019-05-08_21-20-25.wav,44100,16,60,1,ndsi,1024,1000,2000,2000,11000,0.933463124317347,NA 
rayol-farm2_2019-05-08_21-22-25.wav,44100,16,60,1,ndsi,1024,1000,2000,2000,11000,0.934629549375226,NA 
rayol-farm2_2019-05-08_21-24-25.wav,44100,16,60,1,ndsi,1024,1000,2000,2000,11000,0.921064089124971,NA 
rayol-farm2_2019-05-08_21-26-25.wav,44100,16,60,1,ndsi,1024,1000,2000,2000,11000,0.918936432373893,NA 
rayol-farm2_2019-05-08_21-28-25.wav,44100,16,60,1,ndsi,1024,1000,2000,2000,11000,0.909361873826761,NA 
rayol-farm2_2019-05-08_21-30-25.wav,44100,16,60,1,ndsi,1024,1000,2000,2000,11000,0.922762587464577,NA 
rayol-farm2_2019-05-08_21-32-26.wav,44100,16,60,1,ndsi,1024,1000,2000,2000,11000,0.927307786329242,NA 
rayol-farm2_2019-05-08_21-34-26.wav,44100,16,60,1,ndsi,1024,1000,2000,2000,11000,0.878325921025645,NA 
rayol-farm2_2019-05-08_21-36-26.wav,44100,16,60,1,ndsi,1024,1000,2000,2000,11000,0.919272023174166,NA 
rayol-farm2_2019-05-08_21-38-26.wav,44100,16,60,1,ndsi,1024,1000,2000,2000,11000,0.880534210193252,NA 
rayol-farm2_2019-05-08_21-40-26.wav,44100,16,60,1,ndsi,1024,1000,2000,2000,11000,0.927597497766629,NA 
rayol-farm2_2019-05-08_21-42-26.wav,44100,16,60,1,ndsi,1024,1000,2000,2000,11000,0.926867351790939,NA 
rayol-farm2_2019-05-08_21-44-26.wav,44100,16,60,1,ndsi,1024,1000,2000,2000,11000,0.925512397348268,NA 
rayol-farm2_2019-05-08_21-46-26.wav,44100,16,60,1,ndsi,1024,1000,2000,2000,11000,0.928302177310914,NA 
rayol-farm2_2019-05-08_21-48-27.wav,44100,16,60,1,ndsi,1024,1000,2000,2000,11000,0.898507918926435,NA 
rayol-farm2_2019-05-08_21-50-27.wav,44100,16,60,1,ndsi,1024,1000,2000,2000,11000,0.926575307974371,NA 
rayol-farm2_2019-05-08_21-52-27.wav,44100,16,60,1,ndsi,1024,1000,2000,2000,11000,0.926568829745902,NA 
rayol-farm2_2019-05-08_21-54-27.wav,44100,16,60,1,ndsi,1024,1000,2000,2000,11000,0.930374178679856,NA 
rayol-farm2_2019-05-08_21-56-27.wav,44100,16,60,1,ndsi,1024,1000,2000,2000,11000,0.929102232116671,NA 
rayol-farm2_2019-05-08_21-58-27.wav,44100,16,60,1,ndsi,1024,1000,2000,2000,11000,0.913495293548374,NA 
rayol-farm2_2019-05-08_22-00-27.wav,44100,16,60,1,ndsi,1024,1000,2000,2000,11000,0.929447361406157,NA 
rayol-farm2_2019-05-08_22-02-27.wav,44100,16,60,1,ndsi,1024,1000,2000,2000,11000,0.911442557075712,NA 
rayol-farm2_2019-05-08_22-04-28.wav,44100,16,60,1,ndsi,1024,1000,2000,2000,11000,0.905856838693536,NA 
rayol-farm2_2019-05-08_22-06-28.wav,44100,16,60,1,ndsi,1024,1000,2000,2000,11000,0.929675810371446,NA 
rayol-farm2_2019-05-08_22-08-28.wav,44100,16,60,1,ndsi,1024,1000,2000,2000,11000,0.921840095176095,NA 
rayol-farm2_2019-05-08_22-10-28.wav,44100,16,60,1,ndsi,1024,1000,2000,2000,11000,0.926769810670282,NA 
rayol-farm2_2019-05-08_22-12-28.wav,44100,16,60,1,ndsi,1024,1000,2000,2000,11000,0.894573827106554,NA 
rayol-farm2_2019-05-08_22-14-28.wav,44100,16,60,1,ndsi,1024,1000,2000,2000,11000,0.910608930813076,NA 
rayol-farm2_2019-05-08_22-16-28.wav,44100,16,60,1,ndsi,1024,1000,2000,2000,11000,0.914427056640683,NA 
rayol-farm2_2019-05-08_22-18-28.wav,44100,16,60,1,ndsi,1024,1000,2000,2000,11000,0.873234386093671,NA 
rayol-farm2_2019-05-08_22-20-29.wav,44100,16,60,1,ndsi,1024,1000,2000,2000,11000,0.899790255347041,NA 
rayol-farm2_2019-05-08_22-22-29.wav,44100,16,60,1,ndsi,1024,1000,2000,2000,11000,0.903652703602592,NA 
rayol-farm2_2019-05-08_22-24-29.wav,44100,16,60,1,ndsi,1024,1000,2000,2000,11000,0.880124390065036,NA 
rayol-farm2_2019-05-08_22-26-29.wav,44100,16,60,1,ndsi,1024,1000,2000,2000,11000,0.892018688417655,NA 
rayol-farm2_2019-05-08_22-28-29.wav,44100,16,60,1,ndsi,1024,1000,2000,2000,11000,0.919690463288668,NA 
rayol-farm2_2019-05-08_22-30-29.wav,44100,16,60,1,ndsi,1024,1000,2000,2000,11000,0.925565178393086,NA 
rayol-farm2_2019-05-08_22-32-29.wav,44100,16,60,1,ndsi,1024,1000,2000,2000,11000,0.890478408380212,NA 
rayol-farm2_2019-05-08_22-34-29.wav,44100,16,60,1,ndsi,1024,1000,2000,2000,11000,0.73060802175314,NA 
rayol-farm2_2019-05-08_22-36-30.wav,44100,16,60,1,ndsi,1024,1000,2000,2000,11000,0.90497994295784,NA 
rayol-farm2_2019-05-08_22-38-30.wav,44100,16,60,1,ndsi,1024,1000,2000,2000,11000,0.923567473215929,NA 
rayol-farm2_2019-05-08_22-40-30.wav,44100,16,60,1,ndsi,1024,1000,2000,2000,11000,0.928934710900369,NA 
rayol-farm2_2019-05-08_22-42-30.wav,44100,16,60,1,ndsi,1024,1000,2000,2000,11000,0.931248511461876,NA 
rayol-farm2_2019-05-08_22-44-30.wav,44100,16,60,1,ndsi,1024,1000,2000,2000,11000,0.934119661788024,NA 
rayol-farm2_2019-05-08_22-46-30.wav,44100,16,60,1,ndsi,1024,1000,2000,2000,11000,0.935150720555349,NA 
rayol-farm2_2019-05-08_22-48-30.wav,44100,16,60,1,ndsi,1024,1000,2000,2000,11000,0.937883064323147,NA 
rayol-farm2_2019-05-08_22-50-30.wav,44100,16,60,1,ndsi,1024,1000,2000,2000,11000,0.936842511162248,NA 
rayol-farm2_2019-05-08_22-52-31.wav,44100,16,60,1,ndsi,1024,1000,2000,2000,11000,0.939663298676292,NA 
rayol-farm2_2019-05-08_22-54-31.wav,44100,16,60,1,ndsi,1024,1000,2000,2000,11000,0.940048168315662,NA 
rayol-farm2_2019-05-08_22-56-31.wav,44100,16,60,1,ndsi,1024,1000,2000,2000,11000,0.937957654148784,NA 
rayol-farm2_2019-05-08_22-58-31.wav,44100,16,60,1,ndsi,1024,1000,2000,2000,11000,0.936430219778185,NA 
rayol-farm2_2019-05-08_23-00-31.wav,44100,16,60,1,ndsi,1024,1000,2000,2000,11000,0.934746139208139,NA 
rayol-farm2_2019-05-08_23-02-31.wav,44100,16,60,1,ndsi,1024,1000,2000,2000,11000,0.936868437189864,NA 
rayol-farm2_2019-05-08_23-04-31.wav,44100,16,60,1,ndsi,1024,1000,2000,2000,11000,0.817182747671208,NA 
rayol-farm2_2019-05-08_23-06-31.wav,44100,16,60,1,ndsi,1024,1000,2000,2000,11000,0.916904187336743,NA 
rayol-farm2_2019-05-08_23-08-31.wav,44100,16,60,1,ndsi,1024,1000,2000,2000,11000,0.933278958947423,NA 
rayol-farm2_2019-05-08_23-10-32.wav,44100,16,60,1,ndsi,1024,1000,2000,2000,11000,0.896356477914809,NA 
rayol-farm2_2019-05-08_23-12-32.wav,44100,16,60,1,ndsi,1024,1000,2000,2000,11000,0.922449713433994,NA 
rayol-farm2_2019-05-08_23-14-32.wav,44100,16,60,1,ndsi,1024,1000,2000,2000,11000,0.926591958162131,NA 
rayol-farm2_2019-05-08_23-16-32.wav,44100,16,60,1,ndsi,1024,1000,2000,2000,11000,0.928131907168078,NA 
rayol-farm2_2019-05-08_23-18-32.wav,44100,16,60,1,ndsi,1024,1000,2000,2000,11000,0.890531063918612,NA 
rayol-farm2_2019-05-08_23-20-32.wav,44100,16,60,1,ndsi,1024,1000,2000,2000,11000,0.879181666174622,NA 
rayol-farm2_2019-05-08_23-22-32.wav,44100,16,60,1,ndsi,1024,1000,2000,2000,11000,0.89918946908997,NA 
rayol-farm2_2019-05-08_23-24-32.wav,44100,16,60,1,ndsi,1024,1000,2000,2000,11000,0.896630368602311,NA 
rayol-farm2_2019-05-08_23-26-33.wav,44100,16,60,1,ndsi,1024,1000,2000,2000,11000,0.883936860696799,NA 
rayol-farm2_2019-05-08_23-28-33.wav,44100,16,60,1,ndsi,1024,1000,2000,2000,11000,0.882076421808018,NA 
rayol-farm2_2019-05-08_23-30-33.wav,44100,16,60,1,ndsi,1024,1000,2000,2000,11000,0.892721053544976,NA 
rayol-farm2_2019-05-08_23-32-33.wav,44100,16,60,1,ndsi,1024,1000,2000,2000,11000,0.87007346637358,NA 
rayol-farm2_2019-05-08_23-34-33.wav,44100,16,60,1,ndsi,1024,1000,2000,2000,11000,0.792266765228416,NA 
rayol-farm2_2019-05-08_23-36-33.wav,44100,16,59.88,1,ndsi,1024,1000,2000,2000,11000,0.569118321295088,NA 
rayol-farm2_2019-05-08_23-38-33.wav,44100,16,60,1,ndsi,1024,1000,2000,2000,11000,0.874908366863689,NA 
rayol-farm2_2019-05-08_23-40-33.wav,44100,16,60,1,ndsi,1024,1000,2000,2000,11000,0.879049271175033,NA 
rayol-farm2_2019-05-08_23-42-34.wav,44100,16,60,1,ndsi,1024,1000,2000,2000,11000,0.895314113585707,NA 
rayol-farm2_2019-05-08_23-44-34.wav,44100,16,60,1,ndsi,1024,1000,2000,2000,11000,0.905590899481467,NA 
rayol-farm2_2019-05-08_23-46-34.wav,44100,16,60,1,ndsi,1024,1000,2000,2000,11000,0.900805119499175,NA 
rayol-farm2_2019-05-08_23-48-34.wav,44100,16,60,1,ndsi,1024,1000,2000,2000,11000,0.904188920927291,NA 
rayol-farm2_2019-05-08_23-50-34.wav,44100,16,60,1,ndsi,1024,1000,2000,2000,11000,0.904826555769832,NA 
rayol-farm2_2019-05-08_23-52-34.wav,44100,16,60,1,ndsi,1024,1000,2000,2000,11000,0.893676609122764,NA 
rayol-farm2_2019-05-08_23-54-34.wav,44100,16,60,1,ndsi,1024,1000,2000,2000,11000,0.892296837428082,NA 
rayol-farm2_2019-05-08_23-56-34.wav,44100,16,60,1,ndsi,1024,1000,2000,2000,11000,0.885870992870522,NA 
rayol-farm2_2019-05-08_23-58-35.wav,44100,16,60,1,ndsi,1024,1000,2000,2000,11000,0.884990445272955,NA
