FILENAME,SAMPLINGRATE,BIT,DURATION,CHANNELS,INDEX,WL,ENVT,MSMOOTH,KSMOOTH,LEFT_CHANNEL,RIGHT_CHANNEL
rayol-farm2_2019-05-17_00-00-19.wav,44100,16,60,1,H,512,hil,NULL,NULL,0.897745012025242,NA 
rayol-farm2_2019-05-17_00-02-19.wav,44100,16,60,1,H,512,hil,NULL,NULL,0.895462093025713,NA 
rayol-farm2_2019-05-17_00-04-19.wav,44100,16,60,1,H,512,hil,NULL,NULL,0.893157175836801,NA 
rayol-farm2_2019-05-17_00-06-19.wav,44100,16,60,1,H,512,hil,NULL,NULL,0.896069089892509,NA 
rayol-farm2_2019-05-17_00-08-19.wav,44100,16,60,1,H,512,hil,NULL,NULL,0.898938507771828,NA 
rayol-farm2_2019-05-17_00-10-19.wav,44100,16,60,1,H,512,hil,NULL,NULL,0.896382669434154,NA 
rayol-farm2_2019-05-17_00-12-19.wav,44100,16,60,1,H,512,hil,NULL,NULL,0.89978522912162,NA 
rayol-farm2_2019-05-17_00-14-19.wav,44100,16,60,1,H,512,hil,NULL,NULL,0.89547785789339,NA 
rayol-farm2_2019-05-17_00-16-20.wav,44100,16,60,1,H,512,hil,NULL,NULL,0.89967015154794,NA 
rayol-farm2_2019-05-17_00-18-20.wav,44100,16,60,1,H,512,hil,NULL,NULL,0.899764861129675,NA 
rayol-farm2_2019-05-17_00-20-20.wav,44100,16,60,1,H,512,hil,NULL,NULL,0.899994651029743,NA 
rayol-farm2_2019-05-17_00-22-20.wav,44100,16,60,1,H,512,hil,NULL,NULL,0.897461127250132,NA 
rayol-farm2_2019-05-17_00-24-20.wav,44100,16,60,1,H,512,hil,NULL,NULL,0.895206604341125,NA 
rayol-farm2_2019-05-17_00-26-20.wav,44100,16,60,1,H,512,hil,NULL,NULL,0.897244360409691,NA 
rayol-farm2_2019-05-17_00-28-20.wav,44100,16,60,1,H,512,hil,NULL,NULL,0.89863131729794,NA 
rayol-farm2_2019-05-17_00-30-20.wav,44100,16,60,1,H,512,hil,NULL,NULL,0.900101440880152,NA 
rayol-farm2_2019-05-17_00-32-20.wav,44100,16,60,1,H,512,hil,NULL,NULL,0.897600756211698,NA 
rayol-farm2_2019-05-17_00-34-21.wav,44100,16,60,1,H,512,hil,NULL,NULL,0.899937788297002,NA 
rayol-farm2_2019-05-17_00-36-21.wav,44100,16,60,1,H,512,hil,NULL,NULL,0.899533955921067,NA 
rayol-farm2_2019-05-17_00-38-21.wav,44100,16,60,1,H,512,hil,NULL,NULL,0.899115656465699,NA 
rayol-farm2_2019-05-17_00-40-21.wav,44100,16,60,1,H,512,hil,NULL,NULL,0.899660655759098,NA 
rayol-farm2_2019-05-17_00-42-21.wav,44100,16,60,1,H,512,hil,NULL,NULL,0.899116190345548,NA 
rayol-farm2_2019-05-17_00-44-21.wav,44100,16,60,1,H,512,hil,NULL,NULL,0.896995478751386,NA 
rayol-farm2_2019-05-17_00-46-21.wav,44100,16,60,1,H,512,hil,NULL,NULL,0.896080790052731,NA 
rayol-farm2_2019-05-17_00-48-21.wav,44100,16,60,1,H,512,hil,NULL,NULL,0.897048903887633,NA 
rayol-farm2_2019-05-17_00-50-22.wav,44100,16,60,1,H,512,hil,NULL,NULL,0.896745793064054,NA 
rayol-farm2_2019-05-17_00-52-22.wav,44100,16,60,1,H,512,hil,NULL,NULL,0.896222637390568,NA 
rayol-farm2_2019-05-17_00-54-22.wav,44100,16,60,1,H,512,hil,NULL,NULL,0.899395990345315,NA 
rayol-farm2_2019-05-17_00-56-22.wav,44100,16,60,1,H,512,hil,NULL,NULL,0.899156706404694,NA 
rayol-farm2_2019-05-17_00-58-22.wav,44100,16,60,1,H,512,hil,NULL,NULL,0.899305793122669,NA 
rayol-farm2_2019-05-17_01-00-22.wav,44100,16,60,1,H,512,hil,NULL,NULL,0.89653643336099,NA 
rayol-farm2_2019-05-17_01-02-22.wav,44100,16,60,1,H,512,hil,NULL,NULL,0.90000774406596,NA 
rayol-farm2_2019-05-17_01-04-22.wav,44100,16,60,1,H,512,hil,NULL,NULL,0.89329172127656,NA 
rayol-farm2_2019-05-17_01-06-23.wav,44100,16,60,1,H,512,hil,NULL,NULL,0.896973874140996,NA 
rayol-farm2_2019-05-17_01-08-23.wav,44100,16,60,1,H,512,hil,NULL,NULL,0.898369391061711,NA 
rayol-farm2_2019-05-17_01-10-23.wav,44100,16,60,1,H,512,hil,NULL,NULL,0.900632839722149,NA 
rayol-farm2_2019-05-17_01-12-23.wav,44100,16,60,1,H,512,hil,NULL,NULL,0.90061595788804,NA 
rayol-farm2_2019-05-17_01-14-23.wav,44100,16,60,1,H,512,hil,NULL,NULL,0.90053739590068,NA 
rayol-farm2_2019-05-17_01-16-23.wav,44100,16,60,1,H,512,hil,NULL,NULL,0.899861581169943,NA 
rayol-farm2_2019-05-17_01-18-23.wav,44100,16,60,1,H,512,hil,NULL,NULL,0.899840524520812,NA 
rayol-farm2_2019-05-17_01-20-23.wav,44100,16,60,1,H,512,hil,NULL,NULL,0.900241484089166,NA 
rayol-farm2_2019-05-17_01-22-23.wav,44100,16,60,1,H,512,hil,NULL,NULL,0.900635961424605,NA 
rayol-farm2_2019-05-17_01-24-24.wav,44100,16,60,1,H,512,hil,NULL,NULL,0.89545774191715,NA 
rayol-farm2_2019-05-17_01-26-24.wav,44100,16,60,1,H,512,hil,NULL,NULL,0.898019743137438,NA 
rayol-farm2_2019-05-17_01-28-24.wav,44100,16,60,1,H,512,hil,NULL,NULL,0.898384651394904,NA 
rayol-farm2_2019-05-17_01-30-24.wav,44100,16,60,1,H,512,hil,NULL,NULL,0.900067397111485,NA 
rayol-farm2_2019-05-17_01-32-24.wav,44100,16,60,1,H,512,hil,NULL,NULL,0.900893483300893,NA 
rayol-farm2_2019-05-17_01-34-24.wav,44100,16,60,1,H,512,hil,NULL,NULL,0.901564830042979,NA 
rayol-farm2_2019-05-17_01-36-24.wav,44100,16,60,1,H,512,hil,NULL,NULL,0.901924755985117,NA 
rayol-farm2_2019-05-17_01-38-24.wav,44100,16,60,1,H,512,hil,NULL,NULL,0.898304030267683,NA 
rayol-farm2_2019-05-17_01-40-25.wav,44100,16,60,1,H,512,hil,NULL,NULL,0.898941419858107,NA 
rayol-farm2_2019-05-17_01-42-25.wav,44100,16,60,1,H,512,hil,NULL,NULL,0.900497799332132,NA 
rayol-farm2_2019-05-17_01-44-25.wav,44100,16,60,1,H,512,hil,NULL,NULL,0.901713088230917,NA 
rayol-farm2_2019-05-17_01-46-25.wav,44100,16,60,1,H,512,hil,NULL,NULL,0.900468171026146,NA 
rayol-farm2_2019-05-17_01-48-25.wav,44100,16,60,1,H,512,hil,NULL,NULL,0.899881802513388,NA 
rayol-farm2_2019-05-17_01-50-25.wav,44100,16,60,1,H,512,hil,NULL,NULL,0.900352839432751,NA 
rayol-farm2_2019-05-17_01-52-25.wav,44100,16,60,1,H,512,hil,NULL,NULL,0.901362563773092,NA 
rayol-farm2_2019-05-17_01-54-25.wav,44100,16,60,1,H,512,hil,NULL,NULL,0.900324722345659,NA 
rayol-farm2_2019-05-17_01-56-26.wav,44100,16,60,1,H,512,hil,NULL,NULL,0.90190466125126,NA 
rayol-farm2_2019-05-17_01-58-26.wav,44100,16,60,1,H,512,hil,NULL,NULL,0.901764370620291,NA 
rayol-farm2_2019-05-17_02-00-26.wav,44100,16,60,1,H,512,hil,NULL,NULL,0.90204173049501,NA 
rayol-farm2_2019-05-17_02-02-26.wav,44100,16,60,1,H,512,hil,NULL,NULL,0.902341199559372,NA 
rayol-farm2_2019-05-17_02-04-26.wav,44100,16,60,1,H,512,hil,NULL,NULL,0.901986811270568,NA 
rayol-farm2_2019-05-17_02-06-26.wav,44100,16,60,1,H,512,hil,NULL,NULL,0.903542458366479,NA 
rayol-farm2_2019-05-17_02-08-26.wav,44100,16,60,1,H,512,hil,NULL,NULL,0.901435484987023,NA 
rayol-farm2_2019-05-17_02-10-26.wav,44100,16,60,1,H,512,hil,NULL,NULL,0.900775162793731,NA 
rayol-farm2_2019-05-17_02-12-27.wav,44100,16,60,1,H,512,hil,NULL,NULL,0.90037020388643,NA 
rayol-farm2_2019-05-17_02-14-27.wav,44100,16,60,1,H,512,hil,NULL,NULL,0.901821836668111,NA 
rayol-farm2_2019-05-17_02-16-27.wav,44100,16,60,1,H,512,hil,NULL,NULL,0.902446763398163,NA 
rayol-farm2_2019-05-17_02-18-27.wav,44100,16,60,1,H,512,hil,NULL,NULL,0.901892679695266,NA 
rayol-farm2_2019-05-17_02-20-27.wav,44100,16,60,1,H,512,hil,NULL,NULL,0.902446747995704,NA 
rayol-farm2_2019-05-17_02-22-27.wav,44100,16,60,1,H,512,hil,NULL,NULL,0.901427996662007,NA 
rayol-farm2_2019-05-17_02-24-27.wav,44100,16,60,1,H,512,hil,NULL,NULL,0.90069347419487,NA 
rayol-farm2_2019-05-17_02-26-27.wav,44100,16,60,1,H,512,hil,NULL,NULL,0.901397445186307,NA 
rayol-farm2_2019-05-17_02-28-28.wav,44100,16,60,1,H,512,hil,NULL,NULL,0.901248015642797,NA 
rayol-farm2_2019-05-17_02-30-28.wav,44100,16,60,1,H,512,hil,NULL,NULL,0.897617838667002,NA 
rayol-farm2_2019-05-17_02-32-28.wav,44100,16,60,1,H,512,hil,NULL,NULL,0.897449664872224,NA 
rayol-farm2_2019-05-17_02-34-28.wav,44100,16,60,1,H,512,hil,NULL,NULL,0.897719932103914,NA 
rayol-farm2_2019-05-17_02-36-28.wav,44100,16,60,1,H,512,hil,NULL,NULL,0.898668460769043,NA 
rayol-farm2_2019-05-17_02-38-28.wav,44100,16,60,1,H,512,hil,NULL,NULL,0.898969078374686,NA 
rayol-farm2_2019-05-17_02-40-28.wav,44100,16,60,1,H,512,hil,NULL,NULL,0.899303380743877,NA 
rayol-farm2_2019-05-17_02-42-28.wav,44100,16,60,1,H,512,hil,NULL,NULL,0.895910038787105,NA 
rayol-farm2_2019-05-17_02-44-28.wav,44100,16,60,1,H,512,hil,NULL,NULL,0.89817860433872,NA 
rayol-farm2_2019-05-17_02-46-29.wav,44100,16,60,1,H,512,hil,NULL,NULL,0.897928920436205,NA 
rayol-farm2_2019-05-17_02-48-29.wav,44100,16,60,1,H,512,hil,NULL,NULL,0.898513704417366,NA 
rayol-farm2_2019-05-17_02-50-29.wav,44100,16,60,1,H,512,hil,NULL,NULL,0.897072275130003,NA 
rayol-farm2_2019-05-17_02-52-29.wav,44100,16,60,1,H,512,hil,NULL,NULL,0.89583496899371,NA 
rayol-farm2_2019-05-17_02-54-29.wav,44100,16,60,1,H,512,hil,NULL,NULL,0.897922598490793,NA 
rayol-farm2_2019-05-17_02-56-29.wav,44100,16,60,1,H,512,hil,NULL,NULL,0.898203794919166,NA 
rayol-farm2_2019-05-17_02-58-29.wav,44100,16,60,1,H,512,hil,NULL,NULL,0.898632384120232,NA 
rayol-farm2_2019-05-17_03-00-29.wav,44100,16,60,1,H,512,hil,NULL,NULL,0.899670975676095,NA 
rayol-farm2_2019-05-17_03-02-30.wav,44100,16,60,1,H,512,hil,NULL,NULL,0.899464716229247,NA 
rayol-farm2_2019-05-17_03-04-30.wav,44100,16,60,1,H,512,hil,NULL,NULL,0.899250729131541,NA 
rayol-farm2_2019-05-17_03-06-30.wav,44100,16,60,1,H,512,hil,NULL,NULL,0.898661169631085,NA 
rayol-farm2_2019-05-17_03-08-30.wav,44100,16,60,1,H,512,hil,NULL,NULL,0.898607600597881,NA 
rayol-farm2_2019-05-17_03-10-30.wav,44100,16,60,1,H,512,hil,NULL,NULL,0.899013584623713,NA 
rayol-farm2_2019-05-17_03-12-30.wav,44100,16,60,1,H,512,hil,NULL,NULL,0.897221246662331,NA 
rayol-farm2_2019-05-17_03-14-30.wav,44100,16,60,1,H,512,hil,NULL,NULL,0.895712026140479,NA 
rayol-farm2_2019-05-17_03-16-30.wav,44100,16,60,1,H,512,hil,NULL,NULL,0.896535607619435,NA 
rayol-farm2_2019-05-17_03-18-31.wav,44100,16,60,1,H,512,hil,NULL,NULL,0.898568893792226,NA 
rayol-farm2_2019-05-17_03-20-31.wav,44100,16,60,1,H,512,hil,NULL,NULL,0.897686619531361,NA 
rayol-farm2_2019-05-17_03-22-31.wav,44100,16,60,1,H,512,hil,NULL,NULL,0.898315046056729,NA 
rayol-farm2_2019-05-17_03-24-31.wav,44100,16,60,1,H,512,hil,NULL,NULL,0.898739692498489,NA 
rayol-farm2_2019-05-17_03-26-31.wav,44100,16,60,1,H,512,hil,NULL,NULL,0.899030722950919,NA 
rayol-farm2_2019-05-17_03-28-31.wav,44100,16,60,1,H,512,hil,NULL,NULL,0.899172269365014,NA 
rayol-farm2_2019-05-17_03-30-31.wav,44100,16,60,1,H,512,hil,NULL,NULL,0.899078093615504,NA 
rayol-farm2_2019-05-17_03-32-31.wav,44100,16,60,1,H,512,hil,NULL,NULL,0.897114447399538,NA 
rayol-farm2_2019-05-17_03-34-32.wav,44100,16,60,1,H,512,hil,NULL,NULL,0.892878832661758,NA 
rayol-farm2_2019-05-17_03-36-32.wav,44100,16,60,1,H,512,hil,NULL,NULL,0.891508389413738,NA 
rayol-farm2_2019-05-17_03-38-32.wav,44100,16,60,1,H,512,hil,NULL,NULL,0.891067313887529,NA 
rayol-farm2_2019-05-17_03-40-32.wav,44100,16,60,1,H,512,hil,NULL,NULL,0.895636660781855,NA 
rayol-farm2_2019-05-17_03-42-32.wav,44100,16,60,1,H,512,hil,NULL,NULL,0.897069064016405,NA 
rayol-farm2_2019-05-17_03-44-32.wav,44100,16,60,1,H,512,hil,NULL,NULL,0.89748451739685,NA 
rayol-farm2_2019-05-17_03-46-32.wav,44100,16,60,1,H,512,hil,NULL,NULL,0.898022800036694,NA 
rayol-farm2_2019-05-17_03-48-32.wav,44100,16,60,1,H,512,hil,NULL,NULL,0.896899837992945,NA 
rayol-farm2_2019-05-17_03-50-32.wav,44100,16,60,1,H,512,hil,NULL,NULL,0.897843536869062,NA 
rayol-farm2_2019-05-17_03-52-33.wav,44100,16,60,1,H,512,hil,NULL,NULL,0.896228207565572,NA 
rayol-farm2_2019-05-17_03-54-33.wav,44100,16,60,1,H,512,hil,NULL,NULL,0.893307200051165,NA 
rayol-farm2_2019-05-17_03-56-33.wav,44100,16,60,1,H,512,hil,NULL,NULL,0.895761158825311,NA 
rayol-farm2_2019-05-17_03-58-33.wav,44100,16,60,1,H,512,hil,NULL,NULL,0.896503074278004,NA 
rayol-farm2_2019-05-17_04-00-33.wav,44100,16,60,1,H,512,hil,NULL,NULL,0.895047456032193,NA 
rayol-farm2_2019-05-17_04-02-33.wav,44100,16,60,1,H,512,hil,NULL,NULL,0.8950466879275,NA 
rayol-farm2_2019-05-17_04-04-33.wav,44100,16,60,1,H,512,hil,NULL,NULL,0.89458952080963,NA 
rayol-farm2_2019-05-17_04-06-33.wav,44100,16,60,1,H,512,hil,NULL,NULL,0.894491145397082,NA 
rayol-farm2_2019-05-17_04-08-34.wav,44100,16,60,1,H,512,hil,NULL,NULL,0.894210100998365,NA 
rayol-farm2_2019-05-17_04-10-34.wav,44100,16,60,1,H,512,hil,NULL,NULL,0.895778903591833,NA 
rayol-farm2_2019-05-17_04-12-34.wav,44100,16,60,1,H,512,hil,NULL,NULL,0.896181498193575,NA 
rayol-farm2_2019-05-17_04-14-34.wav,44100,16,60,1,H,512,hil,NULL,NULL,0.8943681377147,NA 
rayol-farm2_2019-05-17_04-16-34.wav,44100,16,60,1,H,512,hil,NULL,NULL,0.896197172235835,NA 
rayol-farm2_2019-05-17_04-18-34.wav,44100,16,60,1,H,512,hil,NULL,NULL,0.895535301724185,NA 
rayol-farm2_2019-05-17_04-20-34.wav,44100,16,60,1,H,512,hil,NULL,NULL,0.895435883846589,NA 
rayol-farm2_2019-05-17_04-22-34.wav,44100,16,60,1,H,512,hil,NULL,NULL,0.897903858674127,NA 
rayol-farm2_2019-05-17_04-24-35.wav,44100,16,60,1,H,512,hil,NULL,NULL,0.899173706090156,NA 
rayol-farm2_2019-05-17_04-26-35.wav,44100,16,60,1,H,512,hil,NULL,NULL,0.898785888716013,NA 
rayol-farm2_2019-05-17_04-28-35.wav,44100,16,60,1,H,512,hil,NULL,NULL,0.899060806110857,NA 
rayol-farm2_2019-05-17_04-30-35.wav,44100,16,60,1,H,512,hil,NULL,NULL,0.898942324526532,NA 
rayol-farm2_2019-05-17_04-32-35.wav,44100,16,60,1,H,512,hil,NULL,NULL,0.89996650292698,NA 
rayol-farm2_2019-05-17_04-34-35.wav,44100,16,60,1,H,512,hil,NULL,NULL,0.899655677721488,NA 
rayol-farm2_2019-05-17_04-36-35.wav,44100,16,60,1,H,512,hil,NULL,NULL,0.899544840770614,NA 
rayol-farm2_2019-05-17_04-38-35.wav,44100,16,60,1,H,512,hil,NULL,NULL,0.898881114275628,NA 
rayol-farm2_2019-05-17_04-40-36.wav,44100,16,60,1,H,512,hil,NULL,NULL,0.896757291399158,NA 
rayol-farm2_2019-05-17_04-42-36.wav,44100,16,60,1,H,512,hil,NULL,NULL,0.897051221756867,NA 
rayol-farm2_2019-05-17_04-44-36.wav,44100,16,60,1,H,512,hil,NULL,NULL,0.898879943486713,NA 
rayol-farm2_2019-05-17_04-46-36.wav,44100,16,60,1,H,512,hil,NULL,NULL,0.899349012436711,NA 
rayol-farm2_2019-05-17_04-48-36.wav,44100,16,60,1,H,512,hil,NULL,NULL,0.898684939796113,NA 
rayol-farm2_2019-05-17_04-50-36.wav,44100,16,60,1,H,512,hil,NULL,NULL,0.900532450389156,NA 
rayol-farm2_2019-05-17_04-52-36.wav,44100,16,60,1,H,512,hil,NULL,NULL,0.900096678846234,NA 
rayol-farm2_2019-05-17_04-54-36.wav,44100,16,60,1,H,512,hil,NULL,NULL,0.900965171427496,NA 
rayol-farm2_2019-05-17_04-56-36.wav,44100,16,60,1,H,512,hil,NULL,NULL,0.891334760716268,NA 
rayol-farm2_2019-05-17_04-58-37.wav,44100,16,60,1,H,512,hil,NULL,NULL,0.901488110653718,NA 
rayol-farm2_2019-05-17_05-00-37.wav,44100,16,60,1,H,512,hil,NULL,NULL,0.901013686066601,NA 
rayol-farm2_2019-05-17_05-02-37.wav,44100,16,60,1,H,512,hil,NULL,NULL,0.897438486664594,NA 
rayol-farm2_2019-05-17_05-04-37.wav,44100,16,60,1,H,512,hil,NULL,NULL,0.901117334122302,NA 
rayol-farm2_2019-05-17_05-06-37.wav,44100,16,60,1,H,512,hil,NULL,NULL,0.902428525210852,NA 
rayol-farm2_2019-05-17_05-08-37.wav,44100,16,60,1,H,512,hil,NULL,NULL,0.903731034017603,NA 
rayol-farm2_2019-05-17_05-10-37.wav,44100,16,60,1,H,512,hil,NULL,NULL,0.903091990908284,NA 
rayol-farm2_2019-05-17_05-12-37.wav,44100,16,60,1,H,512,hil,NULL,NULL,0.90128981331771,NA 
rayol-farm2_2019-05-17_05-14-38.wav,44100,16,60,1,H,512,hil,NULL,NULL,0.901439069806998,NA 
rayol-farm2_2019-05-17_05-16-38.wav,44100,16,60,1,H,512,hil,NULL,NULL,0.903690836157696,NA 
rayol-farm2_2019-05-17_05-18-38.wav,44100,16,60,1,H,512,hil,NULL,NULL,0.903554963178388,NA 
rayol-farm2_2019-05-17_05-20-38.wav,44100,16,60,1,H,512,hil,NULL,NULL,0.789908478614041,NA 
rayol-farm2_2019-05-17_05-22-38.wav,44100,16,60,1,H,512,hil,NULL,NULL,0.889799593943685,NA 
rayol-farm2_2019-05-17_05-24-38.wav,44100,16,60,1,H,512,hil,NULL,NULL,0.823998001165362,NA 
rayol-farm2_2019-05-17_05-26-38.wav,44100,16,60,1,H,512,hil,NULL,NULL,0.904744712635546,NA 
rayol-farm2_2019-05-17_05-28-38.wav,44100,16,60,1,H,512,hil,NULL,NULL,0.90621839277626,NA 
rayol-farm2_2019-05-17_05-30-39.wav,44100,16,60,1,H,512,hil,NULL,NULL,0.907873786984749,NA 
rayol-farm2_2019-05-17_05-32-39.wav,44100,16,60,1,H,512,hil,NULL,NULL,0.907284456224412,NA 
rayol-farm2_2019-05-17_05-34-39.wav,44100,16,60,1,H,512,hil,NULL,NULL,0.907335518680989,NA 
rayol-farm2_2019-05-17_05-36-39.wav,44100,16,60,1,H,512,hil,NULL,NULL,0.905869306815554,NA 
rayol-farm2_2019-05-17_05-38-39.wav,44100,16,60,1,H,512,hil,NULL,NULL,0.903430278945587,NA 
rayol-farm2_2019-05-17_05-40-39.wav,44100,16,60,1,H,512,hil,NULL,NULL,0.904789100937373,NA 
rayol-farm2_2019-05-17_05-42-39.wav,44100,16,60,1,H,512,hil,NULL,NULL,0.906551664127183,NA 
rayol-farm2_2019-05-17_05-44-39.wav,44100,16,60,1,H,512,hil,NULL,NULL,0.907047205780888,NA 
rayol-farm2_2019-05-17_05-46-40.wav,44100,16,60,1,H,512,hil,NULL,NULL,0.904368487021556,NA 
rayol-farm2_2019-05-17_05-48-40.wav,44100,16,60,1,H,512,hil,NULL,NULL,0.906497273138282,NA 
rayol-farm2_2019-05-17_05-50-40.wav,44100,16,60,1,H,512,hil,NULL,NULL,0.907020034369102,NA 
rayol-farm2_2019-05-17_05-52-40.wav,44100,16,60,1,H,512,hil,NULL,NULL,0.908925807458405,NA 
rayol-farm2_2019-05-17_05-54-40.wav,44100,16,60,1,H,512,hil,NULL,NULL,0.907200816684891,NA 
rayol-farm2_2019-05-17_05-56-40.wav,44100,16,60,1,H,512,hil,NULL,NULL,0.902526898946496,NA 
rayol-farm2_2019-05-17_05-58-40.wav,44100,16,60,1,H,512,hil,NULL,NULL,0.886690711333469,NA 
rayol-farm2_2019-05-17_06-00-40.wav,44100,16,60,1,H,512,hil,NULL,NULL,0.887699054278707,NA 
rayol-farm2_2019-05-17_06-02-40.wav,44100,16,60,1,H,512,hil,NULL,NULL,0.886551434439237,NA 
rayol-farm2_2019-05-17_06-04-41.wav,44100,16,60,1,H,512,hil,NULL,NULL,0.885614214116011,NA 
rayol-farm2_2019-05-17_06-06-41.wav,44100,16,60,1,H,512,hil,NULL,NULL,0.884777058001877,NA 
rayol-farm2_2019-05-17_06-08-41.wav,44100,16,60,1,H,512,hil,NULL,NULL,0.886882717164008,NA 
rayol-farm2_2019-05-17_06-10-41.wav,44100,16,60,1,H,512,hil,NULL,NULL,0.887903333095311,NA 
rayol-farm2_2019-05-17_06-12-41.wav,44100,16,60,1,H,512,hil,NULL,NULL,0.883798313537378,NA 
rayol-farm2_2019-05-17_06-14-41.wav,44100,16,60,1,H,512,hil,NULL,NULL,0.882322668211571,NA 
rayol-farm2_2019-05-17_06-16-41.wav,44100,16,60,1,H,512,hil,NULL,NULL,0.878809124765989,NA 
rayol-farm2_2019-05-17_06-18-41.wav,44100,16,60,1,H,512,hil,NULL,NULL,0.879882862739722,NA 
rayol-farm2_2019-05-17_06-20-42.wav,44100,16,60,1,H,512,hil,NULL,NULL,0.871311282758353,NA 
rayol-farm2_2019-05-17_06-22-42.wav,44100,16,60,1,H,512,hil,NULL,NULL,0.879866943748302,NA 
rayol-farm2_2019-05-17_06-24-42.wav,44100,16,60,1,H,512,hil,NULL,NULL,0.874124550584564,NA 
rayol-farm2_2019-05-17_06-26-42.wav,44100,16,60,1,H,512,hil,NULL,NULL,0.87051104772802,NA 
rayol-farm2_2019-05-17_06-28-42.wav,44100,16,60,1,H,512,hil,NULL,NULL,0.870290942555138,NA 
rayol-farm2_2019-05-17_06-30-42.wav,44100,16,60,1,H,512,hil,NULL,NULL,0.874202891144312,NA 
rayol-farm2_2019-05-17_06-32-42.wav,44100,16,60,1,H,512,hil,NULL,NULL,0.876746145142879,NA 
rayol-farm2_2019-05-17_06-34-42.wav,44100,16,60,1,H,512,hil,NULL,NULL,0.878635467043884,NA 
rayol-farm2_2019-05-17_06-36-43.wav,44100,16,60,1,H,512,hil,NULL,NULL,0.879894389960215,NA 
rayol-farm2_2019-05-17_06-38-43.wav,44100,16,60,1,H,512,hil,NULL,NULL,0.869569293166492,NA 
rayol-farm2_2019-05-17_06-40-43.wav,44100,16,60,1,H,512,hil,NULL,NULL,0.892404012788784,NA 
rayol-farm2_2019-05-17_06-42-43.wav,44100,16,60,1,H,512,hil,NULL,NULL,0.849390209849595,NA 
rayol-farm2_2019-05-17_06-44-43.wav,44100,16,60,1,H,512,hil,NULL,NULL,0.901542278096189,NA 
rayol-farm2_2019-05-17_06-46-43.wav,44100,16,60,1,H,512,hil,NULL,NULL,0.892018000772082,NA 
rayol-farm2_2019-05-17_06-48-43.wav,44100,16,60,1,H,512,hil,NULL,NULL,0.888327907167073,NA 
rayol-farm2_2019-05-17_06-50-43.wav,44100,16,60,1,H,512,hil,NULL,NULL,0.883342610568824,NA 
rayol-farm2_2019-05-17_06-52-44.wav,44100,16,60,1,H,512,hil,NULL,NULL,0.879464388882539,NA 
rayol-farm2_2019-05-17_06-54-44.wav,44100,16,60,1,H,512,hil,NULL,NULL,0.876634524902878,NA 
rayol-farm2_2019-05-17_06-56-44.wav,44100,16,60,1,H,512,hil,NULL,NULL,0.843173056881087,NA 
rayol-farm2_2019-05-17_06-58-44.wav,44100,16,60,1,H,512,hil,NULL,NULL,0.811714025273161,NA 
rayol-farm2_2019-05-17_07-00-44.wav,44100,16,60,1,H,512,hil,NULL,NULL,0.84157645986641,NA 
rayol-farm2_2019-05-17_07-02-44.wav,44100,16,60,1,H,512,hil,NULL,NULL,0.861897753398522,NA 
rayol-farm2_2019-05-17_07-04-44.wav,44100,16,60,1,H,512,hil,NULL,NULL,0.880107347504558,NA 
rayol-farm2_2019-05-17_07-06-44.wav,44100,16,60,1,H,512,hil,NULL,NULL,0.891554859924533,NA 
rayol-farm2_2019-05-17_07-08-44.wav,44100,16,60,1,H,512,hil,NULL,NULL,0.878562400917491,NA 
rayol-farm2_2019-05-17_07-10-45.wav,44100,16,60,1,H,512,hil,NULL,NULL,0.823455763647695,NA 
rayol-farm2_2019-05-17_07-12-45.wav,44100,16,60,1,H,512,hil,NULL,NULL,0.893083019338065,NA 
rayol-farm2_2019-05-17_07-14-45.wav,44100,16,60,1,H,512,hil,NULL,NULL,0.869318084336726,NA 
rayol-farm2_2019-05-17_07-16-45.wav,44100,16,60,1,H,512,hil,NULL,NULL,0.870332181146101,NA 
rayol-farm2_2019-05-17_07-18-45.wav,44100,16,60,1,H,512,hil,NULL,NULL,0.897851981795478,NA 
rayol-farm2_2019-05-17_07-20-45.wav,44100,16,60,1,H,512,hil,NULL,NULL,0.898917848026504,NA 
rayol-farm2_2019-05-17_07-22-45.wav,44100,16,60,1,H,512,hil,NULL,NULL,0.888703932378389,NA 
rayol-farm2_2019-05-17_07-24-45.wav,44100,16,60,1,H,512,hil,NULL,NULL,0.896549288947548,NA 
rayol-farm2_2019-05-17_07-26-46.wav,44100,16,60,1,H,512,hil,NULL,NULL,0.903803608632393,NA 
rayol-farm2_2019-05-17_07-28-46.wav,44100,16,60,1,H,512,hil,NULL,NULL,0.857604789457852,NA 
rayol-farm2_2019-05-17_07-30-46.wav,44100,16,60,1,H,512,hil,NULL,NULL,0.860146897490489,NA 
rayol-farm2_2019-05-17_07-32-46.wav,44100,16,60,1,H,512,hil,NULL,NULL,0.898316316188576,NA 
rayol-farm2_2019-05-17_07-34-46.wav,44100,16,60,1,H,512,hil,NULL,NULL,0.891475155871254,NA 
rayol-farm2_2019-05-17_07-36-46.wav,44100,16,60,1,H,512,hil,NULL,NULL,0.887390979434913,NA 
rayol-farm2_2019-05-17_07-38-46.wav,44100,16,60,1,H,512,hil,NULL,NULL,0.894421124634389,NA 
rayol-farm2_2019-05-17_07-40-46.wav,44100,16,60,1,H,512,hil,NULL,NULL,0.902609963835435,NA 
rayol-farm2_2019-05-17_07-42-47.wav,44100,16,60,1,H,512,hil,NULL,NULL,0.893501758438215,NA 
rayol-farm2_2019-05-17_07-44-47.wav,44100,16,60,1,H,512,hil,NULL,NULL,0.890415909536761,NA 
rayol-farm2_2019-05-17_07-46-47.wav,44100,16,60,1,H,512,hil,NULL,NULL,0.886808263763825,NA 
rayol-farm2_2019-05-17_07-48-47.wav,44100,16,60,1,H,512,hil,NULL,NULL,0.871977488211315,NA 
rayol-farm2_2019-05-17_07-50-47.wav,44100,16,60,1,H,512,hil,NULL,NULL,0.88290330335527,NA 
rayol-farm2_2019-05-17_07-52-47.wav,44100,16,60,1,H,512,hil,NULL,NULL,0.888564878072662,NA 
rayol-farm2_2019-05-17_07-54-47.wav,44100,16,60,1,H,512,hil,NULL,NULL,0.899579290664121,NA 
rayol-farm2_2019-05-17_07-56-47.wav,44100,16,60,1,H,512,hil,NULL,NULL,0.895078573235687,NA 
rayol-farm2_2019-05-17_07-58-48.wav,44100,16,60,1,H,512,hil,NULL,NULL,0.889467021182263,NA 
rayol-farm2_2019-05-17_08-00-48.wav,44100,16,60,1,H,512,hil,NULL,NULL,0.884168876134562,NA 
rayol-farm2_2019-05-17_08-02-48.wav,44100,16,60,1,H,512,hil,NULL,NULL,0.872065083510495,NA 
rayol-farm2_2019-05-17_08-04-48.wav,44100,16,60,1,H,512,hil,NULL,NULL,0.884252293996974,NA 
rayol-farm2_2019-05-17_08-06-48.wav,44100,16,60,1,H,512,hil,NULL,NULL,0.884270065490375,NA 
rayol-farm2_2019-05-17_08-08-48.wav,44100,16,60,1,H,512,hil,NULL,NULL,0.884770082467984,NA 
rayol-farm2_2019-05-17_08-10-48.wav,44100,16,60,1,H,512,hil,NULL,NULL,0.842959515503134,NA 
rayol-farm2_2019-05-17_08-12-48.wav,44100,16,60,1,H,512,hil,NULL,NULL,0.87849985022549,NA 
rayol-farm2_2019-05-17_08-14-48.wav,44100,16,60,1,H,512,hil,NULL,NULL,0.871738074768338,NA 
rayol-farm2_2019-05-17_08-16-49.wav,44100,16,60,1,H,512,hil,NULL,NULL,0.871251925349511,NA 
rayol-farm2_2019-05-17_08-18-49.wav,44100,16,60,1,H,512,hil,NULL,NULL,0.886152404307683,NA 
rayol-farm2_2019-05-17_08-20-49.wav,44100,16,60,1,H,512,hil,NULL,NULL,0.886474112097483,NA 
rayol-farm2_2019-05-17_08-22-49.wav,44100,16,60,1,H,512,hil,NULL,NULL,0.850932336992331,NA 
rayol-farm2_2019-05-17_08-24-49.wav,44100,16,60,1,H,512,hil,NULL,NULL,0.863892638986024,NA 
rayol-farm2_2019-05-17_08-26-49.wav,44100,16,60,1,H,512,hil,NULL,NULL,0.892793240101465,NA 
rayol-farm2_2019-05-17_08-28-49.wav,44100,16,60,1,H,512,hil,NULL,NULL,0.875742117823636,NA 
rayol-farm2_2019-05-17_08-30-49.wav,44100,16,60,1,H,512,hil,NULL,NULL,0.83623484322544,NA 
rayol-farm2_2019-05-17_08-32-50.wav,44100,16,60,1,H,512,hil,NULL,NULL,0.829096937289103,NA 
rayol-farm2_2019-05-17_08-34-50.wav,44100,16,60,1,H,512,hil,NULL,NULL,0.849749416638148,NA 
rayol-farm2_2019-05-17_08-36-50.wav,44100,16,60,1,H,512,hil,NULL,NULL,0.873064212716793,NA 
rayol-farm2_2019-05-17_08-38-50.wav,44100,16,60,1,H,512,hil,NULL,NULL,0.888622896258018,NA 
rayol-farm2_2019-05-17_08-40-50.wav,44100,16,60,1,H,512,hil,NULL,NULL,0.867146692631511,NA 
rayol-farm2_2019-05-17_08-42-50.wav,44100,16,60,1,H,512,hil,NULL,NULL,0.842626244844941,NA 
rayol-farm2_2019-05-17_08-44-50.wav,44100,16,60,1,H,512,hil,NULL,NULL,0.889149095677545,NA 
rayol-farm2_2019-05-17_08-46-50.wav,44100,16,60,1,H,512,hil,NULL,NULL,0.867994145046542,NA 
rayol-farm2_2019-05-17_08-48-51.wav,44100,16,60,1,H,512,hil,NULL,NULL,0.841290718267655,NA 
rayol-farm2_2019-05-17_08-50-51.wav,44100,16,60,1,H,512,hil,NULL,NULL,0.841045431391056,NA 
rayol-farm2_2019-05-17_08-52-51.wav,44100,16,60,1,H,512,hil,NULL,NULL,0.866518742140731,NA 
rayol-farm2_2019-05-17_08-54-51.wav,44100,16,60,1,H,512,hil,NULL,NULL,0.814882951616388,NA 
rayol-farm2_2019-05-17_08-56-51.wav,44100,16,60,1,H,512,hil,NULL,NULL,0.879597834952833,NA 
rayol-farm2_2019-05-17_08-58-51.wav,44100,16,60,1,H,512,hil,NULL,NULL,0.844366349288635,NA 
rayol-farm2_2019-05-17_09-00-51.wav,44100,16,60,1,H,512,hil,NULL,NULL,0.855662370618205,NA 
rayol-farm2_2019-05-17_09-02-51.wav,44100,16,60,1,H,512,hil,NULL,NULL,0.874900076531827,NA 
rayol-farm2_2019-05-17_09-04-52.wav,44100,16,60,1,H,512,hil,NULL,NULL,0.862438581482834,NA 
rayol-farm2_2019-05-17_09-06-52.wav,44100,16,60,1,H,512,hil,NULL,NULL,0.888356310092878,NA 
rayol-farm2_2019-05-17_09-08-52.wav,44100,16,60,1,H,512,hil,NULL,NULL,0.889714819222831,NA 
rayol-farm2_2019-05-17_09-10-52.wav,44100,16,60,1,H,512,hil,NULL,NULL,0.88947126038102,NA 
rayol-farm2_2019-05-17_09-12-52.wav,44100,16,60,1,H,512,hil,NULL,NULL,0.869442096427711,NA 
rayol-farm2_2019-05-17_09-14-52.wav,44100,16,60,1,H,512,hil,NULL,NULL,0.88365684208268,NA 
rayol-farm2_2019-05-17_09-16-52.wav,44100,16,60,1,H,512,hil,NULL,NULL,0.874785032285652,NA 
rayol-farm2_2019-05-17_09-18-52.wav,44100,16,60,1,H,512,hil,NULL,NULL,0.878781535573207,NA 
rayol-farm2_2019-05-17_09-20-52.wav,44100,16,60,1,H,512,hil,NULL,NULL,0.828112483318155,NA 
rayol-farm2_2019-05-17_09-22-53.wav,44100,16,60,1,H,512,hil,NULL,NULL,0.819483495858347,NA 
rayol-farm2_2019-05-17_09-24-53.wav,44100,16,60,1,H,512,hil,NULL,NULL,0.825508668627354,NA 
rayol-farm2_2019-05-17_09-26-53.wav,44100,16,60,1,H,512,hil,NULL,NULL,0.851765192957931,NA 
rayol-farm2_2019-05-17_09-28-53.wav,44100,16,60,1,H,512,hil,NULL,NULL,0.840850454841901,NA 
rayol-farm2_2019-05-17_09-30-53.wav,44100,16,60,1,H,512,hil,NULL,NULL,0.85421235771504,NA 
rayol-farm2_2019-05-17_09-32-53.wav,44100,16,60,1,H,512,hil,NULL,NULL,0.854085322934475,NA 
rayol-farm2_2019-05-17_09-34-53.wav,44100,16,60,1,H,512,hil,NULL,NULL,0.841936570024763,NA 
rayol-farm2_2019-05-17_09-36-53.wav,44100,16,60,1,H,512,hil,NULL,NULL,0.866547854191683,NA 
rayol-farm2_2019-05-17_09-38-54.wav,44100,16,60,1,H,512,hil,NULL,NULL,0.890888994334354,NA 
rayol-farm2_2019-05-17_09-40-54.wav,44100,16,60,1,H,512,hil,NULL,NULL,0.834953482545573,NA 
rayol-farm2_2019-05-17_09-42-54.wav,44100,16,60,1,H,512,hil,NULL,NULL,0.852633737745009,NA 
rayol-farm2_2019-05-17_09-44-54.wav,44100,16,60,1,H,512,hil,NULL,NULL,0.806783915707212,NA 
rayol-farm2_2019-05-17_09-46-54.wav,44100,16,60,1,H,512,hil,NULL,NULL,0.784880537076924,NA 
rayol-farm2_2019-05-17_09-48-54.wav,44100,16,60,1,H,512,hil,NULL,NULL,0.838705583836787,NA 
rayol-farm2_2019-05-17_09-50-54.wav,44100,16,60,1,H,512,hil,NULL,NULL,0.811138076168922,NA 
rayol-farm2_2019-05-17_09-52-54.wav,44100,16,60,1,H,512,hil,NULL,NULL,0.873073565745254,NA 
rayol-farm2_2019-05-17_09-54-55.wav,44100,16,60,1,H,512,hil,NULL,NULL,0.863374377269228,NA 
rayol-farm2_2019-05-17_09-56-55.wav,44100,16,60,1,H,512,hil,NULL,NULL,0.825371636807708,NA 
rayol-farm2_2019-05-17_09-58-55.wav,44100,16,60,1,H,512,hil,NULL,NULL,0.832003545043869,NA 
rayol-farm2_2019-05-17_10-00-55.wav,44100,16,60,1,H,512,hil,NULL,NULL,0.826273544714609,NA 
rayol-farm2_2019-05-17_10-02-55.wav,44100,16,60,1,H,512,hil,NULL,NULL,0.828856018956964,NA 
rayol-farm2_2019-05-17_10-04-55.wav,44100,16,60,1,H,512,hil,NULL,NULL,0.866291563541838,NA 
rayol-farm2_2019-05-17_10-06-55.wav,44100,16,60,1,H,512,hil,NULL,NULL,0.841930190501733,NA 
rayol-farm2_2019-05-17_10-08-55.wav,44100,16,60,1,H,512,hil,NULL,NULL,0.859721173595275,NA 
rayol-farm2_2019-05-17_10-10-56.wav,44100,16,60,1,H,512,hil,NULL,NULL,0.860254795861825,NA 
rayol-farm2_2019-05-17_10-12-56.wav,44100,16,60,1,H,512,hil,NULL,NULL,0.839881224533217,NA 
rayol-farm2_2019-05-17_10-14-56.wav,44100,16,60,1,H,512,hil,NULL,NULL,0.848246844290358,NA 
rayol-farm2_2019-05-17_10-16-56.wav,44100,16,60,1,H,512,hil,NULL,NULL,0.84486913736201,NA 
rayol-farm2_2019-05-17_10-18-56.wav,44100,16,60,1,H,512,hil,NULL,NULL,0.837134292342342,NA 
rayol-farm2_2019-05-17_10-20-56.wav,44100,16,60,1,H,512,hil,NULL,NULL,0.814979862290624,NA 
rayol-farm2_2019-05-17_10-22-56.wav,44100,16,60,1,H,512,hil,NULL,NULL,0.763119390866053,NA 
rayol-farm2_2019-05-17_10-24-56.wav,44100,16,60,1,H,512,hil,NULL,NULL,0.838940551073942,NA 
rayol-farm2_2019-05-17_10-26-56.wav,44100,16,60,1,H,512,hil,NULL,NULL,0.852658073683005,NA 
rayol-farm2_2019-05-17_10-28-57.wav,44100,16,60,1,H,512,hil,NULL,NULL,0.851332668570874,NA 
rayol-farm2_2019-05-17_10-30-57.wav,44100,16,60,1,H,512,hil,NULL,NULL,0.833613451846213,NA 
rayol-farm2_2019-05-17_10-32-57.wav,44100,16,60,1,H,512,hil,NULL,NULL,0.859651989104271,NA 
rayol-farm2_2019-05-17_10-34-57.wav,44100,16,60,1,H,512,hil,NULL,NULL,0.848843461695069,NA 
rayol-farm2_2019-05-17_10-36-57.wav,44100,16,60,1,H,512,hil,NULL,NULL,0.789123210875584,NA 
rayol-farm2_2019-05-17_10-38-57.wav,44100,16,60,1,H,512,hil,NULL,NULL,0.742191836766882,NA 
rayol-farm2_2019-05-17_10-40-57.wav,44100,16,60,1,H,512,hil,NULL,NULL,0.799715707438666,NA 
rayol-farm2_2019-05-17_10-42-57.wav,44100,16,60,1,H,512,hil,NULL,NULL,0.86311766949868,NA 
rayol-farm2_2019-05-17_10-44-58.wav,44100,16,60,1,H,512,hil,NULL,NULL,0.865097309766839,NA 
rayol-farm2_2019-05-17_10-46-58.wav,44100,16,60,1,H,512,hil,NULL,NULL,0.817929710748442,NA 
rayol-farm2_2019-05-17_10-48-58.wav,44100,16,60,1,H,512,hil,NULL,NULL,0.84324565051227,NA 
rayol-farm2_2019-05-17_10-50-58.wav,44100,16,60,1,H,512,hil,NULL,NULL,0.812581142679698,NA 
rayol-farm2_2019-05-17_10-52-58.wav,44100,16,60,1,H,512,hil,NULL,NULL,0.790660931559752,NA 
rayol-farm2_2019-05-17_10-54-58.wav,44100,16,60,1,H,512,hil,NULL,NULL,0.818560619742679,NA 
rayol-farm2_2019-05-17_10-56-58.wav,44100,16,60,1,H,512,hil,NULL,NULL,0.806689842915926,NA 
rayol-farm2_2019-05-17_10-58-58.wav,44100,16,60,1,H,512,hil,NULL,NULL,0.823726235176376,NA 
rayol-farm2_2019-05-17_11-00-59.wav,44100,16,60,1,H,512,hil,NULL,NULL,0.835568374835088,NA 
rayol-farm2_2019-05-17_11-02-59.wav,44100,16,60,1,H,512,hil,NULL,NULL,0.784390016760435,NA 
rayol-farm2_2019-05-17_11-04-59.wav,44100,16,60,1,H,512,hil,NULL,NULL,0.844240686975119,NA 
rayol-farm2_2019-05-17_11-06-59.wav,44100,16,60,1,H,512,hil,NULL,NULL,0.822545324679419,NA 
rayol-farm2_2019-05-17_11-08-59.wav,44100,16,60,1,H,512,hil,NULL,NULL,0.864273769483642,NA 
rayol-farm2_2019-05-17_11-10-59.wav,44100,16,60,1,H,512,hil,NULL,NULL,0.804459988372794,NA 
rayol-farm2_2019-05-17_11-12-59.wav,44100,16,60,1,H,512,hil,NULL,NULL,0.810553143635661,NA 
rayol-farm2_2019-05-17_11-14-59.wav,44100,16,60,1,H,512,hil,NULL,NULL,0.771553095006088,NA 
rayol-farm2_2019-05-17_11-16-59.wav,44100,16,60,1,H,512,hil,NULL,NULL,0.853477199331917,NA 
rayol-farm2_2019-05-17_11-19-00.wav,44100,16,60,1,H,512,hil,NULL,NULL,0.739255721960981,NA 
rayol-farm2_2019-05-17_11-21-00.wav,44100,16,60,1,H,512,hil,NULL,NULL,0.836344405876967,NA 
rayol-farm2_2019-05-17_11-23-00.wav,44100,16,60,1,H,512,hil,NULL,NULL,0.825616704982598,NA 
rayol-farm2_2019-05-17_11-25-00.wav,44100,16,60,1,H,512,hil,NULL,NULL,0.837027406167393,NA 
rayol-farm2_2019-05-17_11-27-00.wav,44100,16,60,1,H,512,hil,NULL,NULL,0.687837597730749,NA 
rayol-farm2_2019-05-17_11-29-00.wav,44100,16,60,1,H,512,hil,NULL,NULL,0.836616089097797,NA 
rayol-farm2_2019-05-17_11-31-00.wav,44100,16,60,1,H,512,hil,NULL,NULL,0.826218309947597,NA 
rayol-farm2_2019-05-17_11-33-00.wav,44100,16,60,1,H,512,hil,NULL,NULL,0.841600485297616,NA 
rayol-farm2_2019-05-17_11-35-01.wav,44100,16,60,1,H,512,hil,NULL,NULL,0.831941853460956,NA 
rayol-farm2_2019-05-17_11-37-01.wav,44100,16,60,1,H,512,hil,NULL,NULL,0.815825730431394,NA 
rayol-farm2_2019-05-17_11-39-01.wav,44100,16,60,1,H,512,hil,NULL,NULL,0.772698270803752,NA 
rayol-farm2_2019-05-17_11-41-01.wav,44100,16,60,1,H,512,hil,NULL,NULL,0.84686880176645,NA 
rayol-farm2_2019-05-17_11-43-01.wav,44100,16,60,1,H,512,hil,NULL,NULL,0.704417010719077,NA 
rayol-farm2_2019-05-17_11-45-01.wav,44100,16,60,1,H,512,hil,NULL,NULL,0.836202211529855,NA 
rayol-farm2_2019-05-17_11-47-01.wav,44100,16,60,1,H,512,hil,NULL,NULL,0.719711761443651,NA 
rayol-farm2_2019-05-17_11-49-01.wav,44100,16,60,1,H,512,hil,NULL,NULL,0.856800008074455,NA 
rayol-farm2_2019-05-17_11-51-02.wav,44100,16,60,1,H,512,hil,NULL,NULL,0.867988154971074,NA 
rayol-farm2_2019-05-17_11-53-02.wav,44100,16,60,1,H,512,hil,NULL,NULL,0.817848310149872,NA 
rayol-farm2_2019-05-17_11-55-02.wav,44100,16,60,1,H,512,hil,NULL,NULL,0.762677905793456,NA 
rayol-farm2_2019-05-17_11-57-02.wav,44100,16,60,1,H,512,hil,NULL,NULL,0.793152032342404,NA 
rayol-farm2_2019-05-17_11-59-02.wav,44100,16,60,1,H,512,hil,NULL,NULL,0.851116074104506,NA 
rayol-farm2_2019-05-17_12-01-02.wav,44100,16,60,1,H,512,hil,NULL,NULL,0.817310072452071,NA 
rayol-farm2_2019-05-17_12-03-02.wav,44100,16,60,1,H,512,hil,NULL,NULL,0.862697988767686,NA 
rayol-farm2_2019-05-17_12-05-02.wav,44100,16,60,1,H,512,hil,NULL,NULL,0.828886210732548,NA 
rayol-farm2_2019-05-17_12-07-03.wav,44100,16,60,1,H,512,hil,NULL,NULL,0.857213456707521,NA 
rayol-farm2_2019-05-17_12-09-03.wav,44100,16,60,1,H,512,hil,NULL,NULL,0.855995177620059,NA 
rayol-farm2_2019-05-17_12-11-03.wav,44100,16,60,1,H,512,hil,NULL,NULL,0.806081202910156,NA 
rayol-farm2_2019-05-17_12-13-03.wav,44100,16,60,1,H,512,hil,NULL,NULL,0.834935617380079,NA 
rayol-farm2_2019-05-17_12-15-03.wav,44100,16,60,1,H,512,hil,NULL,NULL,0.848563973726111,NA 
rayol-farm2_2019-05-17_12-17-03.wav,44100,16,60,1,H,512,hil,NULL,NULL,0.836429481457122,NA 
rayol-farm2_2019-05-17_12-19-03.wav,44100,16,60,1,H,512,hil,NULL,NULL,0.831956085154395,NA 
rayol-farm2_2019-05-17_12-21-03.wav,44100,16,60,1,H,512,hil,NULL,NULL,0.856247449061594,NA 
rayol-farm2_2019-05-17_12-23-04.wav,44100,16,60,1,H,512,hil,NULL,NULL,0.842304736132869,NA 
rayol-farm2_2019-05-17_12-25-04.wav,44100,16,60,1,H,512,hil,NULL,NULL,0.859109497351529,NA 
rayol-farm2_2019-05-17_12-27-04.wav,44100,16,60,1,H,512,hil,NULL,NULL,0.857840487238547,NA 
rayol-farm2_2019-05-17_12-29-04.wav,44100,16,60,1,H,512,hil,NULL,NULL,0.848859544870447,NA 
rayol-farm2_2019-05-17_12-31-04.wav,44100,16,60,1,H,512,hil,NULL,NULL,0.854148829394009,NA 
rayol-farm2_2019-05-17_12-33-04.wav,44100,16,60,1,H,512,hil,NULL,NULL,0.863490955490769,NA 
rayol-farm2_2019-05-17_12-35-04.wav,44100,16,60,1,H,512,hil,NULL,NULL,0.869577068660171,NA 
rayol-farm2_2019-05-17_12-37-04.wav,44100,16,60,1,H,512,hil,NULL,NULL,0.863595118232369,NA 
rayol-farm2_2019-05-17_12-39-04.wav,44100,16,60,1,H,512,hil,NULL,NULL,0.845771374128623,NA 
rayol-farm2_2019-05-17_12-41-05.wav,44100,16,60,1,H,512,hil,NULL,NULL,0.845089088710658,NA 
rayol-farm2_2019-05-17_12-43-05.wav,44100,16,60,1,H,512,hil,NULL,NULL,0.818613047897529,NA 
rayol-farm2_2019-05-17_12-45-05.wav,44100,16,60,1,H,512,hil,NULL,NULL,0.849429932943537,NA 
rayol-farm2_2019-05-17_12-47-05.wav,44100,16,60,1,H,512,hil,NULL,NULL,0.829393489914797,NA 
rayol-farm2_2019-05-17_12-49-05.wav,44100,16,60,1,H,512,hil,NULL,NULL,0.822547911279017,NA 
rayol-farm2_2019-05-17_12-51-05.wav,44100,16,60,1,H,512,hil,NULL,NULL,0.749455744118442,NA 
rayol-farm2_2019-05-17_12-53-05.wav,44100,16,60,1,H,512,hil,NULL,NULL,0.781058213248903,NA 
rayol-farm2_2019-05-17_12-55-05.wav,44100,16,60,1,H,512,hil,NULL,NULL,0.825820325010588,NA 
rayol-farm2_2019-05-17_12-57-06.wav,44100,16,60,1,H,512,hil,NULL,NULL,0.854790873946228,NA 
rayol-farm2_2019-05-17_12-59-06.wav,44100,16,60,1,H,512,hil,NULL,NULL,0.854817824444643,NA 
rayol-farm2_2019-05-17_13-01-06.wav,44100,16,60,1,H,512,hil,NULL,NULL,0.834638978693667,NA 
rayol-farm2_2019-05-17_13-03-06.wav,44100,16,60,1,H,512,hil,NULL,NULL,0.797974590349016,NA 
rayol-farm2_2019-05-17_13-05-06.wav,44100,16,60,1,H,512,hil,NULL,NULL,0.835608891898091,NA 
rayol-farm2_2019-05-17_13-07-06.wav,44100,16,60,1,H,512,hil,NULL,NULL,0.837946425938007,NA 
rayol-farm2_2019-05-17_13-09-06.wav,44100,16,60,1,H,512,hil,NULL,NULL,0.874458016874518,NA 
rayol-farm2_2019-05-17_13-11-06.wav,44100,16,60,1,H,512,hil,NULL,NULL,0.863632394135014,NA 
rayol-farm2_2019-05-17_13-13-07.wav,44100,16,60,1,H,512,hil,NULL,NULL,0.815142120990368,NA 
rayol-farm2_2019-05-17_13-15-07.wav,44100,16,60,1,H,512,hil,NULL,NULL,0.868634769825651,NA 
rayol-farm2_2019-05-17_13-17-07.wav,44100,16,60,1,H,512,hil,NULL,NULL,0.867467063637885,NA 
rayol-farm2_2019-05-17_13-19-07.wav,44100,16,60,1,H,512,hil,NULL,NULL,0.818080206386473,NA 
rayol-farm2_2019-05-17_13-21-07.wav,44100,16,60,1,H,512,hil,NULL,NULL,0.785507462453978,NA 
rayol-farm2_2019-05-17_13-23-07.wav,44100,16,60,1,H,512,hil,NULL,NULL,0.860715203900208,NA 
rayol-farm2_2019-05-17_13-25-07.wav,44100,16,60,1,H,512,hil,NULL,NULL,0.860216989416186,NA 
rayol-farm2_2019-05-17_13-27-07.wav,44100,16,60,1,H,512,hil,NULL,NULL,0.836892182883464,NA 
rayol-farm2_2019-05-17_13-29-08.wav,44100,16,60,1,H,512,hil,NULL,NULL,0.772546595151876,NA 
rayol-farm2_2019-05-17_13-31-08.wav,44100,16,60,1,H,512,hil,NULL,NULL,0.767419349436867,NA 
rayol-farm2_2019-05-17_13-33-08.wav,44100,16,60,1,H,512,hil,NULL,NULL,0.76119759689132,NA 
rayol-farm2_2019-05-17_13-35-08.wav,44100,16,60,1,H,512,hil,NULL,NULL,0.81952464597075,NA 
rayol-farm2_2019-05-17_13-37-08.wav,44100,16,60,1,H,512,hil,NULL,NULL,0.855986417708768,NA 
rayol-farm2_2019-05-17_13-39-08.wav,44100,16,60,1,H,512,hil,NULL,NULL,0.863020433199766,NA 
rayol-farm2_2019-05-17_13-41-08.wav,44100,16,60,1,H,512,hil,NULL,NULL,0.823128325727761,NA 
rayol-farm2_2019-05-17_13-43-08.wav,44100,16,60,1,H,512,hil,NULL,NULL,0.835253554531629,NA 
rayol-farm2_2019-05-17_13-45-09.wav,44100,16,60,1,H,512,hil,NULL,NULL,0.828974170522023,NA 
rayol-farm2_2019-05-17_13-47-09.wav,44100,16,60,1,H,512,hil,NULL,NULL,0.75368271393909,NA 
rayol-farm2_2019-05-17_13-49-09.wav,44100,16,60,1,H,512,hil,NULL,NULL,0.84197413018871,NA 
rayol-farm2_2019-05-17_13-51-09.wav,44100,16,60,1,H,512,hil,NULL,NULL,0.866900735878017,NA
