FILENAME,SAMPLINGRATE,BIT,DURATION,CHANNELS,INDEX,FFT_W,MIN_FREQ,MAX_FREQ,LEFT_CHANNEL,RIGHT_CHANNEL
rayol-farm2_2019-04-30_00-01-19.wav,44100,16,60,1,bioacoustic_index,512,2000,8000,1.26830181366113,NA 
rayol-farm2_2019-04-30_00-03-19.wav,44100,16,60,1,bioacoustic_index,512,2000,8000,1.25091256791977,NA 
rayol-farm2_2019-04-30_00-05-20.wav,44100,16,60,1,bioacoustic_index,512,2000,8000,1.29286793498542,NA 
rayol-farm2_2019-04-30_00-07-20.wav,44100,16,60,1,bioacoustic_index,512,2000,8000,1.2800523634919,NA 
rayol-farm2_2019-04-30_00-09-20.wav,44100,16,60,1,bioacoustic_index,512,2000,8000,1.20697125348266,NA 
rayol-farm2_2019-04-30_00-11-20.wav,44100,16,60,1,bioacoustic_index,512,2000,8000,1.29365727355377,NA 
rayol-farm2_2019-04-30_00-13-20.wav,44100,16,60,1,bioacoustic_index,512,2000,8000,1.23844450981382,NA 
rayol-farm2_2019-04-30_00-15-20.wav,44100,16,60,1,bioacoustic_index,512,2000,8000,1.30329281035105,NA 
rayol-farm2_2019-04-30_00-17-20.wav,44100,16,60,1,bioacoustic_index,512,2000,8000,1.1932239652252,NA 
rayol-farm2_2019-04-30_00-19-20.wav,44100,16,60,1,bioacoustic_index,512,2000,8000,1.23659317191984,NA 
rayol-farm2_2019-04-30_00-21-21.wav,44100,16,60,1,bioacoustic_index,512,2000,8000,1.25586006663983,NA 
rayol-farm2_2019-04-30_00-23-21.wav,44100,16,60,1,bioacoustic_index,512,2000,8000,1.25192727955168,NA 
rayol-farm2_2019-04-30_00-25-21.wav,44100,16,60,1,bioacoustic_index,512,2000,8000,1.24171869997141,NA 
rayol-farm2_2019-04-30_00-27-21.wav,44100,16,60,1,bioacoustic_index,512,2000,8000,1.28627432842099,NA 
rayol-farm2_2019-04-30_00-29-21.wav,44100,16,60,1,bioacoustic_index,512,2000,8000,1.22551564992676,NA 
rayol-farm2_2019-04-30_00-31-21.wav,44100,16,60,1,bioacoustic_index,512,2000,8000,1.26494087811256,NA 
rayol-farm2_2019-04-30_00-33-21.wav,44100,16,60,1,bioacoustic_index,512,2000,8000,1.26848775096044,NA 
rayol-farm2_2019-04-30_00-35-21.wav,44100,16,60,1,bioacoustic_index,512,2000,8000,1.24103989913682,NA 
rayol-farm2_2019-04-30_00-37-22.wav,44100,16,60,1,bioacoustic_index,512,2000,8000,1.20176223656475,NA 
rayol-farm2_2019-04-30_00-39-22.wav,44100,16,60,1,bioacoustic_index,512,2000,8000,1.26994439681254,NA 
rayol-farm2_2019-04-30_00-41-22.wav,44100,16,60,1,bioacoustic_index,512,2000,8000,1.26487387839082,NA 
rayol-farm2_2019-04-30_00-43-22.wav,44100,16,60,1,bioacoustic_index,512,2000,8000,1.23705690490608,NA 
rayol-farm2_2019-04-30_00-45-22.wav,44100,16,60,1,bioacoustic_index,512,2000,8000,1.25178159317877,NA 
rayol-farm2_2019-04-30_00-47-22.wav,44100,16,60,1,bioacoustic_index,512,2000,8000,1.30838835252211,NA 
rayol-farm2_2019-04-30_00-49-22.wav,44100,16,60,1,bioacoustic_index,512,2000,8000,1.21561371293186,NA 
rayol-farm2_2019-04-30_00-51-22.wav,44100,16,60,1,bioacoustic_index,512,2000,8000,1.33789007148896,NA 
rayol-farm2_2019-04-30_00-53-22.wav,44100,16,60,1,bioacoustic_index,512,2000,8000,1.19715343547126,NA 
rayol-farm2_2019-04-30_00-55-23.wav,44100,16,60,1,bioacoustic_index,512,2000,8000,1.33028753022311,NA 
rayol-farm2_2019-04-30_00-57-23.wav,44100,16,60,1,bioacoustic_index,512,2000,8000,1.24906615368695,NA 
rayol-farm2_2019-04-30_00-59-23.wav,44100,16,60,1,bioacoustic_index,512,2000,8000,1.32493029379057,NA 
rayol-farm2_2019-04-30_01-01-23.wav,44100,16,60,1,bioacoustic_index,512,2000,8000,1.31338594090559,NA 
rayol-farm2_2019-04-30_01-03-23.wav,44100,16,60,1,bioacoustic_index,512,2000,8000,1.41283369526445,NA 
rayol-farm2_2019-04-30_01-05-23.wav,44100,16,60,1,bioacoustic_index,512,2000,8000,1.41870734136822,NA 
rayol-farm2_2019-04-30_01-07-23.wav,44100,16,60,1,bioacoustic_index,512,2000,8000,1.34884886195191,NA 
rayol-farm2_2019-04-30_01-09-23.wav,44100,16,60,1,bioacoustic_index,512,2000,8000,1.33383750552301,NA 
rayol-farm2_2019-04-30_01-11-24.wav,44100,16,60,1,bioacoustic_index,512,2000,8000,1.28323664829946,NA 
rayol-farm2_2019-04-30_01-13-24.wav,44100,16,60,1,bioacoustic_index,512,2000,8000,1.31681863951135,NA 
rayol-farm2_2019-04-30_01-15-24.wav,44100,16,60,1,bioacoustic_index,512,2000,8000,1.36855535197207,NA 
rayol-farm2_2019-04-30_01-17-24.wav,44100,16,60,1,bioacoustic_index,512,2000,8000,1.42711286677972,NA 
rayol-farm2_2019-04-30_01-19-24.wav,44100,16,60,1,bioacoustic_index,512,2000,8000,1.37380041024118,NA 
rayol-farm2_2019-04-30_01-21-24.wav,44100,16,60,1,bioacoustic_index,512,2000,8000,1.44541338388711,NA 
rayol-farm2_2019-04-30_01-23-24.wav,44100,16,60,1,bioacoustic_index,512,2000,8000,1.46643070444805,NA 
rayol-farm2_2019-04-30_01-25-24.wav,44100,16,60,1,bioacoustic_index,512,2000,8000,1.2188292049878,NA 
rayol-farm2_2019-04-30_01-27-25.wav,44100,16,60,1,bioacoustic_index,512,2000,8000,1.44414767014393,NA 
rayol-farm2_2019-04-30_01-29-25.wav,44100,16,60,1,bioacoustic_index,512,2000,8000,1.24638320814545,NA 
rayol-farm2_2019-04-30_01-31-25.wav,44100,16,60,1,bioacoustic_index,512,2000,8000,1.28033046811867,NA 
rayol-farm2_2019-04-30_01-33-25.wav,44100,16,60,1,bioacoustic_index,512,2000,8000,1.35595854350047,NA 
rayol-farm2_2019-04-30_01-35-25.wav,44100,16,60,1,bioacoustic_index,512,2000,8000,1.29162311112276,NA 
rayol-farm2_2019-04-30_01-37-25.wav,44100,16,60,1,bioacoustic_index,512,2000,8000,1.32909386562739,NA 
rayol-farm2_2019-04-30_01-39-25.wav,44100,16,60,1,bioacoustic_index,512,2000,8000,1.44223440905448,NA 
rayol-farm2_2019-04-30_01-41-25.wav,44100,16,60,1,bioacoustic_index,512,2000,8000,1.35691199938973,NA 
rayol-farm2_2019-04-30_01-43-26.wav,44100,16,60,1,bioacoustic_index,512,2000,8000,1.50209987316791,NA 
rayol-farm2_2019-04-30_01-45-26.wav,44100,16,60,1,bioacoustic_index,512,2000,8000,1.35295836701854,NA 
rayol-farm2_2019-04-30_01-47-26.wav,44100,16,60,1,bioacoustic_index,512,2000,8000,1.32273300525464,NA 
rayol-farm2_2019-04-30_01-49-26.wav,44100,16,60,1,bioacoustic_index,512,2000,8000,1.31090149518846,NA 
rayol-farm2_2019-04-30_01-51-26.wav,44100,16,60,1,bioacoustic_index,512,2000,8000,1.3355478480697,NA 
rayol-farm2_2019-04-30_01-53-26.wav,44100,16,60,1,bioacoustic_index,512,2000,8000,1.37266991754551,NA 
rayol-farm2_2019-04-30_01-55-26.wav,44100,16,60,1,bioacoustic_index,512,2000,8000,1.29676575132873,NA 
rayol-farm2_2019-04-30_01-57-26.wav,44100,16,60,1,bioacoustic_index,512,2000,8000,1.28184015847172,NA 
rayol-farm2_2019-04-30_01-59-26.wav,44100,16,60,1,bioacoustic_index,512,2000,8000,1.34343872856038,NA 
rayol-farm2_2019-04-30_02-01-27.wav,44100,16,60,1,bioacoustic_index,512,2000,8000,1.32810067267033,NA 
rayol-farm2_2019-04-30_02-03-27.wav,44100,16,60,1,bioacoustic_index,512,2000,8000,1.5803166186844,NA 
rayol-farm2_2019-04-30_02-05-27.wav,44100,16,60,1,bioacoustic_index,512,2000,8000,1.53687431263157,NA 
rayol-farm2_2019-04-30_02-07-27.wav,44100,16,60,1,bioacoustic_index,512,2000,8000,1.52174743718986,NA 
rayol-farm2_2019-04-30_02-09-27.wav,44100,16,60,1,bioacoustic_index,512,2000,8000,1.45953781213316,NA 
rayol-farm2_2019-04-30_02-11-27.wav,44100,16,60,1,bioacoustic_index,512,2000,8000,1.63339552204299,NA 
rayol-farm2_2019-04-30_02-13-27.wav,44100,16,60,1,bioacoustic_index,512,2000,8000,1.4373059499835,NA 
rayol-farm2_2019-04-30_02-15-27.wav,44100,16,60,1,bioacoustic_index,512,2000,8000,1.4914290921371,NA 
rayol-farm2_2019-04-30_02-17-28.wav,44100,16,60,1,bioacoustic_index,512,2000,8000,1.44367408031122,NA 
rayol-farm2_2019-04-30_02-19-28.wav,44100,16,60,1,bioacoustic_index,512,2000,8000,1.39796873034252,NA 
rayol-farm2_2019-04-30_02-21-28.wav,44100,16,60,1,bioacoustic_index,512,2000,8000,1.36134021877509,NA 
rayol-farm2_2019-04-30_02-23-28.wav,44100,16,60,1,bioacoustic_index,512,2000,8000,1.38151230498848,NA 
rayol-farm2_2019-04-30_02-25-28.wav,44100,16,60,1,bioacoustic_index,512,2000,8000,1.33826592844396,NA 
rayol-farm2_2019-04-30_02-27-28.wav,44100,16,60,1,bioacoustic_index,512,2000,8000,1.37215622953007,NA 
rayol-farm2_2019-04-30_02-29-28.wav,44100,16,60,1,bioacoustic_index,512,2000,8000,1.38119873142823,NA 
rayol-farm2_2019-04-30_02-31-28.wav,44100,16,60,1,bioacoustic_index,512,2000,8000,1.23541713375634,NA 
rayol-farm2_2019-04-30_02-33-29.wav,44100,16,60,1,bioacoustic_index,512,2000,8000,1.42680002247448,NA 
rayol-farm2_2019-04-30_02-35-29.wav,44100,16,60,1,bioacoustic_index,512,2000,8000,1.3086795388266,NA 
rayol-farm2_2019-04-30_02-37-29.wav,44100,16,60,1,bioacoustic_index,512,2000,8000,1.34336341124119,NA 
rayol-farm2_2019-04-30_02-39-29.wav,44100,16,60,1,bioacoustic_index,512,2000,8000,1.35314397110675,NA 
rayol-farm2_2019-04-30_02-41-29.wav,44100,16,60,1,bioacoustic_index,512,2000,8000,1.23967265430084,NA 
rayol-farm2_2019-04-30_02-43-29.wav,44100,16,60,1,bioacoustic_index,512,2000,8000,1.31749358136642,NA 
rayol-farm2_2019-04-30_02-45-29.wav,44100,16,60,1,bioacoustic_index,512,2000,8000,1.42501210296644,NA 
rayol-farm2_2019-04-30_02-47-29.wav,44100,16,60,1,bioacoustic_index,512,2000,8000,1.27599427832072,NA 
rayol-farm2_2019-04-30_02-49-30.wav,44100,16,60,1,bioacoustic_index,512,2000,8000,1.43395003754872,NA 
rayol-farm2_2019-04-30_02-51-30.wav,44100,16,60,1,bioacoustic_index,512,2000,8000,1.27868813231337,NA 
rayol-farm2_2019-04-30_02-53-30.wav,44100,16,60,1,bioacoustic_index,512,2000,8000,1.29813808578371,NA 
rayol-farm2_2019-04-30_02-55-30.wav,44100,16,60,1,bioacoustic_index,512,2000,8000,1.19239647509081,NA 
rayol-farm2_2019-04-30_02-57-30.wav,44100,16,60,1,bioacoustic_index,512,2000,8000,1.2737801479823,NA 
rayol-farm2_2019-04-30_02-59-30.wav,44100,16,60,1,bioacoustic_index,512,2000,8000,1.24178861449219,NA 
rayol-farm2_2019-04-30_03-01-30.wav,44100,16,60,1,bioacoustic_index,512,2000,8000,1.23821364219381,NA 
rayol-farm2_2019-04-30_03-03-30.wav,44100,16,60,1,bioacoustic_index,512,2000,8000,1.26303824921113,NA 
rayol-farm2_2019-04-30_03-05-31.wav,44100,16,60,1,bioacoustic_index,512,2000,8000,1.2842279941823,NA 
rayol-farm2_2019-04-30_03-07-31.wav,44100,16,60,1,bioacoustic_index,512,2000,8000,1.33674413238631,NA 
rayol-farm2_2019-04-30_03-09-31.wav,44100,16,60,1,bioacoustic_index,512,2000,8000,1.27559022933369,NA 
rayol-farm2_2019-04-30_03-11-31.wav,44100,16,60,1,bioacoustic_index,512,2000,8000,1.38403360285052,NA 
rayol-farm2_2019-04-30_03-13-31.wav,44100,16,60,1,bioacoustic_index,512,2000,8000,1.30811719281105,NA 
rayol-farm2_2019-04-30_03-15-31.wav,44100,16,60,1,bioacoustic_index,512,2000,8000,1.24020943285211,NA 
rayol-farm2_2019-04-30_03-17-31.wav,44100,16,60,1,bioacoustic_index,512,2000,8000,1.24432080617786,NA 
rayol-farm2_2019-04-30_03-19-31.wav,44100,16,60,1,bioacoustic_index,512,2000,8000,1.53770399381405,NA 
rayol-farm2_2019-04-30_03-21-31.wav,44100,16,60,1,bioacoustic_index,512,2000,8000,1.41640863315601,NA 
rayol-farm2_2019-04-30_03-23-32.wav,44100,16,60,1,bioacoustic_index,512,2000,8000,1.37815382857026,NA 
rayol-farm2_2019-04-30_03-25-32.wav,44100,16,60,1,bioacoustic_index,512,2000,8000,1.25535517673272,NA 
rayol-farm2_2019-04-30_03-27-32.wav,44100,16,60,1,bioacoustic_index,512,2000,8000,1.37234784751712,NA 
rayol-farm2_2019-04-30_03-29-32.wav,44100,16,60,1,bioacoustic_index,512,2000,8000,1.21546289608309,NA 
rayol-farm2_2019-04-30_03-31-32.wav,44100,16,60,1,bioacoustic_index,512,2000,8000,1.22285799803202,NA 
rayol-farm2_2019-04-30_03-33-32.wav,44100,16,60,1,bioacoustic_index,512,2000,8000,1.35301813433011,NA 
rayol-farm2_2019-04-30_03-35-32.wav,44100,16,60,1,bioacoustic_index,512,2000,8000,1.3149762213217,NA 
rayol-farm2_2019-04-30_03-37-32.wav,44100,16,60,1,bioacoustic_index,512,2000,8000,1.38967581375338,NA 
rayol-farm2_2019-04-30_03-39-33.wav,44100,16,60,1,bioacoustic_index,512,2000,8000,1.23620913792979,NA 
rayol-farm2_2019-04-30_03-41-33.wav,44100,16,60,1,bioacoustic_index,512,2000,8000,1.26046280444928,NA 
rayol-farm2_2019-04-30_03-43-33.wav,44100,16,60,1,bioacoustic_index,512,2000,8000,1.24038889455572,NA 
rayol-farm2_2019-04-30_03-45-33.wav,44100,16,60,1,bioacoustic_index,512,2000,8000,1.18988852861947,NA 
rayol-farm2_2019-04-30_03-47-33.wav,44100,16,60,1,bioacoustic_index,512,2000,8000,1.23233149140448,NA 
rayol-farm2_2019-04-30_03-49-33.wav,44100,16,60,1,bioacoustic_index,512,2000,8000,1.28693597086117,NA 
rayol-farm2_2019-04-30_03-51-33.wav,44100,16,60,1,bioacoustic_index,512,2000,8000,1.2885259316742,NA 
rayol-farm2_2019-04-30_03-53-33.wav,44100,16,60,1,bioacoustic_index,512,2000,8000,1.28653124255321,NA 
rayol-farm2_2019-04-30_03-55-34.wav,44100,16,60,1,bioacoustic_index,512,2000,8000,1.21861855969153,NA 
rayol-farm2_2019-04-30_03-57-34.wav,44100,16,60,1,bioacoustic_index,512,2000,8000,1.20930326001691,NA 
rayol-farm2_2019-04-30_03-59-34.wav,44100,16,60,1,bioacoustic_index,512,2000,8000,1.21846689603843,NA 
rayol-farm2_2019-04-30_04-01-34.wav,44100,16,60,1,bioacoustic_index,512,2000,8000,1.19184546944629,NA 
rayol-farm2_2019-04-30_04-03-34.wav,44100,16,60,1,bioacoustic_index,512,2000,8000,1.22289294274547,NA 
rayol-farm2_2019-04-30_04-05-34.wav,44100,16,60,1,bioacoustic_index,512,2000,8000,1.42778851406811,NA 
rayol-farm2_2019-04-30_04-07-34.wav,44100,16,60,1,bioacoustic_index,512,2000,8000,1.2579281549634,NA 
rayol-farm2_2019-04-30_04-09-34.wav,44100,16,60,1,bioacoustic_index,512,2000,8000,1.26712157593055,NA 
rayol-farm2_2019-04-30_04-11-35.wav,44100,16,60,1,bioacoustic_index,512,2000,8000,1.21467665899918,NA 
rayol-farm2_2019-04-30_04-13-35.wav,44100,16,60,1,bioacoustic_index,512,2000,8000,1.19599157401592,NA 
rayol-farm2_2019-04-30_04-15-35.wav,44100,16,60,1,bioacoustic_index,512,2000,8000,1.34808528715467,NA 
rayol-farm2_2019-04-30_04-17-35.wav,44100,16,60,1,bioacoustic_index,512,2000,8000,1.27153720261697,NA 
rayol-farm2_2019-04-30_04-19-35.wav,44100,16,60,1,bioacoustic_index,512,2000,8000,1.25064907449347,NA 
rayol-farm2_2019-04-30_04-21-35.wav,44100,16,60,1,bioacoustic_index,512,2000,8000,1.24379627017817,NA 
rayol-farm2_2019-04-30_04-23-35.wav,44100,16,60,1,bioacoustic_index,512,2000,8000,1.28585059543276,NA 
rayol-farm2_2019-04-30_04-25-35.wav,44100,16,60,1,bioacoustic_index,512,2000,8000,1.23780292008237,NA 
rayol-farm2_2019-04-30_04-27-35.wav,44100,16,60,1,bioacoustic_index,512,2000,8000,1.31420570692819,NA 
rayol-farm2_2019-04-30_04-29-36.wav,44100,16,60,1,bioacoustic_index,512,2000,8000,1.24420479609487,NA 
rayol-farm2_2019-04-30_04-31-36.wav,44100,16,60,1,bioacoustic_index,512,2000,8000,1.25929948452645,NA 
rayol-farm2_2019-04-30_04-33-36.wav,44100,16,60,1,bioacoustic_index,512,2000,8000,1.38945887840131,NA 
rayol-farm2_2019-04-30_04-35-36.wav,44100,16,60,1,bioacoustic_index,512,2000,8000,1.27204184515018,NA 
rayol-farm2_2019-04-30_04-37-36.wav,44100,16,60,1,bioacoustic_index,512,2000,8000,1.2056690987311,NA 
rayol-farm2_2019-04-30_04-39-36.wav,44100,16,60,1,bioacoustic_index,512,2000,8000,1.26624380308436,NA 
rayol-farm2_2019-04-30_04-41-36.wav,44100,16,60,1,bioacoustic_index,512,2000,8000,1.28688024851204,NA 
rayol-farm2_2019-04-30_04-43-36.wav,44100,16,60,1,bioacoustic_index,512,2000,8000,1.27693665932228,NA 
rayol-farm2_2019-04-30_04-45-37.wav,44100,16,60,1,bioacoustic_index,512,2000,8000,1.28127747632024,NA 
rayol-farm2_2019-04-30_04-47-37.wav,44100,16,60,1,bioacoustic_index,512,2000,8000,1.21919875980457,NA 
rayol-farm2_2019-04-30_04-49-37.wav,44100,16,60,1,bioacoustic_index,512,2000,8000,1.17926754832684,NA 
rayol-farm2_2019-04-30_04-51-37.wav,44100,16,60,1,bioacoustic_index,512,2000,8000,1.24360552189232,NA 
rayol-farm2_2019-04-30_04-53-37.wav,44100,16,60,1,bioacoustic_index,512,2000,8000,1.25887569649697,NA 
rayol-farm2_2019-04-30_04-55-37.wav,44100,16,60,1,bioacoustic_index,512,2000,8000,1.21392882883693,NA 
rayol-farm2_2019-04-30_04-57-37.wav,44100,16,60,1,bioacoustic_index,512,2000,8000,1.34554947746718,NA 
rayol-farm2_2019-04-30_04-59-37.wav,44100,16,60,1,bioacoustic_index,512,2000,8000,2.53895634471212,NA 
rayol-farm2_2019-04-30_05-01-38.wav,44100,16,60,1,bioacoustic_index,512,2000,8000,1.81852548376921,NA 
rayol-farm2_2019-04-30_05-03-38.wav,44100,16,60,1,bioacoustic_index,512,2000,8000,1.20386727132806,NA 
rayol-farm2_2019-04-30_05-05-38.wav,44100,16,60,1,bioacoustic_index,512,2000,8000,1.69262399698677,NA 
rayol-farm2_2019-04-30_05-07-38.wav,44100,16,60,1,bioacoustic_index,512,2000,8000,2.64378099979732,NA 
rayol-farm2_2019-04-30_05-09-38.wav,44100,16,60,1,bioacoustic_index,512,2000,8000,3.2883510863398,NA 
rayol-farm2_2019-04-30_05-11-38.wav,44100,16,60,1,bioacoustic_index,512,2000,8000,1.26488605191286,NA 
rayol-farm2_2019-04-30_05-13-38.wav,44100,16,60,1,bioacoustic_index,512,2000,8000,1.20721605394323,NA 
rayol-farm2_2019-04-30_05-15-38.wav,44100,16,60,1,bioacoustic_index,512,2000,8000,1.3623495265473,NA 
rayol-farm2_2019-04-30_05-17-39.wav,44100,16,60,1,bioacoustic_index,512,2000,8000,1.43310038195339,NA 
rayol-farm2_2019-04-30_05-19-39.wav,44100,16,60,1,bioacoustic_index,512,2000,8000,1.32312042395305,NA 
rayol-farm2_2019-04-30_05-21-39.wav,44100,16,60,1,bioacoustic_index,512,2000,8000,1.59195189946971,NA 
rayol-farm2_2019-04-30_05-23-39.wav,44100,16,60,1,bioacoustic_index,512,2000,8000,1.71976964325671,NA 
rayol-farm2_2019-04-30_05-25-39.wav,44100,16,60,1,bioacoustic_index,512,2000,8000,1.77496013808181,NA 
rayol-farm2_2019-04-30_05-27-39.wav,44100,16,60,1,bioacoustic_index,512,2000,8000,1.67194993510568,NA 
rayol-farm2_2019-04-30_05-29-39.wav,44100,16,60,1,bioacoustic_index,512,2000,8000,1.95800779119124,NA 
rayol-farm2_2019-04-30_05-31-39.wav,44100,16,60,1,bioacoustic_index,512,2000,8000,1.5929857366115,NA 
rayol-farm2_2019-04-30_05-33-39.wav,44100,16,60,1,bioacoustic_index,512,2000,8000,1.61595217601456,NA 
rayol-farm2_2019-04-30_05-35-40.wav,44100,16,60,1,bioacoustic_index,512,2000,8000,1.76829213119855,NA 
rayol-farm2_2019-04-30_05-37-40.wav,44100,16,60,1,bioacoustic_index,512,2000,8000,1.76679220502676,NA 
rayol-farm2_2019-04-30_05-39-40.wav,44100,16,60,1,bioacoustic_index,512,2000,8000,1.80195462055931,NA 
rayol-farm2_2019-04-30_05-41-40.wav,44100,16,60,1,bioacoustic_index,512,2000,8000,1.79649522619092,NA 
rayol-farm2_2019-04-30_05-43-40.wav,44100,16,60,1,bioacoustic_index,512,2000,8000,1.94476498900656,NA 
rayol-farm2_2019-04-30_05-45-40.wav,44100,16,60,1,bioacoustic_index,512,2000,8000,2.56859370210997,NA 
rayol-farm2_2019-04-30_05-47-40.wav,44100,16,60,1,bioacoustic_index,512,2000,8000,3.05123449868878,NA 
rayol-farm2_2019-04-30_05-49-40.wav,44100,16,60,1,bioacoustic_index,512,2000,8000,3.44668614723669,NA 
rayol-farm2_2019-04-30_05-51-41.wav,44100,16,60,1,bioacoustic_index,512,2000,8000,4.39852415452615,NA 
rayol-farm2_2019-04-30_05-53-41.wav,44100,16,60,1,bioacoustic_index,512,2000,8000,3.4592848949988,NA 
rayol-farm2_2019-04-30_05-55-41.wav,44100,16,60,1,bioacoustic_index,512,2000,8000,3.84629420776224,NA 
rayol-farm2_2019-04-30_05-57-41.wav,44100,16,60,1,bioacoustic_index,512,2000,8000,3.92978740565761,NA 
rayol-farm2_2019-04-30_05-59-41.wav,44100,16,60,1,bioacoustic_index,512,2000,8000,3.45577543381107,NA 
rayol-farm2_2019-04-30_06-01-41.wav,44100,16,60,1,bioacoustic_index,512,2000,8000,3.1849530123423,NA 
rayol-farm2_2019-04-30_06-03-41.wav,44100,16,60,1,bioacoustic_index,512,2000,8000,3.50143403008606,NA 
rayol-farm2_2019-04-30_06-05-41.wav,44100,16,60,1,bioacoustic_index,512,2000,8000,3.93398378843351,NA 
rayol-farm2_2019-04-30_06-07-42.wav,44100,16,60,1,bioacoustic_index,512,2000,8000,3.25352960384951,NA 
rayol-farm2_2019-04-30_06-09-42.wav,44100,16,60,1,bioacoustic_index,512,2000,8000,3.35409813254877,NA 
rayol-farm2_2019-04-30_06-11-42.wav,44100,16,60,1,bioacoustic_index,512,2000,8000,2.9654482818938,NA 
rayol-farm2_2019-04-30_06-13-42.wav,44100,16,60,1,bioacoustic_index,512,2000,8000,3.60318071382785,NA 
rayol-farm2_2019-04-30_06-15-42.wav,44100,16,60,1,bioacoustic_index,512,2000,8000,3.95071897721983,NA 
rayol-farm2_2019-04-30_06-17-42.wav,44100,16,60,1,bioacoustic_index,512,2000,8000,4.0789237787416,NA 
rayol-farm2_2019-04-30_06-19-42.wav,44100,16,60,1,bioacoustic_index,512,2000,8000,3.59576849033298,NA 
rayol-farm2_2019-04-30_06-21-42.wav,44100,16,60,1,bioacoustic_index,512,2000,8000,3.98147124229062,NA 
rayol-farm2_2019-04-30_06-23-43.wav,44100,16,60,1,bioacoustic_index,512,2000,8000,3.03592343969423,NA 
rayol-farm2_2019-04-30_06-25-43.wav,44100,16,60,1,bioacoustic_index,512,2000,8000,3.53126675200112,NA 
rayol-farm2_2019-04-30_06-27-43.wav,44100,16,60,1,bioacoustic_index,512,2000,8000,5.28472218417671,NA 
rayol-farm2_2019-04-30_06-29-43.wav,44100,16,60,1,bioacoustic_index,512,2000,8000,3.5523594387302,NA 
rayol-farm2_2019-04-30_06-31-43.wav,44100,16,60,1,bioacoustic_index,512,2000,8000,3.03899171339513,NA 
rayol-farm2_2019-04-30_06-33-43.wav,44100,16,60,1,bioacoustic_index,512,2000,8000,2.17222236831488,NA 
rayol-farm2_2019-04-30_06-35-43.wav,44100,16,60,1,bioacoustic_index,512,2000,8000,2.42136433696015,NA 
rayol-farm2_2019-04-30_06-37-43.wav,44100,16,60,1,bioacoustic_index,512,2000,8000,2.64200929302122,NA 
rayol-farm2_2019-04-30_06-39-44.wav,44100,16,60,1,bioacoustic_index,512,2000,8000,2.15569678129828,NA 
rayol-farm2_2019-04-30_06-41-44.wav,44100,16,60,1,bioacoustic_index,512,2000,8000,2.56713769428312,NA 
rayol-farm2_2019-04-30_06-43-44.wav,44100,16,60,1,bioacoustic_index,512,2000,8000,2.83691659868636,NA 
rayol-farm2_2019-04-30_06-45-44.wav,44100,16,60,1,bioacoustic_index,512,2000,8000,2.57480469267056,NA 
rayol-farm2_2019-04-30_06-47-44.wav,44100,16,60,1,bioacoustic_index,512,2000,8000,4.56786294718888,NA 
rayol-farm2_2019-04-30_06-49-44.wav,44100,16,60,1,bioacoustic_index,512,2000,8000,2.83458760585466,NA 
rayol-farm2_2019-04-30_06-51-44.wav,44100,16,60,1,bioacoustic_index,512,2000,8000,2.56280403686389,NA 
rayol-farm2_2019-04-30_06-53-44.wav,44100,16,60,1,bioacoustic_index,512,2000,8000,2.16155141184139,NA 
rayol-farm2_2019-04-30_06-55-44.wav,44100,16,60,1,bioacoustic_index,512,2000,8000,2.00360095657004,NA 
rayol-farm2_2019-04-30_06-57-45.wav,44100,16,60,1,bioacoustic_index,512,2000,8000,2.17452890179865,NA 
rayol-farm2_2019-04-30_06-59-45.wav,44100,16,60,1,bioacoustic_index,512,2000,8000,2.20073844812671,NA 
rayol-farm2_2019-04-30_07-01-45.wav,44100,16,60,1,bioacoustic_index,512,2000,8000,2.03469545142194,NA 
rayol-farm2_2019-04-30_07-03-45.wav,44100,16,60,1,bioacoustic_index,512,2000,8000,1.84302364807267,NA 
rayol-farm2_2019-04-30_07-05-45.wav,44100,16,60,1,bioacoustic_index,512,2000,8000,3.4926603929902,NA 
rayol-farm2_2019-04-30_07-07-45.wav,44100,16,60,1,bioacoustic_index,512,2000,8000,3.17291864087948,NA 
rayol-farm2_2019-04-30_07-09-45.wav,44100,16,60,1,bioacoustic_index,512,2000,8000,3.44615391837126,NA 
rayol-farm2_2019-04-30_07-11-45.wav,44100,16,60,1,bioacoustic_index,512,2000,8000,2.69203808344204,NA 
rayol-farm2_2019-04-30_07-13-46.wav,44100,16,60,1,bioacoustic_index,512,2000,8000,2.51940436482936,NA 
rayol-farm2_2019-04-30_07-15-46.wav,44100,16,60,1,bioacoustic_index,512,2000,8000,2.41168617471044,NA 
rayol-farm2_2019-04-30_07-17-46.wav,44100,16,60,1,bioacoustic_index,512,2000,8000,2.79191640937108,NA 
rayol-farm2_2019-04-30_07-19-46.wav,44100,16,60,1,bioacoustic_index,512,2000,8000,3.96815870408066,NA 
rayol-farm2_2019-04-30_07-21-46.wav,44100,16,60,1,bioacoustic_index,512,2000,8000,1.78600995583873,NA 
rayol-farm2_2019-04-30_07-23-46.wav,44100,16,60,1,bioacoustic_index,512,2000,8000,2.76255909772974,NA 
rayol-farm2_2019-04-30_07-25-46.wav,44100,16,60,1,bioacoustic_index,512,2000,8000,2.83103886914021,NA 
rayol-farm2_2019-04-30_07-27-46.wav,44100,16,60,1,bioacoustic_index,512,2000,8000,2.83529853852314,NA 
rayol-farm2_2019-04-30_07-29-47.wav,44100,16,60,1,bioacoustic_index,512,2000,8000,2.01701305386558,NA 
rayol-farm2_2019-04-30_07-31-47.wav,44100,16,60,1,bioacoustic_index,512,2000,8000,3.06409884472379,NA 
rayol-farm2_2019-04-30_07-33-47.wav,44100,16,60,1,bioacoustic_index,512,2000,8000,2.340686849603,NA 
rayol-farm2_2019-04-30_07-35-47.wav,44100,16,60,1,bioacoustic_index,512,2000,8000,4.19200630825431,NA 
rayol-farm2_2019-04-30_07-37-47.wav,44100,16,60,1,bioacoustic_index,512,2000,8000,2.2480939072998,NA 
rayol-farm2_2019-04-30_07-39-47.wav,44100,16,60,1,bioacoustic_index,512,2000,8000,2.84423264371198,NA 
rayol-farm2_2019-04-30_07-41-47.wav,44100,16,60,1,bioacoustic_index,512,2000,8000,2.41070852658558,NA 
rayol-farm2_2019-04-30_07-43-47.wav,44100,16,60,1,bioacoustic_index,512,2000,8000,2.32869149877608,NA 
rayol-farm2_2019-04-30_07-45-47.wav,44100,16,60,1,bioacoustic_index,512,2000,8000,1.97951681242469,NA 
rayol-farm2_2019-04-30_07-47-48.wav,44100,16,60,1,bioacoustic_index,512,2000,8000,2.66239466999704,NA 
rayol-farm2_2019-04-30_07-49-48.wav,44100,16,60,1,bioacoustic_index,512,2000,8000,2.36981426580419,NA 
rayol-farm2_2019-04-30_07-51-48.wav,44100,16,60,1,bioacoustic_index,512,2000,8000,2.34831976566045,NA 
rayol-farm2_2019-04-30_07-53-48.wav,44100,16,60,1,bioacoustic_index,512,2000,8000,2.31207710611497,NA 
rayol-farm2_2019-04-30_07-55-48.wav,44100,16,60,1,bioacoustic_index,512,2000,8000,2.15322867111361,NA 
rayol-farm2_2019-04-30_07-57-48.wav,44100,16,60,1,bioacoustic_index,512,2000,8000,2.01555243453102,NA 
rayol-farm2_2019-04-30_07-59-48.wav,44100,16,60,1,bioacoustic_index,512,2000,8000,1.78895925314279,NA 
rayol-farm2_2019-04-30_08-01-48.wav,44100,16,60,1,bioacoustic_index,512,2000,8000,1.88696765511991,NA 
rayol-farm2_2019-04-30_08-03-49.wav,44100,16,60,1,bioacoustic_index,512,2000,8000,2.50219370167021,NA 
rayol-farm2_2019-04-30_08-05-49.wav,44100,16,60,1,bioacoustic_index,512,2000,8000,1.93559952258332,NA 
rayol-farm2_2019-04-30_08-07-49.wav,44100,16,60,1,bioacoustic_index,512,2000,8000,2.5313418847277,NA 
rayol-farm2_2019-04-30_08-09-49.wav,44100,16,60,1,bioacoustic_index,512,2000,8000,1.82613142973607,NA 
rayol-farm2_2019-04-30_08-11-49.wav,44100,16,60,1,bioacoustic_index,512,2000,8000,2.14414990296046,NA 
rayol-farm2_2019-04-30_08-13-49.wav,44100,16,60,1,bioacoustic_index,512,2000,8000,2.19784857383276,NA 
rayol-farm2_2019-04-30_08-15-49.wav,44100,16,60,1,bioacoustic_index,512,2000,8000,2.0524375554063,NA 
rayol-farm2_2019-04-30_08-17-49.wav,44100,16,60,1,bioacoustic_index,512,2000,8000,1.976930965243,NA 
rayol-farm2_2019-04-30_08-19-50.wav,44100,16,60,1,bioacoustic_index,512,2000,8000,2.77247064275051,NA 
rayol-farm2_2019-04-30_08-21-50.wav,44100,16,60,1,bioacoustic_index,512,2000,8000,2.53531768053719,NA 
rayol-farm2_2019-04-30_08-23-50.wav,44100,16,60,1,bioacoustic_index,512,2000,8000,3.08999117712744,NA 
rayol-farm2_2019-04-30_08-25-50.wav,44100,16,60,1,bioacoustic_index,512,2000,8000,2.53625187052434,NA 
rayol-farm2_2019-04-30_08-27-50.wav,44100,16,60,1,bioacoustic_index,512,2000,8000,4.42127700304385,NA 
rayol-farm2_2019-04-30_08-29-50.wav,44100,16,60,1,bioacoustic_index,512,2000,8000,2.20091148108487,NA 
rayol-farm2_2019-04-30_08-31-50.wav,44100,16,60,1,bioacoustic_index,512,2000,8000,2.47485684242079,NA 
rayol-farm2_2019-04-30_08-33-50.wav,44100,16,60,1,bioacoustic_index,512,2000,8000,3.68060454821935,NA 
rayol-farm2_2019-04-30_08-35-50.wav,44100,16,60,1,bioacoustic_index,512,2000,8000,2.24226679250549,NA 
rayol-farm2_2019-04-30_08-37-51.wav,44100,16,60,1,bioacoustic_index,512,2000,8000,2.79379414249328,NA 
rayol-farm2_2019-04-30_08-39-51.wav,44100,16,60,1,bioacoustic_index,512,2000,8000,2.99364684189056,NA 
rayol-farm2_2019-04-30_08-41-51.wav,44100,16,60,1,bioacoustic_index,512,2000,8000,1.90707255769246,NA 
rayol-farm2_2019-04-30_08-43-51.wav,44100,16,60,1,bioacoustic_index,512,2000,8000,2.26608239992257,NA 
rayol-farm2_2019-04-30_08-45-51.wav,44100,16,60,1,bioacoustic_index,512,2000,8000,2.55213561476744,NA 
rayol-farm2_2019-04-30_08-47-51.wav,44100,16,60,1,bioacoustic_index,512,2000,8000,5.28517318159255,NA 
rayol-farm2_2019-04-30_08-49-51.wav,44100,16,60,1,bioacoustic_index,512,2000,8000,3.29223240751168,NA 
rayol-farm2_2019-04-30_08-51-51.wav,44100,16,60,1,bioacoustic_index,512,2000,8000,2.84770119455796,NA 
rayol-farm2_2019-04-30_08-53-52.wav,44100,16,60,1,bioacoustic_index,512,2000,8000,2.50871447231103,NA 
rayol-farm2_2019-04-30_08-55-52.wav,44100,16,60,1,bioacoustic_index,512,2000,8000,2.47536243055997,NA 
rayol-farm2_2019-04-30_08-57-52.wav,44100,16,60,1,bioacoustic_index,512,2000,8000,2.277839411815,NA 
rayol-farm2_2019-04-30_08-59-52.wav,44100,16,60,1,bioacoustic_index,512,2000,8000,2.50841830851023,NA 
rayol-farm2_2019-04-30_09-01-52.wav,44100,16,60,1,bioacoustic_index,512,2000,8000,1.8041857747708,NA 
rayol-farm2_2019-04-30_09-03-52.wav,44100,16,60,1,bioacoustic_index,512,2000,8000,2.04893312646096,NA 
rayol-farm2_2019-04-30_09-05-52.wav,44100,16,60,1,bioacoustic_index,512,2000,8000,2.93244403477752,NA 
rayol-farm2_2019-04-30_09-07-52.wav,44100,16,60,1,bioacoustic_index,512,2000,8000,3.14712772591412,NA 
rayol-farm2_2019-04-30_09-09-53.wav,44100,16,60,1,bioacoustic_index,512,2000,8000,2.53367826662104,NA 
rayol-farm2_2019-04-30_09-11-53.wav,44100,16,60,1,bioacoustic_index,512,2000,8000,2.52322608197072,NA 
rayol-farm2_2019-04-30_09-13-53.wav,44100,16,60,1,bioacoustic_index,512,2000,8000,1.89623449505688,NA 
rayol-farm2_2019-04-30_09-15-53.wav,44100,16,60,1,bioacoustic_index,512,2000,8000,2.48650191247548,NA 
rayol-farm2_2019-04-30_09-17-53.wav,44100,16,60,1,bioacoustic_index,512,2000,8000,1.83275433670768,NA 
rayol-farm2_2019-04-30_09-19-53.wav,44100,16,60,1,bioacoustic_index,512,2000,8000,3.36738585696174,NA 
rayol-farm2_2019-04-30_09-21-53.wav,44100,16,60,1,bioacoustic_index,512,2000,8000,2.64492667569924,NA 
rayol-farm2_2019-04-30_09-23-53.wav,44100,16,60,1,bioacoustic_index,512,2000,8000,2.76202219010635,NA 
rayol-farm2_2019-04-30_09-25-54.wav,44100,16,60,1,bioacoustic_index,512,2000,8000,2.38294978942994,NA 
rayol-farm2_2019-04-30_09-27-54.wav,44100,16,60,1,bioacoustic_index,512,2000,8000,2.27036012656347,NA 
rayol-farm2_2019-04-30_09-29-54.wav,44100,16,60,1,bioacoustic_index,512,2000,8000,2.75750138768528,NA 
rayol-farm2_2019-04-30_09-31-54.wav,44100,16,60,1,bioacoustic_index,512,2000,8000,2.49937322786005,NA 
rayol-farm2_2019-04-30_09-33-54.wav,44100,16,60,1,bioacoustic_index,512,2000,8000,2.79441914667126,NA 
rayol-farm2_2019-04-30_09-35-54.wav,44100,16,60,1,bioacoustic_index,512,2000,8000,2.66464333367026,NA 
rayol-farm2_2019-04-30_09-37-54.wav,44100,16,60,1,bioacoustic_index,512,2000,8000,1.96528551560411,NA 
rayol-farm2_2019-04-30_09-39-54.wav,44100,16,60,1,bioacoustic_index,512,2000,8000,3.07704034590968,NA 
rayol-farm2_2019-04-30_09-41-55.wav,44100,16,60,1,bioacoustic_index,512,2000,8000,2.00192467054227,NA 
rayol-farm2_2019-04-30_09-43-55.wav,44100,16,60,1,bioacoustic_index,512,2000,8000,1.88907135944084,NA 
rayol-farm2_2019-04-30_09-45-55.wav,44100,16,60,1,bioacoustic_index,512,2000,8000,3.15582812644372,NA 
rayol-farm2_2019-04-30_09-47-55.wav,44100,16,60,1,bioacoustic_index,512,2000,8000,2.29715836266411,NA 
rayol-farm2_2019-04-30_09-49-55.wav,44100,16,60,1,bioacoustic_index,512,2000,8000,2.37965000585845,NA 
rayol-farm2_2019-04-30_09-51-55.wav,44100,16,60,1,bioacoustic_index,512,2000,8000,2.04361711524405,NA 
rayol-farm2_2019-04-30_09-53-55.wav,44100,16,60,1,bioacoustic_index,512,2000,8000,3.13697737859526,NA 
rayol-farm2_2019-04-30_09-55-55.wav,44100,16,60,1,bioacoustic_index,512,2000,8000,2.7625066953461,NA 
rayol-farm2_2019-04-30_09-57-55.wav,44100,16,60,1,bioacoustic_index,512,2000,8000,3.92854304166705,NA 
rayol-farm2_2019-04-30_09-59-56.wav,44100,16,60,1,bioacoustic_index,512,2000,8000,2.50799666683554,NA 
rayol-farm2_2019-04-30_10-01-56.wav,44100,16,60,1,bioacoustic_index,512,2000,8000,2.83920516326121,NA 
rayol-farm2_2019-04-30_10-03-56.wav,44100,16,60,1,bioacoustic_index,512,2000,8000,2.26314076504042,NA 
rayol-farm2_2019-04-30_10-05-56.wav,44100,16,60,1,bioacoustic_index,512,2000,8000,4.39851273207885,NA 
rayol-farm2_2019-04-30_10-07-56.wav,44100,16,60,1,bioacoustic_index,512,2000,8000,1.84455604622288,NA 
rayol-farm2_2019-04-30_10-09-56.wav,44100,16,60,1,bioacoustic_index,512,2000,8000,3.96188136978216,NA 
rayol-farm2_2019-04-30_10-11-56.wav,44100,16,60,1,bioacoustic_index,512,2000,8000,2.80573611384601,NA 
rayol-farm2_2019-04-30_10-13-56.wav,44100,16,60,1,bioacoustic_index,512,2000,8000,2.20463437062181,NA 
rayol-farm2_2019-04-30_10-15-57.wav,44100,16,60,1,bioacoustic_index,512,2000,8000,2.20659674745758,NA 
rayol-farm2_2019-04-30_10-17-57.wav,44100,16,60,1,bioacoustic_index,512,2000,8000,2.12088135810195,NA 
rayol-farm2_2019-04-30_10-19-57.wav,44100,16,60,1,bioacoustic_index,512,2000,8000,2.10019828138173,NA 
rayol-farm2_2019-04-30_10-21-57.wav,44100,16,60,1,bioacoustic_index,512,2000,8000,1.81466138583652,NA 
rayol-farm2_2019-04-30_10-23-57.wav,44100,16,60,1,bioacoustic_index,512,2000,8000,1.86326679055102,NA 
rayol-farm2_2019-04-30_10-25-57.wav,44100,16,60,1,bioacoustic_index,512,2000,8000,1.71504180655678,NA 
rayol-farm2_2019-04-30_10-27-57.wav,44100,16,60,1,bioacoustic_index,512,2000,8000,2.25725384872201,NA 
rayol-farm2_2019-04-30_10-29-57.wav,44100,16,60,1,bioacoustic_index,512,2000,8000,3.38011371778135,NA 
rayol-farm2_2019-04-30_10-31-58.wav,44100,16,60,1,bioacoustic_index,512,2000,8000,3.60571515412403,NA 
rayol-farm2_2019-04-30_10-33-58.wav,44100,16,60,1,bioacoustic_index,512,2000,8000,3.54272207731536,NA 
rayol-farm2_2019-04-30_10-35-58.wav,44100,16,60,1,bioacoustic_index,512,2000,8000,2.01267385684819,NA 
rayol-farm2_2019-04-30_10-37-58.wav,44100,16,60,1,bioacoustic_index,512,2000,8000,2.17206467497264,NA 
rayol-farm2_2019-04-30_10-39-58.wav,44100,16,60,1,bioacoustic_index,512,2000,8000,2.1457347989834,NA 
rayol-farm2_2019-04-30_10-41-58.wav,44100,16,60,1,bioacoustic_index,512,2000,8000,3.2248587374598,NA 
rayol-farm2_2019-04-30_10-43-58.wav,44100,16,60,1,bioacoustic_index,512,2000,8000,2.65920222120579,NA 
rayol-farm2_2019-04-30_10-45-58.wav,44100,16,60,1,bioacoustic_index,512,2000,8000,3.01754702160994,NA 
rayol-farm2_2019-04-30_10-47-58.wav,44100,16,60,1,bioacoustic_index,512,2000,8000,4.8561459439236,NA 
rayol-farm2_2019-04-30_10-49-59.wav,44100,16,60,1,bioacoustic_index,512,2000,8000,2.52442017824694,NA 
rayol-farm2_2019-04-30_10-51-59.wav,44100,16,60,1,bioacoustic_index,512,2000,8000,2.2292380932796,NA 
rayol-farm2_2019-04-30_10-53-59.wav,44100,16,60,1,bioacoustic_index,512,2000,8000,2.66000241365807,NA 
rayol-farm2_2019-04-30_10-55-59.wav,44100,16,60,1,bioacoustic_index,512,2000,8000,1.9463906591919,NA 
rayol-farm2_2019-04-30_10-57-59.wav,44100,16,60,1,bioacoustic_index,512,2000,8000,1.76289880979385,NA 
rayol-farm2_2019-04-30_10-59-59.wav,44100,16,60,1,bioacoustic_index,512,2000,8000,1.66379369636032,NA 
rayol-farm2_2019-04-30_11-01-59.wav,44100,16,60,1,bioacoustic_index,512,2000,8000,2.03392105619302,NA 
rayol-farm2_2019-04-30_11-03-59.wav,44100,16,60,1,bioacoustic_index,512,2000,8000,3.44287297303303,NA 
rayol-farm2_2019-04-30_11-06-00.wav,44100,16,60,1,bioacoustic_index,512,2000,8000,1.72946017741965,NA 
rayol-farm2_2019-04-30_11-08-00.wav,44100,16,60,1,bioacoustic_index,512,2000,8000,1.8058568229341,NA 
rayol-farm2_2019-04-30_11-10-00.wav,44100,16,60,1,bioacoustic_index,512,2000,8000,2.14984840928579,NA 
rayol-farm2_2019-04-30_11-12-00.wav,44100,16,60,1,bioacoustic_index,512,2000,8000,1.93150711755488,NA 
rayol-farm2_2019-04-30_11-14-00.wav,44100,16,60,1,bioacoustic_index,512,2000,8000,2.46545957193974,NA 
rayol-farm2_2019-04-30_11-16-00.wav,44100,16,60,1,bioacoustic_index,512,2000,8000,2.00665275888939,NA 
rayol-farm2_2019-04-30_11-18-00.wav,44100,16,60,1,bioacoustic_index,512,2000,8000,2.02291587677538,NA 
rayol-farm2_2019-04-30_11-20-00.wav,44100,16,60,1,bioacoustic_index,512,2000,8000,1.81615859891998,NA 
rayol-farm2_2019-04-30_11-22-01.wav,44100,16,60,1,bioacoustic_index,512,2000,8000,3.19619881066323,NA 
rayol-farm2_2019-04-30_11-24-01.wav,44100,16,60,1,bioacoustic_index,512,2000,8000,2.540310123786,NA 
rayol-farm2_2019-04-30_11-26-01.wav,44100,16,60,1,bioacoustic_index,512,2000,8000,2.91547163724558,NA 
rayol-farm2_2019-04-30_11-28-01.wav,44100,16,60,1,bioacoustic_index,512,2000,8000,2.08949442726936,NA 
rayol-farm2_2019-04-30_11-30-01.wav,44100,16,60,1,bioacoustic_index,512,2000,8000,2.3538019067052,NA 
rayol-farm2_2019-04-30_11-32-01.wav,44100,16,60,1,bioacoustic_index,512,2000,8000,3.08140600651532,NA 
rayol-farm2_2019-04-30_11-34-01.wav,44100,16,60,1,bioacoustic_index,512,2000,8000,2.26164100767085,NA 
rayol-farm2_2019-04-30_11-36-01.wav,44100,16,60,1,bioacoustic_index,512,2000,8000,6.00800507001421,NA 
rayol-farm2_2019-04-30_11-38-01.wav,44100,16,60,1,bioacoustic_index,512,2000,8000,5.7389692476361,NA 
rayol-farm2_2019-04-30_11-40-02.wav,44100,16,60,1,bioacoustic_index,512,2000,8000,2.02125030465296,NA 
rayol-farm2_2019-04-30_11-42-02.wav,44100,16,60,1,bioacoustic_index,512,2000,8000,3.06802129091647,NA 
rayol-farm2_2019-04-30_11-44-02.wav,44100,16,60,1,bioacoustic_index,512,2000,8000,2.319153673236,NA 
rayol-farm2_2019-04-30_11-46-02.wav,44100,16,60,1,bioacoustic_index,512,2000,8000,2.1846961702868,NA 
rayol-farm2_2019-04-30_11-48-02.wav,44100,16,60,1,bioacoustic_index,512,2000,8000,1.97867008909532,NA 
rayol-farm2_2019-04-30_11-50-02.wav,44100,16,60,1,bioacoustic_index,512,2000,8000,1.97059874665806,NA 
rayol-farm2_2019-04-30_11-52-02.wav,44100,16,60,1,bioacoustic_index,512,2000,8000,2.59529522984322,NA 
rayol-farm2_2019-04-30_11-54-02.wav,44100,16,60,1,bioacoustic_index,512,2000,8000,2.61923092916783,NA 
rayol-farm2_2019-04-30_11-56-03.wav,44100,16,60,1,bioacoustic_index,512,2000,8000,1.98107639552762,NA 
rayol-farm2_2019-04-30_11-58-03.wav,44100,16,60,1,bioacoustic_index,512,2000,8000,2.52648324167786,NA 
rayol-farm2_2019-04-30_12-00-03.wav,44100,16,60,1,bioacoustic_index,512,2000,8000,3.18509591613007,NA 
rayol-farm2_2019-04-30_12-02-03.wav,44100,16,60,1,bioacoustic_index,512,2000,8000,4.01060755886383,NA 
rayol-farm2_2019-04-30_12-04-03.wav,44100,16,60,1,bioacoustic_index,512,2000,8000,2.16137319720867,NA 
rayol-farm2_2019-04-30_12-06-03.wav,44100,16,60,1,bioacoustic_index,512,2000,8000,3.3602594140343,NA 
rayol-farm2_2019-04-30_12-08-03.wav,44100,16,60,1,bioacoustic_index,512,2000,8000,1.60415653711033,NA 
rayol-farm2_2019-04-30_12-10-03.wav,44100,16,60,1,bioacoustic_index,512,2000,8000,3.10454504605466,NA 
rayol-farm2_2019-04-30_12-12-04.wav,44100,16,60,1,bioacoustic_index,512,2000,8000,3.20938550001342,NA 
rayol-farm2_2019-04-30_12-14-04.wav,44100,16,60,1,bioacoustic_index,512,2000,8000,4.10108739656492,NA 
rayol-farm2_2019-04-30_12-16-04.wav,44100,16,60,1,bioacoustic_index,512,2000,8000,1.84341243755758,NA 
rayol-farm2_2019-04-30_12-18-04.wav,44100,16,60,1,bioacoustic_index,512,2000,8000,1.89063729158843,NA 
rayol-farm2_2019-04-30_12-20-04.wav,44100,16,60,1,bioacoustic_index,512,2000,8000,4.10076492388874,NA 
rayol-farm2_2019-04-30_12-22-04.wav,44100,16,60,1,bioacoustic_index,512,2000,8000,2.55919738490827,NA 
rayol-farm2_2019-04-30_12-24-04.wav,44100,16,60,1,bioacoustic_index,512,2000,8000,1.99081186365324,NA 
rayol-farm2_2019-04-30_12-26-04.wav,44100,16,60,1,bioacoustic_index,512,2000,8000,1.77311063129145,NA 
rayol-farm2_2019-04-30_12-28-05.wav,44100,16,60,1,bioacoustic_index,512,2000,8000,3.06914310976552,NA 
rayol-farm2_2019-04-30_12-30-05.wav,44100,16,60,1,bioacoustic_index,512,2000,8000,2.30866295341899,NA 
rayol-farm2_2019-04-30_12-32-05.wav,44100,16,60,1,bioacoustic_index,512,2000,8000,3.44937629836066,NA 
rayol-farm2_2019-04-30_12-34-05.wav,44100,16,60,1,bioacoustic_index,512,2000,8000,2.65196427890953,NA 
rayol-farm2_2019-04-30_12-36-05.wav,44100,16,60,1,bioacoustic_index,512,2000,8000,1.95781818884601,NA 
rayol-farm2_2019-04-30_12-38-05.wav,44100,16,60,1,bioacoustic_index,512,2000,8000,2.64134770906591,NA 
rayol-farm2_2019-04-30_12-40-05.wav,44100,16,60,1,bioacoustic_index,512,2000,8000,2.54948682681887,NA 
rayol-farm2_2019-04-30_12-42-05.wav,44100,16,60,1,bioacoustic_index,512,2000,8000,3.36638574793177,NA 
rayol-farm2_2019-04-30_12-44-06.wav,44100,16,60,1,bioacoustic_index,512,2000,8000,1.67632350510667,NA 
rayol-farm2_2019-04-30_12-46-06.wav,44100,16,60,1,bioacoustic_index,512,2000,8000,2.10558846635774,NA 
rayol-farm2_2019-04-30_12-48-06.wav,44100,16,60,1,bioacoustic_index,512,2000,8000,4.2072193216608,NA 
rayol-farm2_2019-04-30_12-50-06.wav,44100,16,60,1,bioacoustic_index,512,2000,8000,2.34871379068303,NA 
rayol-farm2_2019-04-30_12-52-06.wav,44100,16,60,1,bioacoustic_index,512,2000,8000,1.78871843243716,NA 
rayol-farm2_2019-04-30_12-54-06.wav,44100,16,60,1,bioacoustic_index,512,2000,8000,3.10501228620062,NA 
rayol-farm2_2019-04-30_12-56-06.wav,44100,16,60,1,bioacoustic_index,512,2000,8000,3.04470442530135,NA 
rayol-farm2_2019-04-30_12-58-06.wav,44100,16,60,1,bioacoustic_index,512,2000,8000,1.91056312078561,NA 
rayol-farm2_2019-04-30_13-00-06.wav,44100,16,60,1,bioacoustic_index,512,2000,8000,1.74507892309276,NA 
rayol-farm2_2019-04-30_13-02-07.wav,44100,16,60,1,bioacoustic_index,512,2000,8000,2.36609432827721,NA 
rayol-farm2_2019-04-30_13-04-07.wav,44100,16,60,1,bioacoustic_index,512,2000,8000,2.86855042687623,NA 
rayol-farm2_2019-04-30_13-06-07.wav,44100,16,60,1,bioacoustic_index,512,2000,8000,2.94305504146839,NA 
rayol-farm2_2019-04-30_13-08-07.wav,44100,16,60,1,bioacoustic_index,512,2000,8000,3.56647146357144,NA 
rayol-farm2_2019-04-30_13-10-07.wav,44100,16,60,1,bioacoustic_index,512,2000,8000,3.39535479221386,NA 
rayol-farm2_2019-04-30_13-12-07.wav,44100,16,60,1,bioacoustic_index,512,2000,8000,2.2337786724135,NA 
rayol-farm2_2019-04-30_13-14-07.wav,44100,16,60,1,bioacoustic_index,512,2000,8000,2.81694396276247,NA 
rayol-farm2_2019-04-30_13-16-07.wav,44100,16,60,1,bioacoustic_index,512,2000,8000,1.95051540675222,NA 
rayol-farm2_2019-04-30_13-18-08.wav,44100,16,60,1,bioacoustic_index,512,2000,8000,3.12831478959062,NA 
rayol-farm2_2019-04-30_13-20-08.wav,44100,16,60,1,bioacoustic_index,512,2000,8000,1.8840422055366,NA 
rayol-farm2_2019-04-30_13-22-08.wav,44100,16,60,1,bioacoustic_index,512,2000,8000,1.6744603160129,NA 
rayol-farm2_2019-04-30_13-24-08.wav,44100,16,60,1,bioacoustic_index,512,2000,8000,3.12814676361297,NA 
rayol-farm2_2019-04-30_13-26-08.wav,44100,16,60,1,bioacoustic_index,512,2000,8000,3.48422892955019,NA 
rayol-farm2_2019-04-30_13-28-08.wav,44100,16,60,1,bioacoustic_index,512,2000,8000,1.75578788951312,NA 
rayol-farm2_2019-04-30_13-30-08.wav,44100,16,60,1,bioacoustic_index,512,2000,8000,2.37307695688608,NA 
rayol-farm2_2019-04-30_13-32-08.wav,44100,16,60,1,bioacoustic_index,512,2000,8000,2.47826108861429,NA 
rayol-farm2_2019-04-30_13-34-09.wav,44100,16,60,1,bioacoustic_index,512,2000,8000,4.30560711235853,NA 
rayol-farm2_2019-04-30_13-36-09.wav,44100,16,60,1,bioacoustic_index,512,2000,8000,3.46440325259141,NA 
rayol-farm2_2019-04-30_13-38-09.wav,44100,16,60,1,bioacoustic_index,512,2000,8000,3.51483416643446,NA 
rayol-farm2_2019-04-30_13-40-09.wav,44100,16,60,1,bioacoustic_index,512,2000,8000,2.05526349513848,NA 
rayol-farm2_2019-04-30_13-42-09.wav,44100,16,60,1,bioacoustic_index,512,2000,8000,2.08875690257423,NA 
rayol-farm2_2019-04-30_13-44-09.wav,44100,16,60,1,bioacoustic_index,512,2000,8000,1.70481575632636,NA 
rayol-farm2_2019-04-30_13-46-09.wav,44100,16,60,1,bioacoustic_index,512,2000,8000,3.15919077264542,NA 
rayol-farm2_2019-04-30_13-48-09.wav,44100,16,60,1,bioacoustic_index,512,2000,8000,2.52440552550754,NA 
rayol-farm2_2019-04-30_13-50-09.wav,44100,16,60,1,bioacoustic_index,512,2000,8000,2.44559770797849,NA 
rayol-farm2_2019-04-30_13-52-10.wav,44100,16,60,1,bioacoustic_index,512,2000,8000,1.82214007711127,NA 
rayol-farm2_2019-04-30_13-54-10.wav,44100,16,60,1,bioacoustic_index,512,2000,8000,2.39104058183187,NA 
rayol-farm2_2019-04-30_13-56-10.wav,44100,16,60,1,bioacoustic_index,512,2000,8000,1.98646573571278,NA 
rayol-farm2_2019-04-30_13-58-10.wav,44100,16,60,1,bioacoustic_index,512,2000,8000,1.97800677719258,NA 
rayol-farm2_2019-04-30_14-00-10.wav,44100,16,60,1,bioacoustic_index,512,2000,8000,3.4803147627122,NA 
rayol-farm2_2019-04-30_14-02-10.wav,44100,16,60,1,bioacoustic_index,512,2000,8000,2.08769190951076,NA 
rayol-farm2_2019-04-30_14-04-10.wav,44100,16,60,1,bioacoustic_index,512,2000,8000,3.40222239974367,NA 
rayol-farm2_2019-04-30_14-06-10.wav,44100,16,60,1,bioacoustic_index,512,2000,8000,2.49937760130102,NA 
rayol-farm2_2019-04-30_14-08-11.wav,44100,16,60,1,bioacoustic_index,512,2000,8000,1.8117983166457,NA 
rayol-farm2_2019-04-30_14-10-11.wav,44100,16,60,1,bioacoustic_index,512,2000,8000,1.43701783514285,NA 
rayol-farm2_2019-04-30_14-12-11.wav,44100,16,60,1,bioacoustic_index,512,2000,8000,3.21618589667868,NA 
rayol-farm2_2019-04-30_14-14-11.wav,44100,16,60,1,bioacoustic_index,512,2000,8000,2.04256673317956,NA 
rayol-farm2_2019-04-30_14-16-11.wav,44100,16,60,1,bioacoustic_index,512,2000,8000,1.78446619440914,NA 
rayol-farm2_2019-04-30_14-18-11.wav,44100,16,60,1,bioacoustic_index,512,2000,8000,1.96875617964702,NA 
rayol-farm2_2019-04-30_14-20-11.wav,44100,16,60,1,bioacoustic_index,512,2000,8000,2.24150160987205,NA 
rayol-farm2_2019-04-30_14-22-11.wav,44100,16,60,1,bioacoustic_index,512,2000,8000,2.12325866507918,NA 
rayol-farm2_2019-04-30_14-24-12.wav,44100,16,60,1,bioacoustic_index,512,2000,8000,2.37353641182048,NA 
rayol-farm2_2019-04-30_14-26-12.wav,44100,16,60,1,bioacoustic_index,512,2000,8000,2.08434344974906,NA 
rayol-farm2_2019-04-30_14-28-12.wav,44100,16,60,1,bioacoustic_index,512,2000,8000,2.21376156018836,NA 
rayol-farm2_2019-04-30_14-30-12.wav,44100,16,60,1,bioacoustic_index,512,2000,8000,1.46626595560861,NA 
rayol-farm2_2019-04-30_14-32-12.wav,44100,16,60,1,bioacoustic_index,512,2000,8000,2.74875870784394,NA 
rayol-farm2_2019-04-30_14-34-12.wav,44100,16,60,1,bioacoustic_index,512,2000,8000,2.48276353091466,NA 
rayol-farm2_2019-04-30_14-36-12.wav,44100,16,60,1,bioacoustic_index,512,2000,8000,2.1900326590447,NA 
rayol-farm2_2019-04-30_14-38-12.wav,44100,16,60,1,bioacoustic_index,512,2000,8000,1.9720584309311,NA 
rayol-farm2_2019-04-30_14-40-12.wav,44100,16,60,1,bioacoustic_index,512,2000,8000,2.03917747428631,NA 
rayol-farm2_2019-04-30_14-42-13.wav,44100,16,60,1,bioacoustic_index,512,2000,8000,1.73695744878091,NA 
rayol-farm2_2019-04-30_14-44-13.wav,44100,16,60,1,bioacoustic_index,512,2000,8000,2.21467129545092,NA 
rayol-farm2_2019-04-30_14-46-13.wav,44100,16,60,1,bioacoustic_index,512,2000,8000,1.60117103611943,NA 
rayol-farm2_2019-04-30_14-48-13.wav,44100,16,60,1,bioacoustic_index,512,2000,8000,2.78127995294972,NA 
rayol-farm2_2019-04-30_14-50-13.wav,44100,16,60,1,bioacoustic_index,512,2000,8000,1.78412393529355,NA 
rayol-farm2_2019-04-30_14-52-13.wav,44100,16,60,1,bioacoustic_index,512,2000,8000,1.53550761760115,NA 
rayol-farm2_2019-04-30_14-54-13.wav,44100,16,60,1,bioacoustic_index,512,2000,8000,1.4586954567035,NA 
rayol-farm2_2019-04-30_14-56-13.wav,44100,16,60,1,bioacoustic_index,512,2000,8000,1.649229333649,NA 
rayol-farm2_2019-04-30_14-58-14.wav,44100,16,60,1,bioacoustic_index,512,2000,8000,1.50706968612087,NA 
rayol-farm2_2019-04-30_15-00-14.wav,44100,16,60,1,bioacoustic_index,512,2000,8000,1.84809988501123,NA 
rayol-farm2_2019-04-30_15-02-14.wav,44100,16,60,1,bioacoustic_index,512,2000,8000,1.98784358822908,NA 
rayol-farm2_2019-04-30_15-04-14.wav,44100,16,60,1,bioacoustic_index,512,2000,8000,2.48578365897135,NA 
rayol-farm2_2019-04-30_15-06-14.wav,44100,16,60,1,bioacoustic_index,512,2000,8000,1.81823245223286,NA 
rayol-farm2_2019-04-30_15-08-14.wav,44100,16,60,1,bioacoustic_index,512,2000,8000,2.07093904025041,NA 
rayol-farm2_2019-04-30_15-10-14.wav,44100,16,60,1,bioacoustic_index,512,2000,8000,1.56872165672394,NA 
rayol-farm2_2019-04-30_15-12-14.wav,44100,16,60,1,bioacoustic_index,512,2000,8000,2.09615987430774,NA 
rayol-farm2_2019-04-30_15-14-15.wav,44100,16,60,1,bioacoustic_index,512,2000,8000,1.63512821121957,NA 
rayol-farm2_2019-04-30_15-16-15.wav,44100,16,60,1,bioacoustic_index,512,2000,8000,1.90409814974401,NA 
rayol-farm2_2019-04-30_15-18-15.wav,44100,16,60,1,bioacoustic_index,512,2000,8000,1.78781095552822,NA 
rayol-farm2_2019-04-30_15-20-15.wav,44100,16,60,1,bioacoustic_index,512,2000,8000,2.81871429539266,NA 
rayol-farm2_2019-04-30_15-22-15.wav,44100,16,60,1,bioacoustic_index,512,2000,8000,2.3457106233019,NA 
rayol-farm2_2019-04-30_15-24-15.wav,44100,16,60,1,bioacoustic_index,512,2000,8000,2.05280420086557,NA 
rayol-farm2_2019-04-30_15-26-15.wav,44100,16,60,1,bioacoustic_index,512,2000,8000,3.02578726671478,NA 
rayol-farm2_2019-04-30_15-28-15.wav,44100,16,60,1,bioacoustic_index,512,2000,8000,2.20270705876206,NA 
rayol-farm2_2019-04-30_15-30-16.wav,44100,16,60,1,bioacoustic_index,512,2000,8000,2.04324749072529,NA 
rayol-farm2_2019-04-30_15-32-16.wav,44100,16,60,1,bioacoustic_index,512,2000,8000,2.38891864212155,NA 
rayol-farm2_2019-04-30_15-34-16.wav,44100,16,60,1,bioacoustic_index,512,2000,8000,2.09103967603858,NA 
rayol-farm2_2019-04-30_15-36-16.wav,44100,16,60,1,bioacoustic_index,512,2000,8000,1.46548653873142,NA 
rayol-farm2_2019-04-30_15-38-16.wav,44100,16,60,1,bioacoustic_index,512,2000,8000,1.48468448214096,NA 
rayol-farm2_2019-04-30_15-40-16.wav,44100,16,60,1,bioacoustic_index,512,2000,8000,1.69738755116003,NA 
rayol-farm2_2019-04-30_15-42-16.wav,44100,16,60,1,bioacoustic_index,512,2000,8000,2.04099108860173,NA 
rayol-farm2_2019-04-30_15-44-16.wav,44100,16,60,1,bioacoustic_index,512,2000,8000,2.03744568180549,NA 
rayol-farm2_2019-04-30_15-46-16.wav,44100,16,60,1,bioacoustic_index,512,2000,8000,3.19928852572476,NA 
rayol-farm2_2019-04-30_15-48-17.wav,44100,16,60,1,bioacoustic_index,512,2000,8000,1.96311867852302,NA 
rayol-farm2_2019-04-30_15-50-17.wav,44100,16,60,1,bioacoustic_index,512,2000,8000,2.2498734904499,NA 
rayol-farm2_2019-04-30_15-52-17.wav,44100,16,60,1,bioacoustic_index,512,2000,8000,2.27580506368206,NA 
rayol-farm2_2019-04-30_15-54-17.wav,44100,16,60,1,bioacoustic_index,512,2000,8000,3.79263777614137,NA 
rayol-farm2_2019-04-30_15-56-17.wav,44100,16,60,1,bioacoustic_index,512,2000,8000,2.57357202402161,NA 
rayol-farm2_2019-04-30_15-58-17.wav,44100,16,60,1,bioacoustic_index,512,2000,8000,2.35490416489322,NA 
rayol-farm2_2019-04-30_16-00-17.wav,44100,16,60,1,bioacoustic_index,512,2000,8000,2.70147108428588,NA 
rayol-farm2_2019-04-30_16-02-17.wav,44100,16,60,1,bioacoustic_index,512,2000,8000,2.19495567703225,NA 
rayol-farm2_2019-04-30_16-04-18.wav,44100,16,60,1,bioacoustic_index,512,2000,8000,2.22746283823362,NA 
rayol-farm2_2019-04-30_16-06-18.wav,44100,16,60,1,bioacoustic_index,512,2000,8000,2.32592382721424,NA 
rayol-farm2_2019-04-30_16-08-18.wav,44100,16,60,1,bioacoustic_index,512,2000,8000,2.96529351261684,NA 
rayol-farm2_2019-04-30_16-10-18.wav,44100,16,60,1,bioacoustic_index,512,2000,8000,2.63251145840204,NA 
rayol-farm2_2019-04-30_16-12-18.wav,44100,16,60,1,bioacoustic_index,512,2000,8000,1.3375465849968,NA 
rayol-farm2_2019-04-30_16-14-18.wav,44100,16,60,1,bioacoustic_index,512,2000,8000,1.43428576003644,NA 
rayol-farm2_2019-04-30_16-16-18.wav,44100,16,60,1,bioacoustic_index,512,2000,8000,1.58956787159288,NA 
rayol-farm2_2019-04-30_16-18-18.wav,44100,16,60,1,bioacoustic_index,512,2000,8000,1.5903950280141,NA 
rayol-farm2_2019-04-30_16-20-19.wav,44100,16,60,1,bioacoustic_index,512,2000,8000,1.76803210506416,NA 
rayol-farm2_2019-04-30_16-22-19.wav,44100,16,60,1,bioacoustic_index,512,2000,8000,1.34371442522383,NA 
rayol-farm2_2019-04-30_16-24-19.wav,44100,16,60,1,bioacoustic_index,512,2000,8000,1.34762805437094,NA 
rayol-farm2_2019-04-30_16-26-19.wav,44100,16,60,1,bioacoustic_index,512,2000,8000,2.26988092836425,NA 
rayol-farm2_2019-04-30_16-28-19.wav,44100,16,60,1,bioacoustic_index,512,2000,8000,2.84681225857221,NA 
rayol-farm2_2019-04-30_16-30-19.wav,44100,16,60,1,bioacoustic_index,512,2000,8000,1.67222800466069,NA 
rayol-farm2_2019-04-30_16-32-19.wav,44100,16,60,1,bioacoustic_index,512,2000,8000,2.44648101294218,NA 
rayol-farm2_2019-04-30_16-34-19.wav,44100,16,60,1,bioacoustic_index,512,2000,8000,1.51765726876842,NA 
rayol-farm2_2019-04-30_16-36-20.wav,44100,16,60,1,bioacoustic_index,512,2000,8000,1.64685068136349,NA 
rayol-farm2_2019-04-30_16-38-20.wav,44100,16,60,1,bioacoustic_index,512,2000,8000,2.18435639726788,NA 
rayol-farm2_2019-04-30_16-40-20.wav,44100,16,60,1,bioacoustic_index,512,2000,8000,1.62095669324891,NA 
rayol-farm2_2019-04-30_16-42-20.wav,44100,16,60,1,bioacoustic_index,512,2000,8000,1.9696393067003,NA 
rayol-farm2_2019-04-30_16-44-20.wav,44100,16,60,1,bioacoustic_index,512,2000,8000,1.72098181910451,NA 
rayol-farm2_2019-04-30_16-46-20.wav,44100,16,60,1,bioacoustic_index,512,2000,8000,1.32582780981672,NA 
rayol-farm2_2019-04-30_16-48-20.wav,44100,16,60,1,bioacoustic_index,512,2000,8000,1.40776645097929,NA 
rayol-farm2_2019-04-30_16-50-20.wav,44100,16,60,1,bioacoustic_index,512,2000,8000,1.62021206527005,NA 
rayol-farm2_2019-04-30_16-52-20.wav,44100,16,60,1,bioacoustic_index,512,2000,8000,1.56734568414279,NA 
rayol-farm2_2019-04-30_16-54-21.wav,44100,16,60,1,bioacoustic_index,512,2000,8000,1.90524717186104,NA 
rayol-farm2_2019-04-30_16-56-21.wav,44100,16,60,1,bioacoustic_index,512,2000,8000,1.95622288599986,NA 
rayol-farm2_2019-04-30_16-58-21.wav,44100,16,60,1,bioacoustic_index,512,2000,8000,2.38837398960739,NA 
rayol-farm2_2019-04-30_17-00-21.wav,44100,16,60,1,bioacoustic_index,512,2000,8000,2.02567877466243,NA 
rayol-farm2_2019-04-30_17-02-21.wav,44100,16,60,1,bioacoustic_index,512,2000,8000,2.08263126233563,NA 
rayol-farm2_2019-04-30_17-04-21.wav,44100,16,60,1,bioacoustic_index,512,2000,8000,1.62360943346986,NA 
rayol-farm2_2019-04-30_17-06-21.wav,44100,16,60,1,bioacoustic_index,512,2000,8000,2.02762986670808,NA 
rayol-farm2_2019-04-30_17-08-21.wav,44100,16,60,1,bioacoustic_index,512,2000,8000,4.08532181090107,NA 
rayol-farm2_2019-04-30_17-10-22.wav,44100,16,60,1,bioacoustic_index,512,2000,8000,1.37525052280256,NA 
rayol-farm2_2019-04-30_17-12-22.wav,44100,16,60,1,bioacoustic_index,512,2000,8000,2.00198875606486,NA 
rayol-farm2_2019-04-30_17-14-22.wav,44100,16,60,1,bioacoustic_index,512,2000,8000,1.72916633545147,NA 
rayol-farm2_2019-04-30_17-16-22.wav,44100,16,60,1,bioacoustic_index,512,2000,8000,1.66934454157473,NA 
rayol-farm2_2019-04-30_17-18-22.wav,44100,16,60,1,bioacoustic_index,512,2000,8000,1.60814976333225,NA 
rayol-farm2_2019-04-30_17-20-22.wav,44100,16,60,1,bioacoustic_index,512,2000,8000,1.48777720282814,NA 
rayol-farm2_2019-04-30_17-22-22.wav,44100,16,60,1,bioacoustic_index,512,2000,8000,1.90766649225269,NA 
rayol-farm2_2019-04-30_17-24-22.wav,44100,16,60,1,bioacoustic_index,512,2000,8000,1.39848526433809,NA 
rayol-farm2_2019-04-30_17-26-23.wav,44100,16,60,1,bioacoustic_index,512,2000,8000,1.56590144965603,NA 
rayol-farm2_2019-04-30_17-28-23.wav,44100,16,60,1,bioacoustic_index,512,2000,8000,1.36451682193825,NA 
rayol-farm2_2019-04-30_17-30-23.wav,44100,16,60,1,bioacoustic_index,512,2000,8000,1.45262834199648,NA 
rayol-farm2_2019-04-30_17-32-23.wav,44100,16,60,1,bioacoustic_index,512,2000,8000,2.60193235205777,NA 
rayol-farm2_2019-04-30_17-34-23.wav,44100,16,60,1,bioacoustic_index,512,2000,8000,2.22166878893299,NA 
rayol-farm2_2019-04-30_17-36-23.wav,44100,16,60,1,bioacoustic_index,512,2000,8000,2.44554224289795,NA 
rayol-farm2_2019-04-30_17-38-23.wav,44100,16,60,1,bioacoustic_index,512,2000,8000,1.59217547273272,NA 
rayol-farm2_2019-04-30_17-40-23.wav,44100,16,60,1,bioacoustic_index,512,2000,8000,1.52024999665076,NA 
rayol-farm2_2019-04-30_17-42-23.wav,44100,16,60,1,bioacoustic_index,512,2000,8000,1.4725626271809,NA 
rayol-farm2_2019-04-30_17-44-24.wav,44100,16,60,1,bioacoustic_index,512,2000,8000,1.62769201661013,NA 
rayol-farm2_2019-04-30_17-46-24.wav,44100,16,60,1,bioacoustic_index,512,2000,8000,1.30036482487528,NA 
rayol-farm2_2019-04-30_17-48-24.wav,44100,16,60,1,bioacoustic_index,512,2000,8000,1.55678511556048,NA 
rayol-farm2_2019-04-30_17-50-24.wav,44100,16,60,1,bioacoustic_index,512,2000,8000,1.39941105026027,NA 
rayol-farm2_2019-04-30_17-52-24.wav,44100,16,60,1,bioacoustic_index,512,2000,8000,1.25678922575651,NA 
rayol-farm2_2019-04-30_17-54-24.wav,44100,16,60,1,bioacoustic_index,512,2000,8000,3.5493757356443,NA 
rayol-farm2_2019-04-30_17-56-24.wav,44100,16,60,1,bioacoustic_index,512,2000,8000,1.32240330064101,NA 
rayol-farm2_2019-04-30_17-58-24.wav,44100,16,60,1,bioacoustic_index,512,2000,8000,1.40102625234288,NA 
rayol-farm2_2019-04-30_18-00-25.wav,44100,16,60,1,bioacoustic_index,512,2000,8000,1.37541081473648,NA 
rayol-farm2_2019-04-30_18-02-25.wav,44100,16,60,1,bioacoustic_index,512,2000,8000,1.36636891141559,NA 
rayol-farm2_2019-04-30_18-04-25.wav,44100,16,60,1,bioacoustic_index,512,2000,8000,2.53928812337309,NA 
rayol-farm2_2019-04-30_18-06-25.wav,44100,16,60,1,bioacoustic_index,512,2000,8000,1.60873215948551,NA 
rayol-farm2_2019-04-30_18-08-25.wav,44100,16,60,1,bioacoustic_index,512,2000,8000,1.39894652709928,NA 
rayol-farm2_2019-04-30_18-10-25.wav,44100,16,60,1,bioacoustic_index,512,2000,8000,1.55910686121122,NA 
rayol-farm2_2019-04-30_18-12-25.wav,44100,16,60,1,bioacoustic_index,512,2000,8000,1.82260074949069,NA 
rayol-farm2_2019-04-30_18-14-25.wav,44100,16,60,1,bioacoustic_index,512,2000,8000,1.42893689115152,NA 
rayol-farm2_2019-04-30_18-16-26.wav,44100,16,60,1,bioacoustic_index,512,2000,8000,1.5249968781776,NA 
rayol-farm2_2019-04-30_18-18-26.wav,44100,16,60,1,bioacoustic_index,512,2000,8000,1.43336343075382,NA 
rayol-farm2_2019-04-30_18-20-26.wav,44100,16,60,1,bioacoustic_index,512,2000,8000,1.67303919081603,NA 
rayol-farm2_2019-04-30_18-22-26.wav,44100,16,60,1,bioacoustic_index,512,2000,8000,1.78055428919611,NA 
rayol-farm2_2019-04-30_18-24-26.wav,44100,16,60,1,bioacoustic_index,512,2000,8000,1.38783430822631,NA 
rayol-farm2_2019-04-30_18-26-26.wav,44100,16,60,1,bioacoustic_index,512,2000,8000,1.43946278310696,NA 
rayol-farm2_2019-04-30_18-28-26.wav,44100,16,60,1,bioacoustic_index,512,2000,8000,1.44251157278406,NA 
rayol-farm2_2019-04-30_18-30-26.wav,44100,16,60,1,bioacoustic_index,512,2000,8000,1.72157947951675,NA 
rayol-farm2_2019-04-30_18-32-26.wav,44100,16,60,1,bioacoustic_index,512,2000,8000,1.19516386478066,NA 
rayol-farm2_2019-04-30_18-34-27.wav,44100,16,60,1,bioacoustic_index,512,2000,8000,1.32405130333294,NA 
rayol-farm2_2019-04-30_18-36-27.wav,44100,16,60,1,bioacoustic_index,512,2000,8000,1.29957676569951,NA 
rayol-farm2_2019-04-30_18-38-27.wav,44100,16,60,1,bioacoustic_index,512,2000,8000,1.33177893018756,NA 
rayol-farm2_2019-04-30_18-40-27.wav,44100,16,60,1,bioacoustic_index,512,2000,8000,1.52027311784949,NA 
rayol-farm2_2019-04-30_18-42-27.wav,44100,16,60,1,bioacoustic_index,512,2000,8000,1.18629366052473,NA 
rayol-farm2_2019-04-30_18-44-27.wav,44100,16,60,1,bioacoustic_index,512,2000,8000,1.36612940503697,NA 
rayol-farm2_2019-04-30_18-46-27.wav,44100,16,60,1,bioacoustic_index,512,2000,8000,1.30811955096056,NA 
rayol-farm2_2019-04-30_18-48-27.wav,44100,16,60,1,bioacoustic_index,512,2000,8000,1.41258802578164,NA 
rayol-farm2_2019-04-30_18-50-28.wav,44100,16,60,1,bioacoustic_index,512,2000,8000,1.20118974630791,NA 
rayol-farm2_2019-04-30_18-52-28.wav,44100,16,60,1,bioacoustic_index,512,2000,8000,1.38990944943145,NA 
rayol-farm2_2019-04-30_18-54-28.wav,44100,16,60,1,bioacoustic_index,512,2000,8000,1.34883569158417,NA 
rayol-farm2_2019-04-30_18-56-28.wav,44100,16,60,1,bioacoustic_index,512,2000,8000,1.38770419145194,NA 
rayol-farm2_2019-04-30_18-58-28.wav,44100,16,60,1,bioacoustic_index,512,2000,8000,1.76541086932575,NA 
rayol-farm2_2019-04-30_19-00-28.wav,44100,16,60,1,bioacoustic_index,512,2000,8000,2.86941138602021,NA 
rayol-farm2_2019-04-30_19-02-28.wav,44100,16,60,1,bioacoustic_index,512,2000,8000,2.49776271626388,NA 
rayol-farm2_2019-04-30_19-04-28.wav,44100,16,60,1,bioacoustic_index,512,2000,8000,3.58690782204597,NA 
rayol-farm2_2019-04-30_19-06-29.wav,44100,16,60,1,bioacoustic_index,512,2000,8000,1.73731021860635,NA 
rayol-farm2_2019-04-30_19-08-29.wav,44100,16,60,1,bioacoustic_index,512,2000,8000,1.44301923599562,NA 
rayol-farm2_2019-04-30_19-10-29.wav,44100,16,60,1,bioacoustic_index,512,2000,8000,1.32020212581811,NA 
rayol-farm2_2019-04-30_19-12-29.wav,44100,16,60,1,bioacoustic_index,512,2000,8000,1.51019620076495,NA 
rayol-farm2_2019-04-30_19-14-29.wav,44100,16,60,1,bioacoustic_index,512,2000,8000,1.68886579758081,NA 
rayol-farm2_2019-04-30_19-16-29.wav,44100,16,60,1,bioacoustic_index,512,2000,8000,2.37511152194621,NA 
rayol-farm2_2019-04-30_19-18-29.wav,44100,16,60,1,bioacoustic_index,512,2000,8000,1.81046782380491,NA 
rayol-farm2_2019-04-30_19-20-29.wav,44100,16,60,1,bioacoustic_index,512,2000,8000,2.23882077000154,NA 
rayol-farm2_2019-04-30_19-22-29.wav,44100,16,60,1,bioacoustic_index,512,2000,8000,2.48831723927975,NA 
rayol-farm2_2019-04-30_19-24-30.wav,44100,16,60,1,bioacoustic_index,512,2000,8000,1.75356494686297,NA 
rayol-farm2_2019-04-30_19-26-30.wav,44100,16,60,1,bioacoustic_index,512,2000,8000,2.29219046098036,NA 
rayol-farm2_2019-04-30_19-28-30.wav,44100,16,60,1,bioacoustic_index,512,2000,8000,1.27227925072826,NA 
rayol-farm2_2019-04-30_19-30-30.wav,44100,16,60,1,bioacoustic_index,512,2000,8000,1.23118643772951,NA 
rayol-farm2_2019-04-30_19-32-30.wav,44100,16,60,1,bioacoustic_index,512,2000,8000,2.17592356108514,NA 
rayol-farm2_2019-04-30_19-34-30.wav,44100,16,60,1,bioacoustic_index,512,2000,8000,1.24952892087502,NA 
rayol-farm2_2019-04-30_19-36-30.wav,44100,16,60,1,bioacoustic_index,512,2000,8000,1.57854491838213,NA 
rayol-farm2_2019-04-30_19-38-30.wav,44100,16,60,1,bioacoustic_index,512,2000,8000,1.38790082437269,NA 
rayol-farm2_2019-04-30_19-40-31.wav,44100,16,60,1,bioacoustic_index,512,2000,8000,1.63667792304263,NA 
rayol-farm2_2019-04-30_19-42-31.wav,44100,16,60,1,bioacoustic_index,512,2000,8000,1.45504328273039,NA 
rayol-farm2_2019-04-30_19-44-31.wav,44100,16,60,1,bioacoustic_index,512,2000,8000,1.5693335588545,NA 
rayol-farm2_2019-04-30_19-46-31.wav,44100,16,60,1,bioacoustic_index,512,2000,8000,1.63756830296218,NA 
rayol-farm2_2019-04-30_19-48-31.wav,44100,16,60,1,bioacoustic_index,512,2000,8000,2.76195547975698,NA 
rayol-farm2_2019-04-30_19-50-31.wav,44100,16,60,1,bioacoustic_index,512,2000,8000,2.18377691741392,NA 
rayol-farm2_2019-04-30_19-52-31.wav,44100,16,60,1,bioacoustic_index,512,2000,8000,1.78996769838899,NA 
rayol-farm2_2019-04-30_19-54-31.wav,44100,16,60,1,bioacoustic_index,512,2000,8000,1.19316903612149,NA 
rayol-farm2_2019-04-30_19-56-32.wav,44100,16,60,1,bioacoustic_index,512,2000,8000,1.40467962847786,NA 
rayol-farm2_2019-04-30_19-58-32.wav,44100,16,60,1,bioacoustic_index,512,2000,8000,2.80268639071358,NA 
rayol-farm2_2019-04-30_20-00-32.wav,44100,16,60,1,bioacoustic_index,512,2000,8000,1.7282408289948,NA 
rayol-farm2_2019-04-30_20-02-32.wav,44100,16,60,1,bioacoustic_index,512,2000,8000,1.68903553979781,NA 
rayol-farm2_2019-04-30_20-04-32.wav,44100,16,60,1,bioacoustic_index,512,2000,8000,2.72098690928218,NA 
rayol-farm2_2019-04-30_20-06-32.wav,44100,16,60,1,bioacoustic_index,512,2000,8000,1.27980174094041,NA 
rayol-farm2_2019-04-30_20-08-32.wav,44100,16,60,1,bioacoustic_index,512,2000,8000,1.58122229790919,NA 
rayol-farm2_2019-04-30_20-10-32.wav,44100,16,60,1,bioacoustic_index,512,2000,8000,1.28274389884037,NA 
rayol-farm2_2019-04-30_20-12-33.wav,44100,16,60,1,bioacoustic_index,512,2000,8000,2.25996909614403,NA 
rayol-farm2_2019-04-30_20-14-33.wav,44100,16,60,1,bioacoustic_index,512,2000,8000,1.66071600256586,NA 
rayol-farm2_2019-04-30_20-16-33.wav,44100,16,60,1,bioacoustic_index,512,2000,8000,1.46742616766363,NA 
rayol-farm2_2019-04-30_20-18-33.wav,44100,16,60,1,bioacoustic_index,512,2000,8000,1.28060285120068,NA 
rayol-farm2_2019-04-30_20-20-33.wav,44100,16,60,1,bioacoustic_index,512,2000,8000,1.34743350868639,NA 
rayol-farm2_2019-04-30_20-22-33.wav,44100,16,60,1,bioacoustic_index,512,2000,8000,1.60811544046778,NA 
rayol-farm2_2019-04-30_20-24-33.wav,44100,16,60,1,bioacoustic_index,512,2000,8000,1.45251547879035,NA 
rayol-farm2_2019-04-30_20-26-33.wav,44100,16,60,1,bioacoustic_index,512,2000,8000,1.44120918717862,NA 
rayol-farm2_2019-04-30_20-28-33.wav,44100,16,60,1,bioacoustic_index,512,2000,8000,1.30755485648469,NA 
rayol-farm2_2019-04-30_20-30-34.wav,44100,16,60,1,bioacoustic_index,512,2000,8000,1.55161267853579,NA 
rayol-farm2_2019-04-30_20-32-34.wav,44100,16,60,1,bioacoustic_index,512,2000,8000,1.59716019319414,NA 
rayol-farm2_2019-04-30_20-34-34.wav,44100,16,60,1,bioacoustic_index,512,2000,8000,1.45789904563932,NA 
rayol-farm2_2019-04-30_20-36-34.wav,44100,16,60,1,bioacoustic_index,512,2000,8000,2.52729379114838,NA 
rayol-farm2_2019-04-30_20-38-34.wav,44100,16,60,1,bioacoustic_index,512,2000,8000,2.22594962717149,NA 
rayol-farm2_2019-04-30_20-40-34.wav,44100,16,60,1,bioacoustic_index,512,2000,8000,1.82687710120449,NA 
rayol-farm2_2019-04-30_20-42-34.wav,44100,16,60,1,bioacoustic_index,512,2000,8000,2.77374493292842,NA 
rayol-farm2_2019-04-30_20-44-34.wav,44100,16,60,1,bioacoustic_index,512,2000,8000,2.59988708216342,NA 
rayol-farm2_2019-04-30_20-46-35.wav,44100,16,60,1,bioacoustic_index,512,2000,8000,1.92693253269964,NA 
rayol-farm2_2019-04-30_20-48-35.wav,44100,16,60,1,bioacoustic_index,512,2000,8000,1.95435498621578,NA 
rayol-farm2_2019-04-30_20-50-35.wav,44100,16,60,1,bioacoustic_index,512,2000,8000,1.70896632153311,NA 
rayol-farm2_2019-04-30_20-52-35.wav,44100,16,60,1,bioacoustic_index,512,2000,8000,1.96157303794752,NA 
rayol-farm2_2019-04-30_20-54-35.wav,44100,16,60,1,bioacoustic_index,512,2000,8000,1.63594135464009,NA 
rayol-farm2_2019-04-30_20-56-35.wav,44100,16,60,1,bioacoustic_index,512,2000,8000,1.63233526966062,NA 
rayol-farm2_2019-04-30_20-58-35.wav,44100,16,60,1,bioacoustic_index,512,2000,8000,1.73512338215172,NA 
rayol-farm2_2019-04-30_21-00-35.wav,44100,16,60,1,bioacoustic_index,512,2000,8000,1.63062443084015,NA 
rayol-farm2_2019-04-30_21-02-36.wav,44100,16,60,1,bioacoustic_index,512,2000,8000,1.75331317315429,NA 
rayol-farm2_2019-04-30_21-04-36.wav,44100,16,60,1,bioacoustic_index,512,2000,8000,3.12698665962896,NA 
rayol-farm2_2019-04-30_21-06-36.wav,44100,16,60,1,bioacoustic_index,512,2000,8000,2.17578443730966,NA 
rayol-farm2_2019-04-30_21-08-36.wav,44100,16,60,1,bioacoustic_index,512,2000,8000,4.34558242707292,NA 
rayol-farm2_2019-04-30_21-10-36.wav,44100,16,60,1,bioacoustic_index,512,2000,8000,5.15954933360632,NA 
rayol-farm2_2019-04-30_21-12-36.wav,44100,16,60,1,bioacoustic_index,512,2000,8000,5.26696113445831,NA 
rayol-farm2_2019-04-30_21-14-36.wav,44100,16,60,1,bioacoustic_index,512,2000,8000,4.41280812858749,NA 
rayol-farm2_2019-04-30_21-16-36.wav,44100,16,60,1,bioacoustic_index,512,2000,8000,4.06018478275076,NA 
rayol-farm2_2019-04-30_21-18-37.wav,44100,16,60,1,bioacoustic_index,512,2000,8000,5.1139836567035,NA 
rayol-farm2_2019-04-30_21-20-37.wav,44100,16,60,1,bioacoustic_index,512,2000,8000,4.54706730825896,NA 
rayol-farm2_2019-04-30_21-22-37.wav,44100,16,60,1,bioacoustic_index,512,2000,8000,5.28682537545928,NA 
rayol-farm2_2019-04-30_21-24-37.wav,44100,16,60,1,bioacoustic_index,512,2000,8000,3.9629978709875,NA 
rayol-farm2_2019-04-30_21-26-37.wav,44100,16,60,1,bioacoustic_index,512,2000,8000,4.93968841878704,NA 
rayol-farm2_2019-04-30_21-28-37.wav,44100,16,60,1,bioacoustic_index,512,2000,8000,5.18064512053279,NA 
rayol-farm2_2019-04-30_21-30-37.wav,44100,16,60,1,bioacoustic_index,512,2000,8000,5.26775911696796,NA 
rayol-farm2_2019-04-30_21-32-37.wav,44100,16,60,1,bioacoustic_index,512,2000,8000,4.97291285580263,NA 
rayol-farm2_2019-04-30_21-34-38.wav,44100,16,60,1,bioacoustic_index,512,2000,8000,5.40726017268126,NA 
rayol-farm2_2019-04-30_21-36-38.wav,44100,16,60,1,bioacoustic_index,512,2000,8000,5.41022675368483,NA 
rayol-farm2_2019-04-30_21-38-38.wav,44100,16,60,1,bioacoustic_index,512,2000,8000,5.33687970998196,NA 
rayol-farm2_2019-04-30_21-40-38.wav,44100,16,60,1,bioacoustic_index,512,2000,8000,5.16977821758161,NA 
rayol-farm2_2019-04-30_21-42-38.wav,44100,16,60,1,bioacoustic_index,512,2000,8000,5.15489726239039,NA 
rayol-farm2_2019-04-30_21-44-38.wav,44100,16,60,1,bioacoustic_index,512,2000,8000,4.95866251107763,NA 
rayol-farm2_2019-04-30_21-46-38.wav,44100,16,60,1,bioacoustic_index,512,2000,8000,4.74279642011215,NA 
rayol-farm2_2019-04-30_21-48-38.wav,44100,16,60,1,bioacoustic_index,512,2000,8000,5.130172206534,NA 
rayol-farm2_2019-04-30_21-50-39.wav,44100,16,60,1,bioacoustic_index,512,2000,8000,4.77826921999747,NA 
rayol-farm2_2019-04-30_21-52-39.wav,44100,16,60,1,bioacoustic_index,512,2000,8000,4.9135472220509,NA 
rayol-farm2_2019-04-30_21-54-39.wav,44100,16,59.87,1,bioacoustic_index,512,2000,8000,5.04943880221802,NA 
rayol-farm2_2019-04-30_21-56-39.wav,44100,16,60,1,bioacoustic_index,512,2000,8000,4.97277121508073,NA 
rayol-farm2_2019-04-30_22-00-39.wav,44100,16,60,1,bioacoustic_index,512,2000,8000,4.88671780523137,NA 
rayol-farm2_2019-04-30_22-02-39.wav,44100,16,60,1,bioacoustic_index,512,2000,8000,4.77301098229155,NA 
rayol-farm2_2019-04-30_22-04-39.wav,44100,16,60,1,bioacoustic_index,512,2000,8000,4.87913267664322,NA 
rayol-farm2_2019-04-30_22-06-39.wav,44100,16,60,1,bioacoustic_index,512,2000,8000,4.56538498789094,NA 
rayol-farm2_2019-04-30_22-08-40.wav,44100,16,60,1,bioacoustic_index,512,2000,8000,4.57681175772247,NA 
rayol-farm2_2019-04-30_22-10-40.wav,44100,16,60,1,bioacoustic_index,512,2000,8000,4.79478347640891,NA 
rayol-farm2_2019-04-30_22-12-40.wav,44100,16,60,1,bioacoustic_index,512,2000,8000,4.63027389431276,NA 
rayol-farm2_2019-04-30_22-14-40.wav,44100,16,60,1,bioacoustic_index,512,2000,8000,4.38172309914518,NA 
rayol-farm2_2019-04-30_22-16-40.wav,44100,16,60,1,bioacoustic_index,512,2000,8000,4.83649092894438,NA 
rayol-farm2_2019-04-30_22-18-40.wav,44100,16,60,1,bioacoustic_index,512,2000,8000,4.84814434549291,NA 
rayol-farm2_2019-04-30_22-20-40.wav,44100,16,60,1,bioacoustic_index,512,2000,8000,4.58862576781831,NA 
rayol-farm2_2019-04-30_22-22-40.wav,44100,16,60,1,bioacoustic_index,512,2000,8000,4.14242067179237,NA 
rayol-farm2_2019-04-30_22-24-41.wav,44100,16,60,1,bioacoustic_index,512,2000,8000,1.68918295280238,NA 
rayol-farm2_2019-04-30_22-26-41.wav,44100,16,60,1,bioacoustic_index,512,2000,8000,3.79355884499157,NA 
rayol-farm2_2019-04-30_22-32-41.wav,44100,16,60,1,bioacoustic_index,512,2000,8000,4.75376484105478,NA 
rayol-farm2_2019-04-30_22-34-41.wav,44100,16,60,1,bioacoustic_index,512,2000,8000,4.86184810613183,NA 
rayol-farm2_2019-04-30_22-36-41.wav,44100,16,60,1,bioacoustic_index,512,2000,8000,4.66191008008329,NA 
rayol-farm2_2019-04-30_22-38-41.wav,44100,16,60,1,bioacoustic_index,512,2000,8000,4.60657889802827,NA 
rayol-farm2_2019-04-30_22-40-42.wav,44100,16,60,1,bioacoustic_index,512,2000,8000,4.71448817210928,NA 
rayol-farm2_2019-04-30_22-42-42.wav,44100,16,60,1,bioacoustic_index,512,2000,8000,4.6871912451178,NA 
rayol-farm2_2019-04-30_22-44-42.wav,44100,16,60,1,bioacoustic_index,512,2000,8000,4.57871689930381,NA 
rayol-farm2_2019-04-30_22-46-42.wav,44100,16,60,1,bioacoustic_index,512,2000,8000,4.47790338441656,NA 
rayol-farm2_2019-04-30_22-48-42.wav,44100,16,60,1,bioacoustic_index,512,2000,8000,4.32404819667199,NA 
rayol-farm2_2019-04-30_22-52-42.wav,44100,16,60,1,bioacoustic_index,512,2000,8000,3.50242399208315,NA 
rayol-farm2_2019-04-30_22-54-42.wav,44100,16,60,1,bioacoustic_index,512,2000,8000,4.34846025916889,NA 
rayol-farm2_2019-04-30_22-56-43.wav,44100,16,60,1,bioacoustic_index,512,2000,8000,3.747784445479,NA 
rayol-farm2_2019-04-30_23-00-43.wav,44100,16,60,1,bioacoustic_index,512,2000,8000,4.08458989631254,NA 
rayol-farm2_2019-04-30_23-04-43.wav,44100,16,60,1,bioacoustic_index,512,2000,8000,4.44309735057634,NA 
rayol-farm2_2019-04-30_23-06-43.wav,44100,16,60,1,bioacoustic_index,512,2000,8000,3.72485102805726,NA 
rayol-farm2_2019-04-30_23-08-43.wav,44100,16,60,1,bioacoustic_index,512,2000,8000,3.8271711733464,NA 
rayol-farm2_2019-04-30_23-10-43.wav,44100,16,60,1,bioacoustic_index,512,2000,8000,4.06166833466007,NA 
rayol-farm2_2019-04-30_23-14-44.wav,44100,16,60,1,bioacoustic_index,512,2000,8000,1.24876269259194,NA 
rayol-farm2_2019-04-30_23-16-44.wav,44100,16,60,1,bioacoustic_index,512,2000,8000,1.28649389101453,NA 
rayol-farm2_2019-04-30_23-18-44.wav,44100,16,60,1,bioacoustic_index,512,2000,8000,2.54786171158859,NA 
rayol-farm2_2019-04-30_23-20-44.wav,44100,16,60,1,bioacoustic_index,512,2000,8000,3.22896932248993,NA 
rayol-farm2_2019-04-30_23-22-44.wav,44100,16,60,1,bioacoustic_index,512,2000,8000,3.88457398025883,NA 
rayol-farm2_2019-04-30_23-24-44.wav,44100,16,60,1,bioacoustic_index,512,2000,8000,3.80903003646401,NA 
rayol-farm2_2019-04-30_23-26-44.wav,44100,16,60,1,bioacoustic_index,512,2000,8000,3.01254935163298,NA 
rayol-farm2_2019-04-30_23-28-44.wav,44100,16,60,1,bioacoustic_index,512,2000,8000,2.18519586563829,NA 
rayol-farm2_2019-04-30_23-30-45.wav,44100,16,60,1,bioacoustic_index,512,2000,8000,3.20610846119616,NA 
rayol-farm2_2019-04-30_23-32-45.wav,44100,16,60,1,bioacoustic_index,512,2000,8000,3.77020910873225,NA 
rayol-farm2_2019-04-30_23-34-45.wav,44100,16,60,1,bioacoustic_index,512,2000,8000,3.18364364078196,NA 
rayol-farm2_2019-04-30_23-38-45.wav,44100,16,60,1,bioacoustic_index,512,2000,8000,3.49579369402091,NA 
rayol-farm2_2019-04-30_23-42-45.wav,44100,16,60,1,bioacoustic_index,512,2000,8000,2.5744581240637,NA 
rayol-farm2_2019-04-30_23-44-45.wav,44100,16,60,1,bioacoustic_index,512,2000,8000,3.63705907714847,NA 
rayol-farm2_2019-04-30_23-46-46.wav,44100,16,60,1,bioacoustic_index,512,2000,8000,3.225179529679,NA 
rayol-farm2_2019-04-30_23-48-46.wav,44100,16,60,1,bioacoustic_index,512,2000,8000,3.22882502529559,NA 
rayol-farm2_2019-04-30_23-52-46.wav,44100,16,60,1,bioacoustic_index,512,2000,8000,1.44502110057253,NA 
rayol-farm2_2019-04-30_23-54-46.wav,44100,16,60,1,bioacoustic_index,512,2000,8000,1.27852126336614,NA 
rayol-farm2_2019-04-30_23-56-46.wav,44100,16,60,1,bioacoustic_index,512,2000,8000,1.28036541705953,NA 
rayol-farm2_2019-04-30_23-58-46.wav,44100,16,60,1,bioacoustic_index,512,2000,8000,1.22957976895797,NA
