<svg width="25" height="24" viewBox="0 0 25 24" fill="none" xmlns="http://www.w3.org/2000/svg">
<path fill-rule="evenodd" clip-rule="evenodd" d="M17.9916 21.0007C17.8386 21.0007 17.6846 20.9637 17.5432 20.8877L12.6046 18.2237L7.66706 20.8877C7.3397 21.0627 6.94454 21.0327 6.64817 20.8087C6.34986 20.5847 6.20167 20.2057 6.26463 19.8307L7.20507 14.2027L3.21472 10.2177C2.94934 9.9527 2.85346 9.5547 2.96678 9.1907C3.0801 8.8287 3.38325 8.5637 3.74935 8.5097L9.26998 7.6817L11.7378 2.5557C12.0652 1.8757 13.1451 1.8757 13.4724 2.5557L15.9403 7.6817L21.4609 8.5097C21.827 8.5637 22.1301 8.8287 22.2435 9.1907C22.3568 9.5547 22.2609 9.9527 21.9955 10.2177L18.0052 14.2027L18.9456 19.8307C19.0086 20.2057 18.8594 20.5847 18.5621 20.8087C18.3935 20.9367 18.1931 21.0007 17.9916 21.0007Z" fill="#231F20"/>
<mask id="mask0" mask-type="alpha" maskUnits="userSpaceOnUse" x="2" y="2" width="21" height="20">
<path fill-rule="evenodd" clip-rule="evenodd" d="M17.9916 21.0007C17.8386 21.0007 17.6846 20.9637 17.5432 20.8877L12.6046 18.2237L7.66706 20.8877C7.3397 21.0627 6.94454 21.0327 6.64817 20.8087C6.34986 20.5847 6.20167 20.2057 6.26463 19.8307L7.20507 14.2027L3.21472 10.2177C2.94934 9.9527 2.85346 9.5547 2.96678 9.1907C3.0801 8.8287 3.38325 8.5637 3.74935 8.5097L9.26998 7.6817L11.7378 2.5557C12.0652 1.8757 13.1451 1.8757 13.4724 2.5557L15.9403 7.6817L21.4609 8.5097C21.827 8.5637 22.1301 8.8287 22.2435 9.1907C22.3568 9.5547 22.2609 9.9527 21.9955 10.2177L18.0052 14.2027L18.9456 19.8307C19.0086 20.2057 18.8594 20.5847 18.5621 20.8087C18.3935 20.9367 18.1931 21.0007 17.9916 21.0007Z" fill="white"/>
</mask>
<g mask="url(#mask0)">
<rect x="0.982422" width="23.2448" height="24" fill="#D3BEFF"/>
</g>
</svg>
