<svg width="24" height="24" viewBox="0 0 24 24" fill="none" xmlns="http://www.w3.org/2000/svg">
<path fill-rule="evenodd" clip-rule="evenodd" d="M17.2572 21.0007C17.1042 21.0007 16.9502 20.9637 16.8088 20.8877L11.8703 18.2237L6.93269 20.8877C6.60532 21.0627 6.21016 21.0327 5.91379 20.8087C5.61548 20.5847 5.4673 20.2057 5.53025 19.8307L6.4707 14.2027L2.48035 10.2177C2.21497 9.9527 2.11909 9.5547 2.2324 9.1907C2.34572 8.8287 2.64887 8.5637 3.01498 8.5097L8.5356 7.6817L11.0034 2.5557C11.3308 1.8757 12.4107 1.8757 12.7381 2.5557L15.2059 7.6817L20.7265 8.5097C21.0926 8.5637 21.3958 8.8287 21.5091 9.1907C21.6224 9.5547 21.5265 9.9527 21.2611 10.2177L17.2708 14.2027L18.2112 19.8307C18.2742 20.2057 18.125 20.5847 17.8277 20.8087C17.6592 20.9367 17.4587 21.0007 17.2572 21.0007Z" fill="#FAFAFA"/>
<mask id="mask0" mask-type="alpha" maskUnits="userSpaceOnUse" x="2" y="2" width="20" height="20">
<path fill-rule="evenodd" clip-rule="evenodd" d="M17.2572 21.0007C17.1042 21.0007 16.9502 20.9637 16.8088 20.8877L11.8703 18.2237L6.93269 20.8877C6.60532 21.0627 6.21016 21.0327 5.91379 20.8087C5.61548 20.5847 5.4673 20.2057 5.53025 19.8307L6.4707 14.2027L2.48035 10.2177C2.21497 9.9527 2.11909 9.5547 2.2324 9.1907C2.34572 8.8287 2.64887 8.5637 3.01498 8.5097L8.5356 7.6817L11.0034 2.5557C11.3308 1.8757 12.4107 1.8757 12.7381 2.5557L15.2059 7.6817L20.7265 8.5097C21.0926 8.5637 21.3958 8.8287 21.5091 9.1907C21.6224 9.5547 21.5265 9.9527 21.2611 10.2177L17.2708 14.2027L18.2112 19.8307C18.2742 20.2057 18.125 20.5847 17.8277 20.8087C17.6592 20.9367 17.4587 21.0007 17.2572 21.0007Z" fill="white"/>
</mask>
<g mask="url(#mask0)">
<rect x="0.248047" width="23.2448" height="24" fill="#FFA62B"/>
</g>
</svg>
