{
  "object_kind": "issue",
  "event_type": "issue",
  "user": {
    "id": 123456,
    "name": "XXXX",
    "username": "user123",
    "avatar_url": "https://secure.gravatar.com/avatar/xxxxxxxxxxxxxxxxxxxxxxxxxxxxxxxxxx?s=80&d=identicon",
    "email": "[REDACTED]"
  },
  "project": {
    "id": 12345678,
    "name": "project-name",
    "description": null,
    "web_url": "https://gitlab.com/user123/project-name",
    "avatar_url": null,
    "git_ssh_url": "git@gitlab.com:user123/project-name.git",
    "git_http_url": "https://gitlab.com/user123/project-name.git",
    "namespace": "user123",
    "visibility_level": 0,
    "path_with_namespace": "user123/project-name",
    "default_branch": "main",
    "ci_config_path": "",
    "homepage": "https://gitlab.com/user123/project-name",
    "url": "git@gitlab.com:user123/project-name.git",
    "ssh_url": "git@gitlab.com:user123/project-name.git",
    "http_url": "https://gitlab.com/user123/project-name.git"
  },
  "object_attributes": {
    "author_id": 123456,
    "closed_at": "2024-05-23 07:18:32 UTC",
    "confidential": false,
    "created_at": "2024-05-23 07:18:20 UTC",
    "description": "<!-- 原則としてテンプレートを選択して、適切なテンプレートでイシューを作成してください -->\n\n# 概要\n\n# 目的\n\n# タスク\n- [ ] 細かいタスクに分解できているなら書き出す\n\n# 完了条件\n- [ ] 完了条件を具体的にチェックできる内容で列挙",
    "discussion_locked": null,
    "due_date": null,
    "id": 123456789,
    "iid": 2,
    "last_edited_at": null,
    "last_edited_by_id": null,
    "milestone_id": null,
    "moved_to_id": null,
    "duplicated_to_id": null,
    "project_id": 12345678,
    "relative_position": 449214,
    "state_id": 2,
    "time_estimate": 0,
    "title": "issue-title",
    "updated_at": "2024-05-23 07:18:32 UTC",
    "updated_by_id": null,
    "weight": null,
    "health_status": null,
    "url": "https://gitlab.com/user123/project-name/-/issues/2",
    "total_time_spent": 0,
    "time_change": 0,
    "human_total_time_spent": null,
    "human_time_change": null,
    "human_time_estimate": null,
    "assignee_ids": [],
    "assignee_id": null,
    "labels": [
      {
        "id": 12345679,
        "title": "Status::Backlog",
        "color": "#ed9121",
        "project_id": null,
        "created_at": "2023-02-07 08:54:47 UTC",
        "updated_at": "2023-02-07 09:05:56 UTC",
        "template": false,
        "description": "今後対応していくタスク",
        "type": "GroupLabel",
        "group_id": 12345678
      }
    ],
    "state": "closed",
    "severity": "unknown",
    "customer_relations_contacts": [],
    "action": "close"
  },
  "labels": [
    {
      "id": 12345679,
      "title": "Status::Backlog",
      "color": "#ed9121",
      "project_id": null,
      "created_at": "2023-02-07 08:54:47 UTC",
      "updated_at": "2023-02-07 09:05:56 UTC",
      "template": false,
      "description": "今後対応していくタスク",
      "type": "GroupLabel",
      "group_id": 12345678
    }
  ],
  "changes": {
    "closed_at": {
      "previous": null,
      "current": "2024-05-23 07:18:32 UTC"
    },
    "relative_position": {
      "previous": 449983,
      "current": 449214
    },
    "state_id": {
      "previous": 1,
      "current": 2
    },
    "updated_at": {
      "previous": "2024-05-23 07:18:20 UTC",
      "current": "2024-05-23 07:18:32 UTC"
    }
  },
  "repository": {
    "name": "project-name",
    "url": "git@gitlab.com:user123/project-name.git",
    "description": null,
    "homepage": "https://gitlab.com/user123/project-name"
  }
}
