{
  "object_kind": "issue",
  "event_type": "issue",
  "user": {
    "id": 123456,
    "name": "XXXX",
    "username": "user123",
    "avatar_url": "https://secure.gravatar.com/avatar/xxxxxxxxxxxxxxxxxxxxxxxxxxxxxxxxxx?s=80&d=identicon",
    "email": "[REDACTED]"
  },
  "project": {
    "id": 12345678,
    "name": "project-name",
    "description": null,
    "web_url": "https://gitlab.com/user123/project-name",
    "avatar_url": null,
    "git_ssh_url": "git@gitlab.com:user123/project-name.git",
    "git_http_url": "https://gitlab.com/user123/project-name.git",
    "namespace": "user123",
    "visibility_level": 0,
    "path_with_namespace": "user123/project-name",
    "default_branch": "main",
    "ci_config_path": "",
    "homepage": "https://gitlab.com/user123/project-name",
    "url": "git@gitlab.com:user123/project-name.git",
    "ssh_url": "git@gitlab.com:user123/project-name.git",
    "http_url": "https://gitlab.com/user123/project-name.git"
  },
  "object_attributes": {
    "author_id": 123456,
    "closed_at": null,
    "confidential": false,
    "created_at": "2024-05-28 03:00:26 UTC",
    "description": "",
    "discussion_locked": null,
    "due_date": null,
    "id": 123456789,
    "iid": 7,
    "last_edited_at": null,
    "last_edited_by_id": null,
    "milestone_id": null,
    "moved_to_id": null,
    "duplicated_to_id": null,
    "project_id": 12345678,
    "relative_position": 3591,
    "state_id": 1,
    "time_estimate": 0,
    "title": "issue-title",
    "updated_at": "2024-05-28 09:41:59 UTC",
    "updated_by_id": 123456,
    "weight": null,
    "health_status": null,
    "url": "https://gitlab.com/user123/project-name/-/issues/7",
    "total_time_spent": 0,
    "time_change": 0,
    "human_total_time_spent": null,
    "human_time_change": null,
    "human_time_estimate": null,
    "assignee_ids": [123456],
    "assignee_id": 123456,
    "labels": [
      {
        "id": 12345680,
        "title": "Health::On Track",
        "color": "#6699cc",
        "project_id": 12345678,
        "created_at": "2024-05-24 05:13:07 UTC",
        "updated_at": "2024-05-24 05:13:07 UTC",
        "template": false,
        "description": null,
        "type": "ProjectLabel",
        "group_id": null
      }
    ],
    "state": "opened",
    "severity": "unknown",
    "customer_relations_contacts": [],
    "action": "update"
  },
  "labels": [
    {
      "id": 12345680,
      "title": "Health::On Track",
      "color": "#6699cc",
      "project_id": 12345678,
      "created_at": "2024-05-24 05:13:07 UTC",
      "updated_at": "2024-05-24 05:13:07 UTC",
      "template": false,
      "description": null,
      "type": "ProjectLabel",
      "group_id": null
    }
  ],
  "changes": {
    "labels": {
      "previous": [],
      "current": [
        {
          "id": 12345680,
          "title": "Health::On Track",
          "color": "#6699cc",
          "project_id": 12345678,
          "created_at": "2024-05-24 05:13:07 UTC",
          "updated_at": "2024-05-24 05:13:07 UTC",
          "template": false,
          "description": null,
          "type": "ProjectLabel",
          "group_id": null
        }
      ]
    }
  },
  "repository": {
    "name": "project-name",
    "url": "git@gitlab.com:user123/project-name.git",
    "description": null,
    "homepage": "https://gitlab.com/user123/project-name"
  },
  "assignees": [
    {
      "id": 123456,
      "name": "XXXX",
      "username": "user123",
      "avatar_url": "https://secure.gravatar.com/avatar/xxxxxxxxxxxxxxxxxxxxxxxxxxxxxxxxxx?s=80&d=identicon",
      "email": "[REDACTED]"
    }
  ]
}
