{
    "Version": "2012-10-17",
    "Statement": [
      {
        "Action": "sts:AssumeRole",
        "Principal": {
          "Service": "elasticbeanstalk.amazonaws.com"
        },
        "Effect": "Allow",
        "Sid": ""
      }
    ]
  }