{
  "Docking": {
    "Data": []
  },
  "MainWindow": {
    "GLOBAL": {
      "fps": "120",
      "height": "1009",
      "maximized": "1",
      "style": "0",
      "userScale": "2",
      "width": "1920",
      "xpos": "0",
      "ypos": "23"
    }
  },
  "Window": {
    "###/SmartDashboard/Autonomous Mode": {
      "Collapsed": "0",
      "Pos": "517,19",
      "Size": "254,54"
    },
    "###FMS": {
      "Collapsed": "0",
      "Pos": "15,333",
      "Size": "169,184"
    },
    "###Joysticks": {
      "Collapsed": "0",
      "Pos": "529,186",
      "Size": "796,240"
    },
    "###NetworkTables": {
      "Collapsed": "0",
      "Pos": "250,277",
      "Size": "750,185"
    },
    "###NetworkTables Info": {
      "Collapsed": "0",
      "Pos": "765,533",
      "Size": "750,145"
    },
    "###Other Devices": {
      "Collapsed": "1",
      "Pos": "1025,20",
      "Size": "250,695"
    },
    "###Solenoids": {
      "Collapsed": "0",
      "Pos": "290,20",
      "Size": "169,238"
    },
    "###System Joysticks": {
      "Collapsed": "0",
      "Pos": "277,291",
      "Size": "192,218"
    },
    "###Timing": {
      "Collapsed": "0",
      "Pos": "5,150",
      "Size": "133,127"
    },
    "Debug##Default": {
      "Collapsed": "0",
      "Pos": "60,60",
      "Size": "400,400"
    },
    "Robot State": {
      "Collapsed": "0",
      "Pos": "5,20",
      "Size": "92,116"
    }
  }
}
