^E:\VISUAL PRIJECTS\13.4\HOMEWORK13-4\HOMEWORK13-4\DEBUG\HOMEWORK13-4.OBJ
/OUT:"E:\VISUAL PRIJECTS\13.4\HOMEWORK13-4\DEBUG\HOMEWORK13-4.EXE" /INCREMENTAL /ILK:"DEBUG\HOMEWORK13-4.ILK" /NOLOGO KERNEL32.LIB USER32.LIB GDI32.LIB WINSPOOL.LIB COMDLG32.LIB ADVAPI32.LIB SHELL32.LIB OLE32.LIB OLEAUT32.LIB UUID.LIB ODBC32.LIB ODBCCP32.LIB /MANIFEST /MANIFESTUAC:"level='asInvoker' uiAccess='false'" /manifest:embed /DEBUG /PDB:"E:\VISUAL PRIJECTS\13.4\HOMEWORK13-4\DEBUG\HOMEWORK13-4.PDB" /SUBSYSTEM:CONSOLE /TLBID:1 /DYNAMICBASE /NXCOMPAT /IMPLIB:"E:\VISUAL PRIJECTS\13.4\HOMEWORK13-4\DEBUG\HOMEWORK13-4.LIB" /MACHINE:X86 "DEBUG\HOMEWORK13-4.OBJ"
^E:\VISUAL PRIJECTS\13.4\HOMEWORK13-4\HOMEWORK13-4\DEBUG\HOMEWORK13-4.OBJ|E:\VISUAL PRIJECTS\13.4\HOMEWORK13-4\HOMEWORK13-4\DEBUG\HOMEWORK13-4.RES
/OUT:"E:\VISUAL PRIJECTS\13.4\HOMEWORK13-4\DEBUG\HOMEWORK13-4.EXE" /INCREMENTAL /ILK:"DEBUG\HOMEWORK13-4.ILK" /NOLOGO KERNEL32.LIB USER32.LIB GDI32.LIB WINSPOOL.LIB COMDLG32.LIB ADVAPI32.LIB SHELL32.LIB OLE32.LIB OLEAUT32.LIB UUID.LIB ODBC32.LIB ODBCCP32.LIB /MANIFEST /MANIFESTUAC:"level='asInvoker' uiAccess='false'" /manifest:embed /DEBUG /PDB:"E:\VISUAL PRIJECTS\13.4\HOMEWORK13-4\DEBUG\HOMEWORK13-4.PDB" /SUBSYSTEM:CONSOLE /TLBID:1 /DYNAMICBASE /NXCOMPAT /IMPLIB:"E:\VISUAL PRIJECTS\13.4\HOMEWORK13-4\DEBUG\HOMEWORK13-4.LIB" /MACHINE:X86 "DEBUG\HOMEWORK13-4.RES"
"DEBUG\HOMEWORK13-4.OBJ"
