### META ###
ID,Share_electricity_generation|Nuclear__Historic__WDI_2020
creator,AG
entity,Share_electricity_generation|Nuclear
original code,EG.ELC.NUCL.ZS
original name,Electricity production from nuclear sources (% of total)
pathway,Historic
scenario,Historic
source,WDI_2020
source_name,WDI
source_year,2020
unit,%
variable,Share_electricity_generation|Nuclear
### DATA ###
Country Code,1960,1961,1962,1963,1964,1965,1966,1967,1968,1969,1970,1971,1972,1973,1974,1975,1976,1977,1978,1979,1980,1981,1982,1983,1984,1985,1986,1987,1988,1989,1990,1991,1992,1993,1994,1995,1996,1997,1998,1999,2000,2001,2002,2003,2004,2005,2006,2007,2008,2009,2010,2011,2012,2013,2014,2015
AGO,,,,,,,,,,,,0.0,0.0,0.0,0.0,0.0,0.0,0.0,0.0,0.0,0.0,0.0,0.0,0.0,0.0,0.0,0.0,0.0,0.0,0.0,0.0,0.0,0.0,0.0,0.0,0.0,0.0,0.0,0.0,0.0,0.0,0.0,0.0,0.0,0.0,0.0,0.0,0.0,0.0,0.0,0.0,0.0,0.0,0.0,0.0,
ALB,,,,,,,,,,,,0.0,0.0,0.0,0.0,0.0,0.0,0.0,0.0,0.0,0.0,0.0,0.0,0.0,0.0,0.0,0.0,0.0,0.0,0.0,0.0,0.0,0.0,0.0,0.0,0.0,0.0,0.0,0.0,0.0,0.0,0.0,0.0,0.0,0.0,0.0,0.0,0.0,0.0,0.0,0.0,0.0,0.0,0.0,0.0,
ARE,,,,,,,,,,,,0.0,0.0,0.0,0.0,0.0,0.0,0.0,0.0,0.0,0.0,0.0,0.0,0.0,0.0,0.0,0.0,0.0,0.0,0.0,0.0,0.0,0.0,0.0,0.0,0.0,0.0,0.0,0.0,0.0,0.0,0.0,0.0,0.0,0.0,0.0,0.0,0.0,0.0,0.0,0.0,0.0,0.0,0.0,0.0,
ARG,,,,,,,,,,,,0.0,0.0,0.0,3.7066189624329198,8.57785502504856,8.512046597828961,5.050442723598559,8.66184123945684,7.15177598894822,5.8933158716566805,7.25044414119828,4.68836183121897,7.918052228914259,10.3211315215941,12.738318789351599,11.6543885068261,12.4233747766099,11.0975002871033,9.97604482191998,14.3496255419787,14.4639427111501,12.6715699432723,12.5860724957776,12.7660563969802,10.543908080280499,10.7037281519961,11.011369609117802,10.0699886504891,8.830949333267052,6.94747497469351,7.833324085890251,6.892591145370799,8.22123220688906,7.856037538062201,6.51524774625323,7.196661333033901,6.7188009123493,6.027762244663,6.69378849892141,5.72475511523754,4.917602562618191,4.71513784128529,4.4629632292670305,4.1667269910671605,
ARM,,,,,,,,,,,,,,,,,,,,,,,,,,,,,,,0.0,0.0,0.0,0.0,0.0,5.466642690163639,37.399420663019,26.654503234367198,25.6662897754805,36.3477348259577,33.652232292715695,34.586597040905104,41.348070302591,36.320668969278294,36.5008291873963,42.9950926072503,44.436963474162596,43.2858596134283,42.6516464471404,43.9781343678364,38.360807271606795,34.293405114401104,28.758088601294197,30.609597924773002,31.8064516129032,
AUS,0.0,0.0,0.0,0.0,0.0,0.0,0.0,0.0,0.0,0.0,0.0,0.0,0.0,0.0,0.0,0.0,0.0,0.0,0.0,0.0,0.0,0.0,0.0,0.0,0.0,0.0,0.0,0.0,0.0,0.0,0.0,0.0,0.0,0.0,0.0,0.0,0.0,0.0,0.0,0.0,0.0,0.0,0.0,0.0,0.0,0.0,0.0,0.0,0.0,0.0,0.0,0.0,0.0,0.0,0.0,0.0
AUT,0.0,0.0,0.0,0.0,0.0,0.0,0.0,0.0,0.0,0.0,0.0,0.0,0.0,0.0,0.0,0.0,0.0,0.0,0.0,0.0,0.0,0.0,0.0,0.0,0.0,0.0,0.0,0.0,0.0,0.0,0.0,0.0,0.0,0.0,0.0,0.0,0.0,0.0,0.0,0.0,0.0,0.0,0.0,0.0,0.0,0.0,0.0,0.0,0.0,0.0,0.0,0.0,0.0,0.0,0.0,0.0
AZE,,,,,,,,,,,,,,,,,,,,,,,,,,,,,,,0.0,0.0,0.0,0.0,0.0,0.0,0.0,0.0,0.0,0.0,0.0,0.0,0.0,0.0,0.0,0.0,0.0,0.0,0.0,0.0,0.0,0.0,0.0,0.0,0.0,
BEL,0.0,0.0,0.0227985180963237,0.24984052732298498,0.24816310641817899,0.0,0.0264924055104203,0.396775146680174,0.23053665910808802,0.0754328818789645,0.18674442223896698,0.0,0.029681597409606002,0.187122984119168,0.349766034882072,16.6201185751384,21.297455594932398,25.4731272269517,24.749302794754602,21.9766881803294,23.636774594564,25.691794369742897,31.3417903877706,46.4747729857911,51.6725647234122,61.5030484011447,68.3674354835911,67.3335793476343,66.7823554019925,61.6310540245525,60.7778979115689,60.209872727783605,60.8542220977454,59.8375863446937,56.943412623876895,56.25442080635511,57.67521094519421,60.887992704948594,56.2473347547974,58.7973514382362,58.179599627898,58.954692309649204,58.5132012997443,56.699895884443706,56.0881059357699,55.5309244070051,55.3006591738986,55.09893976784571,54.518263283203495,52.58223281295239,51.0950305329681,54.186981823084004,49.3684223422894,51.901075896986505,47.13574445470061,37.5323517570599
BEN,,,,,,,,,,,,,,0.0,0.0,0.0,0.0,0.0,0.0,0.0,0.0,0.0,0.0,0.0,0.0,0.0,0.0,0.0,0.0,0.0,0.0,0.0,0.0,0.0,0.0,0.0,0.0,0.0,0.0,0.0,0.0,0.0,0.0,0.0,0.0,0.0,0.0,0.0,0.0,0.0,0.0,0.0,0.0,0.0,0.0,
BGD,,,,,,,,,,,,0.0,0.0,0.0,0.0,0.0,0.0,0.0,0.0,0.0,0.0,0.0,0.0,0.0,0.0,0.0,0.0,0.0,0.0,0.0,0.0,0.0,0.0,0.0,0.0,0.0,0.0,0.0,0.0,0.0,0.0,0.0,0.0,0.0,0.0,0.0,0.0,0.0,0.0,0.0,0.0,0.0,0.0,0.0,0.0,
BGR,,,,,,,,,,,,0.0,0.0,0.0,4.06910462159081,10.120061814003199,17.9803221969943,19.804779535509898,18.7666709005462,19.0929312901631,17.697717812544898,24.6646110570161,26.5602214587607,28.8829487900957,28.5077901146132,31.5406418139892,28.8617886178862,28.6062613576243,35.6056062726283,32.859592131384204,34.7998386369569,32.2646958053938,32.4403257511935,36.7739558386188,40.2145123646186,41.3051281437699,42.3307425788932,41.648483142113,40.737169442904296,41.5949919776954,44.722727943709096,44.9143198419626,47.9546586354905,40.8240408240408,40.5904504417516,42.4201764759392,42.8398751703222,34.103453897570894,35.3602189126144,35.9972629244237,33.1377534389465,32.612998020910396,33.888662272698,32.9030160904595,33.8120911202506,
BHR,,,,,,,,,,,,0.0,0.0,0.0,0.0,0.0,0.0,0.0,0.0,0.0,0.0,0.0,0.0,0.0,0.0,0.0,0.0,0.0,0.0,0.0,0.0,0.0,0.0,0.0,0.0,0.0,0.0,0.0,0.0,0.0,0.0,0.0,0.0,0.0,0.0,0.0,0.0,0.0,0.0,0.0,0.0,0.0,0.0,0.0,0.0,
BIH,,,,,,,,,,,,,,,,,,,,,,,,,,,,,,,0.0,0.0,0.0,0.0,0.0,0.0,0.0,0.0,0.0,0.0,0.0,0.0,0.0,0.0,0.0,0.0,0.0,0.0,0.0,0.0,0.0,0.0,0.0,0.0,0.0,
BLR,,,,,,,,,,,,,,,,,,,,,,,,,,,,,,,0.0,0.0,0.0,0.0,0.0,0.0,0.0,0.0,0.0,0.0,0.0,0.0,0.0,0.0,0.0,0.0,0.0,0.0,0.0,0.0,0.0,0.0,0.0,0.0,0.0,
BOL,,,,,,,,,,,,0.0,0.0,0.0,0.0,0.0,0.0,0.0,0.0,0.0,0.0,0.0,0.0,0.0,0.0,0.0,0.0,0.0,0.0,0.0,0.0,0.0,0.0,0.0,0.0,0.0,0.0,0.0,0.0,0.0,0.0,0.0,0.0,0.0,0.0,0.0,0.0,0.0,0.0,0.0,0.0,0.0,0.0,0.0,0.0,
BRA,,,,,,,,,,,,0.0,0.0,0.0,0.0,0.0,0.0,0.0,0.0,0.0,0.0,0.0,0.0,0.0,0.9158815987513241,1.74564492312141,0.0712419852766564,0.47853008149273796,0.28286042605851697,0.826099321515147,1.00394487054631,0.615248083216357,0.727665348402363,0.17541353144743901,0.0211505108809765,0.9140024891056271,0.8332246170325258,1.0289562377022,1.0147693225754302,1.18817146476416,1.73282508383251,4.34662169566647,4.00264991856418,3.66636566494391,2.9967505736179603,2.4452092012316604,3.27993952358127,2.7743644234376497,3.01662610378196,2.77975032234119,2.81592647529302,2.9447661243763594,2.9021540866846203,2.7053244988583396,2.60356792759176,
BRN,,,,,,,,,,,,0.0,0.0,0.0,0.0,0.0,0.0,0.0,0.0,0.0,0.0,0.0,0.0,0.0,0.0,0.0,0.0,0.0,0.0,0.0,0.0,0.0,0.0,0.0,0.0,0.0,0.0,0.0,0.0,0.0,0.0,0.0,0.0,0.0,0.0,0.0,0.0,0.0,0.0,0.0,0.0,0.0,0.0,0.0,0.0,
BWA,,,,,,,,,,,,,,,,,,,,,,0.0,0.0,0.0,0.0,0.0,0.0,0.0,0.0,0.0,0.0,0.0,0.0,0.0,0.0,0.0,0.0,0.0,0.0,0.0,0.0,0.0,0.0,0.0,0.0,0.0,0.0,0.0,0.0,0.0,0.0,0.0,0.0,0.0,0.0,
CAN,0.0,0.0,0.0,0.0747125975079734,0.10981818181818198,0.0869547495635279,0.10664550290795,0.090477401347108,0.508578804784408,0.270693466513837,0.49495971591126003,1.9235190436048701,2.92978828003429,5.6479352490549095,5.18349999118212,4.53659592897358,5.839983904500031,8.18008483787023,9.0992601492533,9.82178162679959,10.1886529610639,10.261486451877301,9.89727609984794,11.919182012112902,11.947095032150301,13.188046405815498,15.2124539466101,15.5690300011285,16.3821223395633,15.9913508318818,15.1370941475933,16.7033459793376,15.488228431284002,17.6534483957475,19.406017567886103,17.471986857260198,16.1917096184693,14.3877266387727,12.7323292661431,12.6939519298033,12.021050337188498,13.004001492081802,12.5634192674804,12.703420621431599,15.067890275311902,14.832625329560198,16.0310789935328,14.8712001539903,15.196259966511901,14.777616481723001,15.0131819506637,14.707805167823802,14.9001572289999,15.549008260114698,16.1190749922158,15.546560515251802
CHE,0.0,0.0,0.0,0.0,0.0,0.0,0.0,0.0,0.0,1.81768762953148,5.07821486082356,4.46104999839646,12.0455472254462,17.1388217399571,19.047490701309897,18.057656064589697,21.9990024384837,17.681412072346898,19.869822485207102,25.96502804355,29.7789309807992,29.5751823127677,28.820370229298398,30.0986684548328,37.211179497528,40.617966400777895,39.9373905661379,39.1240751764606,38.1916284057777,42.48637183947611,42.980797206866505,40.3505379368539,40.211277267114795,38.368386460729496,37.240904922042205,39.9932527952705,44.696094291657,40.9875467802297,41.4580123266564,37.613035690882896,39.994555683261794,37.7311492020603,41.6008554189261,42.0290519877676,42.210913645972,40.3900396269186,44.771147161066,42.031035987898704,41.321081210096104,41.5250551197636,39.8761581784049,42.4723317644066,37.3363663046669,37.8201396973225,39.30986277139029,34.931993887771
CHL,,,,,,,,,,,,0.0,0.0,0.0,0.0,0.0,0.0,0.0,0.0,0.0,0.0,0.0,0.0,0.0,0.0,0.0,0.0,0.0,0.0,0.0,0.0,0.0,0.0,0.0,0.0,0.0,0.0,0.0,0.0,0.0,0.0,0.0,0.0,0.0,0.0,0.0,0.0,0.0,0.0,0.0,0.0,0.0,0.0,0.0,0.0,0.0
CHN,,,,,,,,,,,,0.0,0.0,0.0,0.0,0.0,0.0,0.0,0.0,0.0,0.0,0.0,0.0,0.0,0.0,0.0,0.0,0.0,0.0,0.0,0.0,0.0,0.0,0.191317022086143,1.5896665212309298,1.27322370757823,1.32729763756202,1.26931528460552,1.20770877944325,1.20563549305725,1.23453056564026,1.17978404387997,1.51901504324843,2.2683180208870297,2.29039955489035,2.1231242496398703,1.9136036377415702,1.893174151911,1.97260890318803,1.88782902891769,1.76021942226301,1.83533583670166,1.9538462649546697,2.0530051409280903,2.33928636039921,
CIV,,,,,,,,,,,,0.0,0.0,0.0,0.0,0.0,0.0,0.0,0.0,0.0,0.0,0.0,0.0,0.0,0.0,0.0,0.0,0.0,0.0,0.0,0.0,0.0,0.0,0.0,0.0,0.0,0.0,0.0,0.0,0.0,0.0,0.0,0.0,0.0,0.0,0.0,0.0,0.0,0.0,0.0,0.0,0.0,0.0,0.0,0.0,
CMR,,,,,,,,,,,,0.0,0.0,0.0,0.0,0.0,0.0,0.0,0.0,0.0,0.0,0.0,0.0,0.0,0.0,0.0,0.0,0.0,0.0,0.0,0.0,0.0,0.0,0.0,0.0,0.0,0.0,0.0,0.0,0.0,0.0,0.0,0.0,0.0,0.0,0.0,0.0,0.0,0.0,0.0,0.0,0.0,0.0,0.0,0.0,
COD,,,,,,,,,,,,0.0,0.0,0.0,0.0,0.0,0.0,0.0,0.0,0.0,0.0,0.0,0.0,0.0,0.0,0.0,0.0,0.0,0.0,0.0,0.0,0.0,0.0,0.0,0.0,0.0,0.0,0.0,0.0,0.0,0.0,0.0,0.0,0.0,0.0,0.0,0.0,0.0,0.0,0.0,0.0,0.0,0.0,0.0,0.0,
COG,,,,,,,,,,,,0.0,0.0,0.0,0.0,0.0,0.0,0.0,0.0,0.0,0.0,0.0,0.0,0.0,0.0,0.0,0.0,0.0,0.0,0.0,0.0,0.0,0.0,0.0,0.0,0.0,0.0,0.0,0.0,0.0,0.0,0.0,0.0,0.0,0.0,0.0,0.0,0.0,0.0,0.0,0.0,0.0,0.0,0.0,0.0,
COL,,,,,,,,,,,,0.0,0.0,0.0,0.0,0.0,0.0,0.0,0.0,0.0,0.0,0.0,0.0,0.0,0.0,0.0,0.0,0.0,0.0,0.0,0.0,0.0,0.0,0.0,0.0,0.0,0.0,0.0,0.0,0.0,0.0,0.0,0.0,0.0,0.0,0.0,0.0,0.0,0.0,0.0,0.0,0.0,0.0,0.0,0.0,
CRI,,,,,,,,,,,,0.0,0.0,0.0,0.0,0.0,0.0,0.0,0.0,0.0,0.0,0.0,0.0,0.0,0.0,0.0,0.0,0.0,0.0,0.0,0.0,0.0,0.0,0.0,0.0,0.0,0.0,0.0,0.0,0.0,0.0,0.0,0.0,0.0,0.0,0.0,0.0,0.0,0.0,0.0,0.0,0.0,0.0,0.0,0.0,
CUB,,,,,,,,,,,,0.0,0.0,0.0,0.0,0.0,0.0,0.0,0.0,0.0,0.0,0.0,0.0,0.0,0.0,0.0,0.0,0.0,0.0,0.0,0.0,0.0,0.0,0.0,0.0,0.0,0.0,0.0,0.0,0.0,0.0,0.0,0.0,0.0,0.0,0.0,0.0,0.0,0.0,0.0,0.0,0.0,0.0,0.0,0.0,
CUW,,,,,,,,,,,,0.0,0.0,0.0,0.0,0.0,0.0,0.0,0.0,0.0,0.0,0.0,0.0,0.0,0.0,0.0,0.0,0.0,0.0,0.0,,,,,,,,,,,,,,,,,,,,,,,,,,
CYP,,,,,,,,,,,,0.0,0.0,0.0,0.0,0.0,0.0,0.0,0.0,0.0,0.0,0.0,0.0,0.0,0.0,0.0,0.0,0.0,0.0,0.0,0.0,0.0,0.0,0.0,0.0,0.0,0.0,0.0,0.0,0.0,0.0,0.0,0.0,0.0,0.0,0.0,0.0,0.0,0.0,0.0,0.0,0.0,0.0,0.0,0.0,
CZE,,,,,,,,,,,,0.0,0.0,0.0,0.0,0.0,0.0,0.0,0.0,0.0,0.0,0.0,0.0,0.353038781310127,2.13532331449056,4.12415478054404,10.1458601458601,17.2052865136022,18.366649050268897,19.0661896792618,20.2100496218143,20.1200703174235,20.742672333508303,21.527943533262896,22.2250766411482,20.1898472967396,20.1338075615374,19.455907314262603,20.3918049022035,20.8185913122087,18.6391628149388,19.8682544386669,24.656885321402697,31.2403400309119,31.4178302900107,30.1814941841305,31.1353910153728,29.820883277881602,31.875862896932603,33.330066640533104,32.8183608402101,32.5931133032175,34.981023682905196,35.746674727932295,35.6362226191595,32.488864142539
DEU,0.0,0.0189971108560573,0.0728485987572029,0.0375199324641216,0.0635867837315659,0.0682434600017498,0.14998613335748198,0.667764162051371,0.873647602416135,2.19839428604507,2.10317678797555,1.8994710449840901,2.75296995209335,3.23385476770526,3.7020915959781098,6.28970477108685,7.007923155594259,9.683067599570949,9.79364873854286,11.134945773173401,11.920272762362199,14.010651284803199,15.899288413596,16.3719301189153,20.7293639328105,26.6330490241279,25.006851113329898,26.7170248102144,28.6633924866891,29.004641216224698,27.840409020359697,27.4770167927648,29.756854397457598,29.3358495043896,28.6941289591683,28.7325408116153,29.057311632113105,31.081127933563398,29.263453269970604,30.7674488050747,29.6351821468322,29.4396153198393,28.325606491234698,27.345788539818397,27.338182472733802,26.478564468983397,26.435995018428002,22.178034696676303,23.4078943220152,22.871148506863104,22.432143866016197,17.780965304630197,15.9463090691627,15.371003799698201,15.617151548868199,14.3199259868293
DNK,0.0,0.0,0.0,0.0,0.0,0.0,0.0,0.0,0.0,0.0,0.0,0.0,0.0,0.0,0.0,0.0,0.0,0.0,0.0,0.0,0.0,0.0,0.0,0.0,0.0,0.0,0.0,0.0,0.0,0.0,0.0,0.0,0.0,0.0,0.0,0.0,0.0,0.0,0.0,0.0,0.0,0.0,0.0,0.0,0.0,0.0,0.0,0.0,0.0,0.0,0.0,0.0,0.0,0.0,0.0,0.0
DOM,,,,,,,,,,,,0.0,0.0,0.0,0.0,0.0,0.0,0.0,0.0,0.0,0.0,0.0,0.0,0.0,0.0,0.0,0.0,0.0,0.0,0.0,0.0,0.0,0.0,0.0,0.0,0.0,0.0,0.0,0.0,0.0,0.0,0.0,0.0,0.0,0.0,0.0,0.0,0.0,0.0,0.0,0.0,0.0,0.0,0.0,0.0,
DZA,,,,,,,,,,,,0.0,0.0,0.0,0.0,0.0,0.0,0.0,0.0,0.0,0.0,0.0,0.0,0.0,0.0,0.0,0.0,0.0,0.0,0.0,0.0,0.0,0.0,0.0,0.0,0.0,0.0,0.0,0.0,0.0,0.0,0.0,0.0,0.0,0.0,0.0,0.0,0.0,0.0,0.0,0.0,0.0,0.0,0.0,0.0,
ECU,,,,,,,,,,,,0.0,0.0,0.0,0.0,0.0,0.0,0.0,0.0,0.0,0.0,0.0,0.0,0.0,0.0,0.0,0.0,0.0,0.0,0.0,0.0,0.0,0.0,0.0,0.0,0.0,0.0,0.0,0.0,0.0,0.0,0.0,0.0,0.0,0.0,0.0,0.0,0.0,0.0,0.0,0.0,0.0,0.0,0.0,0.0,
EGY,,,,,,,,,,,,0.0,0.0,0.0,0.0,0.0,0.0,0.0,0.0,0.0,0.0,0.0,0.0,0.0,0.0,0.0,0.0,0.0,0.0,0.0,0.0,0.0,0.0,0.0,0.0,0.0,0.0,0.0,0.0,0.0,0.0,0.0,0.0,0.0,0.0,0.0,0.0,0.0,0.0,0.0,0.0,0.0,0.0,0.0,0.0,
ERI,,,,,,,,,,,,,,,,,,,,,,,,,,,,,,,,,0.0,0.0,0.0,0.0,0.0,0.0,0.0,0.0,0.0,0.0,0.0,0.0,0.0,0.0,0.0,0.0,0.0,0.0,0.0,0.0,0.0,0.0,0.0,
ESP,0.0,0.0,0.0,0.0,0.0,0.0,0.0,0.0,0.18117919277029504,1.5931278345760602,1.6393442622950802,4.09677681253552,6.99550909224766,8.65054189796458,9.0201808282132,9.18901800287461,8.46546024987394,7.03859141861494,7.78223180856259,6.399052558188401,4.747953783897611,8.69849812720462,7.727344809965991,9.240063096950891,19.5468477469392,22.3250037813353,29.212028574102398,31.123026107416,36.4154592160711,38.1290760869565,35.8901101808129,35.9149332144311,35.5979578813019,36.065594863579896,34.3768256454239,33.4881277325539,32.492140858881605,29.235462365250303,30.504364192934602,28.5915554540729,28.1575766903101,27.3346290980705,26.2657502386242,24.0465891734969,22.9913392999147,19.8790789269118,20.3415634240245,18.2557588648253,18.9637209063021,18.0769454789649,20.7796996513811,19.798101758634502,20.9122888188826,20.1552701238253,20.8420470705476,20.6186643243866
EST,,,,,,,,,,,,,,,,,,,,,,,,,,,,,,,0.0,0.0,0.0,0.0,0.0,0.0,0.0,0.0,0.0,0.0,0.0,0.0,0.0,0.0,0.0,0.0,0.0,0.0,0.0,0.0,0.0,0.0,0.0,0.0,0.0,0.0
ETH,,,,,,,,,,,,0.0,0.0,0.0,0.0,0.0,0.0,0.0,0.0,0.0,0.0,0.0,0.0,0.0,0.0,0.0,0.0,0.0,0.0,0.0,0.0,0.0,0.0,0.0,0.0,0.0,0.0,0.0,0.0,0.0,0.0,0.0,0.0,0.0,0.0,0.0,0.0,0.0,0.0,0.0,0.0,0.0,0.0,0.0,0.0,
EU28,0.38580965100651293,0.433482384711029,0.598813219652099,0.941459393693437,1.3637748064585098,2.22596729066262,2.75623474632576,3.0993831434827204,3.19523759220572,3.5821147945796206,3.23206101459152,3.5399427668959804,4.2553306263883295,4.22826527964368,4.86725456101544,6.551232951714179,7.143380201026889,8.29580423685572,8.92949723759118,9.44195813441998,10.8225037186831,14.7918068165943,16.2066410605474,18.649689911180197,22.6953624027767,26.0539711429536,27.6649718722183,27.7161949853724,29.2123646612226,30.226957834998103,30.847992536215802,31.2905523206996,31.789120991648502,33.0679732671084,32.4171812676436,32.3525209425055,32.806493420908104,33.0680474791848,32.1902530426891,32.227103474191196,31.4393820934592,31.6835842381138,31.8376152880332,31.098360517516998,30.8485707057621,30.318562503038898,29.6697170326237,27.9154915536623,27.932983371914897,28.0139052701902,27.4855467063283,27.7418405406505,27.025679366427998,27.0801143082685,27.7366017817657,25.895949572037697
FIN,0.0,0.0,0.0,0.0,0.0,0.0,0.0,0.0,0.0,0.0,0.0,0.0,0.0,0.0,0.0,0.0,0.0,8.03673938002296,9.134669204074779,17.1801340366435,17.233170540162497,35.8478574396832,40.743169398907106,41.993506647392,41.6609623070638,38.3357470432054,38.68590914626721,36.788884311448996,36.29310664835371,35.4720627311073,35.3384703091381,33.647777049632694,33.3650931139021,32.6265983398549,29.6003413021286,30.0085890528617,28.074322863361804,30.204117034809798,31.1442700984793,33.0765797543804,32.1238710414999,30.5735305963537,29.7445133746915,26.9560989493157,26.4616459898655,32.9701623643422,27.828263193702,28.8300818511908,29.6492406240314,32.6437164384132,28.2618935468676,31.546509571298298,32.6468875601824,33.1279733920878,34.6286016389109,33.8979838768459
FRA,0.19451364926257997,0.339241900756096,0.5427174885834269,0.5050942987210061,0.663351596601209,0.9922915999170742,1.4492884408868998,2.49901613537977,2.87079399072001,3.6048879837067203,3.88974404380815,5.990413797971111,8.5233147002646,8.07690621780963,7.86472354386209,9.848133236909991,7.664543833826389,8.54644808743169,13.479404806650601,16.6175265834681,23.8045455252071,38.212821536117296,39.113650401482396,48.8425949437803,59.26924590814279,65.4203424861482,70.4864202255854,70.5341061836883,70.60440968449541,75.317321464858,75.2832581094394,73.3682895937221,73.5732406398977,78.3955848347933,75.85046555680341,76.797685672464,78.0383376541755,78.9426618094715,76.4864982080408,75.63622689870441,77.5736942808455,77.2211279952172,78.8902335494825,78.55153302558841,78.81714757961,79.04781078762629,79.0596594501187,77.9992266240009,77.2583429734776,77.2120912895755,75.9405265069956,79.51166030105591,75.96277983425558,74.7044863069252,78.2355882895947,77.6278008284028
GAB,,,,,,,,,,,,0.0,0.0,0.0,0.0,0.0,0.0,0.0,0.0,0.0,0.0,0.0,0.0,0.0,0.0,0.0,0.0,0.0,0.0,0.0,0.0,0.0,0.0,0.0,0.0,0.0,0.0,0.0,0.0,0.0,0.0,0.0,0.0,0.0,0.0,0.0,0.0,0.0,0.0,0.0,0.0,0.0,0.0,0.0,0.0,
GBR,1.6029059878340601,1.73773532537689,2.29970326409496,3.65206414780388,4.458268249789731,7.73357860044455,10.0203708384756,11.215236957234001,11.7646001877664,12.242487421238199,10.488117606264199,10.7712038036253,11.180247139100402,9.95088003639569,12.340951975389302,11.2035156394254,13.1339477402926,14.205444929542502,12.994393671761,12.8272698354233,13.033009353295501,13.7222304542514,16.1854562051856,18.118279764993602,19.2509878885576,20.729915614534498,19.735431177030602,18.3123151794831,20.6903297749548,22.942032461821398,20.6917279035735,21.9519405511713,24.051342431093502,27.778278643930804,27.161686521610697,26.7569754187357,27.1020546043233,28.1075662981843,27.552419276668,26.0459958932238,22.7213355592654,23.562118168884396,22.8416906096023,22.4258086703214,20.4455655569697,20.640524396473698,19.1777444526345,16.0388425609014,13.6387495777356,18.521407453273,16.418391557765602,18.9561217170982,19.557542036006698,19.8628306509918,19.0126247789247,20.9138531793695
GEO,,,,,,,,,,,,,,,,,,,,,,,,,,,,,,,0.0,0.0,0.0,0.0,0.0,0.0,0.0,0.0,0.0,0.0,0.0,0.0,0.0,0.0,0.0,0.0,0.0,0.0,0.0,0.0,0.0,0.0,0.0,0.0,0.0,
GHA,,,,,,,,,,,,0.0,0.0,0.0,0.0,0.0,0.0,0.0,0.0,0.0,0.0,0.0,0.0,0.0,0.0,0.0,0.0,0.0,0.0,0.0,0.0,0.0,0.0,0.0,0.0,0.0,0.0,0.0,0.0,0.0,0.0,0.0,0.0,0.0,0.0,0.0,0.0,0.0,0.0,0.0,0.0,0.0,0.0,0.0,0.0,
GIB,,,,,,,,,,,,0.0,0.0,0.0,0.0,0.0,0.0,0.0,0.0,0.0,0.0,0.0,0.0,0.0,0.0,0.0,0.0,0.0,0.0,0.0,0.0,0.0,0.0,0.0,0.0,0.0,0.0,0.0,0.0,0.0,0.0,0.0,0.0,0.0,0.0,0.0,0.0,0.0,0.0,0.0,0.0,0.0,0.0,0.0,0.0,
GRC,0.0,0.0,0.0,0.0,0.0,0.0,0.0,0.0,0.0,0.0,0.0,0.0,0.0,0.0,0.0,0.0,0.0,0.0,0.0,0.0,0.0,0.0,0.0,0.0,0.0,0.0,0.0,0.0,0.0,0.0,0.0,0.0,0.0,0.0,0.0,0.0,0.0,0.0,0.0,0.0,0.0,0.0,0.0,0.0,0.0,0.0,0.0,0.0,0.0,0.0,0.0,0.0,0.0,0.0,0.0,0.0
GTM,,,,,,,,,,,,0.0,0.0,0.0,0.0,0.0,0.0,0.0,0.0,0.0,0.0,0.0,0.0,0.0,0.0,0.0,0.0,0.0,0.0,0.0,0.0,0.0,0.0,0.0,0.0,0.0,0.0,0.0,0.0,0.0,0.0,0.0,0.0,0.0,0.0,0.0,0.0,0.0,0.0,0.0,0.0,0.0,0.0,0.0,0.0,
HKG,,,,,,,,,,,,0.0,0.0,0.0,0.0,0.0,0.0,0.0,0.0,0.0,0.0,0.0,0.0,0.0,0.0,0.0,0.0,0.0,0.0,0.0,0.0,0.0,0.0,0.0,0.0,0.0,0.0,0.0,0.0,0.0,0.0,0.0,0.0,0.0,0.0,0.0,0.0,0.0,0.0,0.0,0.0,0.0,0.0,0.0,0.0,
HND,,,,,,,,,,,,0.0,0.0,0.0,0.0,0.0,0.0,0.0,0.0,0.0,0.0,0.0,0.0,0.0,0.0,0.0,0.0,0.0,0.0,0.0,0.0,0.0,0.0,0.0,0.0,0.0,0.0,0.0,0.0,0.0,0.0,0.0,0.0,0.0,0.0,0.0,0.0,0.0,0.0,0.0,0.0,0.0,0.0,0.0,0.0,
HRV,,,,,,,,,,,,,,,,,,,,,,,,,,,,,,,0.0,0.0,0.0,0.0,0.0,0.0,0.0,0.0,0.0,0.0,0.0,0.0,0.0,0.0,0.0,0.0,0.0,0.0,0.0,0.0,0.0,0.0,0.0,0.0,0.0,
HTI,,,,,,,,,,,,0.0,0.0,0.0,0.0,0.0,0.0,0.0,0.0,0.0,0.0,0.0,0.0,0.0,0.0,0.0,0.0,0.0,0.0,0.0,0.0,0.0,0.0,0.0,0.0,0.0,0.0,0.0,0.0,0.0,0.0,0.0,0.0,0.0,0.0,0.0,0.0,0.0,0.0,0.0,0.0,0.0,0.0,0.0,0.0,
HUN,,,,,,0.0,0.0,0.0,0.0,0.0,0.0,0.0,0.0,0.0,0.0,0.0,0.0,0.0,0.0,0.0,0.0,0.0,0.0,9.588987979837151,14.317758430597301,24.1827138378863,26.4538198403649,36.92897240243371,45.992542674374796,46.959196781718,48.28738219158811,45.8098321262891,44.0713271264005,41.914020963086706,41.918543935551206,41.2311129402081,40.410373325733794,39.4609712687516,37.507394460876604,37.2594628885599,40.294393452871496,38.7917067142661,38.590037890311706,32.2536242495241,35.3476919425656,38.6900100682403,37.538693215092394,36.729229229229205,37.0218613366646,42.95978612008471,42.1744133151374,43.5464615897165,45.59838313844379,50.736119363570296,53.242378878606395,52.1850899742931
IDN,,,,,,,,,,,,0.0,0.0,0.0,0.0,0.0,0.0,0.0,0.0,0.0,0.0,0.0,0.0,0.0,0.0,0.0,0.0,0.0,0.0,0.0,0.0,0.0,0.0,0.0,0.0,0.0,0.0,0.0,0.0,0.0,0.0,0.0,0.0,0.0,0.0,0.0,0.0,0.0,0.0,0.0,0.0,0.0,0.0,0.0,0.0,
IND,,,,,,,,,,,,1.79260062665703,1.6067275511940602,3.2913896367932303,2.87696601371971,3.0561180550706397,3.40113998849553,2.29661976386867,2.5152321368576898,2.55005717020767,2.4923386125621803,2.2829290410337797,1.4291570659165098,2.33373918194083,2.3708263275172903,2.6772567522543302,2.46211471238558,2.2691832742940097,2.38089390962672,1.7015061548536203,2.09782326496591,1.7305861127120599,1.9947743200239598,1.4959331568956202,1.44519245777392,1.88405797101449,2.04748651900206,2.13316464908458,2.36664542601404,2.42757938325668,2.96688713822303,3.3111119045311703,3.17607477125382,2.7318668115058,2.48702102805446,2.4207160982371403,2.42987707163756,2.05898030873169,1.7595228412633899,2.03161009133306,2.68180221683125,3.00473878957987,2.9264974190796695,2.8740033183537204,2.79063943071017,
IRL,0.0,0.0,0.0,0.0,0.0,0.0,0.0,0.0,0.0,0.0,0.0,0.0,0.0,0.0,0.0,0.0,0.0,0.0,0.0,0.0,0.0,0.0,0.0,0.0,0.0,0.0,0.0,0.0,0.0,0.0,0.0,0.0,0.0,0.0,0.0,0.0,0.0,0.0,0.0,0.0,0.0,0.0,0.0,0.0,0.0,0.0,0.0,0.0,0.0,0.0,0.0,0.0,0.0,0.0,0.0,0.0
IRN,,,,,,,,,,,,0.0,0.0,0.0,0.0,0.0,0.0,0.0,0.0,0.0,0.0,0.0,0.0,0.0,0.0,0.0,0.0,0.0,0.0,0.0,0.0,0.0,0.0,0.0,0.0,0.0,0.0,0.0,0.0,0.0,0.0,0.0,0.0,0.0,0.0,0.0,0.0,0.0,0.0,0.0,0.0,0.136220485561462,0.726376063804685,1.73224505971025,1.62849724517405,
IRQ,,,,,,,,,,,,0.0,0.0,0.0,0.0,0.0,0.0,0.0,0.0,0.0,0.0,0.0,0.0,0.0,0.0,0.0,0.0,0.0,0.0,0.0,0.0,0.0,0.0,0.0,0.0,0.0,0.0,0.0,0.0,0.0,0.0,0.0,0.0,0.0,0.0,0.0,0.0,0.0,0.0,0.0,0.0,0.0,0.0,0.0,0.0,
ISL,0.0,0.0,0.0,0.0,0.0,0.0,0.0,0.0,0.0,0.0,0.0,0.0,0.0,0.0,0.0,0.0,0.0,0.0,0.0,0.0,0.0,0.0,0.0,0.0,0.0,0.0,0.0,0.0,0.0,0.0,0.0,0.0,0.0,0.0,0.0,0.0,0.0,0.0,0.0,0.0,0.0,0.0,0.0,0.0,0.0,0.0,0.0,0.0,0.0,0.0,0.0,0.0,0.0,0.0,0.0,0.0
ISR,,,,,,,,,,,,0.0,0.0,0.0,0.0,0.0,0.0,0.0,0.0,0.0,0.0,0.0,0.0,0.0,0.0,0.0,0.0,0.0,0.0,0.0,0.0,0.0,0.0,0.0,0.0,0.0,0.0,0.0,0.0,0.0,0.0,0.0,0.0,0.0,0.0,0.0,0.0,0.0,0.0,0.0,0.0,0.0,0.0,0.0,0.0,0.0
ITA,0.0,0.0,0.0,0.45476304451890903,3.1467477490465403,4.24970336828341,4.321415786647569,3.27582623155269,2.4958579996318195,1.5317665948983703,2.7262738634802903,2.71546158812137,2.70811238741094,2.1832179882709397,2.31415502802774,2.6067033434400297,2.35315206171229,2.05203748833036,2.55777817570573,1.4681646266180302,1.20344026946597,1.5126792360047798,3.7420390923190294,3.2108334397503704,3.8338640361620198,3.8543215702629,4.636438232880701,0.0877493797026607,0.0,0.0,0.0,0.0,0.0,0.0,0.0,0.0,0.0,0.0,0.0,0.0,0.0,0.0,0.0,0.0,0.0,0.0,0.0,0.0,0.0,0.0,0.0,0.0,0.0,0.0,0.0,0.0
JAM,,,,,,,,,,,,0.0,0.0,0.0,0.0,0.0,0.0,0.0,0.0,0.0,0.0,0.0,0.0,0.0,0.0,0.0,0.0,0.0,0.0,0.0,0.0,0.0,0.0,0.0,0.0,0.0,0.0,0.0,0.0,0.0,0.0,0.0,0.0,0.0,0.0,0.0,0.0,0.0,0.0,0.0,0.0,0.0,0.0,0.0,0.0,
JOR,,,,,,,,,,,,0.0,0.0,0.0,0.0,0.0,0.0,0.0,0.0,0.0,0.0,0.0,0.0,0.0,0.0,0.0,0.0,0.0,0.0,0.0,0.0,0.0,0.0,0.0,0.0,0.0,0.0,0.0,0.0,0.0,0.0,0.0,0.0,0.0,0.0,0.0,0.0,0.0,0.0,0.0,0.0,0.0,0.0,0.0,0.0,
JPN,0.0,0.0,0.0,0.0,0.0,0.0,0.27926460321154306,0.246153846153846,0.367714653428939,0.34970592910507103,1.29650507328072,2.08931835988509,2.2316185106882798,2.08579096536861,4.310729666328211,5.310200234177191,6.72180231640736,5.980493831358349,10.633914932983402,12.026001981754199,14.425594421961401,15.1341775293136,17.699589088910898,18.6022929986068,20.8692192073166,23.926854099538,25.0786763303452,26.333114075378898,23.880583049850603,23.0405009544089,23.181522811690197,23.693268407902497,24.684320276535804,27.2722995602619,27.6164890735055,29.130730923758996,29.654576195677,30.628368211757802,31.7327991429529,29.6472751822897,29.5975891744448,29.8506989097791,27.027541909112,22.2032785065404,25.446554865029,26.984632957458402,26.8427603741387,22.8743838840987,23.4420790986722,26.1847732384597,25.281913997810697,9.47148762138249,1.5084722022426,0.8780018215022201,0.0,0.9115531660462141
KAZ,,,,,,,,,,,,,,,,,,,,,,,,,,,,,,,0.0,0.0,0.0,0.0,0.0,0.0,0.0,0.0,0.0,0.0,0.0,0.0,0.0,0.0,0.0,0.0,0.0,0.0,0.0,0.0,0.0,0.0,0.0,0.0,0.0,
KEN,,,,,,,,,,,,0.0,0.0,0.0,0.0,0.0,0.0,0.0,0.0,0.0,0.0,0.0,0.0,0.0,0.0,0.0,0.0,0.0,0.0,0.0,0.0,0.0,0.0,0.0,0.0,0.0,0.0,0.0,0.0,0.0,0.0,0.0,0.0,0.0,0.0,0.0,0.0,0.0,0.0,0.0,0.0,0.0,0.0,0.0,0.0,
KGZ,,,,,,,,,,,,,,,,,,,,,,,,,,,,,,,0.0,0.0,0.0,0.0,0.0,0.0,0.0,0.0,0.0,0.0,0.0,0.0,0.0,0.0,0.0,0.0,0.0,0.0,0.0,0.0,0.0,0.0,0.0,0.0,0.0,
KHM,,,,,,,,,,,,,,,,,,,,,,,,,,,,,,,,,,,,0.0,0.0,0.0,0.0,0.0,0.0,0.0,0.0,0.0,0.0,0.0,0.0,0.0,0.0,0.0,0.0,0.0,0.0,0.0,0.0,
KOR,,,,,,,,,,,,0.0,0.0,0.0,0.0,0.0,0.0,0.26704780531838895,7.375436369406541,8.85393258426966,9.33698541851285,7.2052130226080005,8.75887018227355,18.3520982599795,21.9149568837348,28.867205682072896,44.308631348305795,54.082980245418995,47.590847594407904,50.5523240300977,50.1912290858016,49.7205421394199,45.4406610719913,40.6459957353095,36.2571400311565,37.0041791110694,36.48675995163,34.7056016279928,41.5094252299034,43.74607378733089,37.7657472810076,36.272914597735,36.113267273896,37.7842076278224,35.6548612702257,37.8419280487994,36.97740323663211,33.5607705943814,34.0044510920493,32.7161505149709,29.9155657737388,29.7513907236378,28.3136353790954,25.801509971351102,28.6530027515911,29.998943968421003
KWT,,,,,,,,,,,,0.0,0.0,0.0,0.0,0.0,0.0,0.0,0.0,0.0,0.0,0.0,0.0,0.0,0.0,0.0,0.0,0.0,0.0,0.0,0.0,0.0,0.0,0.0,0.0,0.0,0.0,0.0,0.0,0.0,0.0,0.0,0.0,0.0,0.0,0.0,0.0,0.0,0.0,0.0,0.0,0.0,0.0,0.0,0.0,
LBN,,,,,,,,,,,,0.0,0.0,0.0,0.0,0.0,0.0,0.0,0.0,0.0,0.0,0.0,0.0,0.0,0.0,0.0,0.0,0.0,0.0,0.0,0.0,0.0,0.0,0.0,0.0,0.0,0.0,0.0,0.0,0.0,0.0,0.0,0.0,0.0,0.0,0.0,0.0,0.0,0.0,0.0,0.0,0.0,0.0,0.0,0.0,
LBY,,,,,,,,,,,,0.0,0.0,0.0,0.0,0.0,0.0,0.0,0.0,0.0,0.0,0.0,0.0,0.0,0.0,0.0,0.0,0.0,0.0,0.0,0.0,0.0,0.0,0.0,0.0,0.0,0.0,0.0,0.0,0.0,0.0,0.0,0.0,0.0,0.0,0.0,0.0,0.0,0.0,0.0,0.0,0.0,0.0,0.0,0.0,
LKA,,,,,,,,,,,,0.0,0.0,0.0,0.0,0.0,0.0,0.0,0.0,0.0,0.0,0.0,0.0,0.0,0.0,0.0,0.0,0.0,0.0,0.0,0.0,0.0,0.0,0.0,0.0,0.0,0.0,0.0,0.0,0.0,0.0,0.0,0.0,0.0,0.0,0.0,0.0,0.0,0.0,0.0,0.0,0.0,0.0,0.0,0.0,
LTU,,,,,,,,,,,,,,,,,,,,,,,,,,,,,,,59.96479493047,57.895991553996495,78.9195600603839,87.9862207549878,78.99538698103541,87.4408284023669,85.8444677051906,83.5696413678065,79.018247536874,75.34571013828399,75.70362377484041,79.1115443531542,81.774025673644,82.2392181856809,80.53540955631401,71.7100242802636,71.6320278214788,72.99925760950259,74.24026412545959,74.1104964829611,0.0,0.0,0.0,0.0,0.0,
LUX,0.0,0.0,0.0,0.0,0.0,0.0,0.0,0.0,0.0,0.0,0.0,0.0,0.0,0.0,0.0,0.0,0.0,0.0,0.0,0.0,0.0,0.0,0.0,0.0,0.0,0.0,0.0,0.0,0.0,0.0,0.0,0.0,0.0,0.0,0.0,0.0,0.0,0.0,0.0,0.0,0.0,0.0,0.0,0.0,0.0,0.0,0.0,0.0,0.0,0.0,0.0,0.0,0.0,0.0,0.0,0.0
LVA,,,,,,,,,,,,,,,,,,,,,,,,,,,,,,,0.0,0.0,0.0,0.0,0.0,0.0,0.0,0.0,0.0,0.0,0.0,0.0,0.0,0.0,0.0,0.0,0.0,0.0,0.0,0.0,0.0,0.0,0.0,0.0,0.0,
MAR,,,,,,,,,,,,0.0,0.0,0.0,0.0,0.0,0.0,0.0,0.0,0.0,0.0,0.0,0.0,0.0,0.0,0.0,0.0,0.0,0.0,0.0,0.0,0.0,0.0,0.0,0.0,0.0,0.0,0.0,0.0,0.0,0.0,0.0,0.0,0.0,0.0,0.0,0.0,0.0,0.0,0.0,0.0,0.0,0.0,0.0,0.0,
MDA,,,,,,,,,,,,,,,,,,,,,,,,,,,,,,,0.0,0.0,0.0,0.0,0.0,0.0,0.0,0.0,0.0,0.0,0.0,0.0,0.0,0.0,0.0,0.0,0.0,0.0,0.0,0.0,0.0,0.0,0.0,0.0,0.0,
MEA,,,,,,,,,,,,,,,,,,,,,,,,,,,,,,,,,,,,,,,,,,,,,,,,,,,,0.0272711668320852,0.145770516521489,0.347699069215215,0.32200453753475605,
MEX,,,,,,,,,,,,0.0,0.0,0.0,0.0,0.0,0.0,0.0,0.0,0.0,0.0,0.0,0.0,0.0,0.0,0.0,0.0,0.0,0.0,0.316044348158532,2.53545930920172,3.2993699929999196,2.9496327071290898,3.63447406632123,2.88110595319817,5.54555724869949,4.9958463070181605,6.24264894652314,5.08217044058276,5.22270377525978,3.9970827762246297,4.07779875507038,4.466572877954,4.445912021573379,3.8698054995517404,4.308763478593759,4.21486256894826,3.9284206399469195,3.64034680578505,3.9218835199474102,2.13365174187133,3.3324415113410004,2.8545575273087103,3.9687077483973803,3.20966115636692,3.7208569830750298
MKD,,,,,,,,,,,,,,,,,,,,,,,,,,,,,,,0.0,0.0,0.0,0.0,0.0,0.0,0.0,0.0,0.0,0.0,0.0,0.0,0.0,0.0,0.0,0.0,0.0,0.0,0.0,0.0,0.0,0.0,0.0,0.0,0.0,
MLT,,,,,,,,,,,,0.0,0.0,0.0,0.0,0.0,0.0,0.0,0.0,0.0,0.0,0.0,0.0,0.0,0.0,0.0,0.0,0.0,0.0,0.0,0.0,0.0,0.0,0.0,0.0,0.0,0.0,0.0,0.0,0.0,0.0,0.0,0.0,0.0,0.0,0.0,0.0,0.0,0.0,0.0,0.0,0.0,0.0,0.0,0.0,
MMR,,,,,,,,,,,,0.0,0.0,0.0,0.0,0.0,0.0,0.0,0.0,0.0,0.0,0.0,0.0,0.0,0.0,0.0,0.0,0.0,0.0,0.0,0.0,0.0,0.0,0.0,0.0,0.0,0.0,0.0,0.0,0.0,0.0,0.0,0.0,0.0,0.0,0.0,0.0,0.0,0.0,0.0,0.0,0.0,0.0,0.0,0.0,
MNE,,,,,,,,,,,,,,,,,,,,,,,,,,,,,,,,,,,,,,,,,,,,,,0.0,0.0,0.0,0.0,0.0,0.0,0.0,0.0,0.0,0.0,
MNG,,,,,,,,,,,,,,,,,,,,,,,,,,0.0,0.0,0.0,0.0,0.0,0.0,0.0,0.0,0.0,0.0,0.0,0.0,0.0,0.0,0.0,0.0,0.0,0.0,0.0,0.0,0.0,0.0,0.0,0.0,0.0,0.0,0.0,0.0,0.0,0.0,
MOZ,,,,,,,,,,,,0.0,0.0,0.0,0.0,0.0,0.0,0.0,0.0,0.0,0.0,0.0,0.0,0.0,0.0,0.0,0.0,0.0,0.0,0.0,0.0,0.0,0.0,0.0,0.0,0.0,0.0,0.0,0.0,0.0,0.0,0.0,0.0,0.0,0.0,0.0,0.0,0.0,0.0,0.0,0.0,0.0,0.0,0.0,0.0,
MUS,,,,,,,,,,,,0.0,0.0,0.0,0.0,0.0,0.0,0.0,0.0,0.0,0.0,0.0,0.0,0.0,0.0,0.0,0.0,0.0,0.0,0.0,0.0,0.0,0.0,0.0,0.0,0.0,0.0,0.0,0.0,0.0,0.0,0.0,0.0,0.0,0.0,0.0,0.0,0.0,0.0,0.0,0.0,0.0,0.0,0.0,0.0,
MYS,,,,,,,,,,,,0.0,0.0,0.0,0.0,0.0,0.0,0.0,0.0,0.0,0.0,0.0,0.0,0.0,0.0,0.0,0.0,0.0,0.0,0.0,0.0,0.0,0.0,0.0,0.0,0.0,0.0,0.0,0.0,0.0,0.0,0.0,0.0,0.0,0.0,0.0,0.0,0.0,0.0,0.0,0.0,0.0,0.0,0.0,0.0,
NAM,,,,,,,,,,,,,,,,,,,,,,,,,,,,,,,,0.0,0.0,0.0,0.0,0.0,0.0,0.0,0.0,0.0,0.0,0.0,0.0,0.0,0.0,0.0,0.0,0.0,0.0,0.0,0.0,0.0,0.0,0.0,0.0,
NER,,,,,,,,,,,,,,,,,,,,,,,,,,,,,,,,,,,,,,,,,0.0,0.0,0.0,0.0,0.0,0.0,0.0,0.0,0.0,0.0,0.0,0.0,0.0,0.0,0.0,
NGA,,,,,,,,,,,,0.0,0.0,0.0,0.0,0.0,0.0,0.0,0.0,0.0,0.0,0.0,0.0,0.0,0.0,0.0,0.0,0.0,0.0,0.0,0.0,0.0,0.0,0.0,0.0,0.0,0.0,0.0,0.0,0.0,0.0,0.0,0.0,0.0,0.0,0.0,0.0,0.0,0.0,0.0,0.0,0.0,0.0,0.0,0.0,
NIC,,,,,,,,,,,,0.0,0.0,0.0,0.0,0.0,0.0,0.0,0.0,0.0,0.0,0.0,0.0,0.0,0.0,0.0,0.0,0.0,0.0,0.0,0.0,0.0,0.0,0.0,0.0,0.0,0.0,0.0,0.0,0.0,0.0,0.0,0.0,0.0,0.0,0.0,0.0,0.0,0.0,0.0,0.0,0.0,0.0,0.0,0.0,
NLD,0.0,0.0,0.0,0.0,0.0,0.0,0.0,0.0,0.0832862369493441,0.8480508292052551,0.9006804053061821,0.901924104756815,0.657908013965409,2.10538316833565,5.98418582567886,6.14655903276936,6.660130381684639,6.36516487664276,6.591337099811679,5.41232315711095,6.4808813998703805,5.7108956645278095,6.46140071627537,6.016764459346191,5.91130650864953,6.194099798242969,6.2777331070014,5.1973866908314905,5.279338035655281,5.50171115674196,4.86605157847932,4.475424822542481,4.91864814838785,5.11670705944867,4.96700765021849,4.95028767849003,4.86988281844468,2.78307502051478,4.185918893705759,4.41881918819188,4.38018096417534,4.24500603226461,4.07893228868214,4.15005474188684,3.77615744857431,4.00016012649993,3.50996124776138,3.99372414776779,3.8762645046117203,3.7364435179565696,3.32774377462899,3.63363547818151,3.7900056148231296,2.8416686325391205,3.9557910615173397,3.5086762969019705
NOR,0.0,0.0,0.0,0.0,0.0,0.0,0.0,0.0,0.0,0.0,0.0,0.0,0.0,0.0,0.0,0.0,0.0,0.0,0.0,0.0,0.0,0.0,0.0,0.0,0.0,0.0,0.0,0.0,0.0,0.0,0.0,0.0,0.0,0.0,0.0,0.0,0.0,0.0,0.0,0.0,0.0,0.0,0.0,0.0,0.0,0.0,0.0,0.0,0.0,0.0,0.0,0.0,0.0,0.0,0.0,0.0
NPL,,,,,,,,,,,,0.0,0.0,0.0,0.0,0.0,0.0,0.0,0.0,0.0,0.0,0.0,0.0,0.0,0.0,0.0,0.0,0.0,0.0,0.0,0.0,0.0,0.0,0.0,0.0,0.0,0.0,0.0,0.0,0.0,0.0,0.0,0.0,0.0,0.0,0.0,0.0,0.0,0.0,0.0,0.0,0.0,0.0,0.0,0.0,
NZL,0.0,0.0,0.0,0.0,0.0,0.0,0.0,0.0,0.0,0.0,0.0,0.0,0.0,0.0,0.0,0.0,0.0,0.0,0.0,0.0,0.0,0.0,0.0,0.0,0.0,0.0,0.0,0.0,0.0,0.0,0.0,0.0,0.0,0.0,0.0,0.0,0.0,0.0,0.0,0.0,0.0,0.0,0.0,0.0,0.0,0.0,0.0,0.0,0.0,0.0,0.0,0.0,0.0,0.0,0.0,0.0
OMN,,,,,,,,,,,,0.0,0.0,0.0,0.0,0.0,0.0,0.0,0.0,0.0,0.0,0.0,0.0,0.0,0.0,0.0,0.0,0.0,0.0,0.0,0.0,0.0,0.0,0.0,0.0,0.0,0.0,0.0,0.0,0.0,0.0,0.0,0.0,0.0,0.0,0.0,0.0,0.0,0.0,0.0,0.0,0.0,0.0,0.0,0.0,
PAK,,,,,,,,,,,,1.3734812466983601,1.3734812466983601,3.6289841231944595,5.0639894086496,6.0859068504174605,5.91085271317829,3.87055254206123,1.8666666666666698,0.7478481727105971,0.0133564845732603,0.933881210310048,1.03459972862958,1.1575366807128,1.48127828830064,1.50415163239577,1.6804095509789398,1.7489461031947902,0.767580308845305,0.0867026964538597,0.7777453348552009,0.9372869802317659,1.19237861094038,0.981321328436599,0.9541592755111569,0.8480081464964799,0.585200845665962,0.6033303837181241,0.434064926331234,0.60656734569778,2.9317634623289703,3.16305398315615,2.29842544647575,2.1774093777063,3.2640810940218903,2.6530241698619,2.32963049698105,3.2165668349693197,1.7660670625218302,3.0349109137242203,3.62349550771317,5.5368598170154595,4.73654096228869,4.89065682770283,4.7575429020077005,
PAN,,,,,,,,,,,,0.0,0.0,0.0,0.0,0.0,0.0,0.0,0.0,0.0,0.0,0.0,0.0,0.0,0.0,0.0,0.0,0.0,0.0,0.0,0.0,0.0,0.0,0.0,0.0,0.0,0.0,0.0,0.0,0.0,0.0,0.0,0.0,0.0,0.0,0.0,0.0,0.0,0.0,0.0,0.0,0.0,0.0,0.0,0.0,
PER,,,,,,,,,,,,0.0,0.0,0.0,0.0,0.0,0.0,0.0,0.0,0.0,0.0,0.0,0.0,0.0,0.0,0.0,0.0,0.0,0.0,0.0,0.0,0.0,0.0,0.0,0.0,0.0,0.0,0.0,0.0,0.0,0.0,0.0,0.0,0.0,0.0,0.0,0.0,0.0,0.0,0.0,0.0,0.0,0.0,0.0,0.0,
PHL,,,,,,,,,,,,0.0,0.0,0.0,0.0,0.0,0.0,0.0,0.0,0.0,0.0,0.0,0.0,0.0,0.0,0.0,0.0,0.0,0.0,0.0,0.0,0.0,0.0,0.0,0.0,0.0,0.0,0.0,0.0,0.0,0.0,0.0,0.0,0.0,0.0,0.0,0.0,0.0,0.0,0.0,0.0,0.0,0.0,0.0,0.0,
POL,0.0,0.0,0.0,0.0,0.0,0.0,0.0,0.0,0.0,0.0,0.0,0.0,0.0,0.0,0.0,0.0,0.0,0.0,0.0,0.0,0.0,0.0,0.0,0.0,0.0,0.0,0.0,0.0,0.0,0.0,0.0,0.0,0.0,0.0,0.0,0.0,0.0,0.0,0.0,0.0,0.0,0.0,0.0,0.0,0.0,0.0,0.0,0.0,0.0,0.0,0.0,0.0,0.0,0.0,0.0,0.0
PRK,,,,,,,,,,,,0.0,0.0,0.0,0.0,0.0,0.0,0.0,0.0,0.0,0.0,0.0,0.0,0.0,0.0,0.0,0.0,0.0,0.0,0.0,0.0,0.0,0.0,0.0,0.0,0.0,0.0,0.0,0.0,0.0,0.0,0.0,0.0,0.0,0.0,0.0,0.0,0.0,0.0,0.0,0.0,0.0,0.0,0.0,0.0,
PRT,0.0,0.0,0.0,0.0,0.0,0.0,0.0,0.0,0.0,0.0,0.0,0.0,0.0,0.0,0.0,0.0,0.0,0.0,0.0,0.0,0.0,0.0,0.0,0.0,0.0,0.0,0.0,0.0,0.0,0.0,0.0,0.0,0.0,0.0,0.0,0.0,0.0,0.0,0.0,0.0,0.0,0.0,0.0,0.0,0.0,0.0,0.0,0.0,0.0,0.0,0.0,0.0,0.0,0.0,0.0,0.0
PRY,,,,,,,,,,,,0.0,0.0,0.0,0.0,0.0,0.0,0.0,0.0,0.0,0.0,0.0,0.0,0.0,0.0,0.0,0.0,0.0,0.0,0.0,0.0,0.0,0.0,0.0,0.0,0.0,0.0,0.0,0.0,0.0,0.0,0.0,0.0,0.0,0.0,0.0,0.0,0.0,0.0,0.0,0.0,0.0,0.0,0.0,0.0,
QAT,,,,,,,,,,,,0.0,0.0,0.0,0.0,0.0,0.0,0.0,0.0,0.0,0.0,0.0,0.0,0.0,0.0,0.0,0.0,0.0,0.0,0.0,0.0,0.0,0.0,0.0,0.0,0.0,0.0,0.0,0.0,0.0,0.0,0.0,0.0,0.0,0.0,0.0,0.0,0.0,0.0,0.0,0.0,0.0,0.0,0.0,0.0,
ROU,,,,,,,,,,,,0.0,0.0,0.0,0.0,0.0,0.0,0.0,0.0,0.0,0.0,0.0,0.0,0.0,0.0,0.0,0.0,0.0,0.0,0.0,0.0,0.0,0.0,0.0,0.0,0.0,2.2591687041564796,9.44914957653811,9.92036787797218,10.2504436994676,10.5056417761004,10.1102736420005,10.0721658901982,8.897352194414221,9.81964282553674,9.34980559810143,8.982885943506071,12.4997973181133,17.2824681322742,20.352955438942896,19.1738563816625,18.9470797916095,19.508626263313698,19.8476151428181,17.907426152572,
RUS,,,,,,,,,,,,,,,,,,,,,,,,,,,,,,,10.932382881517599,11.2327425683159,11.862363032376402,12.4710422286445,11.180949180517098,11.5866108825577,12.884705837861599,13.022249854172099,12.7476884829016,14.417038210344401,14.913835987166701,15.397494526796999,15.925681875427301,16.4428957660708,15.561482086879801,15.7119892678301,15.7401659179064,15.792298985888099,15.7049433231481,16.5228853233944,16.4474827142907,16.4236311266561,16.6026224314116,16.311440455602302,17.0150979024468,
SAS,,,,,,,,,,,,1.68760189844824,1.52783456292685,3.19569508479334,2.9842250476152796,3.24244569151942,3.50897173997352,2.3574605875723,2.35458206952927,2.25418815079415,2.13105116283175,2.05109747763291,1.3273290683423602,2.1060825985604,2.17528945588776,2.4382236460260898,2.27396940014973,2.1145363666752197,2.0934422802934702,1.4544599776468403,1.86309397547589,1.5702600265010902,1.81332877442924,1.3723418101632698,1.3279070211692199,1.68613418980437,1.7964527572438798,1.8737380150403202,2.0532970510093302,2.1340305806523703,2.8275742373841806,3.1407848062159505,2.93184703509597,2.5428611738266,2.4378889637668704,2.3154990333986802,2.28678913939483,2.06141697861467,1.66087239654772,2.0069002800311897,2.60616141411642,3.0275795843023103,2.8892880246881605,2.85670692762919,2.7711903216382003,
SAU,,,,,,,,,,,,0.0,0.0,0.0,0.0,0.0,0.0,0.0,0.0,0.0,0.0,0.0,0.0,0.0,0.0,0.0,0.0,0.0,0.0,0.0,0.0,0.0,0.0,0.0,0.0,0.0,0.0,0.0,0.0,0.0,0.0,0.0,0.0,0.0,0.0,0.0,0.0,0.0,0.0,0.0,0.0,0.0,0.0,0.0,0.0,
SDN,,,,,,,,,,,,0.0,0.0,0.0,0.0,0.0,0.0,0.0,0.0,0.0,0.0,0.0,0.0,0.0,0.0,0.0,0.0,0.0,0.0,0.0,0.0,0.0,0.0,0.0,0.0,0.0,0.0,0.0,0.0,0.0,0.0,0.0,0.0,0.0,0.0,0.0,0.0,0.0,0.0,0.0,0.0,0.0,0.0,0.0,0.0,
SEN,,,,,,,,,,,,0.0,0.0,0.0,0.0,0.0,0.0,0.0,0.0,0.0,0.0,0.0,0.0,0.0,0.0,0.0,0.0,0.0,0.0,0.0,0.0,0.0,0.0,0.0,0.0,0.0,0.0,0.0,0.0,0.0,0.0,0.0,0.0,0.0,0.0,0.0,0.0,0.0,0.0,0.0,0.0,0.0,0.0,0.0,0.0,
SGP,,,,,,,,,,,,0.0,0.0,0.0,0.0,0.0,0.0,0.0,0.0,0.0,0.0,0.0,0.0,0.0,0.0,0.0,0.0,0.0,0.0,0.0,0.0,0.0,0.0,0.0,0.0,0.0,0.0,0.0,0.0,0.0,0.0,0.0,0.0,0.0,0.0,0.0,0.0,0.0,0.0,0.0,0.0,0.0,0.0,0.0,0.0,
SLV,,,,,,,,,,,,0.0,0.0,0.0,0.0,0.0,0.0,0.0,0.0,0.0,0.0,0.0,0.0,0.0,0.0,0.0,0.0,0.0,0.0,0.0,0.0,0.0,0.0,0.0,0.0,0.0,0.0,0.0,0.0,0.0,0.0,0.0,0.0,0.0,0.0,0.0,0.0,0.0,0.0,0.0,0.0,0.0,0.0,0.0,0.0,
SRB,,,,,,,,,,,,,,,,,,,,,,,,,,,,,,,0.0,0.0,0.0,0.0,0.0,0.0,0.0,0.0,0.0,0.0,0.0,0.0,0.0,0.0,0.0,0.0,0.0,0.0,0.0,0.0,0.0,0.0,0.0,0.0,0.0,
SSD,,,,,,,,,,,,,,,,,,,,,,,,,,,,,,,,,,,,,,,,,,,,,,,,,,,,,0.0,0.0,0.0,
SUR,,,,,,,,,,,,,,,,,,,,,,,,,,,,,,,,,,,,,,,,,0.0,0.0,0.0,0.0,0.0,0.0,0.0,0.0,0.0,0.0,0.0,0.0,0.0,0.0,0.0,
SVK,,,,,,,,,,,,0.0,0.0253742704897234,1.88633222213188,3.77153499922396,1.3987583214900101,3.0447062065165,0.7447573005814331,0.123120787973043,12.747135308436699,22.6523764210948,26.0492260847501,29.5696202531646,31.977953410981698,36.291171604752606,42.7523353839143,49.374183488558295,49.79240550125421,51.0136937577805,51.9529914529914,47.205553594540504,48.1802069164503,47.56370523415979,47.7707536183663,49.473642862754296,43.276070833964006,44.193447002435796,44.1982996048377,44.279496346961004,46.67141078099979,53.555425676991995,53.6884731290809,55.73388799205271,57.6518427677015,55.89625738673671,56.541847410053606,57.636555630219796,54.9763373010182,58.07719054242,54.326941625834294,53.0658316341392,54.4789309954751,54.6985314882801,55.1308129339973,57.09076175040521,56.8714328627215
SVN,,,,,,,,,,,,,,,,,,,,,,,,,,,,,,,37.1423979427837,38.857501569366,32.1694750486066,33.115687259333704,35.742535866615,37.0092155192442,35.5901049245615,38.091985428051,36.7278554778555,35.409440506710894,34.9456840869055,36.3403843495092,37.8682011234416,37.6772793053546,35.7474952524393,38.9230667460475,36.7052596758187,37.8581399986705,38.2523324592963,34.9875022861672,34.8015995078437,39.0512095507383,35.5544121430409,33.5252071604782,37.114723533181795,38.118377539313
SWE,0.0,0.0,0.0,0.0,0.0,0.0366673456915869,0.0888906447534766,0.0928988146111256,0.0409179861234656,0.10506010816024301,0.0924153409465971,0.135269185679502,2.04457594238901,2.70433000256213,2.7346558381041097,14.858724798887698,18.5121307528475,22.1282601206814,25.602902545110002,22.130940609681698,27.5011420740064,36.6363300468662,39.23647399308629,37.6636140682839,41.31323620079829,42.8895773368781,50.658294950899496,46.1613815875104,47.6678957161788,45.9031878865907,46.7071733888645,52.2290263319045,43.5423747396119,42.2693756153311,51.2655921513665,47.1600142960221,52.816315501290596,46.8667479860059,46.339528058895,47.2674666425554,39.465403391837796,44.6232866115907,46.428766189502404,49.7972359080803,51.0875370039493,45.7026489438954,46.743575785492,44.9990928821486,42.622786769317,38.1928786858364,38.951906237370295,40.2485125188015,38.4754500228316,43.4271487476394,42.250283287963796,34.7364000716355
SYR,,,,,,,,,,,,0.0,0.0,0.0,0.0,0.0,0.0,0.0,0.0,0.0,0.0,0.0,0.0,0.0,0.0,0.0,0.0,0.0,0.0,0.0,0.0,0.0,0.0,0.0,0.0,0.0,0.0,0.0,0.0,0.0,0.0,0.0,0.0,0.0,0.0,0.0,0.0,0.0,0.0,0.0,0.0,0.0,0.0,0.0,0.0,
TGO,,,,,,,,,,,,0.0,0.0,0.0,0.0,0.0,0.0,0.0,0.0,0.0,0.0,0.0,0.0,0.0,0.0,0.0,0.0,0.0,0.0,0.0,0.0,0.0,0.0,0.0,0.0,0.0,0.0,0.0,0.0,0.0,0.0,0.0,0.0,0.0,0.0,0.0,0.0,0.0,0.0,0.0,0.0,0.0,0.0,0.0,0.0,
THA,,,,,,,,,,,,0.0,0.0,0.0,0.0,0.0,0.0,0.0,0.0,0.0,0.0,0.0,0.0,0.0,0.0,0.0,0.0,0.0,0.0,0.0,0.0,0.0,0.0,0.0,0.0,0.0,0.0,0.0,0.0,0.0,0.0,0.0,0.0,0.0,0.0,0.0,0.0,0.0,0.0,0.0,0.0,0.0,0.0,0.0,0.0,
TJK,,,,,,,,,,,,,,,,,,,,,,,,,,,,,,,0.0,0.0,0.0,0.0,0.0,0.0,0.0,0.0,0.0,0.0,0.0,0.0,0.0,0.0,0.0,0.0,0.0,0.0,0.0,0.0,0.0,0.0,0.0,0.0,0.0,
TKM,,,,,,,,,,,,,,,,,,,,,,,,,,,,,,,0.0,0.0,0.0,0.0,0.0,0.0,0.0,0.0,0.0,0.0,0.0,0.0,0.0,0.0,0.0,0.0,0.0,0.0,0.0,0.0,0.0,0.0,0.0,0.0,0.0,
TTO,,,,,,,,,,,,0.0,0.0,0.0,0.0,0.0,0.0,0.0,0.0,0.0,0.0,0.0,0.0,0.0,0.0,0.0,0.0,0.0,0.0,0.0,0.0,0.0,0.0,0.0,0.0,0.0,0.0,0.0,0.0,0.0,0.0,0.0,0.0,0.0,0.0,0.0,0.0,0.0,0.0,0.0,0.0,0.0,0.0,0.0,0.0,
TUN,,,,,,,,,,,,0.0,0.0,0.0,0.0,0.0,0.0,0.0,0.0,0.0,0.0,0.0,0.0,0.0,0.0,0.0,0.0,0.0,0.0,0.0,0.0,0.0,0.0,0.0,0.0,0.0,0.0,0.0,0.0,0.0,0.0,0.0,0.0,0.0,0.0,0.0,0.0,0.0,0.0,0.0,0.0,0.0,0.0,0.0,0.0,
TUR,0.0,0.0,0.0,0.0,0.0,0.0,0.0,0.0,0.0,0.0,0.0,0.0,0.0,0.0,0.0,0.0,0.0,0.0,0.0,0.0,0.0,0.0,0.0,0.0,0.0,0.0,0.0,0.0,0.0,0.0,0.0,0.0,0.0,0.0,0.0,0.0,0.0,0.0,0.0,0.0,0.0,0.0,0.0,0.0,0.0,0.0,0.0,0.0,0.0,0.0,0.0,0.0,0.0,0.0,0.0,0.0
TZA,,,,,,,,,,,,0.0,0.0,0.0,0.0,0.0,0.0,0.0,0.0,0.0,0.0,0.0,0.0,0.0,0.0,0.0,0.0,0.0,0.0,0.0,0.0,0.0,0.0,0.0,0.0,0.0,0.0,0.0,0.0,0.0,0.0,0.0,0.0,0.0,0.0,0.0,0.0,0.0,0.0,0.0,0.0,0.0,0.0,0.0,0.0,
UKR,,,,,,,,,,,,,,,,,,,,,,,,,,,,,,,25.5098350445038,26.9802166863578,29.2291046580294,32.7559336200742,33.963287998302995,36.3856341676083,43.53584812758161,44.6689460483844,43.5799265549158,41.9119015493416,45.15761754900189,44.0785171553735,44.932362362593004,45.1733552339519,47.8064055375488,47.7406098551473,46.6923351601435,47.154918955827,46.649808397287394,47.762053692280205,47.2133370051052,46.29337053983629,45.440429918886096,42.956335890473206,48.5720566011815,
URY,,,,,,,,,,,,0.0,0.0,0.0,0.0,0.0,0.0,0.0,0.0,0.0,0.0,0.0,0.0,0.0,0.0,0.0,0.0,0.0,0.0,0.0,0.0,0.0,0.0,0.0,0.0,0.0,0.0,0.0,0.0,0.0,0.0,0.0,0.0,0.0,0.0,0.0,0.0,0.0,0.0,0.0,0.0,0.0,0.0,0.0,0.0,
USA,0.0692777977163337,0.21517968932242199,0.268683990460557,0.353732927008749,0.343260630424641,0.34996400191393606,0.487348894616474,0.594980561581967,0.952330207445297,0.975677779516332,1.43630329868199,2.38067841585553,3.12315482232543,4.53658568849087,6.19469840369686,9.12468426181905,9.474933312503481,11.912272324536099,12.648147460631401,11.4619757143287,10.966127251454301,11.860121197000899,12.6119071712737,12.7110214614706,13.5514148151241,15.5119379662836,16.625980594941,17.7605001054399,19.5445343350448,17.9407113942132,19.095370226110603,19.9514883759513,20.056582941891,19.0766087182148,19.6684077721093,20.059892523944896,19.5881732362997,18.1460533410308,18.7704888731882,19.924706438753397,19.814723967525197,20.647014677124396,19.9811047042283,19.4299925838217,19.607601589169,18.9915076224786,19.0922315755445,19.3489927530953,19.290993741624398,19.9311229787331,19.2664460909667,18.9848461910931,18.757919906042897,19.1738311600765,19.230238500299603,19.323777625942302
UZB,,,,,,,,,,,,,,,,,,,,,,,,,,,,,,,0.0,0.0,0.0,0.0,0.0,0.0,0.0,0.0,0.0,0.0,0.0,0.0,0.0,0.0,0.0,0.0,0.0,0.0,0.0,0.0,0.0,0.0,0.0,0.0,0.0,
VEN,,,,,,,,,,,,0.0,0.0,0.0,0.0,0.0,0.0,0.0,0.0,0.0,0.0,0.0,0.0,0.0,0.0,0.0,0.0,0.0,0.0,0.0,0.0,0.0,0.0,0.0,0.0,0.0,0.0,0.0,0.0,0.0,0.0,0.0,0.0,0.0,0.0,0.0,0.0,0.0,0.0,0.0,0.0,0.0,0.0,0.0,0.0,
VNM,,,,,,,,,,,,0.0,0.0,0.0,0.0,0.0,0.0,0.0,0.0,0.0,0.0,0.0,0.0,0.0,0.0,0.0,0.0,0.0,0.0,0.0,0.0,0.0,0.0,0.0,0.0,0.0,0.0,0.0,0.0,0.0,0.0,0.0,0.0,0.0,0.0,0.0,0.0,0.0,0.0,0.0,0.0,0.0,0.0,0.0,0.0,
WLD,,,,,,,,,,,,2.00393253076254,2.51892839029948,3.11956933785335,3.95645271380142,5.3394023407467595,5.754854689289269,6.781735961999019,7.55990231918051,7.455759481472841,7.810296195836691,9.03964757659395,9.64135892637466,10.4959583048164,11.959446233376902,13.654641473106198,14.426413131724601,14.805786865315499,15.293506206538698,14.904364304005,16.9202763991377,17.3078951067309,17.303937242997502,17.4304203350337,17.4153740204025,17.5115895353483,17.5934408323292,17.0565333552629,16.9850054717892,17.0944421193223,16.7129971766146,16.8874272496246,16.3933886224432,15.664919106875,15.560446386166198,15.0797604167818,14.640821383407399,13.6700432335713,13.4828113371522,13.351591001092698,12.7941011567922,11.610670487058801,10.817549047051001,10.5860665269462,10.6073757890339,8.11798195829433
YEM,,,,,,,,,,,,0.0,0.0,0.0,0.0,0.0,0.0,0.0,0.0,0.0,0.0,0.0,0.0,0.0,0.0,0.0,0.0,0.0,0.0,0.0,0.0,0.0,0.0,0.0,0.0,0.0,0.0,0.0,0.0,0.0,0.0,0.0,0.0,0.0,0.0,0.0,0.0,0.0,0.0,0.0,0.0,0.0,0.0,0.0,0.0,
ZAF,,,,,,,,,,,,0.0,0.0,0.0,0.0,0.0,0.0,0.0,0.0,0.0,0.0,0.0,0.0,0.0,2.9018187195031806,3.75926554631359,6.01067897525537,4.09498071036328,6.69461138970767,6.83772794480039,5.10868579375397,5.4914961083885805,5.5697811786012,4.18490894722573,5.38204947467157,6.09609399021475,5.902373982435741,6.08748808687197,6.7015185707106,6.40498548063586,6.259713140586129,5.14908273407214,5.48626489266302,5.4759392513664995,5.547254389241691,4.66546859184896,3.99679491012593,4.34433781190019,5.08924972311257,5.188501509227559,4.71423895763848,5.2015594662064295,4.68944306488881,5.571266074757499,5.52929999879746,
ZMB,,,,,,,,,,,,0.0,0.0,0.0,0.0,0.0,0.0,0.0,0.0,0.0,0.0,0.0,0.0,0.0,0.0,0.0,0.0,0.0,0.0,0.0,0.0,0.0,0.0,0.0,0.0,0.0,0.0,0.0,0.0,0.0,0.0,0.0,0.0,0.0,0.0,0.0,0.0,0.0,0.0,0.0,0.0,0.0,0.0,0.0,0.0,
ZWE,,,,,,,,,,,,0.0,0.0,0.0,0.0,0.0,0.0,0.0,0.0,0.0,0.0,0.0,0.0,0.0,0.0,0.0,0.0,0.0,0.0,0.0,0.0,0.0,0.0,0.0,0.0,0.0,0.0,0.0,0.0,0.0,0.0,0.0,0.0,0.0,0.0,0.0,0.0,0.0,0.0,0.0,0.0,0.0,0.0,0.0,0.0,
