### META ###
ID,GDP|PPP|constant__Historic__WDI_2020
creator,AG
entity,GDP|PPP|constant
original code,NY.GDP.MKTP.PP.KD
original name,GDP, PPP (constant 2011 international $)
pathway,Historic
scenario,Historic
source,WDI_2020
source_name,WDI
source_year,2020
unit,USD_ppp_2011
variable,GDP|PPP|constant
### DATA ###
Country Code,1990,1991,1992,1993,1994,1995,1996,1997,1998,1999,2000,2001,2002,2003,2004,2005,2006,2007,2008,2009,2010,2011,2012,2013,2014,2015,2016,2017,2018
ABW,2186223151.48958,2360309313.52807,2499151037.85325,2681781306.00407,2901792038.3962803,2975704821.3787303,3010990431.21167,3223171079.0513396,3287376271.82908,3328075281.4572396,3581561120.69236,3475143735.6350603,3361379800.90554,3427785448.3547,3698976910.91797,3743895393.82435,3783229007.2884,3851335673.9818296,3847842213.9115295,3443058924.7065,3316181184.84374,3430458604.0959997,3383466020.47825,3525511784.59555,3555416155.9886703,3539395957.0280704,3531919864.17979,3578912447.7975397,
AFG,,,,,,,,,,,,,28768540779.5181,31309458221.2366,31752210899.4523,35317893638.493996,37210015619.2475,42354791279.2986,44017209985.211,53432723790.3233,61106967465.0219,61367499949.5783,69193259718.55,73068597518.2292,75059383143.7744,76148730970.9774,77869931553.6962,79945392645.9093,80769357876.1566
AGO,68226795453.2211,68903168136.0353,64880407746.232,49319868718.344,49980441006.8774,57477507172.335,65262473269.7717,70009846583.889,73294111017.2145,74893014513.25099,77180714684.3765,80426934429.6624,91417827168.8975,94151083084.0101,104463321067.945,120163025129.12599,134039070568.335,152817968807.214,169881834597.876,171340631342.328,179666448856.49698,185904434493.071,201784665193.626,211782269000.483,221995734814.129,224090432429.86603,218308681366.87802,217987314775.76398,213336570114.423
ALB,16263083321.8961,11709071692.4579,10867527722.6438,11906399438.6486,12894971899.8465,14612883037.8748,15942655313.0156,14201719890.0914,15455744212.53,17447973680.871002,18660614156.3823,20207592137.4625,21125008866.8854,22293232584.0671,23521589408.1209,24822313264.175,26286850586.9254,27858799529.9206,29948201014.5273,30951485931.3703,32098823911.8735,32915842547.7522,33382432649.8645,33716920855.889,34315223156.1757,35076592671.0744,36239313232.2726,37624046895.7302,39183653160.691
ARE,203348978385.779,205097946235.8,211958359450.156,214631559100.483,229432870252.36398,244777080125.088,258970244280.246,280180939647.775,280999052157.64,289154244990.685,320535299917.697,325019861315.757,332929079265.973,362228638771.327,396881011981.039,416150145494.058,457088166044.132,471643636688.66,486697729378.425,461180547505.549,468572395257.697,501045735029.62103,523515762760.08203,549970824702.131,573533245033.89,602817491109.822,621269519334.9829,624319087625.314,635097016092.292
ARG,461387109092.60706,503526103904.234,543492438833.849,588096749547.999,622419256183.47,604710123688.495,638130576578.147,689889646102.83,716451631356.1991,692196469159.722,686735046361.8629,656457999123.639,584940282003.047,636631693354.543,694116818761.362,755557679006.573,816358550109.3671,889893278191.8191,925998322860.119,871192879915.067,959404627714.0641,1017006818100.56,1006568052096.61,1030779272823.56,1004879754890.82,1032324627079.02,1010848890423.71,1037824306663.36,1012067661427.25
ARM,18344742184.9944,16198407627.2875,9427472794.48032,8597855302.24607,9062139727.82622,9687427225.460258,10255633654.6858,10596231421.9204,11369756314.5882,11744958273.1959,12437910811.4361,13626557357.7507,15423396162.8987,17588963608.6851,19430148503.3521,22124276790.9986,25044239620.2217,28487622704.3547,30453268671.5386,26144134614.2082,26719305575.0741,27975112936.7813,29989321069.253,30978968664.5384,32094211536.6445,33121226305.4854,33187468758.0387,35676528915.4363,37531708418.9153
ATG,966654208.8294369,987697046.809556,999137801.1583029,1051892991.32101,1122119420.32685,1073200691.63759,1144083645.0433302,1206677970.67309,1263769690.96046,1310628939.3217301,1398332851.52432,1329058397.35285,1342669295.85182,1424006973.9175599,1505694567.05754,1602245803.22954,1806187779.6154,1973430302.22831,1972835643.18357,1733973853.80229,1602636480.0565,1571247039.5716698,1624243099.89289,1614483406.48004,1675764798.94618,1739867714.15252,1835521960.49272,1893259104.10692,2033155752.10302
AUS,534296505193.601,532174110323.448,534369483439.925,555901413731.441,578041272900.59,600215277854.7161,623495338432.026,648226260108.27,677893591051.907,712287100351.5079,740302043112.325,754596406039.062,784790653311.6609,808224035158.77,841001980161.312,867949030235.097,892204589022.442,926503695269.4591,960394391147.14,978996479182.5709,999236895371.7141,1023845963462.35,1063961904609.02,1091463991069.98,1119112034023.59,1143650132443.49,1175336751377.16,1203164227083.2,1238541268895.18
AUT,289461681256.528,299423873933.487,305692386721.846,307302803152.338,314684581454.082,323080314672.63,330671196034.033,337594126175.533,349684809358.972,362120759498.965,374344950176.563,379088530303.18896,385349381792.758,388977334165.53204,399616331892.885,408583983428.48706,422696645151.87897,438452304579.81,444855565842.715,428108630287.752,435973386864.606,448716005173.47705,451769273383.149,451884495836.12103,454872685315.26,459487375921.632,469056698739.519,480672624842.608,492303766235.444
AZE,55783491487.577995,55393006945.2336,42874187350.3343,32970250368.4343,26475110807.6699,23351047803.3336,23654611299.8525,25026578758.1605,27529236925.6289,29566400344.381,32848270635.809,36100249471.5297,39507721818.5402,43540788589.317,47569966661.267,60871260998.4415,81851277256.5466,102693244706.29901,113569935324.945,124210873577.214,130159124520.205,128111724587.878,130933947761.45099,138583990528.534,142460585780.266,143957491784.919,139546346270.703,139152809949.428,141118863163.171
BDI,6444307085.5261,6766318570.798229,6834658278.13972,6408175601.4887705,6162742476.195371,5674653271.84973,5220681010.2186,5137672182.32014,5381711610.7284,5327356323.6485,5281708122.04697,5390289853.06244,5629970137.7553,5561074619.02674,5829877934.33885,5882346835.80048,6200805749.0857,6414854617.51195,6726726438.06685,6983199494.262429,7341030040.14927,7637064600.799009,7976662580.3333,8369449021.12303,8724368198.60431,8384117569.630191,8333811187.34308,8375481076.5592,8510320717.21629
BEL,354193132891.604,360685756109.47705,366206610078.339,362684167240.579,374387881830.878,383316123824.919,388381563942.74603,403115381185.72797,411023863006.526,425585346287.954,441402979447.659,446256717939.053,453873825478.31,458584822708.62,474961771297.549,485989136282.70294,498393298309.58203,516718812406.31396,519028114271.867,508539979172.635,523106015177.21204,531970033244.826,535902514816.644,538363529485.959,546861722858.183,557978267655.609,566409910927.683,577535293364.163,585958098997.183
BEN,10829251969.7034,11286874436.488998,11620707543.6601,12298912033.7281,12547399307.5157,13305914520.7808,13881300057.6388,14677349358.5828,15258720948.2152,16073757802.4829,17015312596.6258,17922762308.2107,18754921695.0711,19400761822.9039,20260154372.7025,20607244157.9487,21419940047.218998,22702212482.9606,23813843817.0295,24366156424.7022,24881272742.8767,25618692190.0885,26851264681.9124,28782255584.8831,30612139032.1129,31156469106.8938,32196993426.2291,34023063767.8921,36301676624.9684
BFA,7855200763.77945,8567666252.4216,8587604133.8897295,8884854169.669691,9001690648.11995,9516260939.89867,10564452708.3544,11231791726.5967,12052579575.7551,12944974137.6028,13180603979.8625,14052289984.83,14663986775.3324,15808135530.1599,16516098824.8807,17946700447.6646,19068936090.7667,20147285402.7017,21616928763.6917,22257225300.3245,23453189063.2122,25007400285.7278,26621052492.6164,28163100735.3423,29381672298.8251,30525955646.3693,32328826216.067,34381680209.9908,36730770038.2728
BGD,156587049533.805,162044464939.401,170864035618.40198,178914400121.525,185874396506.79398,195393540891.57898,204231032902.559,213400794895.36603,224448611395.26102,234930712513.849,247366287511.38602,259925785789.08102,269889063310.54102,282680637369.117,297491782395.55,316935681495.505,338081329017.296,361945135532.003,383711755026.669,403070491917.693,425528782752.05896,453036596791.065,482581084332.067,511601630440.72705,542610108943.55396,578165465420.357,619293204946.049,664403662063.264,716650431919.53
BGR,92273216067.0659,84480415180.6001,78336671683.6288,77177120652.8296,78580209381.5587,80827752233.3895,81397329785.6953,80511059178.1413,85622689441.4762,78423418646.0565,82160899239.2325,85258544081.1686,90320784118.4127,94977921046.8835,101090090594.164,108291254394.765,115735583315.45801,124235692853.11,131717021420.526,126993457219.334,128674962094.365,131138966474.745,131179580040.45,131827504086.555,134249862352.949,138909924834.882,144378472620.56,149881094499.499,154499166684.686
BHR,19156023760.015,21307244994.5636,22732699336.6685,25658399257.4911,25594252878.4374,26600104852.6479,27693370788.7204,28549926688.1544,29917468972.6474,31203919827.4425,32857749438.5178,33676218926.586002,34803884180.3895,36995290554.1395,39577917209.4701,42256945582.7949,44989702305.186,48721130419.8697,51762223712.6485,53077250831.906,55379092447.66,56477545059.6471,58583146458.0226,61756498554.632996,64443087847.0162,66288123936.3272,68590652908.3592,71199513661.6348,72464535611.6653
BHS,9905416483.81151,9491193284.75715,9128099905.757309,9156196771.55645,9444517681.891909,9858069697.32301,10274428270.3371,10486311602.3178,10980896624.1081,11765384480.397,12253558874.3974,12575298616.3526,12915405315.7058,12752061502.0593,12864641792.8695,13301442128.0537,13636219357.0815,13833473356.6167,13511988004.6531,12947827320.1432,13147065561.6133,13227643591.4724,13635964967.0899,13233418244.2831,13330887769.5886,13410549995.4777,13470395241.0163,13479375207.722,13690429864.3048
BIH,,,,,6620895329.876471,7998041594.898971,15112912627.5663,20310178988.4774,23478566172.1137,25732508476.5256,27147796554.8848,28342299469.3696,29844441416.9883,31038219093.1721,32931540147.0214,35816098283.7838,37756352918.0992,39967208233.1766,42136119353.7406,40870875960.7251,41184457225.9807,41558514736.4944,41267762090.9656,42237982242.0053,42722888722.0457,44042266732.7019,45427682881.6045,46394223063.4146,48075339151.7464
BLR,90636010185.6982,89548382078.8226,80951736149.1807,74799402710.5413,66047869678.0612,59178890906.9179,60835902604.4492,67771198789.7528,73463973673.54,75961748163.7156,80367532170.3519,84165143985.127,88411500624.1222,94638492857.1568,105474357168.12,115388948348.90599,126927837197.965,137843639493.308,151903689949.072,152207490204.709,164077036415.00302,172902260196.085,175819355671.141,177583651637.882,180649428903.24103,173731331560.254,169342102526.663,173630155305.786,179098111978.7
BLZ,882798671.647092,984003032.8844699,1102668340.94678,1171868408.9065,1173724218.27898,1181285799.99666,1198157044.96255,1240627772.05827,1287035271.94108,1400024092.89679,1582301312.9377,1661662978.35905,1746738212.84495,1909673103.2913399,1998436376.2002301,2049956242.01909,2143877044.78717,2167579451.98106,2237567464.00625,2252577099.6011,2328792408.4313602,2379155031.91635,2449050148.88277,2469914455.14627,2561112871.7091603,2649008997.29368,2633432197.9060802,2671282227.7954,2752366426.2290897
BOL,31491964059.3279,33150496998.0289,33696318914.2542,35134913733.4144,36774755174.3155,38495178464.1215,40174085257.7777,42164393302.0377,44284989202.0619,44474037205.0118,45589360469.325,46356994549.0011,47509227709.6899,48797364740.2101,50833822390.2643,53081406686.8076,55627726633.6016,58166788993.589005,61743172383.2894,63815891457.5066,66449394210.9164,69907484441.5643,73488337803.2458,78482613842.6033,82768209675.446,86788417235.6859,90489005485.5214,94285208719.9567,98267462302.7744
BRA,1567166771268.45,1590861349267.24,1583433407447.08,1657303251755.89,1745712950574.46,1822816401838.41,1863055721496.87,1926303593853.51,1932816385908.83,1941860759886.94,2027068628277.9,2055242782233.93,2117998836677.76,2142161581586.0,2265549331189.56,2338095197250.74,2430730265271.93,2578272447196.59,2709614684821.37,2706205664409.95,2909934938252.49,3025588131731.76,3083714227756.88,3176375100788.15,3192382625440.2,3079188290952.61,2978316641105.62,3017715870282.25,3057465947938.42
BRB,3687485045.8868604,3543676564.79478,3341952040.12294,3368455992.2696,3436188314.4221897,3505393078.3607,3644784234.0950103,3817550736.97697,3959886776.2831397,3973138752.35647,4149831766.66757,4051668980.93918,4083571886.3009,4172409207.38509,4231306878.8221297,4398674428.48903,4648007904.23913,4734391155.68011,4777582781.4006,4545427793.15297,4446774193.49594,4411435590.63372,4408490707.06186,4348120593.83891,4340758384.90928,4436467100.99446,4537574770.29469,4529721747.43642,4507144306.71889
BRN,18428919884.5686,19008682897.7249,19913226441.082,19973876727.188,20602134525.5171,21524843836.6747,22144397236.8854,21818615159.9052,21696756263.0502,22358975358.8289,22996076889.8896,23627098557.2186,24541962723.8529,25254650394.4204,25382014206.0119,25480371340.6547,26600926645.0082,26642046839.3565,26125267156.9915,25664277532.74,26331283314.8852,27317473701.2105,27566838984.6099,26980760126.4509,26346780592.3846,26197443191.0268,25551541319.6116,25891019749.5614,25904544646.2882
BTN,1477849968.09945,1471822171.45027,1539539111.62855,1570120002.18144,1647864551.71607,1764436422.68615,1862630359.65085,1962725107.38705,2078801275.43675,2244772187.6571302,2400402787.55513,2600811324.3361897,2886699826.69013,3112535091.69997,3299559296.0169396,3540006404.59636,3787797590.4296103,4483269574.02332,4698442329.31708,5015508899.41758,5614656375.97935,6062852893.39507,6373174008.12615,6508283561.601171,6884234271.3341,7341501098.67587,7938147343.82943,8307416846.5231905,8558935571.32708
BWA,11675857847.5649,12546726120.7826,12912722942.9432,13160144549.4411,13637583541.9289,14596361614.5784,15447300315.432,16733425686.4475,16807665785.2278,18432503299.7145,18798885403.6628,18845990497.7195,19989853708.293,20914563309.8965,21480474110.0581,22459263200.7676,24337727017.9176,26352103195.8901,27997907294.7985,25855420578.3824,28069583583.5426,29767320801.5938,31093802391.3721,34620904312.945,36057425996.5141,35445183301.1211,36970650931.4881,38045584113.2416,39739976375.5055
CAF,3372788348.74427,3354152242.6464,3138678879.6497397,3149202106.7523303,3303511416.80188,3541365743.80946,3399707821.8743,3579890161.24144,3748150095.8242,3883082558.6502204,3786415841.75199,3955469427.54081,4098520648.2599397,3877303602.09053,4109743464.2034297,4147068586.47959,4344928771.59951,4545122879.15504,4638485655.47693,5036804498.5544,5270049769.669001,5491108085.5972,5768615578.41872,3669302318.2265,3672277040.5247703,3831548140.3366604,4013558816.92666,4195263790.82987,4354240945.750629
CAN,886096356169.138,867611628775.0941,875422385487.945,898716119607.3871,939108611992.1079,964407975130.218,980023403519.0541,1021968798021.88,1050548589326.33,1092260438816.6,1145975215417.64,1162082213328.89,1201850365052.44,1247653966544.86,1296487501494.02,1361258213684.68,1417965748096.8,1515360269076.47,1530629382751.45,1485806429173.73,1531710339177.14,1579911446387.84,1607753882075.81,1645217357441.18,1692409660060.03,1704085704675.59,1722951627028.35,1774270877603.06,1807928348260.32
CHE,373446080268.954,370025999206.54706,369864175697.66705,369398207690.86,374088669913.089,375887722717.128,377917214397.572,386761124457.872,398324835162.743,405075443408.34796,421022988815.391,426547946481.98706,427241570246.318,427410625475.49,439276812515.575,452961172199.64,471028537823.009,490396137323.118,500962919249.33203,489830962422.646,504539597966.11,513080203012.08295,518242189093.173,527840218168.095,540767972716.44604,547978510683.846,557418257609.319,567448869241.539,583056646748.259
CHL,126691618366.55301,136579129131.18901,151830521306.759,161834306138.37698,169974892132.52698,185159252150.508,197755481643.672,212444540909.226,221631873967.577,220718537510.03302,232476078082.78302,240154872932.12198,247616414065.935,257746519640.52698,276328857323.737,292197955193.276,310656615293.906,325895330365.853,337397905622.78,332120194503.204,351529887505.093,373011593590.68396,392850692652.18896,408741520055.421,415962919102.35297,425545735715.06396,432654648185.928,438189094371.65295,455824684751.704
CHN,1602660553402.26,1751613041870.29,2000625217248.15,2278063440043.58,2575399896031.29,2857386286413.52,3141078239640.83,3431023923299.97,3699934331870.12,3983626285097.41,4321896249366.42,4682338530621.13,5109866283781.29,5622672179194.14,6191193127545.43,6896727624449.36,7773955447755.39,8880297213246.99,9737626803360.71,10652945530206.3,11786007780270.4,12911679258005.9,13926489150812.9,15008384515525.4,16103924382998.3,17215951357973.4,18375734092610.1,19617383843809.2,20905652312773.3
CIV,39263723476.1826,39279792221.2671,39183729320.948,39108306480.363,39425555676.7891,42234920130.4038,45499395393.7451,47202689440.5223,49530102832.4847,50331265838.402,49290213907.2212,49350038383.809006,48527056348.6354,47867313575.5091,48456930143.3563,49290993777.7316,50038167542.8707,50921359605.8919,52216209058.2171,53913994929.3921,55001784497.605,52588716073.5915,58219129117.7694,63394472783.2456,68969431781.0043,75068302041.4141,81052560299.8974,87295300973.1161,93784023219.3969
CMR,37966569606.4468,36520575074.6743,35388436074.7602,32581401765.6126,33273409705.7365,34427927863.1868,35929359583.6155,37808939612.0116,39511208188.4851,41207035939.2079,42671276190.5024,44535193481.7126,46422240337.5612,48542434696.1608,51834075797.2339,52881467429.1265,54709933425.4654,57391924729.6656,59394214727.0872,60700094004.9174,62777559360.4236,65369818781.0567,68339742888.5416,72033004179.57599,76271468880.2925,80581923290.7949,84327759128.3801,87320624933.3409,90867942645.6069
COD,62984305228.0304,57680364448.4064,51623921241.2037,44670669199.4626,42928514528.7495,43229013628.0989,42786706187.25,40383356962.662994,39727469037.1319,38031050160.6014,35402751926.2926,34659232880.2684,35680905680.0151,37671123197.9603,40209544343.8915,42676460668.3229,44947266419.7587,47760730566.9975,50734263154.0536,52182758842.1619,55891897117.2762,59734281098.2755,63967589236.2596,69393292416.4297,75965037128.357,81218921766.2939,83167671599.0109,86267287184.0017,91234499555.1906
COG,8184454373.84233,8380502130.206409,8599396492.36212,8515149649.079591,8047406029.056459,8368121263.33406,8727153962.691092,8672625644.42611,8996769604.41901,8764455077.50044,9428448475.65127,9786974836.54216,10235401306.5001,10318642148.2288,10677383324.1951,11505495439.9736,12222977791.9063,12029583056.5016,12699899481.6198,13648447669.4376,14842905414.8526,15350631586.3827,15933951182.9561,16482191477.7121,17599670240.8472,18065443028.146,17559607229.2797,17015259405.171999,17189760113.9137
COL,277696891490.906,283255293567.046,294712770320.498,310584261143.567,328643685868.146,345741168527.159,352849104632.24896,364952865162.30396,367032308523.509,351602214323.88,361886092064.52704,367958172679.07794,377171773444.198,391950389071.365,412853189814.007,432284356427.265,461590665180.43896,493203416356.445,509267290660.149,515406111106.885,537813666336.271,577410363782.533,599947003348.684,627345801697.415,657008670063.69,676429490952.625,690549161782.621,699880736818.865,717862219600.697
COM,1260037681.6342402,1192050620.39762,1293744241.7243,1332634986.79212,1262314730.3910198,1307886897.9753,1290993067.7469301,1343022072.2168698,1360246542.40171,1386423245.37004,1536820756.13278,1572673356.6949801,1609237145.08807,1643093428.9320002,1674635233.0806801,1722153809.4652698,1767738454.02905,1781881110.28005,1853155855.6120698,1912458939.1242101,1985131106.15902,2066518443.36704,2132652673.1495101,2228619360.89065,2275420510.95462,2300817402.7048697,2377220186.60695,2467927827.4934,2552596610.30707
CPV,590950870.0050269,599248688.045852,664792395.6518639,722684587.471318,861314583.3543969,983721478.983303,1095339679.85605,1217124212.00066,1369475126.5476599,1523166506.73548,1740748844.3174698,1779596344.1109102,1873041012.76037,1951264062.2814102,2150235875.50837,2298870027.0483303,2482406073.10979,2859004152.57337,3049142810.48216,3010405708.42955,3054562041.2424,3175794136.98827,3210153634.25249,3235924670.6030197,3255703052.05869,3288483544.49253,3443232723.9130397,3570702548.6782703,3752006785.53544
CRI,29765834547.8397,30440225663.4699,33239679579.089,35595547602.9451,37192814862.1882,38725715386.1228,39205068625.9576,41386809346.4891,44268034958.225,46013680102.8362,47777461148.1345,49445118867.7708,51072730131.6649,53246118333.7382,55555176089.0011,57705646581.3549,61882227059.7948,66936703101.6166,70048990866.1678,69369131567.1654,72804196512.1501,75939947268.6198,79582725725.3086,81388479578.05,84249560187.2384,87309277953.9211,91016421058.5723,94108414260.021,96587215745.2296
CUW,,,,,,,,,,,3971608076.26385,3943975495.68254,3959635646.10695,3971046714.9190702,3979324832.8672204,4006242030.87365,4071781517.20447,4172352985.83484,4263645930.95931,4240992777.2254295,4244483367.05985,4270485436.20861,4264553002.9999104,4230687898.93278,4182507191.185,4194163626.6986103,4152785279.13446,4080536556.8692,3992146746.82474
CYM,,,,,,,,,3327592335.79948,3440730396.0394897,3475137629.26827,3495988463.2783103,3555420328.91224,3626528716.4879603,3659167553.90239,3897013359.9225397,4076275974.0567,4205193306.31512,4190163894.9300604,3888451879.18988,3782855708.80586,3827079644.91719,3874143296.8073,3923706413.76223,4027862298.5456705,4141976560.57037,4270223842.7879705,4400010857.138121,
CYP,14662811754.7742,14771243424.0357,16159740160.5928,16272858420.6,17232956856.022,18674057583.3931,18907218425.9544,19406538143.8481,20592441948.6053,21621644047.2188,22911442209.8153,23817030833.9431,24703728531.2039,25351778013.6231,26626045567.8829,27918208581.2949,29234225100.3306,30724605907.5361,31845074519.8292,31203312719.8138,31831964521.6198,31959750104.6175,30858154379.413998,28835995374.885,28298567447.2848,29253555541.7736,31227171145.3768,32589059538.3076,33912237848.9597
CZE,244504862007.457,216105763220.512,215011096008.811,215144197011.27,221403407495.795,235177812379.40802,245108935305.212,243651372749.101,242850452880.858,246330110041.15698,256840378726.06302,264311261461.504,268678989341.733,278359465009.888,292017349651.408,311096212096.302,332417260473.87,351041415121.228,360457338359.49603,343146114822.63,350947267410.641,357186524394.568,354329588406.765,352615798795.08,362189727236.742,381419243744.28705,390766083981.964,407774582307.656,419835675587.85205
DEU,2910426440404.3,3059098633968.22,3118080301939.17,3087543697223.64,3161584510645.29,3210108429899.89,3236461937889.93,3294188678223.76,3360699912017.42,3424282976722.72,3523422370497.29,3583240652291.23,3576129386477.37,3550612506115.6,3592861773379.32,3618796981360.51,3756839173301.58,3868946157261.47,3906175727782.0,3683634973702.92,3837572938722.96,3988164420840.49,4004896807742.44,4022047508458.52,4111565767339.72,4183096725487.14,4276379781084.97,4381793826850.42,4448723374458.21
DJI,,,,,,,,,,,,,,,,,,,,,,,,3581102586.68441,3833983694.39566,4128244630.0433,4413860728.24391,4637948007.812679,4891188816.32706
DMA,547565321.166871,554938135.12555,566203300.55498,578445369.664618,578642046.860262,596175879.400821,614686686.8556321,628119433.011696,651823700.916629,654136242.92292,669439808.778074,669019385.450045,650093639.688597,691396634.348225,712489034.7937349,717164623.743555,750575598.662022,798265366.477826,855107782.912483,845105098.445889,850788791.5872151,848885774.100212,839897889.825265,831500749.47769,868485465.152491,845113575.297132,866718860.859858,807786936.210854,826079838.724892
DNK,201119508414.40698,203922378274.42102,207913152889.684,207935373924.30103,219023450098.571,225654576277.528,232198784033.518,239770531420.15802,245089022320.58102,252314301044.534,261768171260.38602,263922923869.398,265153716677.692,266187971363.559,273290450164.98398,279676267760.388,290620022327.71,293262452793.882,291760899958.741,277445512146.531,282636493013.194,286414714843.732,287063443591.478,289742724283.23804,294434800044.427,301332201491.916,311113317185.158,317448098301.086,325039328911.555
DOM,44250527081.52901,44668313516.3578,49680514931.9421,53339242933.2951,54726252213.5779,57837675378.1293,61295110462.4351,66741345951.2655,71222678749.6998,75453340863.6107,78970796247.0014,80913095906.4224,84550223233.9207,83412425650.3761,85556236995.2137,93622681741.8854,102211959305.365,109791948850.923,113315726130.297,114387868731.20801,123927417833.45,127810588053.09401,131283671945.232,137684020201.426,147391382052.71802,157601210759.50302,168096190998.72598,175940743804.625,188225854772.95
DZA,221710745963.66397,219050215716.44397,222993124639.724,218310267329.295,216345482457.547,224566599519.067,233773826662.932,236345338610.934,248398959413.346,256347729966.23602,266088943704.953,274071612016.102,289419622289.003,310257835093.812,323598922002.846,342691258401.013,348517009793.831,360366588126.82104,369015386241.864,374919632421.735,388416739188.91705,399680824625.395,413269972662.65796,424841531897.21295,440985510109.308,457301973983.351,471935637150.819,478070800433.78,484763791639.85297
ECU,84852688573.0856,88494007973.6831,90365046231.1193,92148145660.2242,96072044504.2498,98236114165.1149,99937315630.4905,104262467500.07199,107668231658.034,102565418785.56699,103685229632.358,107848844714.92801,112267171012.05301,115324068368.38,124793351744.835,131396552682.369,137182634612.881,140187022069.715,149098894146.809,149943526846.065,155229484002.13098,167443158551.426,176890238040.202,185640133594.918,192673794231.404,192864295837.36,190499039001.124,195010792573.62802,197696338909.345
EGY,341672983666.773,345518187124.258,360972729108.08795,371443792801.221,386201894261.09705,404131157971.839,424292172591.88794,447595803845.16797,472551496524.812,501157112083.21,533080839338.435,551926590209.204,565118761799.138,583165573678.672,607029126570.398,634173917960.629,677575754793.361,725601154982.985,777527231173.721,813865742297.9541,855757323488.8,870857777172.805,890244811237.087,909700809390.511,936226883353.395,977158901320.088,1019632514733.42,1062265603571.56,1118715683484.7
ESP,1072673576556.89,1099983852005.88,1110205071692.72,1098753397674.21,1124938837086.57,1155958958457.79,1186713529211.0,1230652550387.37,1284715576589.94,1342405617986.04,1412828145295.19,1468393953493.84,1508496118811.26,1553477886678.78,1601989820201.97,1660495011875.21,1728620590977.69,1790931969489.54,1806820136178.46,1738825303952.12,1741659767094.02,1727476152271.76,1676352509543.8,1652290241857.96,1675156417751.0,1739401558702.49,1792128061282.34,1843952249000.96,1887303716314.19
EST,,,,17830020619.0213,17537175970.1779,18331028121.6839,19235842472.3376,21745453369.5576,22687095819.7528,22595568008.8475,24879193646.7153,26366870610.3582,28160448205.3538,30291262593.9384,32341210665.0442,35410487545.305,38851947576.5637,41794431265.4636,39667536810.8365,33941976656.6584,34860752957.1265,37454945456.9429,38619882113.26,39139778268.4538,40309010970.1099,41052665939.6029,42132994720.8374,44555137202.5778,46676477890.6651
ETH,36746225978.1261,34123471558.2388,31164120261.5802,35259968847.8013,36384749365.7337,38614229035.989,43412500238.8291,44773007557.9503,43224694662.2466,45456016431.4177,48216659166.8511,52219271741.8141,53010250474.5358,51864508272.2171,58903872148.894005,65865582931.6854,73001939072.6823,81365163126.1043,90143261394.3028,98078169932.7913,110387508259.19301,122726950930.191,133340146470.018,147450560852.23,162575291752.61,179470868828.037,196401222114.81198,215066916496.507,229713337813.862
EU28,12009974033664.1,12175629718869.9,12294891668313.8,12234053882296.6,12561426149591.9,12911026838548.8,13167929999030.2,13519837969036.6,13923095370961.9,14321480176986.8,14880865861700.0,15217994559185.2,15409966614256.6,15577478256078.3,16009753415966.1,16342389742378.0,16940768939707.6,17506425964385.4,17660019949177.5,16903532387390.1,17253776237737.1,17571131527262.6,17444812770196.4,17442766059441.6,17733163839831.9,18165745356422.7,18554782270488.1,19089252807967.7,19521440290294.7
FIN,164576747348.88098,154846331644.547,149703635556.14902,148672216693.501,154521722678.415,161038771343.37,166944560373.62802,177519221056.79898,187206442787.946,195405437049.83,206686907629.51602,212080913926.72,215701351005.00198,220023362421.06897,228807438173.33603,235167417972.399,244638669954.499,257602086248.00302,259621729883.22302,238658273248.00897,246261714785.163,252535306637.852,249006493064.67398,246760408446.06,245859880304.98898,247238159521.371,253735574519.645,261477760174.91602,265848201122.9
FJI,6139867189.57285,5974090546.48655,6338510183.92,6473522505.87014,6803672128.32708,6973763832.09746,7308504526.039941,7147717472.6062,7240637832.02475,7877813868.510079,7743891157.5256405,7898768992.04047,8151529529.781559,8233044771.66707,8669396120.245779,8730081927.97596,8891805287.70366,8816166762.78292,8907219623.5574,8783762200.87296,9043293600.24696,9287927626.66699,9419009485.03143,9864926067.7958,10417708668.640999,10903570582.0707,11177226815.1834,11783674116.4674,12199191137.4774
FRA,1972546664084.47,1993222421388.3,2025100878479.93,2012369750272.01,2059828315459.77,2103222620400.49,2132941023206.99,2182772849637.88,2261105133513.44,2338465992510.61,2430219662501.04,2478428450073.25,2506571785524.03,2527204901330.85,2598718556036.76,2641940962817.37,2706650646331.15,2772279785386.5,2779347600306.07,2699488220709.51,2752113059989.68,2812458661000.57,2821265446163.5,2837525151627.62,2864657086101.25,2896538208327.62,2928268753076.5,2994453563106.2,3046104312504.99
FSM,289117541.459484,310591287.811158,323039836.420823,349337395.358742,347470113.067292,371843284.029177,360009871.800412,338189937.617081,347830009.059175,352610784.152363,369655545.438691,377668269.032206,379734161.952317,385703939.248285,373823722.48267204,381456611.083437,381147518.00588596,374148982.200402,365137508.111146,369128936.08656204,377468937.954822,389504743.83981097,382233506.123083,368168129.035131,359678987.003878,376302983.92061603,379690415.166466,389874391.241488,390699593.134958
GAB,17259771506.4662,18314775640.9588,17748822397.8997,18449289437.0877,19134266323.8098,20085975601.3903,20814102063.1421,22008491709.4619,22773910426.1672,20739602910.4638,20349083156.6623,20783583581.2886,20731825564.5593,21197738102.4044,21343905634.0411,21915111948.035,21300047159.4761,22579777002.1671,21832740739.3995,21861195594.8918,23411129728.1833,25071389303.218998,26387907239.8179,27875841902.3642,29078674568.1014,30206607100.0205,30838360830.6043,30986311650.7557,31245296783.3756
GBR,1737139517569.78,1718241200496.01,1724616320501.17,1768186112612.46,1837056228404.6,1902668580195.91,1950074198859.52,2025246243165.12,2099063499812.8,2171024084854.78,2245652421677.42,2312446291693.92,2366195662558.74,2443957786103.84,2501976157179.1,2581532216722.0,2653513713531.57,2718008776337.89,2710366997099.77,2595235438383.49,2645830110758.27,2686579793576.32,2726312265503.0,2784641326590.31,2857250178258.32,2924553400689.22,2980650871071.16,3037047081796.49,3079130640504.87
GEO,53521019774.7448,42228084255.339,23267674505.6388,16450245541.9137,14739421031.7142,15122645374.7271,16816382050.9354,18585304129.2712,19162359838.3893,19712177130.9425,20074554316.4862,21039227391.8837,22190880510.3792,24644908559.397003,26072956903.4595,28573242368.4467,31264776365.8704,35197557815.2094,36048836166.566,34732868357.7918,36903494724.5423,39634353334.1584,42170951947.5445,43689106217.6561,45611426891.233,46979769697.97,48342183019.2111,50662607804.1332,53094412978.7317
GHA,34631391604.3299,36460561578.1411,37875019557.922005,39711958221.9868,41022452767.3752,42709467879.9898,44675154521.0397,46549883699.6612,48737910170.7811,50882376700.752,52765024658.9897,54875625697.3748,57345028622.1432,60326970152.9154,63705280475.0756,67463894517.9273,71781524737.3544,74901737810.9545,81755096249.6382,85715711258.0208,92487005491.3143,105478769494.659,115280689410.358,123710618652.114,127295058162.32901,130067807704.50099,134552276462.471,145509469176.384,154623426741.42
GIN,9576958309.49878,9827244741.103079,10148688737.6773,10660603266.7276,11083839781.7089,11594546897.0857,12111846312.658998,12739434160.1263,13203674586.5273,13706999194.4729,14050093685.4689,14564094791.9518,15316273410.1791,15507512592.9639,15870406579.9082,16346085921.7382,16538992693.0898,17668188189.6331,18398416087.4449,18191867767.2863,19067508392.3974,20137597401.8193,21328794312.3221,22170361442.0067,22989897982.9697,23869473636.306,26452298966.1544,29176885979.9954,30975306436.5091
GMB,2164645785.69037,2231902179.99806,2307311212.0941,2376809757.67033,2380478274.34173,2401470478.58645,2454868269.54953,2575156792.4629397,2665287241.8993397,2835865607.15825,2991838220.49061,3165364844.33429,3062490477.1673,3272883566.91143,3503621856.23188,3421226152.31383,3402218470.6229897,3505756467.50142,3725073280.3584104,3973376395.4919896,4208136815.9203296,3865996599.2678103,4068635488.0783205,4185517978.572,4126611731.2119203,4294072680.8690004,4377521956.896271,4588632823.229071,4889051833.13389
GNB,1945323523.22207,2044535023.34963,2067024908.0174398,2110432431.07925,2177966269.3053603,2273796785.32975,2537557212.34344,2702498431.14576,1943096919.8076,1963024105.60544,2069557175.8252199,2114857853.88112,2094022749.61917,2105927482.0403602,2164080605.4475,2256402425.0323,2308510834.8939,2383836515.1353397,2460204322.3849397,2543087989.91513,2660349037.09413,2875432396.89844,2826185354.72066,2918203244.22682,2946351087.35449,3127082706.7897897,3322925818.84943,3519615667.21345,3653361062.2871795
GNQ,435949252.885629,431492810.136103,581416367.9202981,645565274.428,753173488.337642,884875390.870833,1474025401.52716,3684664978.76283,4560675003.05705,5731127340.05734,6774982262.82899,11068957581.0799,13223290424.5925,15068633703.4066,20794522665.2413,24277335008.7551,26147883668.2549,30143833037.9722,35509166777.3851,35986181402.1271,32774711278.2401,34912908411.9523,37815173745.4104,36252197550.8951,36402668206.5172,33086370153.6367,30169337713.9028,28459489607.0027,26650507937.7747
GRC,249406235339.147,257137828606.265,258937793418.703,254794788821.559,259890684660.705,265347660679.117,272942252786.07,285181526780.37,296289075699.203,305392844026.573,317363543422.575,330475773923.926,343439914908.245,363340648064.225,381729291412.12103,384016392229.87103,405722664078.769,419004997231.88794,417600607386.234,399640717495.574,377744254308.78204,343246782458.207,318188071834.556,307874243948.866,310151827221.10803,308793877262.68896,308204228264.92,312843008068.54803,318894551952.375
GRD,849797865.1581099,861572203.8863549,854238942.787562,837505977.273533,851689610.372105,869826128.976692,908431054.202067,953993364.755391,1066121003.42463,1139665894.2225199,1195372217.64819,1171179078.84845,1211436292.8987699,1326086301.78935,1317500551.83686,1492373241.54111,1432787552.05702,1520523594.98789,1534931204.1721802,1433421885.1421,1426093332.93355,1437002616.41956,1420403170.72875,1453802797.54426,1560571187.47274,1661121032.14173,1723174104.16115,1800011268.73445,1875201612.8714602
GTM,53172526099.9081,55117709369.4547,57784490891.9451,60053764119.9407,62476177711.9305,65567841046.5414,67507193468.9597,70453268102.552,73971371647.6886,76817096296.1472,79589324475.2972,81445805046.4143,84595009705.5765,86735933090.1955,89469920578.5433,92386740289.8713,97356940716.9809,103494374512.04301,106890107569.544,107452395479.75699,110535728811.101,115136279940.431,118555663271.635,122939360406.30801,128071057245.1,133373255825.13199,137497800498.14902,141293200212.265,145736932563.33
GUY,2595801249.52667,2753051415.41188,2966630000.02792,3209155131.80942,3482973828.13583,3658217794.5254602,3949247952.66326,4193337763.21211,4122927240.2855296,4244972145.55995,4187079049.68587,4282524423.63111,4331029449.987411,4303647581.5893,4370928746.981179,4285653781.16582,4505491077.76494,4821760353.389271,4917069537.344,5091731629.24461,5302456219.23411,5577974986.50498,5872292521.701,6166948008.80768,6407350640.55853,6603086523.20465,6825162593.80961,6968491239.75352,7254199488.60458
HKG,164390583663.9,173764055651.795,184598077864.25302,196045098661.851,207878549775.12698,212813146798.072,221875877576.458,233190816725.04602,219472790042.96802,224974140438.93,242215120726.453,243573365895.42398,247608510177.57,255176256346.827,277376952459.56396,297870235416.842,318818152060.195,339428877894.3,346651614819.167,338127191617.853,361010254133.91,378391799904.322,384825540278.49396,396761130097.67896,407721245370.52704,417456694270.569,426542214955.64795,442961926853.802,456261750430.57794
HND,19771799006.996002,19115512017.1726,20276528553.1976,21593634710.4162,21639392377.8517,22978720276.5293,23408600728.1,24484947633.3436,25364014311.5304,25177423664.9346,27013182175.2807,27748803335.1589,28790587164.8006,30099706118.4787,31975610994.0599,33910327064.1473,36137300831.6536,38373595236.3599,39997412334.6285,39024824105.0691,40480895061.5572,42033616973.3577,43769053767.6593,44990893058.8619,46366750814.2298,48147271125.4224,50021631004.0765,52444135530.2339,54382853395.6408
HRV,,,,,,68856213510.8389,72872972521.6656,77794035379.0035,79352206916.7631,78703290237.438,81283648304.37401,84004153420.4772,88301662144.2322,93282167518.9564,97163062257.8012,101354686149.871,106423489632.945,112028156627.378,113999327607.601,105609549347.612,104029356437.8,103707024299.577,101386366551.319,100830243377.673,100725512769.627,103180333828.715,106774646987.82599,110126512434.226,113023704889.949
HTI,15482537249.0405,15773693287.9896,14936120755.6481,14125642632.6044,12437539445.6784,13668570719.8208,14234555250.3318,14619559246.6819,14938534689.2702,15343406027.1501,15476902751.5987,15315265930.1625,15276753490.4463,15332330360.1224,14792189495.4741,15059190190.1572,15397904723.8622,15912699587.3864,16046993952.1157,16541762549.8695,16025263477.4667,16910457368.6922,17399548410.0245,18138618586.9807,18642201079.6471,18870443098.6515,19144575941.3054,19369195429.5748,19656611005.6867
HUN,,171617231708.051,166358570224.722,165400164332.577,170274762812.52,172811048783.074,172953472984.45,178389615330.117,185346814783.482,191038866356.809,199595863374.195,207727585106.44,217576529195.942,226463500853.399,237385499032.18,247459251239.088,257434366621.42398,258057815448.068,260788819809.768,243317130103.79398,244933465907.53,249389001495.708,245718521975.86603,250541937366.78,261052378109.619,271091297953.561,277055303150.409,289031874731.567,303755165842.61
IDN,822124057756.015,878949131518.023,936058908618.0021,996869115569.6859,1072032758743.75,1160153930832.56,1250856935522.84,1309645696128.07,1137732100674.55,1146732996066.25,1203153036350.11,1246989513538.17,1303097499826.4,1365390370333.44,1434081438722.31,1515717547176.63,1599096438646.68,1700559463104.74,1802826068759.16,1886276565127.66,2003675667984.48,2127298132921.52,2255575287878.2,2380923554327.49,2500128502163.36,2622042825848.54,2754012055276.19,2893569037474.25,3043203314538.29
IND,1579592017296.66,1596285642247.71,1683800342792.8,1763793929064.62,1881243627505.39,2023738272567.4,2176520843712.76,2264666038626.28,2404722403409.78,2617438269137.34,2717973841589.94,2849087982770.04,2957466586518.89,3189934742230.69,3442671249849.39,3715448917857.45,4014941319013.57,4322518548433.45,4455941644590.9,4806262823153.54,5214679077531.62,5487998385220.17,5787443276327.66,6157035561848.46,6613285910707.68,7142101035702.78,7725576872862.06,8279337636969.53,8843273901181.64
IRL,93029883524.3707,94825024949.4705,97995285653.3603,100633915731.085,106426229741.571,116679782193.82,125330688910.996,138996408806.096,151077064687.433,166945534183.424,182714792983.817,192359267881.305,203746582696.474,209899666429.81,224007764629.909,236776407111.08603,248783104394.387,262028981721.465,250289078892.625,237576364278.728,241876448348.67102,242707150746.76,243254976811.024,246542893793.88,267638799965.34198,334983501468.524,347303577649.625,375592482609.637,406277903673.28296
IRN,487543947568.87,547918378103.236,563450372277.4711,569310244226.506,560704620317.763,573503606421.442,603172573785.417,606080148301.09,619279501974.965,624577181777.826,661165329054.525,666313418396.6589,714724760498.256,777152998181.246,811149628179.8141,837023712173.522,878873184075.005,950552090527.6959,952936612741.15,962536357600.9609,1018343621746.04,1045286121414.04,967469199981.2059,965591598923.7941,1010041824891.27,996702756823.5741,1130223494687.02,1172665504577.8,
IRQ,138683689513.528,49860799088.3285,66111534354.3151,86136606873.8412,89456769340.2647,91353272204.2183,101421122123.506,122960874485.857,165821462956.833,194976634345.62302,197718931446.529,202276978933.517,188319501894.173,125984169812.384,194214392146.63397,202761024498.588,223357893099.476,226434867297.242,245066170698.881,253347689586.057,269568439694.38397,289911344361.35803,330314636434.07,355418548803.05896,357906478644.66205,366774200828.394,422569589447.701,412027987021.47797,409709318052.71704
ISL,8899020170.49852,8879128589.86516,8579556190.574659,8692244325.29607,9005935074.13945,9016434527.34923,9428770843.39005,9767163678.062971,10460198647.3083,10883109911.214,11415467408.7325,11860534877.6129,11941325614.5085,12212171271.6038,13194299156.4042,14029498861.9728,14765882020.5718,16148754582.6685,16470434674.2576,15354197896.4398,14826646376.9002,15105627444.3362,15301462250.3588,15934001916.1242,16265474917.8142,16992193647.8609,18241370568.2368,19081163388.9343,19961086664.7772
ISR,114116588334.987,122933367369.143,132472094468.21901,137925647887.323,148170551598.776,157954141750.50198,165903684642.921,172423156408.404,179176787908.70102,184757422891.04898,198531425173.474,198767323113.436,198737785019.482,200666452937.031,209066114509.363,217244139770.179,229332548950.54,242573023658.13397,249841683221.673,252150876472.51898,266274194201.85,279011413594.806,285309363985.51697,297144152044.788,308311424132.421,315372039770.89197,327930300649.208,339528222046.88,351254516801.13
ITA,2084572116733.64,2116642165555.68,2134300791732.08,2116099351859.34,2161617149263.89,2224019507265.16,2252193048374.86,2293412961076.91,2334937843876.9,2372897572832.58,2462758139510.78,2510815701339.56,2517191742030.11,2520681246676.97,2556565517650.98,2577474362497.79,2623627641195.59,2662642898953.27,2637027932366.56,2497768143093.14,2540562300760.85,2558532545116.31,2482265100896.7,2436564975724.78,2436454171900.28,2455417200723.4,2486838465711.66,2529516776275.05,2549103836811.21
JAM,20790383780.0556,21796272185.0505,22222507551.5789,24315223880.6899,24651598208.3679,25230900176.3024,25202204769.2181,24914783736.8765,24333134770.3222,24588066665.2423,24804122879.4052,25137720861.093,25639794283.3976,26579830571.965,26931674460.7246,27172389211.17,27960150834.88,28360527343.4138,28130314533.7233,26910401195.962997,26515878756.766003,26974703229.884,26809176729.2177,26943640992.3823,27129950371.542004,27380273578.2955,27756927225.1976,28035430606.1794,28579564152.1887
JOR,26577984434.8226,27062739253.5157,32113954993.5195,33601125022.4915,35276624960.5607,37458957833.0794,38240856359.2778,39505823157.9075,40688603001.2131,42075870691.8971,43862095498.6253,46173021014.6144,48843890656.3547,50876309234.0265,55235034406.1941,59734802297.1361,64569337826.0046,69848345513.3765,74900063130.5318,79002025649.1492,80828072477.5572,82918920460.1544,85117242623.976,87525010788.6012,90235074258.9605,92393222883.9071,94244536957.9511,96238499622.195,98105807728.6217
JPN,3961925149649.06,4097323813341.72,4132071970249.73,4110671149413.9,4151492841904.64,4265332601091.15,4397557881474.09,4444877593478.59,4394721157833.05,4383648470129.54,4505497801949.96,4523805257136.58,4529143020574.84,4598358296754.2,4699737744908.26,4777878893514.11,4845725087041.88,4925882290357.52,4872015767584.18,4608127282089.72,4801287962458.85,4795746251568.87,4867446954344.63,4964808930455.06,4983413036480.11,5044356243067.19,5075081072981.37,5172967067183.67,5213753629971.37
KAZ,220299761047.029,196066787328.12698,185675247601.825,168593124818.682,147350391097.666,135267659022.886,135943997320.805,138255045274.572,135628199415.151,139290160796.433,152940596557.466,173587577090.332,190599159644.505,208324881492.087,228324070118.178,250471504917.876,277271955944.089,301949160023.097,311913482304.495,315656444090.368,338699364509.476,363763117485.49396,381223747124.771,404097171949.419,421069253173.84204,426122084210.952,430809427136.85297,448472613650.923,466859990810.03296
KEN,75912429369.9819,77004313361.8598,76388668527.648,76658471209.0672,78676723571.2476,82143390367.2059,85549744734.3355,85956022115.0481,88784158950.5027,90830978825.9299,91375688020.1066,94829603587.6082,95348188312.08301,98144250618.0727,103153827382.223,109246779516.164,116317771091.77802,124286387264.498,124575083097.325,128694706120.27301,139512396034.233,148034181105.811,154789290374.605,163888858307.273,172668590364.13,182542656017.678,193274246214.92102,202672280312.04898,215480725312.279
KGZ,22690305105.1854,20908874334.312,18004901653.3657,15221465450.2271,12164209977.3328,11504444874.461,12319477549.8491,13540974459.6394,13828291648.1397,14333824892.7753,15111674819.8239,15915855333.0015,15913093428.2543,17031831021.182,18228633894.5421,18196633850.4847,18761256964.0859,20364007675.4679,22074913393.8897,22712060449.3123,22604957901.8472,23951371217.1824,23903468474.747997,26508946538.4955,27569304400.0353,28644507271.6367,29876221084.3171,31280403475.28,32375217596.9148
KHM,,,,17555988082.2009,11444987607.7395,12578438396.206001,13320252506.2443,13853944550.1516,14502535266.4441,16345137646.1899,18096027941.2246,19443568020.2109,20722748597.4457,22485403949.6999,24810513615.709,28097928233.5118,31124379593.1296,34302979863.9258,36598390337.6548,36630120029.2196,38814402868.8205,41558414228.712006,44597724647.7815,47878629914.1382,51298395097.8171,54907794898.4794,58768343715.2305,62890960721.9282,67606502006.4007
KIR,154839658.445572,154839658.445572,156197901.06351498,157556143.681459,160272628.917346,160272628.917346,162989114.153234,165705599.389121,176571540.33267,173855055.096782,184720996.040331,182004510.804444,188897863.739032,192687768.11588,189548190.304503,198933918.443017,198835853.326001,202882058.084855,198638908.1464,200233484.97986498,198383558.534226,201546905.59141698,211046454.46131498,219941585.366227,218406771.207951,241132886.691383,253502402.212996,254335004.937795,259424340.02723
KNA,610365680.1417849,598987149.889426,624557028.534529,667040261.1425049,702401069.948197,740212071.260812,783462879.101673,836923401.846883,832853764.012704,859666549.0707179,949133703.898927,1001499836.62532,1026233851.35986,990887802.3548199,1031097041.67607,1131064318.6863,1164065396.16327,1163469887.4064,1238954131.89223,1197220237.96345,1162062064.8209,1183309617.8447,1156945333.92909,1219231692.66976,1295858017.73029,1309253356.80859,1346257817.0146,1319637696.5544,1358223095.40775
KOR,535209238924.22296,590624543170.6421,627098595420.106,670034430355.826,731718748213.6959,801748652966.021,862637527288.869,913724521541.278,863732649551.038,961408905605.629,1047209132272.64,1094598557964.42,1175953869121.63,1210447158528.31,1269757138033.29,1319578311795.8,1387881714966.82,1463707194524.11,1505118737662.49,1515767602436.86,1614243894803.9,1673675327756.4,1712042624923.22,1761626887916.77,1820490730125.52,1871286720897.04,1926102412534.86,1985094469780.13,2038062971852.03
KWT,,,67170381279.5144,90001907610.3389,97594617730.6026,102336048479.06401,102955311516.935,105501731229.37401,109365262761.361,107408707861.08801,112451097713.37401,112690992537.42699,116087818139.217,136201217212.265,150148627814.291,166077963282.00198,178558345226.066,189256803310.75198,193949912030.54398,180225906807.903,175953544885.953,192895119489.305,205677098695.54,208040408458.89,209082966896.01898,210322334834.035,216476621118.518,206275505961.749,208845731659.815
LAO,8366077048.4496,8725530873.10541,9210657979.13219,9755243341.35711,10551175453.2735,11293055433.9466,12075474872.8747,12905312527.8019,13417344751.8632,14397666418.4512,15232555754.1036,16108642928.032,17062072213.5544,18097228527.8197,19247795207.9614,20615845411.9041,22392780009.1365,24093921170.1042,25979247073.3644,27928151712.7976,30309558822.0562,32746038984.8469,35374268307.0201,38213513284.2258,41122311944.8449,44111931099.5629,47209839789.6086,50463792572.0591,53616750150.2587
LBN,21609840669.8741,32295340526.8223,37604160249.9968,41652499971.952,45028535884.6325,47932364280.0066,53341980100.4742,53904720210.9511,55880718360.2931,55587017890.9542,56332924308.1026,58495922296.3002,60498325359.3312,62450665769.4848,66381170437.4643,68205586579.5733,69366059613.2623,75845494360.161,82860324480.6744,91191497051.8562,98520785059.7298,99424909120.46301,102129417342.631,104804351087.377,106779164448.384,107222330831.121,108943811729.286,109545175880.355,109764255974.777
LBR,,,,,,,,,,,4839570802.84241,4980899480.80227,5168331638.85531,3610331213.67194,3704916392.42999,3900580884.18271,4214339953.61602,4616189062.83117,4946047576.82868,5208214776.24577,5525906898.74156,5979073584.06923,6457029706.53674,7019051384.42237,7068265035.866909,7068265035.866909,6955202193.97297,7126900130.296959,7214030141.41583
LBY,,,,,,,,,,86540024803.4361,89724016899.4594,88142291793.69301,87297139974.6564,98659736652.8152,103061569043.631,115295728535.17099,122790581819.267,130590628815.79199,134073945514.39099,133014571185.66801,139693618199.999,52977520100.9302,118213802708.455,102136725570.625,77623911398.46,70744849815.5782,68767199547.7759,87111448381.7943,94036579249.0229
LCA,1471046837.7752,1476573218.21291,1594006225.62937,1603302474.62908,1628932235.19925,1657409608.411,1705848877.15382,1694008056.19038,1800501399.03627,1848585677.27076,1849486833.66362,1786455134.60252,1793894835.19347,1870397471.63228,2006326904.49496,1998094865.0894198,2121881960.17252,2165758648.46969,2273549836.61405,2240491596.61631,2247298617.53836,2340322754.66756,2333590333.70209,2287514366.64783,2318140731.1807604,2323570943.0620003,2396678207.84656,2457793927.89282,2478860553.88582
LKA,67752942512.9643,70869569226.3495,73987824072.537,79093030732.3001,83522176172.1989,88115967049.3347,91464344899.7814,97323001771.521,101895648116.039,106277711728.892,112654409674.467,110913439263.887,115310797422.513,122160569064.94199,128812286907.959,136852425307.30801,147346668752.25598,157361565619.424,166724717480.25598,172624958602.48,186462518958.05103,202134195860.727,220618503435.943,228110117988.693,239425977961.48,251415672687.038,262695775074.08102,271679495598.683,280398046860.312
LSO,2320798300.1465697,2482479199.6101,2655169512.71462,2748359762.1971397,2912708189.06522,3008563625.60373,3176954007.5710397,3294615790.43486,3345275635.93665,3361199987.69698,3491464866.74093,3615816257.63461,3641988836.00868,3808055398.42326,3872501945.75244,4006727606.2884703,4176215984.5796204,4378050988.58549,4673111205.954829,4773784430.45523,5080721565.07148,5417575074.75242,5737207568.44657,5860885774.16986,6026003893.33784,6189759098.651529,6388979798.17309,6243487372.31098,6314300267.56952
LTU,,,,,,38727860177.1692,40722329049.0437,44099524998.3846,47392513935.3112,46854778214.4282,48650097428.8223,51824239314.3197,55327946324.8291,61158717886.1262,65164664706.5451,70200204156.1736,75399543114.2561,83759055983.6293,85960309274.438,73226008807.1206,74311388465.1814,78789123794.5505,81809349454.9243,84720473496.6736,87692443321.9509,89475360544.1083,91762296687.0446,95659970670.1725,99146543699.4489
LUX,25947241380.5781,28190170374.7922,28703133604.4493,29908851223.1066,31051644843.1008,31496366556.5002,31933671080.5704,33756993338.797,35797485962.7485,38833471701.3314,42033271770.0056,43097543760.5182,44743641367.6196,45472643679.5836,47115195951.2691,48609898583.881,51127155310.227005,55398600739.7179,54689728232.4208,52306017935.6142,54850689227.8223,56243477062.0479,56045207990.3165,58093307402.8138,60589452705.5013,63198696611.3278,66089784365.2233,67280181468.9465,69373157753.6469
LVA,,,,,24020613035.1275,23588533026.0451,24189110260.7209,26351434935.9708,28028746956.1326,28821342055.066,30433953266.0829,32357093618.2756,34659613745.6323,37583631800.8667,40718617514.8366,45093174138.6835,50453894280.4303,55504758689.2703,53647365717.0357,46008975070.9082,43950790625.4063,46713149948.4144,48644379778.2861,49776823013.4505,50730143938.25,52384212650.065,53313408830.8534,55332554898.2565,57889348840.9685
MAC,16658466447.9254,17267981680.6456,19564430224.5481,20579189671.5117,21454276627.2089,22161562603.8155,22068641599.2092,22006952915.5666,21001116988.8784,20505667624.0257,21684154269.0846,22310546594.4995,24306699282.1796,27139141011.3163,34400364651.0203,37172863602.6552,42122119532.7604,48207766370.9735,49843874414.5005,50502469008.7351,63261163106.7643,76971570041.1159,84081675804.8526,93498899538.908,92375893911.2132,72427752314.8252,71907472284.8585,79017384059.024,83317938863.0259
MAR,95559611980.7687,102455277827.976,100306033751.8,99563175599.2372,110104925030.551,104153260708.849,117040014793.783,115213368525.358,123553148911.591,124889169341.825,127278140517.908,136594858980.138,140858598735.895,149255408215.49698,156415217554.116,161563842927.46698,173801708900.06,179939679886.85898,190598006793.814,198686523660.49,206267840942.004,217088027499.487,223622293032.138,233764512626.999,240004842094.927,250892369354.01898,253551468162.845,264288992649.476,272191799556.18698
MDA,,,,,,16816808189.5039,15828474247.619,16089179428.3349,15036594415.1933,14530123642.7677,14836377390.5143,15741396472.5896,16969225341.0186,18089194219.9348,19427794536.1173,20884879153.2665,21887353321.3157,22543973973.418,24302403975.9566,22844259667.0707,24466202122.5746,25889686474.9359,25737006156.4163,28064626384.2218,29467752625.0271,29368082284.6817,30662887771.2892,32101220495.8184,33192661992.6761
MDG,21494727489.7775,20138510266.1067,20377383666.1102,20804607704.2681,20789709887.4212,21145674039.3293,21600076610.8102,22397873843.3709,23278633598.9354,24363212071.7867,25522916826.5895,27058841143.7606,23629460945.0681,25941578209.7585,27305327911.2344,28562164840.1448,29996730131.4216,31868699608.0561,34007928308.7951,32654851936.1367,32857063758.2731,33375688540.8726,34380679957.2629,35171564947.4465,36346014939.0802,37484480464.4979,38981290520.8233,40514544581.3315,42363949399.0067
MDV,,,,,,2693215728.11549,2904866043.1786103,3148814974.67175,3384808676.05627,3593842810.3243704,3732055190.5972204,3584876579.98681,3845439258.6758795,4374189072.56048,4638116882.8203,4029176039.1054,5081254078.702479,5473215274.02809,5992367949.99926,5559189170.87669,5963071439.29747,6473911879.73571,6636885097.82815,7120121611.702159,7641999911.07076,7862437107.13797,8360782008.325859,8929621692.98355,9544767007.6909
MEA,2696075362525.61,2816950926733.92,2945401277014.32,3014546508900.19,3083972092441.56,3167434413339.63,3317317392832.96,3423383415363.05,3581647439195.19,3645084749257.64,3849240736073.5,3902993531911.54,3968506266432.9,4189930551758.07,4511266159162.32,4736021540934.39,5009818634195.67,5269613191270.75,5517625702033.05,5564625648177.97,5842026055778.91,6056363488012.91,6276037028996.46,6435009291065.65,6625518921932.76,6809724021608.79,7151633855496.88,7271439922678.66,7461294739790.24
MEX,1256745361953.59,1309714097906.39,1356092415469.38,1382416282692.89,1450722586494.58,1359454280004.36,1451533635221.84,1550917999000.02,1631006243884.67,1675916885589.86,1758748301956.55,1751636097470.06,1750938167149.81,1776263433601.82,1845903454546.11,1888503344900.14,1973393041288.24,2018612271559.1,2041696810371.85,1933777940926.03,2032750980569.99,2107210810175.28,2183962227417.35,2213535084381.37,2275610137008.47,2350432007146.83,2418842422702.14,2470075497063.95,2522835275243.19
MHL,160164998.208215,160305765.221722,171752880.71176398,182068780.871622,192770266.55198202,208602927.555578,187110707.00588402,175050166.602348,173615868.224677,171436727.36271498,173758113.624145,185618965.94177,192563835.302344,189452259.490336,191250688.042063,195620362.934383,196927418.7977,202380572.72403702,188713621.206656,191438280.50781798,205902189.794624,204345273.852145,199501598.033127,206918325.051097,204973364.561298,208235082.028097,210956018.80889198,219513754.721093,227470585.60318398
MKD,22760488327.4458,21355991477.4319,19953928207.5255,18463515170.9896,18138895891.3798,17936696595.4666,18149265084.3296,18410611114.2724,19032656994.8546,19858489294.4613,20761878936.8968,20125058829.8307,20425659884.7974,20879640939.9163,21855648265.5094,22888050753.2291,24063815679.4074,25621583624.8325,27023597036.9634,26926686403.0985,27831086713.622997,28482302427.8635,28352445146.651,29181676642.3937,30240866832.1235,31406836809.0903,32301442170.4034,32379133926.6488,33241905703.0246
MLI,11985874051.2422,13393639384.9778,12962543338.0064,13373737012.7438,13879255451.9811,14007086503.3267,14995396468.3713,15719527813.6107,16909758214.2193,17873774002.072,17862900496.6959,20609542851.1974,21249738781.4953,23187511384.8766,23549236251.892002,25088122948.5153,26257778125.0087,27175124275.6845,28472296963.8363,29804534444.9563,31417988677.1974,32436010970.5789,32164787901.9852,32905731070.0371,35223398920.717995,37323622820.3185,39488392942.0502,41620766201.6875,43660181974.7985
MLT,6438536179.88461,6841362686.18429,7162286387.12724,7483210488.49655,7906094550.918641,8407538058.881841,8725119000.6487,9183796774.138279,9654521574.60343,10110212567.9427,10794693563.6065,10860363485.1301,11184308402.8895,11468811325.0996,11519665471.6453,11955529554.4402,12174162341.9515,12659479079.0645,13083130158.1614,12760987158.9804,13213068508.9809,13385783497.2767,13759408217.0774,14393837896.8922,15647010796.6007,17339732591.0529,18323883594.9954,19556041260.3249,20880440540.0835
MMR,24858647173.7764,24696912612.1332,27082867127.191,28718512574.204,30866070985.6475,33010661474.2491,35137444427.3453,37123266250.2969,39300996177.8921,43602541293.7934,49596116340.685,55222298325.1316,61863063228.7713,70427383778.3065,79980620073.0427,90833150437.7278,102710585275.232,115027058593.188,126823434736.52199,140203318637.311,153711122481.32098,162305852808.191,174207206111.06,188885907083.34302,203979620493.54602,218243589579.321,231038060907.51102,246653065887.024,261945681941.535
MNE,,,,,,,,7675872012.40903,8051990256.32157,7295103058.964109,7521251267.19337,7603973201.60882,7748747826.69903,7941122839.956341,8292601142.31678,8639281752.31893,9379358869.720371,10018102568.5282,10741689077.4687,10119198220.7858,10395891661.3293,10731517865.9166,10439216146.17,10809705380.1531,11002516154.258999,11375547758.8276,11711051189.5251,12263398815.5725,12886117063.3331
MNG,10885264183.7989,9938948872.84512,9018953479.01696,8733161643.36445,8919560734.08778,9488310002.96763,9700382635.70502,10078378763.5211,10414990224.5168,10734768856.8057,10857795978.1507,11178395264.8117,11707466305.4684,12527531538.1002,13858632620.78,14863891465.719,16135680921.3443,17789268141.8066,19372578461.3978,19126818136.2853,20344271035.8285,23861953691.6565,26801703398.7972,29923811365.185,32283371363.9943,33051662595.3843,33437836058.3048,35222426052.7844,37767545338.0426
MOZ,6121236733.48307,6421177280.71306,6029341146.23277,6667793960.04215,7103623431.74813,7263760469.904691,8077645401.889521,8990438076.41211,9882897018.87221,11039348429.6159,11170553357.0984,12521037144.1911,13684301402.6234,14632137705.4986,15792429771.0883,16840710541.5273,18474614259.6634,19902994273.2664,21353749860.7657,22701981832.6703,24174920386.4962,25964752362.1171,27849388139.4062,29788710118.8997,31992631649.1491,34143585464.0944,35449309348.5047,36775580595.8018,38036311363.3997
MRT,5743220850.52403,5845914649.725821,5955474440.940761,6305277416.96114,6112289761.9736395,6712504418.01047,7103093412.44754,6815794838.64041,7005124313.84513,7545417321.99683,7512941373.77613,7663861109.04174,7714826103.948091,8176037953.80237,8645949478.46105,9421441204.62487,11199182315.4783,11514756976.7021,11639112578.5908,11517823524.7859,12067649531.6759,12635319799.7677,13367546462.6805,14181664618.987,14972984339.8344,15038054554.995,15315301280.0791,15785980091.2777,16347057706.2906
MUS,8459114515.621659,8834313994.16405,9409666237.488329,9887871397.01499,10296847887.5984,10738349600.1649,11338391813.2038,11983260290.1178,12710876684.3172,13042749071.6613,14112618620.8534,14585044274.5362,14820580873.8517,15698766314.6325,16378526015.7204,16669661364.4653,17480731171.334,18481855467.3388,19477466103.6153,20123159100.366,21003990672.3874,21860436389.0341,22624703114.3061,23384985018.5518,24260653501.9776,25122651923.0792,26086842378.4319,27081834228.7363,28103853610.8089
MWI,6314486667.981689,6865755992.88343,6362291607.10064,6978914747.0329,6264261193.88324,7312198022.4945,7847208263.268121,8144807288.17968,8462068189.69945,8719507836.30893,8856934066.8427,8416304799.109429,8559381981.841491,9047749455.80128,9538182506.38117,9849959541.44852,10312907639.1112,11302946772.7348,12166462153.8888,13179698538.7824,14085679666.8347,14769406320.3377,15047927711.9605,15830419952.735,16732753890.6381,17201270999.4091,17628557559.2948,18333705241.2908,18975384924.7359
MYS,185851824004.79398,203592249273.531,221681660819.743,243616935587.22302,266059029523.59198,292210198167.87103,321439109702.907,344977265884.53,319588956566.333,339204086764.709,369253729662.044,371165265086.572,391174741095.81104,413817888181.423,441888966957.845,465451101560.04706,491445833775.259,522400954805.574,547642166829.27795,539353445357.502,579399615546.039,610072526189.664,643464566450.436,673667007715.422,714132311737.729,750492470657.1129,783887552637.249,828897039978.8679,868200075493.3259
NAM,8684419837.087809,9393555905.11228,10068890819.5773,9909848727.15938,10081277197.5412,10474347606.4092,10808618005.7301,11264752542.918999,11635541512.56,12027575297.5366,12447600289.0175,12594226627.1873,13197321480.6701,13756860774.1493,15444765409.5162,15835404104.369,16955469984.7867,17866664439.7416,18340097452.1544,18394378803.5653,19505261241.9501,20498340058.0882,21535900849.827,22745081317.5527,24189775634.9135,25662056361.1399,25950284583.0171,25725068018.3167,25584523728.0668
NER,6590864479.19719,6755913123.2953205,6315667787.299789,6407209468.31452,6663790124.99156,6837432226.2962,7071210399.6629095,7265949103.23566,8023225393.460279,7977592630.5506,7865147716.514529,8423914599.93797,8676558078.96768,9136415657.00662,9145552072.739979,9557101915.95495,10111413827.2267,10429576581.2905,11429532649.6092,11348076950.081999,12297255018.6389,12578002394.3821,14068472934.7822,14809658458.7011,15924684022.3532,16615349092.8966,17433809713.4329,18286922154.8502,19472475516.3042
NGA,310358599711.732,311470777837.038,325895590532.049,319263228179.911,313468841684.979,313241060282.565,326384417250.615,335970652075.844,344642908316.841,346656060234.6,364044102047.867,385587083999.928,444694328612.608,477366887957.834,521525989891.937,555104526933.7739,588740686241.567,627545352358.437,669995486887.374,723842522354.601,781790864062.807,823287730558.45,858113305208.2109,915360921849.611,973117620702.761,998931446583.678,982780034192.898,990700126987.506,1009892644212.07
NIC,14416196298.2218,14388909106.2508,14444500170.1586,14387742526.1652,14867965960.8748,15746946417.4684,16745974952.8614,17410229315.4639,18056441569.5549,19326887484.8469,20119597199.1068,20715306995.8476,20871487752.4319,21397602210.6477,22534279328.7368,23499286926.3495,24475053266.2211,25717362302.9084,26601107010.5386,25725188520.3146,26859372184.9428,28556219690.4578,30411445121.9033,31909753849.0088,33436896008.6633,35039005092.9456,36638024880.8833,38334872386.3983,36820293365.2116
NLD,547719073151.279,561078678057.797,570651078092.309,577827313298.259,594937314139.2329,613475774821.475,634939710695.651,662426589335.545,693321617125.35,728223760923.653,758777426402.328,776433836467.7759,778120821916.1959,779331936364.7941,794801252091.5941,811101640805.8779,839173779383.7671,870834484530.5991,889734421225.53,857108891869.264,868617631039.308,882091534371.3009,873002868905.0029,871866435424.381,884276542246.447,901601020246.0991,921361533499.832,948181470187.0029,972810044092.1841
NOR,175623607978.03,181041106988.466,187512232240.272,192847563474.855,202596832015.30103,211015725813.045,221625485031.26602,233337489865.763,239461260135.477,244281287931.547,252110452453.603,257341215903.087,261063023890.993,263438973258.838,273895958220.448,281086980543.607,287832480102.217,296450909466.19604,297863142307.204,292718985345.082,294773386193.101,297666497064.742,305712642321.525,308873933949.028,314957342911.759,321152958372.42,324594301728.427,332135466131.602,336418513060.854
NPL,26639133536.9388,28335553626.7035,29499126674.4587,30634798809.1122,33151754709.2657,34301607369.8671,36129294486.9581,37953322577.5597,39098142607.7394,40823376797.8949,43354426154.3014,45435391851.4397,45489979373.8971,47284576240.5372,49498725342.1272,51220875612.3963,52944260767.8308,54750486136.4452,58092805743.7394,60726198358.988,63651023873.2747,65829052583.7763,68976466149.1291,71824420061.8687,76125973562.1402,78655567678.4141,79118596093.4637,85624913438.4777,91325420022.8633
NRU,,,,,,,,,,,,,,,,,,43840501.347361,58930090.932079196,64033259.056375794,72710295.07053159,81206145.5471126,89397045.2722548,119984228.677327,163807386.055942,168407410.698572,185921788.146745,193646252.984264,204684089.40436798
NZL,90868091865.4845,89876903328.8725,90860827430.6827,96668320206.7019,101616191038.733,106414737827.02301,110268104141.70401,112521685745.621,113412786810.782,119600450422.84401,123072838701.934,127342697882.214,133302743283.489,139385476515.716,145008130345.759,149824434657.392,154085415076.0,158728180729.74698,157126781692.114,156791004519.978,159204403183.953,162920552798.077,166547108101.519,170836338987.561,177183819659.679,183535336040.63397,190226665447.012,196177832086.615,201618963575.347
OMN,48884256322.1628,51853524429.3107,56216419634.3379,59613555540.8253,61924042410.47099,65018275138.0254,66998692791.1204,71041067166.1185,72918212261.2499,72827205305.5552,76760874103.3693,80201645048.8092,79318973613.22299,77201974442.11299,78199510853.8501,80147037109.3276,84452590682.5924,88213006377.2392,95446204568.0564,101280309688.70699,106146536157.856,104969640910.408,114766116950.16801,119784398285.28699,123079704978.142,128915222373.09,135335420856.21199,135696492788.887,138090297722.197
PAK,315615445581.375,331590535204.62897,357142563038.594,363420228216.64294,377002752346.753,395711925430.586,414890425546.055,419099057486.029,429787065378.531,445517842487.503,464497294684.709,473705879382.676,488980193739.469,512677743238.59796,550454768592.395,592659810577.141,629271619507.073,659683167054.944,670907052513.879,689904849222.302,700989471986.042,720255508114.4609,745515109494.124,778291357979.2059,814674206209.496,853217644348.734,900372729732.64,950381922984.568,1005791488120.01
PAN,26602665542.0143,29108372089.1135,31495747718.2835,33214075221.8668,34160725128.5976,34759111293.9518,36177179871.714,38514584004.6975,41342132460.116,42961589196.7645,44128157086.3169,44381573085.4721,45370904663.0013,47278976218.7301,50835338471.3171,54491049695.9124,59205869031.687996,66301091729.3023,72835498492.9748,73740838143.8477,78038335757.5317,86867383725.8866,95362061740.5051,101945164786.835,107110464509.779,113250854265.407,118875367844.74,125200999800.06401,129804657626.78801
PER,115857374579.764,118428549911.38,117788432792.831,123964759972.525,139222796570.106,149541148019.887,153726764495.18,163683377119.305,163042495225.22598,165479834839.104,169938476178.581,170988512981.172,180313421017.577,187823516721.464,197136188349.39,209526316709.744,225301341565.557,244493383489.085,266807239125.77698,269730975976.69,292206199250.197,310694647686.192,329770443729.172,349070319002.42,357385723339.32104,369008781843.15796,383596875076.52295,393259049121.62604,408898708708.642
PHL,254077204138.99698,252607787626.59,253460599172.137,258824604028.712,270180852767.895,282821783304.175,299355186907.979,314877837839.753,313061880210.122,322710185819.701,336945649049.31,346696812538.102,359337043129.444,377197419035.40704,402460682442.154,421688916955.678,443797899697.517,473162507944.794,492811796371.34204,498470913015.019,536515532946.517,556150668752.356,593322772158.718,635235236746.848,674272340037.527,715177401296.9109,764410607212.443,815454534969.963,866369377542.0029
PLW,,,,,,,,,,,261231432.084493,277967118.742762,287574240.660738,279418408.365962,293318607.877312,305221913.14429504,300658950.28814,304696727.857752,287680071.155049,269675001.974607,270454320.465791,283613589.835051,288835805.494798,284751121.796506,297204465.597317,327148194.66412,329754518.535596,318154002.830617,323580178.472785
PNG,11263064881.0501,12338338164.0986,14047085137.2157,16603975741.9152,17590602088.7422,17007922404.7586,18323263385.0964,17607851784.7749,16944191915.7783,17258600545.6375,16828025731.8898,16807615254.1355,16780907863.8982,17144063910.8762,17610584019.0374,18727939635.9108,19741110674.6356,21283915853.3955,21220818046.8017,22663923073.1748,24959428119.5406,25235864667.4676,26411129076.0005,27421340571.4486,31135224040.13,34087948132.2902,35477977494.824,36733131212.9005,36431635134.957
POL,431195228072.024,400944387060.79706,411028052675.72705,426393556741.555,448961723699.739,480172899014.914,509254939184.92206,542149517725.88104,567168551589.597,593496706274.051,620556075913.318,628300393057.688,641127884396.125,663967784132.211,698066753828.25,722454886091.61,767100006939.198,821064175325.645,855956188333.3309,880096376267.751,911840821191.261,957590019839.473,972987173396.16,986530107149.4009,1019267591191.87,1058398001150.75,1090826343409.05,1144687674834.63,1203616407914.28
PRI,76798425208.5703,78568161351.1414,82154052944.9412,85969720116.5961,89568377020.2768,93642831837.6978,95809453069.2914,100485037933.828,106042589662.86,111757967041.327,115414648080.83,122701319057.357,123825826809.58699,123891974324.42401,134730882895.975,132053862797.967,130192677135.893,128678787975.884,126305778374.62,123839752602.185,123327979724.235,122885835809.271,122921810773.481,122544653890.638,121085927116.07199,119815198541.57,118301929079.33301,115158181400.497,109508951536.866
PRT,235467724438.346,245753440833.996,248430866783.86398,243354735913.917,245702715436.52698,256225623195.96698,265204402855.93802,276875698473.278,290187780810.39197,301524188453.403,313030887732.56396,319115182959.0,321575318942.602,318582992615.81,324281600482.216,326816988243.594,332127876767.35803,340452927664.01697,341539815139.322,330876672025.98804,336626070478.523,330916334387.06396,317490086413.397,314560782076.683,317052704625.568,322734435812.356,329252009712.286,340796722600.216,349116480285.432
PRY,35788621797.0255,37038951037.9172,37667290178.3965,39526683003.4001,41628679459.3447,44468925290.7436,45168770625.2184,47085062992.3843,47117098612.5651,46473441487.347,45397980724.454,45019336724.9142,45009700608.2559,46954455215.3313,48859593903.7842,49902008778.480995,52300856821.9659,55136412037.772995,58642603080.3218,58491321916.4052,65009440293.1007,67771763600.6464,67406803882.2943,73080768420.6555,76633144455.5414,78993731918.81,82400656508.7436,86486123430.1818,89665892336.1151
PSE,,,,,2631904857.15312,2819257315.5992303,2853515542.67127,3272047092.3582397,3741068980.39278,4050845556.2585397,3704247785.64366,3359358677.4927697,2939801930.32741,3351840614.68903,3698523831.43657,4097918621.7159705,3938075290.69425,4197617814.57258,4452803314.21502,4838528960.89595,5230405740.40944,5879689254.7496395,6249182790.15505,6387753572.71758,6376134824.07592,6594755415.3293705,6905265204.35542,7122106882.061391,7186581765.353371
QAT,,,,,,,,,,,53845291013.1016,55944280941.1663,59962284088.6039,62192856254.0603,74145648635.0245,79701203030.1626,100559203669.434,118645436913.57901,139602440554.825,156294091713.667,186915748329.553,211916059399.58398,221849114342.02103,231633269524.683,240849684332.975,249658786250.01,254979791213.855,259008090091.22,262875961485.472
ROU,308904920462.41,268999931880.345,245416093315.911,249168099210.833,258965246172.298,275107874531.275,285858270689.031,271996823801.643,266475797168.976,265472087550.683,272006055036.01398,286199701614.36896,302521646701.014,309604124152.992,341889992128.35803,357849923131.944,386581017395.789,414545544967.562,453129235473.32104,428128308374.057,411426011482.021,419683974359.45,428401503012.891,443457895765.757,458583398029.99896,476337556654.75397,499205569628.54205,534706277347.015,555847550507.676
RUS,3220079659103.62,3057564188424.75,2613267280523.31,2386735152081.34,2086728367582.61,2000264184922.22,1925152875813.36,1952103395186.84,1848642664354.15,1966954217792.74,2163650953807.11,2273998260784.64,2380875995049.27,2554678808070.88,2738614350493.08,2913884722677.68,3152825258807.92,3420814704885.34,3598696018154.72,3317997947774.84,3467307855425.19,3616403105169.6,3750212083404.71,3817715906163.38,3844438912609.12,3755720530993.34,3768087392273.42,3829514215295.17,3915862268241.65
RWA,6518823895.02746,6354915913.3586,6728122663.83107,6182559928.148379,3075943066.64563,4159415661.14558,4689562126.58841,5339054873.799729,5812024099.261189,6063241759.45042,6570790159.46346,7128294220.671929,8068663610.85215,8246365628.983729,8860528254.04698,9691461144.37305,10731329693.0495,11550480983.2349,12839659787.3641,13641912357.8695,14642499591.6387,15807802187.9441,17173842572.5939,17984418758.0223,19092996425.1,20786151732.6008,22029440627.8511,23376905693.9275,25388887238.4998
SAS,2165699976745.09,2208993667369.04,2336289607689.01,2437727438325.69,2583961311105.96,2762027389546.22,2949691705893.13,3060053483028.91,3229158591578.53,3476387443809.9,3618585174354.6,3772995963583.61,3912637300230.19,4193534450529.38,4508618700165.71,4856004786931.99,5228664264346.41,5608570178903.62,5790085995619.97,6196596743115.63,6663995570381.34,7003158003292.91,7387337758563.42,7833560091010.49,8375707794710.53,8994908055014.11,9681226039614.15,10348610062239.9,11036312348559.5
SAU,671957415312.107,772803979540.614,803619848648.947,792660551839.302,797089306344.0459,798779863794.6991,819847077362.5459,828896402228.02,852879380055.145,820783096438.36,866955561241.0,856458949989.703,832313878488.356,925883115628.553,999568983259.7009,1055283460246.89,1084709007761.41,1104744995985.72,1173789047754.78,1149617583231.58,1207552488624.23,1328269793696.42,1400148381734.23,1437941953028.31,1490462519737.01,1551667004835.63,1577589537960.38,1565891669705.93,1604007207602.88
SDN,44436860738.4556,47774473633.4721,50917012286.4934,53243282872.6742,53779031822.204,57004210009.4925,60378360317.2073,66758382439.9741,69634670086.9195,71796196872.8445,76352288589.3506,81315462537.1094,86541830038.5367,93235487256.4756,96856107731.03,104110376574.77199,114588365535.012,127791133920.666,137761351333.763,142227364357.466,147161708220.47,144265964642.133,145018397149.334,151391536792.575,155447939512.945,163074285648.323,170738777142.309,178051640198.70602,173919369087.793
SEN,17445873174.48,17891759239.1634,18114090689.304,18349715232.0011,18346535472.4523,19330546928.1555,19719501717.4347,20335545514.1909,21535072758.0657,22901928762.4811,23634558723.5095,24717238110.0166,24879087486.7384,26541813672.0439,28100023093.9469,29679976919.0943,30410570402.2968,31912391885.183,33206878403.4899,33901741327.7848,35109574054.0435,35621608104.6208,37444506224.8036,38501229750.4849,41047344850.3757,43660937426.8334,46436199852.5739,49725239803.0015,53089795632.52901
SGP,113921085156.975,121540665128.98,129610555581.004,144467651581.47598,160500104599.094,172057684717.087,184912648992.667,200297051565.595,195899874722.88397,207113188979.08,225834555533.99103,223420144732.316,232166317529.591,242696933099.499,266528623638.14603,286142561561.61304,311910237182.101,340051142360.885,346404019951.532,346823182012.337,397201491973.308,422075312957.035,440854776563.51294,462082132605.803,480105984559.67,493993046456.16296,508626737127.817,527444815441.261,544003758406.114
SLB,646084243.1460099,684876295.859169,771790161.4911389,802480076.426532,876258649.190667,948318585.7791301,963540804.4862831,949668961.6439619,966609787.1739811,961944921.747558,824699593.273319,758900404.850004,737651174.376174,785598514.212916,824080043.585698,868755015.1382331,929104385.382657,997114838.13379,1067972513.1192199,1017368274.6457801,1086641338.3701901,1230030532.13394,1286063278.64872,1324874733.567,1354685620.0049698,1389124974.38925,1433867961.91976,1486829569.85266,1544142564.28634
SLE,6310218803.29786,6458632666.14554,5230658673.759629,5302556660.062221,5199295502.33258,4783364689.55327,4867256363.07905,4581203714.747371,4662978855.310929,4570685186.84161,4874760434.78869,4565434697.56727,5771500035.79611,6309006815.85458,6725271606.796121,7028251526.85736,7325118846.67514,7915387555.9178295,8342682751.63205,8608651750.50585,9068910393.91386,9641616169.59815,11105384072.3379,13405949704.0196,14016828315.5528,11129533989.2603,11803480029.5034,12300546132.4661,12724442955.5114
SLV,27683182615.9961,28096868677.2177,30068719921.9969,31818489336.0776,33310707873.065,34887956424.8146,35173228434.6471,36275887897.3884,37238713057.1252,38043261662.431,38471650492.5445,38809169550.3888,39422689067.2714,40038562569.1021,40395220499.7562,41488908074.4092,43290727945.327,44096186201.3228,45229831543.1263,44286282758.9531,45218191568.484,46944195441.9715,48265910119.8673,49343274185.043,50187394483.5311,51391376593.4799,52679770733.2775,53894859689.2591,55263223120.4924
SMR,,,,,,,,1905925630.44405,2049116934.2857,2233455164.51863,2282831476.18817,2409564009.47331,2417793394.75156,2511608386.9236803,2626819780.81926,2689363108.934,2793053363.44003,2992204487.17382,3041580798.84335,2651507936.65403,2528067157.48019,2289414984.41077,2116597893.5674,2052408688.397,2033937010.20143,2046140632.2626398,2091155726.17242,2122523062.065,
SRB,,,,,,60841971192.6869,62318091731.7061,66795542456.5516,68418979147.6227,60108408045.353,64772345295.8586,68006243267.945,72845423424.8601,76061850492.3379,82942795732.4143,91365060831.1309,96031794337.8428,102215788180.93599,107996681672.14,105046478378.02,105814413666.54301,107969086952.862,107233235367.67801,110335100567.09401,108581314065.46901,110510070032.85,114201473281.12599,116541809515.9,121660602272.453
STP,,,,,,,,,,,,371581696.26707596,380413737.891793,405420131.102732,420956751.171,450818456.78540593,491913473.863651,507918394.820687,549497467.313065,562829821.8563981,600381744.9477099,626787744.9706,646481264.557756,677608008.192219,721990879.408706,749414973.2883099,780683396.766813,810905102.715775,832456477.003146
SUR,4835293143.18693,4965846014.11148,4985709400.42828,4651666945.944571,4809823600.445,4809823600.445,4857921859.9947605,5134823338.39234,5252924339.4069605,5179383397.52509,5288150379.46155,5510252698.03601,5664539822.55525,6021405779.3882,6533225287.11791,6827220470.2452,7222758464.1264,7591948882.42573,7906514187.81342,8144792697.58314,8565782791.919359,9066826931.039879,9310756314.55908,9583881879.11725,9608368998.69833,9280618321.22852,8764505185.44272,8912369715.22077,9081704739.80997
SVK,,,63706952498.112,64918230180.5569,68946750578.1101,72975650734.2546,77806562578.7286,82417252496.2063,85776661890.5951,85685810255.8679,86685358503.0215,89505915292.8408,93542132211.2962,98686092522.4043,103895613267.11699,110777099325.075,120185594390.00099,133204131507.81,140630110466.715,132957989454.599,140564309679.57098,144590694135.34302,147331860148.344,148320227950.05,152402644824.559,159751376159.03302,163143637876.286,168104392708.322,174885224713.061
SVN,44205090222.8901,40270789827.0173,38070515047.0684,39153018894.0489,41238891162.7131,42932638635.8582,44307771899.2072,46545223271.51,48071612519.0067,50635111472.2044,52494619604.7654,54183141088.9583,56082584951.4003,57742775419.6127,60259894464.6469,62548547474.0775,66142835288.2493,70759712626.0033,73243266191.4306,67714543126.207,68624456267.347,69215538643.7197,67388636910.0893,66695016566.2356,68541240015.9809,70056057366.4003,72242997156.4253,75734777836.5049,78853700982.8912
SWE,294591034785.351,291215095579.967,287841098629.011,281895405733.565,293092334268.574,304811422169.917,309733755476.617,319332804984.895,332939635779.883,347293428037.42,364222334254.21704,369568817971.02,377684768358.835,386162305187.11896,402868193451.324,414534827530.21796,433613745752.909,448490529977.137,447403867569.201,428449958342.87,454966852377.497,468853912663.849,465895564654.854,470963721966.822,483902450447.3,505294808231.54297,517487764678.55396,529968800848.859,541761871239.009
SWZ,4223720424.1520705,4298073799.55989,4436738552.23536,4574548716.50519,4684369497.61834,4910420846.8862295,5099081849.661321,5257296434.1137,5394198504.70271,5553374571.2363,5651123620.46869,5710729690.60501,5960865304.11699,6192159611.26799,6416558168.96449,6801473142.66805,7209028755.084259,7528776271.236209,7590637506.9525795,7709434698.59178,8001911739.62174,8181733102.35587,8622835633.72509,8955872989.25105,9037657705.119791,9246650439.00663,9363925381.01674,9553541391.19561,9778146087.466429
SXM,,,,,,,,,,,,,,,,,,,,1257052960.7084,1297278580.29872,1356953433.8643599,1375822504.65037,1393800760.93576,1415828174.0421698,1423035673.18361,1429190391.5515802,1308768467.69408,
SYC,1004828093.2126801,1032565630.1512699,1106512474.29078,1175079176.9621599,1165693854.83848,1156069392.55303,1212919397.97584,1358003430.80644,1472121871.0845199,1499680089.4854698,1522390327.1772301,1487814364.98151,1505859042.7973099,1417207200.5627801,1376810366.05866,1500802622.94578,1641970036.8794198,1813086895.22995,1774161865.84083,1754553016.4493198,1859035990.0727398,2005663356.4182103,2030951338.33066,2153175550.14227,2250171484.5978,2361271127.8785896,2467599938.1024103,2574505944.14005,2667892326.2526
TCA,,,,,,,,,,,,,,,,,,,,,,777711445.277396,758035345.711877,768384960.3402821,819895062.751394,868607248.935753,906823376.964991,945594300.6627461,995541400.0483439
TCD,5985824130.22011,6496722430.27816,7016553994.90448,5914264796.115971,6513787172.84677,6594333363.63464,6740363097.78887,7121422268.03076,7616473627.97355,7564464521.254509,7497921362.184529,8372039130.861079,9082926539.58965,10420084739.702,13924293784.1584,16337726701.6699,16443637977.8434,16981591525.0421,17499987131.5205,18238083310.3491,20709361993.75,20726523800.292,22567573043.8726,23853925014.9375,25499842273.6904,26205595207.9731,24566297101.8342,23832085166.556,24461569189.787003
TGO,5083164685.18939,5047584184.96086,4846655666.577661,4115012888.65922,4731541169.9231205,5102769956.43849,5553661508.63889,6352132392.83546,6206041188.67038,6360059704.55371,6310229933.76716,6362190812.17485,6605647842.52851,7049558700.9814,6980567113.62471,6654832953.75446,6831194817.84124,6750920054.72674,7025159495.56333,7414206574.052059,7866418247.722091,8369727345.504721,8917401042.804571,9462463188.156721,10022696702.2274,10598286989.313,11187454168.1673,11674937852.7889,12248194526.5107
THA,401625525312.623,435997683285.43396,471241067798.66296,510123371513.465,550917452176.143,595653391836.499,629321948942.56,611992999048.881,565275083659.487,591121147088.6329,617459590353.227,638726403799.6179,678000922731.4661,726744646231.43,772451714044.565,804800716694.2421,844782546898.062,890697260336.313,906067737118.399,899809225119.283,967417206997.4441,975543119465.558,1046199625852.36,1074314984508.79,1084890692306.16,1118890048752.74,1156445468731.66,1202981826401.3,1252655665986.61
TJK,20443306932.6795,18991832325.2207,13484200750.458,11272791848.2993,8871687408.5912,7770150112.53371,6472535165.3171,6581317389.7763605,6930974072.9402895,7187388973.927171,7785690554.815929,8531624812.2323,9456273066.49886,10489702673.7084,11577524046.7848,12346768749.7454,13217025673.9033,14242685277.8508,15369357102.9955,15967658683.8843,17008858730.113998,18267623225.2623,19635169509.1117,21088188007.6342,22502355182.5721,23854361459.8975,25493863087.0159,27435856244.3022,29438673829.0085
TKM,26553870092.73,25330994481.5667,21539961242.8807,21863060698.9858,18080781703.1233,16778958019.228998,17903146891.1557,15862188104.8054,16988403514.7911,19791490009.3185,20873899290.7111,21780629270.4636,21836644676.4873,22550447154.1205,23678061390.8425,26764268169.0701,29701193836.2995,32985937808.9547,37834870666.871,40142797821.0059,43835935215.7434,50279817660.8398,55860877401.8627,61558686953.4951,67899231691.5735,72312681690.0883,76796067930.5985,81787812382.0508,86858656701.7867
TLS,,,,,,,,,,,2059164364.48403,2395790203.94081,2235255616.98817,2186476365.9822397,2195222271.44617,2261495217.11099,2168556472.53863,2390351085.13014,2661400316.27377,2927227428.01479,3204120283.81251,3390174281.97147,3594147088.1651397,3670521334.9520297,3833884437.0239797,3951047561.4364204,4091330215.77646,3935914957.3421702,3905220416.1432796
TON,374167709.087093,398170342.45857596,399173674.05727,414094975.00127,434603139.52498,450735057.58893204,450781104.208196,450187951.04689103,462427718.02992195,480377795.943649,496565757.59025705,514451006.71107304,532039452.04752403,543257938.3384969,541348821.268761,549913871.124664,545447349.0560861,522725235.813732,538927208.356004,551271943.454659,571038666.526738,586942926.46979,592168611.87965,573689376.517247,585579704.188957,607315526.111129,627839594.8947821,644791263.956941,646725600.638872
TTO,12323429435.0418,12706984822.1671,13989498196.9845,13895892398.7949,14391583977.4503,14939890826.9862,16005773971.3046,17209865078.976,18608091581.0366,20101356997.3504,21488623926.3535,22384382368.093998,24160965811.912003,27650048357.3252,29848241444.4659,31701500213.8884,35888652940.858,37594874760.5043,38869994067.2118,37162929169.2756,38397936814.4904,38284910794.4952,38771115518.8348,39635352686.3918,39273662269.5827,39989693670.0242,37471763820.2171,36605373315.5511,36515611926.2763
TUN,44783486165.503,46532077670.3423,50164245484.7988,51262756624.2409,52892097920.0062,54135945459.6848,58004543885.0193,61160538308.3877,64086313248.7605,67966505290.4011,71167632499.3611,73869286654.4366,74846254964.4542,78365834100.8837,83252565979.4049,86155196509.5874,90673343176.2772,96757180300.0012,100857533673.665,103927081228.135,107575554319.578,105513139803.429,109731211162.371,112886558301.798,116240867627.02802,117629413325.18599,119114518296.32301,121287971523.548,124299341831.988
TUR,686015604911.141,690956831494.33,725750895114.245,781280020812.692,744808718116.0691,803486736646.3821,862781361902.023,928160031490.737,949583946340.751,917399651239.769,978315548802.168,919985335620.5441,979142956113.452,1034055790838.06,1133783467014.87,1235935694215.23,1323807056619.26,1390400609178.06,1402152990538.38,1336189181085.59,1449596529369.21,1610697375480.71,1687848817872.79,1831169281492.6,1925780134797.82,2042980930278.81,2108026001638.18,2265513818143.82,2329554821757.92
TUV,23313432.6214365,24154852.868401602,24828499.4883838,25849122.385863103,28507313.528721504,27080682.8923995,25466305.578263197,28013757.2504015,32356231.3853057,31850247.430912897,31541108.9886018,32056524.661442798,34584558.089717306,33431669.2111775,32979612.494029198,31733072.1993693,32411823.043452803,34470156.8930114,37221999.4519899,35572003.530537896,34601091.3373499,37201693.5169781,35774729.9964755,37412076.3190677,37916395.852558,41383051.7085099,42638912.760224395,44384557.4028796,45494171.3379516
TZA,34116432207.7579,34823320661.1923,35026801031.6384,35449154481.6325,36004877322.6786,37290219711.4392,38984824076.3519,40359147577.4525,41855871245.4403,43891683796.3581,45875932293.4154,48660972193.5007,52112589832.0704,55589953426.0566,59761320500.9934,64229267614.3385,68424865572.2764,73056226685.3248,77210508276.6666,81278811220.217,86429062134.7592,93060034122.7454,97247878561.091,103842826690.53099,110834005400.461,117662077028.613,125742068577.319,134274523119.768,141585727441.522
UGA,13307905507.3842,14047039287.772,14527217223.3209,15736795824.4223,16744522906.6758,18674035105.7394,20368164967.602,21406941760.5333,22457009085.872997,24265685004.5764,25028090342.4006,26325461732.1322,28624381581.1254,30477311843.9851,32551973578.2661,34613348501.7536,38346309661.1159,41572164571.8607,45192581244.4738,48266362497.8322,50987426854.687996,55775996578.6708,57916375686.1674,59993781539.9759,63057248400.8691,66328570081.1243,69499739210.0117,72184530646.6478,76625579164.1468
UKR,815735799382.9691,747127166232.783,674663312976.339,578684988975.692,445969110105.271,391560878573.815,352404790816.345,341832646996.44,335337826757.209,334667151112.287,354412513026.56396,387031559115.454,407348004628.485,446111057311.94604,500129553037.452,515120231366.27795,553444673826.708,595470327155.515,609190134860.889,519282532480.507,539193838026.706,568663649276.177,570020943098.472,569868578499.356,532527262370.275,480483511760.534,492212089000.076,504350302211.014,521172852621.67896
URY,31591728425.1563,32709699197.3092,35304097908.6783,36242320586.8376,38881248133.0422,38318403587.7779,40455787953.333,43913820556.7689,45898237834.2164,45008173636.4811,44139547103.0914,42442765545.6901,39161087852.8644,39476445795.213,41451910449.2434,44544277731.6541,46369959408.0793,49403255333.6553,52948504403.6583,55195371114.5949,59502492033.4052,62574089823.4715,64788072955.3412,67792644866.1736,69988307101.6807,70247782630.7224,71434828370.1814,73285946717.2745,74473240342.3469
USA,10109879948581.7,10098935083004.6,10454664263796.4,10742464895876.6,11175261517989.1,11475237624930.7,11908141115720.0,12437721913534.2,12995106922976.5,13612795022022.1,14174660960354.6,14316172383226.0,14565516477567.8,14982266603352.9,15551426599914.8,16097781464799.4,16557368665197.8,16868013290367.4,16844974990630.3,16417658897313.7,16838569345855.3,17099707857919.7,17484373626804.9,17806449963769.1,18243059315435.6,18768625520582.1,19062770266937.2,19485393853000.1,20055794215940.4
UZB,70077075600.6176,69732296385.8942,61922279192.4669,60498066767.5353,57352167300.5041,56835997791.2326,57802209755.7439,60807924661.4988,63422665421.9434,66149840036.9543,68686686401.8024,71546688922.903,74389588159.2726,77538222236.794,83314044880.1775,89104376995.4477,95743917005.5349,104813743342.46901,114277544997.056,123477953954.01,132858781510.593,143201611170.279,153763651903.083,165425981344.64902,177302588900.45,190507507306.411,202117408963.762,211134957472.626,221949539372.913
VCT,685397095.195119,693181444.529439,737386338.24666,768732802.350099,759141038.176468,818106663.90211,828636720.767809,857687260.939363,892762237.736299,916964289.4069029,931994974.387352,947925225.26758,1007849717.2936901,1085351256.53149,1130461540.29499,1158587478.30065,1247663865.7750099,1289367780.22071,1309797449.0034301,1282303998.17963,1239301601.6182802,1234104571.98673,1251165085.47861,1274096338.6389802,1289564364.0745301,1306719122.84609,1331513346.50268,1344833245.1784801,1373923722.3545802
VNM,113762338443.979,120543533891.737,130965785041.446,141538300120.819,154048843508.85,168745842883.477,184506734132.55103,199547878349.082,211050726925.773,221125416737.654,236133898430.638,250757418833.471,266607346391.338,285000756492.526,306479583748.597,329610357167.482,352610418945.75104,377749794575.41,399137123683.052,420682136674.609,447703552450.32104,475641609540.69104,500600271140.23,527742232095.62,559320504637.703,596679136398.068,633737753821.4039,676909526449.6011,724806213667.817
VUT,411262512.20511097,424173364.925052,435168008.618316,438434989.393582,478141359.775438,482979004.127051,494224953.724297,518507411.005221,540810831.107017,542621402.037467,574755683.143816,554705286.5436519,526353086.936465,548951694.475779,570826073.6429139,601096137.2727259,651979886.236619,685710152.0890679,729928317.701603,754109498.350495,766394557.404509,775769291.3332809,789382102.4029571,804926189.131779,823689068.6258451,825336446.7630969,854223222.399805,891809044.185397,920346933.5993301
WLD,50955091146065.7,51615445034090.3,52430850144806.9,53305755915177.9,54818761346949.1,56557054042149.3,58665745744462.1,60935474725982.1,62443605458589.4,64626974473742.5,67647649626616.1,69205151598633.6,71088636931971.7,73743809303842.8,77479380141504.2,81025359625433.3,85204780144095.2,89614063812727.9,92000272259588.4,91363310902980.2,95964220720143.6,99669643559972.9,102803553983995.0,106169301516695.0,109787060392918.0,113421209654849.0,117074229518590.0,121414814205164.0,125773191705220.0
WSM,680373189.5430241,664724558.400579,663395173.4248589,690594293.88813,673038721.018144,717954915.003363,769496653.505418,774447785.66523,791446034.206255,808742603.365171,864697808.151491,924705811.1734539,964874990.881959,1008443719.85401,1055084261.5377699,1098938755.54617,1120574748.93123,1191424675.99687,1203447183.43822,1145582167.07715,1151071323.84341,1199110066.39094,1150081779.75681,1145264719.03655,1146160836.55289,1195126999.32133,1291384412.9014401,1304499219.9804301,1276216383.80597
ZAF,378914243351.642,375056063223.399,367040901787.52,371568424401.132,383458617880.99396,395345817466.48206,412345683509.64,423066680007.28,425182017236.716,435386369682.961,453672612341.576,465921748227.389,483162634371.789,497411482822.195,520066351165.66205,547510545374.54706,578191928488.732,609185767416.3989,628625169995.131,618956353305.859,637770960300.042,658716430999.129,673296162798.926,690028922405.376,702773698665.01,711162938824.4921,714001104272.8191,724100740041.47,729799815251.963
ZMB,17622761666.7655,17616393966.6418,17311467897.2976,18488175812.1939,16893488939.4716,17383006313.4835,18463976642.2633,19168194095.6775,19094253525.7358,19982172545.3362,20760942340.5392,21864774297.265,22850004149.4608,24436930992.5753,26155432533.9902,28047934750.5799,30264757811.3429,32792602412.0798,35341865158.7609,38600508259.5301,42575668059.918,44944844208.0969,48359581318.2814,50806274552.1078,53192048991.5072,54745193582.1317,56802067844.5745,58735138124.2957,60964078419.3943
ZWE,35895898719.568,37881581725.8584,34466341175.5794,34828740492.8571,38045243938.1751,38105365182.7538,42053346522.3663,43180626079.1074,44426478600.767,44063149521.9755,42715174163.071,43330108381.8341,39476318302.1307,32767288520.2321,30864315769.7142,29101628868.931,28094277384.7473,27067901603.2563,22285288608.4447,24963882227.619,29875606724.8073,34116124338.7667,39801722739.0058,40593575132.0783,41558455724.2623,42298143333.6543,42617861992.827995,44622621285.6755,47371013223.7205
