### META ###
ID,Emissions|CH4|IPC1B3__Historic|third_party__PRIMAP_2019
category,IPC1B3
creator,AG
entity,Emissions|CH4
modified,2020/06/21-10:25:30
original code,CH4_IPC1B3_HISTTP
pathway,Historic|third_party
scenario,Historic|third_party
source,PRIMAP_2019
source_name,PRIMAP
source_year,2019
unit,Mt CH4
unitTo,Mt CH4
variable,Emissions|CH4|IPC1B3
### DATA ###
country,1850,1851,1852,1853,1854,1855,1856,1857,1858,1859,1860,1861,1862,1863,1864,1865,1866,1867,1868,1869,1870,1871,1872,1873,1874,1875,1876,1877,1878,1879,1880,1881,1882,1883,1884,1885,1886,1887,1888,1889,1890,1891,1892,1893,1894,1895,1896,1897,1898,1899,1900,1901,1902,1903,1904,1905,1906,1907,1908,1909,1910,1911,1912,1913,1914,1915,1916,1917,1918,1919,1920,1921,1922,1923,1924,1925,1926,1927,1928,1929,1930,1931,1932,1933,1934,1935,1936,1937,1938,1939,1940,1941,1942,1943,1944,1945,1946,1947,1948,1949,1950,1951,1952,1953,1954,1955,1956,1957,1958,1959,1960,1961,1962,1963,1964,1965,1966,1967,1968,1969,1970,1971,1972,1973,1974,1975,1976,1977,1978,1979,1980,1981,1982,1983,1984,1985,1986,1987,1988,1989,1990,1991,1992,1993,1994,1995,1996,1997,1998,1999,2000,2001,2002,2003,2004,2005,2006,2007,2008,2009,2010,2011,2012,2013,2014,2015,2016,2017
AUS,1.24e-08,1.24e-08,1.2500000000000001e-08,1.26e-08,1.28e-08,1.31e-08,1.3300000000000002e-08,1.3699999999999999e-08,1.4099999999999999e-08,1.4499999999999999e-08,1.5e-08,1.55e-08,1.6100000000000002e-08,1.67e-08,1.73e-08,1.8000000000000002e-08,1.8700000000000002e-08,1.94e-08,2.02e-08,2.1e-08,2.1899999999999998e-08,2.2800000000000002e-08,2.37e-08,2.4600000000000002e-08,2.55e-08,2.6500000000000002e-08,2.75e-08,2.8499999999999997e-08,2.9600000000000004e-08,3.0599999999999996e-08,3.17e-08,3.2799999999999996e-08,3.39e-08,3.4999999999999996e-08,3.61e-08,3.7299999999999997e-08,3.84e-08,3.9600000000000004e-08,4.07e-08,4.19e-08,4.8e-08,5.15e-08,5.5100000000000004e-08,5.8800000000000004e-08,6.26e-08,6.65e-08,7.06e-08,7.47e-08,7.9e-08,8.33e-08,8.770000000000001e-08,9.25e-08,9.76e-08,1.03e-07,1.0900000000000001e-07,1.15e-07,1.2e-07,1.26e-07,1.3100000000000002e-07,1.35e-07,1.39e-07,1.4199999999999997e-07,1.46e-07,1.49e-07,1.53e-07,1.56e-07,1.59e-07,1.6100000000000003e-07,1.63e-07,1.64e-07,1.64e-07,1.63e-07,1.6100000000000003e-07,1.57e-07,1.52e-07,1.46e-07,1.4099999999999998e-07,1.36e-07,1.3200000000000002e-07,1.29e-07,1.28e-07,1.29e-07,1.3000000000000003e-07,1.3200000000000002e-07,1.35e-07,1.38e-07,1.4099999999999998e-07,1.4500000000000001e-07,1.49e-07,1.53e-07,1.57e-07,1.6200000000000002e-07,1.67e-07,1.73e-07,1.7900000000000003e-07,1.8600000000000002e-07,1.93e-07,2.0000000000000002e-07,2.07e-07,2.1400000000000004e-07,2.21e-07,2.2699999999999998e-07,2.33e-07,2.38e-07,2.4300000000000005e-07,2.49e-07,2.55e-07,2.6200000000000004e-07,2.69e-07,2.78e-07,2.8900000000000006e-07,3.03e-07,3.2400000000000004e-07,3.5099999999999995e-07,3.81e-07,4.1500000000000005e-07,4.5099999999999995e-07,4.88e-07,5.25e-07,5.62e-07,5.96e-07,6.3e-07,7.599999999999999e-07,8.2e-07,8.000000000000001e-07,7.280000000000001e-07,7.31e-07,8.150000000000001e-07,8.2e-07,8.359999999999999e-07,8.28e-07,9.25e-07,9.75e-07,1.0400000000000002e-06,1.1199999999999999e-06,1.11e-06,1.2099999999999998e-06,1.3e-06,1.23e-06,1.3e-06,1.31e-06,1.79e-06,3.4799999999999997e-06,8.62e-06,9.69e-06,1.2e-05,2.1000000000000002e-05,3.53e-05,4.65e-05,4.7600000000000005e-05,4.85e-05,4.18e-05,3.61e-05,7.82e-05,0.000248,0.00027800000000000004,0.00031,0.000313,0.000382,0.0008370000000000001,0.00113,0.0007700000000000001,0.0008690000000000001,0.00267,0.00361,0.00318,0.00332,0.0038900000000000002
BEL,0.000351,0.00035200000000000005,0.000354,0.000358,0.000364,0.000371,0.000379,0.000389,0.0004,0.00041200000000000004,0.000426,0.00044,0.000456,0.000473,0.000491,0.0005110000000000001,0.000531,0.0005520000000000001,0.000574,0.000597,0.000621,0.0006459999999999999,0.0006720000000000001,0.0006979999999999999,0.000725,0.000753,0.0007809999999999999,0.0008100000000000001,0.0008390000000000001,0.0008690000000000001,0.0009000000000000001,0.000931,0.0009620000000000001,0.000994,0.00103,0.0010600000000000002,0.00109,0.0011200000000000001,0.00116,0.0011899999999999999,0.00123,0.00127,0.0013100000000000002,0.00135,0.00139,0.00143,0.00147,0.00151,0.0015500000000000002,0.00159,0.00163,0.00167,0.00172,0.00177,0.00182,0.0018700000000000001,0.00191,0.00195,0.00198,0.002,0.0020099999999999996,0.002,0.00198,0.00195,0.00191,0.00186,0.00182,0.0017800000000000001,0.00175,0.00173,0.00172,0.00173,0.00175,0.0017800000000000001,0.0018100000000000002,0.00185,0.0019,0.00193,0.00196,0.00199,0.002,0.002,0.002,0.0020099999999999996,0.0020099999999999996,0.0020099999999999996,0.0020099999999999996,0.0020099999999999996,0.0020099999999999996,0.0020099999999999996,0.0020099999999999996,0.0020099999999999996,0.00199,0.00196,0.00192,0.00189,0.00185,0.0018100000000000002,0.0017900000000000001,0.00177,0.00176,0.00176,0.00177,0.0017800000000000001,0.0017900000000000001,0.0018000000000000002,0.00182,0.00183,0.00184,0.00185,0.00185,0.00185,0.00185,0.00185,0.00185,0.00185,0.00185,0.00185,0.00185,0.00185,0.00185,0.00184,0.00168,0.00167,0.00158,0.00164,0.00161,0.00157,0.0015400000000000001,0.0016,0.0016200000000000001,0.0016,0.0015600000000000002,0.00149,0.0012,0.0013700000000000001,0.00139,0.00133,0.00127,0.00124,0.00147,0.00127,0.00111,0.0008900000000000001,0.000833,0.000835,0.0008340000000000001,0.000747,0.000648,0.000624,0.00063,0.000639,0.000535,0.000532,0.0005710000000000001,0.000555,0.000565,0.000499,0.000297,0.000191,0.000294,0.00027699999999999996,0.00023,0.000162,5.9499999999999996e-05,8.16e-05,4.1500000000000006e-05,1.4e-06
BGR,6.72e-06,6.76e-06,6.87e-06,7.04e-06,7.28e-06,7.58e-06,7.95e-06,8.380000000000001e-06,8.88e-06,9.43e-06,1e-05,1.07e-05,1.1400000000000001e-05,1.2200000000000002e-05,1.3e-05,1.3899999999999999e-05,1.48e-05,1.58e-05,1.68e-05,1.78e-05,1.8900000000000002e-05,2e-05,2.12e-05,2.24e-05,2.37e-05,2.49e-05,2.6200000000000003e-05,2.76e-05,2.8899999999999998e-05,3.03e-05,3.18e-05,3.32e-05,3.47e-05,3.6200000000000006e-05,3.7699999999999995e-05,3.92e-05,4.07e-05,4.23e-05,4.38e-05,4.5400000000000006e-05,4.89e-05,5.05e-05,5.22e-05,5.4e-05,5.59e-05,5.79e-05,5.9900000000000006e-05,6.19e-05,6.4e-05,6.62e-05,6.840000000000001e-05,7.099999999999999e-05,7.41e-05,7.74e-05,8.1e-05,8.44e-05,8.77e-05,9.05e-05,9.279999999999999e-05,9.43e-05,9.48e-05,9.43e-05,9.279999999999999e-05,9.06e-05,8.790000000000001e-05,8.5e-05,8.21e-05,7.94e-05,7.72e-05,7.570000000000001e-05,7.52e-05,7.539999999999999e-05,7.620000000000001e-05,7.74e-05,7.910000000000001e-05,8.11e-05,8.340000000000001e-05,8.59e-05,8.87e-05,9.17e-05,9.48e-05,9.96e-05,0.000107,0.000117,0.000127,0.00013800000000000002,0.000149,0.00015900000000000002,0.000167,0.00017300000000000003,0.000175,0.00017600000000000002,0.00017600000000000002,0.00017600000000000002,0.00017600000000000002,0.00017600000000000002,0.000177,0.000177,0.000177,0.000177,0.00017800000000000002,0.00017999999999999998,0.000184,0.00019,0.00019899999999999999,0.00020800000000000001,0.000218,0.000228,0.00023899999999999998,0.000249,0.00025800000000000004,0.00026500000000000004,0.00027100000000000003,0.00027600000000000004,0.00028100000000000005,0.000286,0.00029299999999999997,0.000302,0.000314,0.000329,0.00034899999999999997,0.000475,0.0004870000000000001,0.000506,0.000522,0.0005520000000000001,0.000585,0.000605,0.000603,0.000614,0.00061,0.0005610000000000001,0.000614,0.000615,0.000614,0.000613,0.000612,0.000611,0.000548,0.0005440000000000001,0.000611,0.0005920000000000001,0.0006509999999999999,0.000652,0.00061,0.000601,0.00061,0.00063,0.00013600000000000003,0.000131,0.000273,0.000602,0.000703,0.000708,0.0006820000000000001,0.000675,0.00116,0.0006870000000000001,0.000463,0.00041600000000000003,0.000442,0.00041600000000000003,0.00010400000000000001,0.00013000000000000002,0.000156,0.000156,0.00010400000000000001,6.35e-05
BLR,2.0500000000000003e-06,2.06e-06,2.09e-06,2.15e-06,2.22e-06,2.31e-06,2.43e-06,2.56e-06,2.7100000000000003e-06,2.8699999999999996e-06,3.0600000000000003e-06,3.2600000000000006e-06,3.4799999999999997e-06,3.7200000000000004e-06,3.97e-06,4.229999999999999e-06,4.51e-06,4.8e-06,5.11e-06,5.43e-06,5.77e-06,6.11e-06,6.47e-06,6.840000000000001e-06,7.22e-06,7.6e-06,8e-06,8.409999999999999e-06,8.83e-06,9.25e-06,9.69e-06,1.01e-05,1.06e-05,1.1e-05,1.15e-05,1.2e-05,1.24e-05,1.29e-05,1.34e-05,1.3899999999999999e-05,1.58e-05,1.87e-05,2.1600000000000003e-05,2.4400000000000004e-05,2.72e-05,2.9900000000000002e-05,3.26e-05,3.51e-05,3.7699999999999995e-05,4.01e-05,4.25e-05,4.49e-05,4.7600000000000005e-05,5.04e-05,5.31e-05,5.57e-05,5.81e-05,6.02e-05,6.18e-05,6.28e-05,6.32e-05,6.19e-05,5.8500000000000006e-05,5.3400000000000004e-05,4.72e-05,4.04e-05,3.37e-05,2.75e-05,2.24e-05,1.8900000000000002e-05,1.76e-05,1.9e-05,2.31e-05,2.94e-05,3.7699999999999995e-05,4.7600000000000005e-05,5.9e-05,7.13e-05,8.44e-05,9.790000000000001e-05,0.000111,0.000128,0.000149,0.000174,0.000201,0.00023,0.000259,0.000287,0.000313,0.00033600000000000004,0.000354,0.000369,0.000381,0.000391,0.0004,0.00040899999999999997,0.00041799999999999997,0.000428,0.00044,0.000455,0.000473,0.000499,0.0005390000000000001,0.000588,0.0006459999999999999,0.0007109999999999999,0.0007790000000000001,0.0008490000000000001,0.000918,0.0009860000000000001,0.0010500000000000002,0.0011,0.00114,0.00118,0.00122,0.00125,0.0013000000000000002,0.00136,0.0014399999999999999,0.0015400000000000001,0.00166,0.00218,0.0022500000000000003,0.00235,0.00248,0.00265,0.00281,0.00294,0.0030499999999999998,0.00317,0.00326,0.00331,0.00348,0.0036000000000000003,0.00384,0.0044800000000000005,0.00474,0.004980000000000001,0.00526,0.0054,0.007,0.007030000000000001,0.00705,0.0070999999999999995,0.00619,0.00539,0.007110000000000001,0.008740000000000001,0.007019999999999999,0.00641,0.011300000000000001,0.00975,0.010400000000000001,0.011300000000000001,0.0123,0.009519999999999999,0.0126,0.011,0.0125,0.012199999999999999,0.0119,0.0106,0.0106,0.0106,0.0106,0.0106,0.0106,0.0106
CAN,1.27e-05,1.2800000000000001e-05,1.29e-05,1.3e-05,1.32e-05,1.34e-05,1.38e-05,1.41e-05,1.4500000000000002e-05,1.49e-05,1.54e-05,1.6e-05,1.66e-05,1.72e-05,1.78e-05,1.85e-05,1.93e-05,2e-05,2.08e-05,2.1700000000000002e-05,2.2499999999999998e-05,2.34e-05,2.4400000000000004e-05,2.5300000000000002e-05,2.6300000000000002e-05,2.7300000000000003e-05,2.83e-05,2.94e-05,3.05e-05,3.15e-05,3.26e-05,3.3799999999999995e-05,3.49e-05,3.61e-05,3.7199999999999996e-05,3.84e-05,3.960000000000001e-05,4.07e-05,4.19e-05,4.31e-05,6.24e-05,6.4e-05,6.68e-05,7.06e-05,7.52e-05,8.07e-05,8.690000000000001e-05,9.36e-05,0.00010099999999999999,0.00010800000000000001,0.000116,0.000125,0.000137,0.000151,0.00016600000000000002,0.000182,0.00019899999999999999,0.000215,0.00023,0.000245,0.000257,0.000268,0.00028100000000000005,0.00029299999999999997,0.000305,0.000316,0.00032700000000000003,0.00033600000000000004,0.000342,0.00034700000000000003,0.000348,0.00034700000000000003,0.000345,0.00034,0.000335,0.00033,0.00032500000000000004,0.00032,0.000316,0.000313,0.000312,0.000313,0.000316,0.000321,0.00032700000000000003,0.000334,0.000342,0.00035,0.000359,0.000366,0.000373,0.000379,0.00038500000000000003,0.000391,0.00039700000000000005,0.000403,0.00040899999999999997,0.00041600000000000003,0.000423,0.00043200000000000004,0.000441,0.000451,0.000462,0.000473,0.0004870000000000001,0.0005020000000000001,0.000518,0.000537,0.0005589999999999999,0.000583,0.00061,0.0006509999999999999,0.000715,0.0007970000000000001,0.000894,0.001,0.0011200000000000001,0.00123,0.00135,0.00147,0.00157,0.00168,0.0018700000000000001,0.0020099999999999996,0.0019399999999999999,0.00199,0.00197,0.00204,0.00207,0.00221,0.00222,0.00211,0.0022,0.00213,0.00234,0.00244,0.0023799999999999997,0.0024500000000000004,0.0027300000000000002,0.00284,0.00189,0.00158,0.00168,0.00292,0.004059999999999999,0.0037300000000000002,0.00451,0.00575,0.00383,0.0043300000000000005,0.00609,0.0023799999999999997,0.00217,0.0031000000000000003,0.00357,0.00419,0.00434,0.0029100000000000003,0.00281,0.00192,0.002,0.00235,0.00237,0.00278,0.00296,0.00231,0.00122,0.002
CZE,3.32e-07,3.3300000000000003e-07,3.38e-07,3.47e-07,3.59e-07,3.7400000000000004e-07,3.92e-07,4.13e-07,4.38e-07,4.6500000000000005e-07,4.95e-07,5.269999999999999e-07,5.63e-07,6.009999999999999e-07,6.41e-07,6.84e-07,7.29e-07,7.769999999999999e-07,8.26e-07,8.78e-07,9.32e-07,9.880000000000001e-07,1.05e-06,1.11e-06,1.17e-06,1.23e-06,1.2900000000000001e-06,1.36e-06,1.43e-06,1.5e-06,1.57e-06,1.64e-06,1.7100000000000001e-06,1.7800000000000001e-06,1.8600000000000002e-06,1.93e-06,2.0100000000000002e-06,2.0800000000000004e-06,2.16e-06,2.2399999999999997e-06,2.4100000000000002e-06,2.49e-06,2.5800000000000003e-06,2.66e-06,2.7600000000000003e-06,2.8500000000000002e-06,2.95e-06,3.0500000000000004e-06,3.1600000000000002e-06,3.2600000000000006e-06,3.3700000000000003e-06,3.5e-06,3.65e-06,3.820000000000001e-06,3.99e-06,4.160000000000001e-06,4.32e-06,4.4600000000000005e-06,4.58e-06,4.6499999999999995e-06,4.68e-06,4.6499999999999995e-06,4.57e-06,4.47e-06,4.33e-06,4.1900000000000005e-06,4.05e-06,3.92e-06,3.81e-06,3.73e-06,3.7100000000000005e-06,3.7200000000000004e-06,3.7600000000000004e-06,3.820000000000001e-06,3.9e-06,4e-06,4.11e-06,4.24e-06,4.3799999999999996e-06,4.520000000000001e-06,4.68e-06,4.9100000000000004e-06,5.28e-06,5.739999999999999e-06,6.27e-06,6.820000000000001e-06,7.36e-06,7.84e-06,8.24e-06,8.52e-06,8.64e-06,8.66e-06,8.67e-06,8.68e-06,8.69e-06,8.7e-06,8.71e-06,8.71e-06,8.720000000000001e-06,8.740000000000001e-06,8.759999999999999e-06,8.85e-06,9.07e-06,9.390000000000002e-06,9.790000000000001e-06,1.02e-05,1.07e-05,1.13e-05,1.18e-05,1.23e-05,1.27e-05,1.3100000000000002e-05,1.34e-05,1.36e-05,1.38e-05,1.41e-05,1.44e-05,1.49e-05,1.55e-05,1.62e-05,1.72e-05,2.34e-05,2.4e-05,2.49e-05,2.57e-05,2.72e-05,2.88e-05,2.98e-05,2.97e-05,3.03e-05,3.01e-05,2.76e-05,3.03e-05,3.03e-05,3.03e-05,3.0200000000000002e-05,3.0200000000000002e-05,3.01e-05,2.97e-05,2.82e-05,3e-05,3e-05,3e-05,3e-05,3e-05,3e-05,3e-05,3e-05,5.4e-05,7.8e-05,0.000102,0.000126,0.00015,0.00017999999999999998,0.00017999999999999998,0.00017999999999999998,0.00017999999999999998,0.00017999999999999998,0.00017999999999999998,0.00017999999999999998,0.00019800000000000002,0.000192,0.00017999999999999998,0.00017999999999999998,0.00017999999999999998,0.00017999999999999998,0.00017999999999999998,0.00017999999999999998
DEU,0.000652,0.0006540000000000001,0.000658,0.0006659999999999999,0.000676,0.0006879999999999999,0.0007040000000000001,0.000722,0.000742,0.0007650000000000001,0.00079,0.0008179999999999999,0.000847,0.000879,0.000913,0.000948,0.0009860000000000001,0.00103,0.00107,0.00111,0.00115,0.0012,0.00125,0.0013000000000000002,0.00135,0.0014,0.00145,0.0015,0.0015600000000000002,0.00161,0.00167,0.00173,0.0017900000000000001,0.00185,0.0019,0.00196,0.00202,0.00209,0.00215,0.00221,0.00228,0.00236,0.0024300000000000003,0.0025099999999999996,0.0025800000000000003,0.00266,0.0027300000000000002,0.00281,0.0028799999999999997,0.0029500000000000004,0.0030299999999999997,0.00311,0.00319,0.00328,0.0033799999999999998,0.0034700000000000004,0.0035499999999999998,0.0036200000000000004,0.00368,0.00371,0.0037300000000000002,0.00371,0.00367,0.00361,0.00354,0.00346,0.0033799999999999998,0.00331,0.0032500000000000003,0.00321,0.0032,0.00321,0.0032500000000000003,0.0033,0.00337,0.00344,0.00352,0.00359,0.00365,0.00369,0.00371,0.00371,0.00372,0.00372,0.0037300000000000002,0.0037300000000000002,0.0037300000000000002,0.0037400000000000003,0.0037400000000000003,0.0037400000000000003,0.0037400000000000003,0.0037300000000000002,0.00369,0.00364,0.00357,0.0035,0.0034300000000000003,0.00337,0.00332,0.00328,0.00327,0.00327,0.00329,0.0033,0.00333,0.00335,0.00337,0.0034,0.00342,0.0034300000000000003,0.0034300000000000003,0.0034300000000000003,0.0034300000000000003,0.0034300000000000003,0.0034300000000000003,0.0034300000000000003,0.0034300000000000003,0.0034300000000000003,0.0034300000000000003,0.0034300000000000003,0.0034300000000000003,0.00342,0.0031200000000000004,0.0031000000000000003,0.00294,0.0030499999999999998,0.0029900000000000005,0.0029100000000000003,0.00287,0.0029700000000000004,0.003,0.0029700000000000004,0.00289,0.00276,0.00222,0.00254,0.00259,0.00248,0.00236,0.0023,0.00236,0.00235,0.00234,0.0020499999999999997,0.00199,0.00172,0.00175,0.00214,0.00174,0.00148,0.00191,0.00143,0.0013700000000000001,0.0015300000000000001,0.0018100000000000002,0.0019,0.0014,0.0020800000000000003,0.00202,0.0023,0.00221,0.0024500000000000004,0.00202,0.00237,0.00239,0.00236,0.00221,0.0020299999999999997
DNK,0.00048,0.00048100000000000004,0.00048499999999999997,0.00049,0.000498,0.000507,0.000518,0.000532,0.0005470000000000001,0.0005629999999999999,0.000582,0.000602,0.000624,0.000647,0.0006720000000000001,0.0006979999999999999,0.000726,0.000755,0.0007859999999999999,0.0008170000000000001,0.00085,0.000884,0.0009190000000000001,0.000955,0.000992,0.00103,0.00107,0.00111,0.00115,0.0011899999999999999,0.00123,0.00127,0.00132,0.00136,0.0014,0.00145,0.00149,0.0015400000000000001,0.00158,0.00163,0.00168,0.00174,0.0017900000000000001,0.00185,0.0019,0.00196,0.0020099999999999996,0.00207,0.0021200000000000004,0.00218,0.00223,0.00229,0.00235,0.00242,0.0024900000000000005,0.0025499999999999997,0.00261,0.00267,0.00271,0.0027400000000000002,0.00275,0.0027300000000000002,0.0027,0.00266,0.00261,0.0025499999999999997,0.0024900000000000005,0.00244,0.00239,0.00236,0.00235,0.00236,0.00239,0.0024300000000000003,0.00248,0.00254,0.00259,0.00264,0.00269,0.00272,0.0027300000000000002,0.0027400000000000002,0.0027400000000000002,0.0027400000000000002,0.00275,0.00275,0.00275,0.00275,0.00275,0.00275,0.00275,0.0027400000000000002,0.00272,0.00268,0.00263,0.0025800000000000003,0.0025299999999999997,0.00248,0.00244,0.00242,0.0024100000000000002,0.0024100000000000002,0.00242,0.0024300000000000003,0.0024500000000000004,0.0024700000000000004,0.0024900000000000005,0.0025,0.00252,0.00252,0.0025299999999999997,0.0025299999999999997,0.0025299999999999997,0.0025299999999999997,0.0025299999999999997,0.0025299999999999997,0.0025299999999999997,0.0025299999999999997,0.0025299999999999997,0.0025299999999999997,0.0025299999999999997,0.00252,0.0023,0.00228,0.00216,0.0022400000000000002,0.0022,0.00214,0.00211,0.00219,0.00221,0.00219,0.00213,0.0020299999999999997,0.00164,0.0018700000000000001,0.00191,0.00183,0.00174,0.0017,0.00114,0.00235,0.0024300000000000003,0.0021000000000000003,0.00207,0.0016,0.00177,0.00257,0.0018700000000000001,0.004070000000000001,0.00264,0.00285,0.00235,0.0024700000000000004,0.00276,0.00195,0.00191,0.0019399999999999999,0.00139,0.0009009999999999999,0.00126,0.0008190000000000001,0.0007490000000000001,0.0009159999999999999,0.000891,0.0009420000000000001,0.00102,0.00096
EARTH,0.028100000000000003,0.0282,0.028399999999999998,0.0287,0.0292,0.0297,0.0303,0.031100000000000003,0.0319,0.032799999999999996,0.0338,0.0349,0.0361,0.0374,0.038700000000000005,0.040100000000000004,0.041600000000000005,0.0432,0.0448,0.0465,0.04820000000000001,0.050100000000000006,0.0519,0.053899999999999997,0.055799999999999995,0.0579,0.0599,0.062,0.06420000000000001,0.0664,0.0686,0.0709,0.0731,0.0755,0.0778,0.08009999999999999,0.0825,0.0849,0.0873,0.0897,0.0928,0.0958,0.0988,0.10200000000000001,0.105,0.108,0.111,0.114,0.117,0.12,0.123,0.126,0.13,0.134,0.137,0.14100000000000001,0.145,0.148,0.15,0.152,0.153,0.153,0.152,0.15,0.147,0.145,0.14200000000000002,0.14,0.138,0.137,0.136,0.137,0.139,0.14100000000000001,0.14400000000000002,0.147,0.15,0.152,0.155,0.157,0.158,0.158,0.159,0.16,0.161,0.162,0.164,0.165,0.166,0.166,0.167,0.166,0.165,0.163,0.161,0.159,0.156,0.154,0.152,0.151,0.151,0.152,0.154,0.156,0.158,0.16,0.162,0.165,0.167,0.169,0.17,0.17200000000000001,0.17400000000000002,0.176,0.179,0.182,0.184,0.187,0.19,0.193,0.196,0.2,0.191,0.194,0.19,0.197,0.198,0.198,0.198,0.20400000000000001,0.20600000000000002,0.20500000000000002,0.20500000000000002,0.201,0.182,0.196,0.199,0.195,0.195,0.194,0.181,0.18,0.182,0.185,0.19,0.193,0.195,0.182,0.18,0.181,0.18,0.176,0.17500000000000002,0.18,0.186,0.17300000000000001,0.17300000000000001,0.178,0.182,0.184,0.188,0.183,0.179,0.184,0.187,0.186,0.183,0.184
ESP,8.430000000000001e-08,8.45e-08,8.51e-08,8.6e-08,8.73e-08,8.9e-08,9.100000000000001e-08,9.33e-08,9.590000000000002e-08,9.89e-08,1.02e-07,1.0600000000000001e-07,1.0900000000000001e-07,1.1399999999999999e-07,1.18e-07,1.23e-07,1.27e-07,1.33e-07,1.38e-07,1.43e-07,1.49e-07,1.55e-07,1.6100000000000003e-07,1.68e-07,1.74e-07,1.8100000000000002e-07,1.8700000000000002e-07,1.94e-07,2.0099999999999999e-07,2.0899999999999998e-07,2.1600000000000003e-07,2.23e-07,2.3100000000000002e-07,2.38e-07,2.46e-07,2.54e-07,2.6200000000000004e-07,2.7e-07,2.77e-07,2.8499999999999997e-07,2.9500000000000003e-07,3.05e-07,3.15e-07,3.2400000000000004e-07,3.34e-07,3.44e-07,3.5299999999999994e-07,3.63e-07,3.7200000000000005e-07,3.8199999999999995e-07,3.9100000000000005e-07,4.01e-07,4.13e-07,4.2400000000000004e-07,4.37e-07,4.4800000000000004e-07,4.59e-07,4.68e-07,4.75e-07,4.8e-07,4.82e-07,4.8e-07,4.75e-07,4.67e-07,4.5800000000000005e-07,4.4699999999999997e-07,4.37e-07,4.280000000000001e-07,4.2e-07,4.1500000000000005e-07,4.13e-07,4.1500000000000005e-07,4.2e-07,4.27e-07,4.3600000000000004e-07,4.4500000000000003e-07,4.55e-07,4.6399999999999997e-07,4.71e-07,4.769999999999999e-07,4.79e-07,4.8e-07,4.81e-07,4.81e-07,4.82e-07,4.82e-07,4.830000000000001e-07,4.830000000000001e-07,4.830000000000001e-07,4.830000000000001e-07,4.830000000000001e-07,4.81e-07,4.769999999999999e-07,4.7000000000000005e-07,4.6200000000000003e-07,4.53e-07,4.4400000000000006e-07,4.3600000000000004e-07,4.2900000000000004e-07,4.2400000000000004e-07,4.2199999999999994e-07,4.2300000000000007e-07,4.25e-07,4.27e-07,4.3e-07,4.33e-07,4.3600000000000004e-07,4.39e-07,4.4100000000000004e-07,4.43e-07,4.4400000000000006e-07,4.4400000000000006e-07,4.4400000000000006e-07,4.4400000000000006e-07,4.4400000000000006e-07,4.4400000000000006e-07,4.4400000000000006e-07,4.4400000000000006e-07,4.4400000000000006e-07,4.4400000000000006e-07,4.4400000000000006e-07,4.4100000000000004e-07,4.04e-07,4.01e-07,3.7999999999999996e-07,3.94e-07,3.86e-07,3.76e-07,3.7100000000000003e-07,3.83e-07,3.88e-07,3.84e-07,3.7400000000000004e-07,3.5700000000000003e-07,2.8700000000000007e-07,3.28e-07,3.34e-07,3.2e-07,3.05e-07,2.98e-07,3.2100000000000003e-07,3.18e-07,2.9500000000000003e-07,3.05e-07,2.99e-07,2.44e-07,2.41e-07,2.65e-07,2.63e-07,2.33e-07,2.78e-07,2.65e-07,2.63e-07,2.71e-07,2.8399999999999995e-07,2.7400000000000004e-07,2.8399999999999995e-07,2.7400000000000004e-07,2.66e-07,1.72e-07,2.05e-07,2.1099999999999997e-07,1.8000000000000002e-07,1.64e-07,1.55e-07,1.57e-07,1.57e-07,1.59e-07
EU28,0.0234,0.0234,0.023600000000000003,0.0238,0.0242,0.0247,0.0252,0.0259,0.026600000000000002,0.0274,0.028300000000000002,0.0293,0.0304,0.0315,0.032799999999999996,0.034100000000000005,0.0354,0.0368,0.0383,0.0399,0.0415,0.0431,0.0449,0.0466,0.0484,0.0503,0.0522,0.0541,0.056100000000000004,0.058100000000000006,0.060200000000000004,0.062200000000000005,0.0643,0.0665,0.0686,0.0708,0.0729,0.0751,0.0773,0.07959999999999999,0.08220000000000001,0.085,0.0878,0.0905,0.0932,0.09590000000000001,0.0986,0.101,0.10400000000000001,0.107,0.109,0.112,0.115,0.11900000000000001,0.122,0.125,0.128,0.131,0.133,0.134,0.135,0.134,0.133,0.131,0.128,0.125,0.122,0.12,0.117,0.116,0.115,0.116,0.117,0.11900000000000001,0.122,0.124,0.127,0.13,0.132,0.133,0.134,0.134,0.135,0.135,0.135,0.136,0.136,0.136,0.137,0.137,0.137,0.136,0.135,0.133,0.131,0.129,0.126,0.124,0.122,0.121,0.12,0.12,0.121,0.122,0.123,0.124,0.125,0.126,0.127,0.127,0.128,0.128,0.128,0.128,0.128,0.128,0.129,0.129,0.129,0.129,0.13,0.132,0.122,0.121,0.116,0.121,0.11900000000000001,0.117,0.115,0.11900000000000001,0.12,0.11800000000000001,0.116,0.112,0.0925,0.10400000000000001,0.105,0.101,0.101,0.0983,0.08140000000000001,0.08090000000000001,0.0805,0.07890000000000001,0.079,0.0783,0.0717,0.049600000000000005,0.046200000000000005,0.0419,0.037899999999999996,0.0376,0.0343,0.0349,0.032299999999999995,0.0329,0.0324,0.0357,0.0358,0.027600000000000003,0.030100000000000002,0.029500000000000002,0.0274,0.0254,0.0252,0.024800000000000003,0.0237,0.0227
FIN,3.93e-06,3.94e-06,3.97e-06,4.0100000000000006e-06,4.070000000000001e-06,4.15e-06,4.24e-06,4.35e-06,4.47e-06,4.610000000000001e-06,4.76e-06,4.929999999999999e-06,5.1e-06,5.3e-06,5.5e-06,5.7099999999999995e-06,5.94e-06,6.18e-06,6.43e-06,6.6799999999999996e-06,6.9499999999999995e-06,7.229999999999999e-06,7.520000000000001e-06,7.81e-06,8.109999999999999e-06,8.42e-06,8.740000000000001e-06,9.059999999999998e-06,9.390000000000002e-06,9.73e-06,1.01e-05,1.04e-05,1.0800000000000002e-05,1.11e-05,1.15e-05,1.18e-05,1.2200000000000002e-05,1.26e-05,1.29e-05,1.33e-05,1.3700000000000001e-05,1.4200000000000001e-05,1.47e-05,1.5100000000000001e-05,1.56e-05,1.6e-05,1.65e-05,1.6899999999999997e-05,1.74e-05,1.78e-05,1.8200000000000002e-05,1.87e-05,1.92e-05,1.9800000000000004e-05,2.04e-05,2.09e-05,2.14e-05,2.18e-05,2.22e-05,2.24e-05,2.2499999999999998e-05,2.24e-05,2.2100000000000002e-05,2.18e-05,2.13e-05,2.09e-05,2.04e-05,1.9900000000000003e-05,1.96e-05,1.93e-05,1.93e-05,1.93e-05,1.96e-05,1.9900000000000003e-05,2.03e-05,2.08e-05,2.12e-05,2.1600000000000003e-05,2.2e-05,2.22e-05,2.23e-05,2.24e-05,2.24e-05,2.24e-05,2.2499999999999998e-05,2.2499999999999998e-05,2.2499999999999998e-05,2.2499999999999998e-05,2.2499999999999998e-05,2.2499999999999998e-05,2.2499999999999998e-05,2.24e-05,2.22e-05,2.19e-05,2.1499999999999997e-05,2.11e-05,2.0700000000000002e-05,2.03e-05,2e-05,1.9800000000000004e-05,1.9699999999999998e-05,1.9699999999999998e-05,1.9800000000000004e-05,1.9900000000000003e-05,2e-05,2.02e-05,2.03e-05,2.05e-05,2.06e-05,2.0700000000000002e-05,2.0700000000000002e-05,2.0700000000000002e-05,2.0700000000000002e-05,2.0700000000000002e-05,2.0700000000000002e-05,2.0700000000000002e-05,2.0700000000000002e-05,2.0700000000000002e-05,2.0700000000000002e-05,2.0700000000000002e-05,2.0700000000000002e-05,2.06e-05,1.88e-05,1.87e-05,1.77e-05,1.84e-05,1.8e-05,1.7500000000000002e-05,1.73e-05,1.7899999999999998e-05,1.8100000000000003e-05,1.7899999999999998e-05,1.74e-05,1.66e-05,1.34e-05,1.53e-05,1.56e-05,1.49e-05,1.4200000000000001e-05,1.3899999999999999e-05,1.12e-05,1.07e-05,1e-05,4.88e-06,8.22e-06,7.4799999999999995e-06,6.740000000000001e-06,6.01e-06,5.27e-06,4.529999999999999e-06,3.79e-06,3.0500000000000004e-06,2.31e-06,1.57e-06,8.310000000000001e-07,9.15e-08,0.0,0.0,0.0,0.0,0.0,0.0,0.0,0.0,0.0,0.0,0.0,0.0
FRA,0.000326,0.00032700000000000003,0.000329,0.00033299999999999996,0.000338,0.00034399999999999996,0.00035200000000000005,0.000361,0.000371,0.000383,0.000395,0.00040899999999999997,0.000424,0.000439,0.000456,0.000474,0.0004930000000000001,0.000513,0.0005329999999999999,0.000555,0.000577,0.0006,0.000624,0.000648,0.000673,0.0006990000000000001,0.000725,0.0007520000000000001,0.0007790000000000001,0.0008070000000000001,0.0008359999999999999,0.0008640000000000001,0.000893,0.000923,0.000952,0.000982,0.00101,0.0010400000000000001,0.00107,0.0011,0.00114,0.00118,0.00122,0.00125,0.0012900000000000001,0.00133,0.0013700000000000001,0.0014,0.0014399999999999999,0.00148,0.00151,0.0015500000000000002,0.0016,0.00164,0.0016899999999999999,0.00173,0.0017800000000000001,0.0018100000000000002,0.00184,0.00186,0.00186,0.00186,0.00184,0.0018100000000000002,0.00177,0.00173,0.0016899999999999999,0.00166,0.00163,0.00161,0.0016,0.0016,0.0016200000000000001,0.00165,0.0016899999999999999,0.00172,0.00176,0.0017900000000000001,0.00182,0.00184,0.00185,0.00186,0.00186,0.00186,0.00186,0.0018700000000000001,0.0018700000000000001,0.0018700000000000001,0.0018700000000000001,0.0018700000000000001,0.0018700000000000001,0.00186,0.00185,0.00182,0.0017900000000000001,0.00175,0.00172,0.0016899999999999999,0.00166,0.00164,0.00163,0.00164,0.00164,0.00165,0.00166,0.00168,0.0016899999999999999,0.0017,0.00171,0.00171,0.00172,0.00172,0.00172,0.00172,0.00172,0.00172,0.00172,0.00172,0.00172,0.00172,0.00172,0.00171,0.0015600000000000002,0.0015500000000000002,0.00147,0.00152,0.00149,0.00146,0.00143,0.00148,0.0015,0.00148,0.00145,0.00138,0.00111,0.00127,0.0012900000000000001,0.00124,0.00118,0.00115,0.0011899999999999999,0.00116,0.00113,0.00103,0.0009420000000000001,0.000972,0.0009370000000000001,0.000908,0.0009670000000000001,0.0009040000000000001,0.000872,0.000858,0.0007750000000000001,0.0007859999999999999,0.000782,0.000762,0.000746,0.000769,0.000615,0.00069,0.000691,0.000213,0.00017199999999999998,0.000252,0.00015,0.000197,0.000248,0.00026700000000000004
GBR,0.000223,0.00022399999999999997,0.00022500000000000002,0.000228,0.000231,0.00023600000000000002,0.00024100000000000003,0.000247,0.000254,0.000262,0.00027,0.00028000000000000003,0.00029,0.000301,0.000312,0.000324,0.000337,0.000351,0.000365,0.00038,0.000395,0.000411,0.0004270000000000001,0.000443,0.00046100000000000004,0.00047799999999999996,0.000496,0.000515,0.0005329999999999999,0.0005520000000000001,0.000572,0.0005909999999999999,0.000611,0.000631,0.000652,0.0006720000000000001,0.0006929999999999999,0.0007140000000000001,0.0007340000000000001,0.000755,0.0007800000000000001,0.0008070000000000001,0.000833,0.0008590000000000001,0.000884,0.00091,0.0009350000000000001,0.0009609999999999999,0.0009860000000000001,0.00101,0.0010400000000000001,0.0010600000000000002,0.00109,0.0011200000000000001,0.00116,0.0011899999999999999,0.00121,0.00124,0.00126,0.00127,0.00128,0.00127,0.00126,0.00124,0.00121,0.00118,0.00116,0.00113,0.00111,0.0011,0.00109,0.0011,0.00111,0.00113,0.00115,0.00118,0.0012,0.00123,0.00125,0.00126,0.00127,0.00127,0.00127,0.00127,0.00128,0.00128,0.00128,0.00128,0.00128,0.00128,0.00128,0.00127,0.00126,0.00124,0.00122,0.0012,0.00117,0.00115,0.00113,0.0011200000000000001,0.0011200000000000001,0.0011200000000000001,0.0011200000000000001,0.00113,0.00114,0.00115,0.00115,0.00116,0.00117,0.00117,0.00117,0.00117,0.00117,0.00117,0.00117,0.00117,0.00117,0.00117,0.00117,0.00117,0.00117,0.00117,0.00107,0.0010600000000000002,0.00101,0.0010400000000000001,0.00102,0.000996,0.000981,0.00102,0.00103,0.00102,0.00099,0.000945,0.00076,0.0008680000000000001,0.000885,0.000848,0.0008079999999999999,0.000788,0.0007170000000000001,0.000676,0.000623,0.000821,0.0010500000000000002,0.000684,0.000572,0.0007809999999999999,0.0006990000000000001,0.0006720000000000001,0.0006929999999999999,0.000633,0.0005520000000000001,0.000553,0.000527,0.000523,0.0005440000000000001,0.0005290000000000001,0.000526,0.000475,0.000501,0.000501,0.00047200000000000003,0.000483,0.00046600000000000005,0.000391,0.00027899999999999995,0.00027800000000000004
HUN,4.31e-05,4.33e-05,4.4e-05,4.5100000000000005e-05,4.66e-05,4.8599999999999995e-05,5.1e-05,5.37e-05,5.69e-05,6.0400000000000004e-05,6.429999999999999e-05,6.850000000000001e-05,7.31e-05,7.81e-05,8.33e-05,8.89e-05,9.48e-05,0.00010099999999999999,0.000107,0.000114,0.000121,0.000128,0.00013600000000000003,0.00014400000000000003,0.000152,0.00016,0.00016800000000000002,0.000177,0.000185,0.00019399999999999997,0.00020300000000000003,0.000213,0.000222,0.000232,0.00024100000000000003,0.00025100000000000003,0.000261,0.00027100000000000003,0.00028100000000000005,0.000291,0.000313,0.000324,0.000335,0.00034600000000000006,0.000358,0.000371,0.000384,0.00039700000000000005,0.00041,0.000424,0.00043799999999999997,0.000455,0.000474,0.000496,0.000519,0.000541,0.0005620000000000001,0.00058,0.0005949999999999999,0.000604,0.000608,0.000604,0.000594,0.00058,0.0005629999999999999,0.000545,0.000526,0.000509,0.000495,0.00048499999999999997,0.00048200000000000006,0.000483,0.000488,0.000496,0.000507,0.000519,0.0005340000000000001,0.0005510000000000001,0.000569,0.000588,0.000608,0.000638,0.000686,0.000746,0.000815,0.000886,0.0009559999999999999,0.00102,0.00107,0.00111,0.0011200000000000001,0.0011200000000000001,0.00113,0.00113,0.00113,0.00113,0.00113,0.00113,0.00113,0.00114,0.00114,0.00115,0.00118,0.00122,0.00127,0.00133,0.0014,0.00146,0.0015300000000000001,0.00159,0.00165,0.0017,0.00174,0.00177,0.0018000000000000002,0.00183,0.00188,0.00193,0.0020099999999999996,0.00211,0.00223,0.0030499999999999998,0.0031200000000000004,0.0032400000000000003,0.00334,0.0035299999999999997,0.00375,0.0038799999999999998,0.00386,0.00393,0.00391,0.00359,0.00394,0.00394,0.00394,0.00393,0.0038,0.0038,0.0038,0.0038,0.0038,0.0038,0.0038,0.0032500000000000003,0.00335,0.00329,0.00298,0.00289,0.0029100000000000003,0.00319,0.0025099999999999996,0.0024700000000000004,0.00248,0.0024500000000000004,0.0024,0.00237,0.00236,0.00254,0.0024700000000000004,0.00272,0.00261,0.00261,0.00261,0.0025800000000000003,0.00248,0.00256,0.00256,0.00256
ISL,2.1800000000000003e-06,2.1800000000000003e-06,2.2e-06,2.22e-06,2.25e-06,2.3e-06,2.35e-06,2.4100000000000002e-06,2.48e-06,2.55e-06,2.64e-06,2.73e-06,2.83e-06,2.93e-06,3.0399999999999997e-06,3.1600000000000002e-06,3.29e-06,3.4200000000000003e-06,3.5600000000000002e-06,3.7e-06,3.85e-06,4e-06,4.160000000000001e-06,4.32e-06,4.49e-06,4.66e-06,4.839999999999999e-06,5.02e-06,5.2e-06,5.379999999999999e-06,5.57e-06,5.760000000000001e-06,5.9600000000000005e-06,6.15e-06,6.35e-06,6.550000000000001e-06,6.75e-06,6.9599999999999994e-06,7.16e-06,7.36e-06,7.61e-06,7.86e-06,8.12e-06,8.370000000000001e-06,8.62e-06,8.870000000000001e-06,9.119999999999999e-06,9.37e-06,9.61e-06,9.849999999999999e-06,1.01e-05,1.04e-05,1.06e-05,1.1e-05,1.13e-05,1.1599999999999999e-05,1.18e-05,1.21e-05,1.23e-05,1.24e-05,1.24e-05,1.24e-05,1.2200000000000002e-05,1.2e-05,1.18e-05,1.15e-05,1.13e-05,1.1e-05,1.0800000000000002e-05,1.07e-05,1.07e-05,1.07e-05,1.0800000000000002e-05,1.1e-05,1.12e-05,1.15e-05,1.17e-05,1.2e-05,1.2200000000000002e-05,1.23e-05,1.24e-05,1.24e-05,1.24e-05,1.24e-05,1.24e-05,1.24e-05,1.25e-05,1.25e-05,1.25e-05,1.25e-05,1.25e-05,1.24e-05,1.23e-05,1.21e-05,1.1900000000000001e-05,1.17e-05,1.15e-05,1.12e-05,1.11e-05,1.09e-05,1.09e-05,1.09e-05,1.1e-05,1.1e-05,1.11e-05,1.12e-05,1.13e-05,1.13e-05,1.1400000000000001e-05,1.1400000000000001e-05,1.1400000000000001e-05,1.1400000000000001e-05,1.1400000000000001e-05,1.1400000000000001e-05,1.1400000000000001e-05,1.1400000000000001e-05,1.1400000000000001e-05,1.1400000000000001e-05,1.1400000000000001e-05,1.1400000000000001e-05,1.1400000000000001e-05,1.1400000000000001e-05,1.04e-05,1.03e-05,9.8e-06,1.02e-05,9.96e-06,9.71e-06,9.57e-06,9.900000000000002e-06,1e-05,9.900000000000002e-06,9.65e-06,9.21e-06,7.409999999999999e-06,8.47e-06,8.63e-06,8.27e-06,7.88e-06,7.68e-06,7.820000000000001e-06,7.38e-06,6.35e-06,7.03e-06,7.14e-06,7.96e-06,9.48e-06,1.03e-05,1.8e-05,3.14e-05,3.66e-05,4.01e-05,3.95e-05,3.88e-05,4.09e-05,4.57e-05,7.27e-05,9.89e-05,0.000102,9.2e-05,0.000183,0.00014000000000000001,0.000111,0.00013900000000000002,0.000161,0.000158,0.000114,0.000105
ITA,0.000977,0.000979,0.0009860000000000001,0.000997,0.00101,0.00103,0.0010500000000000002,0.00108,0.00111,0.00115,0.00118,0.00122,0.00127,0.00132,0.0013700000000000001,0.00142,0.00148,0.0015400000000000001,0.0016,0.00166,0.00173,0.0018000000000000002,0.0018700000000000001,0.0019399999999999999,0.00202,0.00209,0.00217,0.0022500000000000003,0.00233,0.00242,0.0025,0.00259,0.00268,0.00276,0.00285,0.00294,0.0030299999999999997,0.0031200000000000004,0.00321,0.00331,0.00342,0.0035299999999999997,0.00364,0.00376,0.00387,0.00398,0.00409,0.00421,0.00432,0.00442,0.00453,0.0046500000000000005,0.00478,0.00492,0.005059999999999999,0.00519,0.00532,0.00542,0.00551,0.00556,0.00558,0.00556,0.0055,0.00541,0.0053,0.00518,0.005070000000000001,0.00496,0.00487,0.00481,0.00479,0.00481,0.004860000000000001,0.00495,0.00505,0.0051600000000000005,0.0052699999999999995,0.005370000000000001,0.0054600000000000004,0.00552,0.00555,0.00556,0.00557,0.00558,0.00558,0.00559,0.00559,0.00559,0.0056,0.0056,0.0056,0.00558,0.00553,0.00545,0.00535,0.00525,0.00514,0.00505,0.00497,0.00491,0.004889999999999999,0.004900000000000001,0.00492,0.00495,0.004980000000000001,0.005019999999999999,0.00505,0.00509,0.005110000000000001,0.00513,0.00514,0.00514,0.00514,0.00514,0.00514,0.00514,0.00514,0.00514,0.00514,0.00514,0.00514,0.005110000000000001,0.00468,0.00464,0.0044,0.00456,0.00447,0.00436,0.0043,0.00444,0.00449,0.00444,0.0043300000000000005,0.00414,0.00333,0.0038,0.0038799999999999998,0.00371,0.00354,0.0034500000000000004,0.00364,0.0034900000000000005,0.00319,0.00294,0.00311,0.00304,0.0029300000000000003,0.00309,0.0031000000000000003,0.00298,0.0027400000000000002,0.0029100000000000003,0.00252,0.0024100000000000002,0.00254,0.00281,0.00286,0.0028799999999999997,0.0027300000000000002,0.00183,0.00252,0.00283,0.0025099999999999996,0.0016899999999999999,0.00143,0.00136,0.00136,0.00134
JPN,6.88e-05,6.890000000000001e-05,6.94e-05,7.02e-05,7.13e-05,7.26e-05,7.42e-05,7.61e-05,7.829999999999999e-05,8.07e-05,8.33e-05,8.62e-05,8.93e-05,9.27e-05,9.62e-05,0.0001,0.00010400000000000001,0.00010800000000000001,0.00011199999999999998,0.000117,0.000122,0.000127,0.000132,0.000137,0.00014199999999999998,0.000147,0.000153,0.00015900000000000002,0.00016399999999999997,0.00017,0.00017600000000000002,0.000182,0.00018800000000000002,0.00019500000000000002,0.000201,0.000207,0.000214,0.00022,0.00022600000000000002,0.00023300000000000003,0.000377,0.000426,0.00048100000000000004,0.0005420000000000001,0.000607,0.000678,0.0007520000000000001,0.00083,0.000912,0.000997,0.00108,0.00118,0.00127,0.00138,0.00149,0.0016,0.00173,0.00186,0.00199,0.00213,0.00227,0.0024500000000000004,0.00265,0.0028799999999999997,0.00313,0.0033799999999999998,0.0036200000000000004,0.00383,0.004019999999999999,0.0041600000000000005,0.004240000000000001,0.00429,0.00432,0.00435,0.004370000000000001,0.00439,0.00441,0.00443,0.00446,0.0045000000000000005,0.00455,0.0047,0.005,0.00541,0.005900000000000001,0.00642,0.0069299999999999995,0.0074,0.00779,0.008050000000000002,0.008150000000000001,0.00807,0.00788,0.00759,0.007240000000000001,0.006860000000000001,0.0064800000000000005,0.00613,0.00584,0.0056500000000000005,0.00558,0.00563,0.00577,0.00597,0.00622,0.00649,0.00675,0.007,0.007200000000000001,0.00734,0.00739,0.00738,0.00734,0.00726,0.0071600000000000006,0.007019999999999999,0.00685,0.00664,0.0064,0.006110000000000001,0.00579,0.00478,0.004070000000000001,0.00376,0.0033,0.00296,0.0031200000000000004,0.0032400000000000003,0.00286,0.00286,0.00304,0.00309,0.0030800000000000003,0.0030099999999999997,0.00329,0.00333,0.00331,0.00296,0.0028,0.0028,0.00271,0.00268,0.00279,0.00267,0.00282,0.00326,0.00321,0.00304,0.00279,0.00307,0.00277,0.0027300000000000002,0.00242,0.0022500000000000003,0.00206,0.0020099999999999996,0.00196,0.00183,0.00168,0.00151,0.00151,0.00143,0.00141,0.0013100000000000002,0.0013000000000000002,0.00117,0.0011200000000000001,0.0011
KAZ,1.69e-09,1.7000000000000001e-09,1.73e-09,1.77e-09,1.83e-09,1.91e-09,2e-09,2.1100000000000004e-09,2.23e-09,2.3700000000000003e-09,2.53e-09,2.69e-09,2.8700000000000002e-09,3.07e-09,3.27e-09,3.49e-09,3.72e-09,3.97e-09,4.220000000000001e-09,4.48e-09,4.76e-09,5.04e-09,5.34e-09,5.64e-09,5.96e-09,6.28e-09,6.61e-09,6.94e-09,7.2899999999999994e-09,7.64e-09,8e-09,8.36e-09,8.73e-09,9.099999999999999e-09,9.480000000000001e-09,9.86e-09,1.0300000000000001e-08,1.06e-08,1.1e-08,1.1400000000000001e-08,1.3e-08,1.54e-08,1.7800000000000004e-08,2.02e-08,2.2500000000000003e-08,2.4700000000000003e-08,2.6899999999999996e-08,2.8999999999999998e-08,3.11e-08,3.3100000000000005e-08,3.510000000000001e-08,3.71e-08,3.9299999999999995e-08,4.16e-08,4.39e-08,4.6e-08,4.8e-08,4.970000000000001e-08,5.1e-08,5.19e-08,5.2200000000000004e-08,5.11e-08,4.83e-08,4.4e-08,3.8900000000000004e-08,3.34e-08,2.78e-08,2.27e-08,1.85e-08,1.56e-08,1.46e-08,1.5699999999999998e-08,1.9e-08,2.43e-08,3.11e-08,3.9299999999999995e-08,4.8700000000000006e-08,5.89e-08,6.97e-08,8.08e-08,9.2e-08,1.0600000000000001e-07,1.23e-07,1.4400000000000002e-07,1.66e-07,1.8999999999999998e-07,2.1400000000000004e-07,2.3700000000000002e-07,2.5900000000000003e-07,2.77e-07,2.9300000000000004e-07,3.05e-07,3.14e-07,3.23e-07,3.3e-07,3.38e-07,3.4500000000000003e-07,3.5399999999999997e-07,3.6400000000000003e-07,3.76e-07,3.9e-07,4.12e-07,4.4500000000000003e-07,4.860000000000001e-07,5.34e-07,5.87e-07,6.43e-07,7.01e-07,7.58e-07,8.140000000000001e-07,8.65e-07,9.09e-07,9.44e-07,9.740000000000001e-07,1e-06,1.0400000000000002e-06,1.07e-06,1.1199999999999999e-06,1.19e-06,1.27e-06,1.37e-06,1.8e-06,1.8600000000000002e-06,1.94e-06,2.0500000000000003e-06,2.1899999999999998e-06,2.3200000000000002e-06,2.4199999999999997e-06,2.52e-06,2.62e-06,2.7000000000000004e-06,2.74e-06,2.8699999999999996e-06,2.97e-06,3.17e-06,3.7e-06,3.910000000000001e-06,4.11e-06,4.34e-06,4.4600000000000005e-06,4.34e-06,4.44e-06,4.34e-06,3.86e-06,3.4100000000000004e-06,3.4700000000000007e-06,3.86e-06,4.33e-06,4.360000000000001e-06,5.28e-06,4.6400000000000005e-06,3.3899999999999997e-06,3.4200000000000003e-06,3.09e-06,3.84e-06,3.7600000000000004e-06,4.360000000000001e-06,3.83e-06,2.55e-06,2.4199999999999997e-06,1.8899999999999997e-06,1.7800000000000001e-06,3.0500000000000004e-06,1.54e-06,1.3800000000000001e-06,1.75e-06,1.1e-06,1.25e-06
NLD,0.0202,0.0202,0.020399999999999998,0.0206,0.0209,0.0213,0.0218,0.0223,0.023,0.0237,0.0245,0.0253,0.0262,0.0272,0.0282,0.0294,0.0305,0.0317,0.033,0.0343,0.0357,0.0371,0.0386,0.040100000000000004,0.0417,0.0433,0.0449,0.0466,0.048299999999999996,0.05,0.0517,0.0535,0.055299999999999995,0.057100000000000005,0.059000000000000004,0.0608,0.0627,0.06459999999999999,0.0664,0.0683,0.0706,0.073,0.07529999999999999,0.0777,0.08,0.0823,0.0846,0.0869,0.0892,0.0915,0.0937,0.09609999999999999,0.0988,0.10200000000000001,0.105,0.107,0.11,0.112,0.114,0.115,0.115,0.115,0.114,0.112,0.11,0.107,0.105,0.10200000000000001,0.101,0.0994,0.0989,0.0993,0.101,0.10200000000000001,0.10400000000000001,0.107,0.109,0.111,0.113,0.114,0.115,0.115,0.115,0.115,0.115,0.115,0.116,0.116,0.116,0.116,0.116,0.115,0.114,0.113,0.111,0.108,0.106,0.10400000000000001,0.10300000000000001,0.10200000000000001,0.101,0.101,0.10200000000000001,0.10200000000000001,0.10300000000000001,0.10400000000000001,0.10400000000000001,0.105,0.106,0.106,0.106,0.106,0.106,0.106,0.106,0.106,0.106,0.106,0.106,0.106,0.106,0.106,0.09670000000000001,0.096,0.091,0.0943,0.0925,0.0901,0.0888,0.09190000000000001,0.0928,0.09190000000000001,0.0896,0.0855,0.0688,0.07859999999999999,0.08009999999999999,0.0767,0.0731,0.0713,0.0601,0.0601,0.0601,0.060200000000000004,0.060200000000000004,0.0603,0.054700000000000006,0.031,0.0299,0.023899999999999998,0.0214,0.0209,0.0175,0.0173,0.015,0.0165,0.0141,0.017,0.0188,0.0127,0.0157,0.0156,0.015,0.0131,0.0134,0.0126,0.0114,0.0109
NOR,0.0014,0.0014,0.00141,0.00143,0.00145,0.00148,0.00151,0.0015500000000000002,0.00159,0.00164,0.0017,0.00175,0.00182,0.00189,0.00196,0.0020299999999999997,0.0021200000000000004,0.0022,0.00229,0.0023799999999999997,0.00248,0.00257,0.00268,0.00278,0.00289,0.003,0.00311,0.0032300000000000002,0.00334,0.00346,0.00359,0.00371,0.00383,0.00396,0.00409,0.00422,0.00434,0.00447,0.00461,0.00474,0.004889999999999999,0.005059999999999999,0.00522,0.00538,0.00555,0.00571,0.00587,0.006030000000000001,0.00618,0.00634,0.00649,0.00666,0.00685,0.00705,0.00725,0.00744,0.00762,0.00777,0.00789,0.00797,0.008,0.00797,0.00788,0.00775,0.0076,0.00743,0.00726,0.0070999999999999995,0.00697,0.006889999999999999,0.006860000000000001,0.006889999999999999,0.00697,0.00709,0.00723,0.00739,0.00755,0.0077,0.00783,0.00792,0.00796,0.00797,0.007980000000000001,0.00799,0.008,0.008,0.00801,0.00802,0.00802,0.00802,0.00802,0.00799,0.00792,0.0078,0.00767,0.00752,0.007370000000000001,0.00723,0.0071200000000000005,0.00704,0.00701,0.007019999999999999,0.00705,0.00709,0.00714,0.00719,0.007240000000000001,0.0072900000000000005,0.007330000000000001,0.00736,0.007370000000000001,0.007370000000000001,0.007370000000000001,0.007370000000000001,0.007370000000000001,0.007370000000000001,0.007370000000000001,0.007370000000000001,0.007370000000000001,0.007370000000000001,0.007370000000000001,0.007330000000000001,0.0067,0.0066500000000000005,0.00631,0.00654,0.00641,0.00625,0.0061600000000000005,0.006370000000000001,0.00644,0.006370000000000001,0.00621,0.0059299999999999995,0.00477,0.00545,0.00555,0.00532,0.005070000000000001,0.004940000000000001,0.00681,0.0072699999999999996,0.00797,0.00808,0.00877,0.00858,0.00916,0.00906,0.00827,0.00757,0.010400000000000001,0.0125,0.0119,0.0162,0.0188,0.0165,0.016399999999999998,0.017,0.017,0.0162,0.0167,0.0151,0.0147,0.0159,0.021500000000000002,0.0188,0.0192,0.0192
NZL,3.44e-05,3.4500000000000005e-05,3.47e-05,3.51e-05,3.56e-05,3.63e-05,3.71e-05,3.8100000000000005e-05,3.91e-05,4.04e-05,4.1700000000000004e-05,4.31e-05,4.4699999999999996e-05,4.6399999999999996e-05,4.81e-05,5e-05,5.2e-05,5.41e-05,5.6300000000000006e-05,5.8500000000000006e-05,6.09e-05,6.33e-05,6.58e-05,6.840000000000001e-05,7.099999999999999e-05,7.37e-05,7.65e-05,7.93e-05,8.219999999999999e-05,8.52e-05,8.81e-05,9.120000000000001e-05,9.420000000000001e-05,9.73e-05,0.0001,0.00010400000000000001,0.000107,0.00011,0.00011300000000000001,0.000116,0.000134,0.000143,0.000153,0.00016399999999999997,0.000174,0.000185,0.00019600000000000002,0.00020800000000000001,0.00022,0.000232,0.000244,0.000257,0.00027200000000000005,0.000287,0.000303,0.000319,0.000334,0.00034899999999999997,0.000363,0.000375,0.000386,0.00039600000000000003,0.00040600000000000006,0.000415,0.000425,0.00043400000000000003,0.000441,0.00044799999999999994,0.00045299999999999995,0.000456,0.00045700000000000005,0.000455,0.000447,0.000436,0.00042200000000000007,0.000407,0.00039200000000000004,0.00037799999999999997,0.00036700000000000003,0.000359,0.00035600000000000003,0.000358,0.000361,0.00036700000000000003,0.000374,0.000383,0.00039299999999999996,0.00040399999999999995,0.000415,0.000426,0.00043700000000000005,0.00045000000000000004,0.000464,0.00048,0.000498,0.000517,0.000536,0.0005560000000000001,0.0005760000000000001,0.0005949999999999999,0.000614,0.000631,0.000647,0.000662,0.0006770000000000001,0.0006920000000000001,0.0007090000000000001,0.000728,0.0007490000000000001,0.0007740000000000001,0.0008020000000000001,0.000843,0.000902,0.000975,0.0010600000000000002,0.00115,0.00125,0.00136,0.00146,0.0015600000000000002,0.00166,0.00175,0.00211,0.00228,0.00222,0.00202,0.0020299999999999997,0.00227,0.00228,0.00233,0.0023,0.00257,0.00271,0.0028799999999999997,0.00311,0.00309,0.00337,0.00361,0.0034300000000000003,0.0036200000000000004,0.00483,0.0033900000000000002,0.00314,0.00311,0.00335,0.00313,0.00344,0.0039900000000000005,0.00444,0.004370000000000001,0.004240000000000001,0.0043300000000000005,0.00378,0.0033799999999999998,0.00332,0.00342,0.0035499999999999998,0.00523,0.00766,0.00889,0.00956,0.00914,0.00873,0.00836,0.0088,0.011300000000000001,0.00994,0.010400000000000001
POL,7.38e-05,7.42e-05,7.539999999999999e-05,7.73e-05,7.99e-05,8.33e-05,8.730000000000001e-05,9.21e-05,9.750000000000001e-05,0.00010400000000000001,0.00011,0.000117,0.000125,0.000134,0.000143,0.000152,0.000162,0.00017300000000000003,0.000184,0.00019600000000000002,0.00020800000000000001,0.00022,0.00023300000000000003,0.000246,0.00026000000000000003,0.000274,0.00028800000000000006,0.000303,0.00031800000000000003,0.00033299999999999996,0.00034899999999999997,0.000365,0.000381,0.00039700000000000005,0.000414,0.00043,0.000447,0.000464,0.00048100000000000004,0.000499,0.000537,0.000555,0.000574,0.000594,0.000614,0.000635,0.000657,0.00068,0.000703,0.000727,0.0007509999999999999,0.0007800000000000001,0.0008129999999999999,0.00085,0.000889,0.0009270000000000001,0.000963,0.000994,0.00102,0.0010400000000000001,0.0010400000000000001,0.0010400000000000001,0.00102,0.000995,0.000965,0.0009329999999999999,0.000902,0.000872,0.000848,0.0008320000000000001,0.000826,0.000828,0.0008370000000000001,0.00085,0.0008680000000000001,0.0008900000000000001,0.000915,0.0009440000000000001,0.000975,0.00101,0.0010400000000000001,0.00109,0.00118,0.00128,0.0014,0.00152,0.00164,0.00175,0.00184,0.0019,0.00192,0.00193,0.00193,0.00193,0.0019399999999999999,0.0019399999999999999,0.0019399999999999999,0.0019399999999999999,0.0019399999999999999,0.00195,0.00195,0.00197,0.00202,0.00209,0.00218,0.00228,0.00239,0.0025099999999999996,0.0026200000000000004,0.0027300000000000002,0.00283,0.0029100000000000003,0.00298,0.0030299999999999997,0.0030800000000000003,0.00314,0.00322,0.00331,0.00344,0.00361,0.00383,0.00522,0.00534,0.00556,0.005730000000000001,0.006059999999999999,0.00642,0.00664,0.00662,0.00674,0.006690000000000001,0.0061600000000000005,0.00675,0.00675,0.00675,0.006730000000000001,0.006730000000000001,0.00671,0.01,0.00918,0.00452,0.004019999999999999,0.00342,0.00333,0.0030299999999999997,0.00335,0.00281,0.0030600000000000002,0.00252,0.00289,0.0031200000000000004,0.00321,0.0031000000000000003,0.00383,0.00281,0.00229,0.0031200000000000004,0.00322,0.00322,0.0026000000000000003,0.0035,0.00331,0.00307,0.00335,0.0034,0.0038900000000000002,0.004240000000000001,0.00395
PRT,7.61e-06,7.63e-06,7.68e-06,7.77e-06,7.89e-06,8.040000000000001e-06,8.22e-06,8.43e-06,8.66e-06,8.930000000000001e-06,9.220000000000002e-06,9.54e-06,9.890000000000002e-06,1.03e-05,1.07e-05,1.11e-05,1.15e-05,1.2e-05,1.25e-05,1.3e-05,1.35e-05,1.4e-05,1.46e-05,1.5100000000000001e-05,1.57e-05,1.63e-05,1.6899999999999997e-05,1.76e-05,1.8200000000000002e-05,1.88e-05,1.95e-05,2.02e-05,2.09e-05,2.1499999999999997e-05,2.22e-05,2.29e-05,2.36e-05,2.4299999999999998e-05,2.51e-05,2.58e-05,2.66e-05,2.75e-05,2.8400000000000003e-05,2.93e-05,3.0200000000000002e-05,3.1e-05,3.1899999999999996e-05,3.2800000000000004e-05,3.36e-05,3.4500000000000005e-05,3.53e-05,3.6200000000000006e-05,3.73e-05,3.83e-05,3.9399999999999995e-05,4.05e-05,4.1400000000000003e-05,4.23e-05,4.29e-05,4.3400000000000005e-05,4.35e-05,4.33e-05,4.29e-05,4.22e-05,4.13e-05,4.04e-05,3.95e-05,3.86e-05,3.7900000000000006e-05,3.75e-05,3.73e-05,3.75e-05,3.7900000000000006e-05,3.86e-05,3.93e-05,4.02e-05,4.1099999999999996e-05,4.19e-05,4.26e-05,4.31e-05,4.33e-05,4.3400000000000005e-05,4.3400000000000005e-05,4.35e-05,4.35e-05,4.35e-05,4.36e-05,4.36e-05,4.36e-05,4.36e-05,4.36e-05,4.35e-05,4.31e-05,4.25e-05,4.1700000000000004e-05,4.09e-05,4.01e-05,3.93e-05,3.87e-05,3.83e-05,3.8100000000000005e-05,3.82e-05,3.83e-05,3.86e-05,3.88e-05,3.91e-05,3.9399999999999995e-05,3.97e-05,3.99e-05,4e-05,4.01e-05,4.01e-05,4.01e-05,4.01e-05,4.01e-05,4.01e-05,4.01e-05,4.01e-05,4.01e-05,4.01e-05,4.01e-05,3.99e-05,3.65e-05,3.6200000000000006e-05,3.43e-05,3.56e-05,3.49e-05,3.4000000000000007e-05,3.35e-05,3.46e-05,3.5000000000000004e-05,3.46e-05,3.3799999999999995e-05,3.2200000000000003e-05,2.59e-05,2.96e-05,3.0200000000000002e-05,2.8899999999999998e-05,2.76e-05,2.69e-05,2.3e-05,2.4e-05,2.68e-05,2.68e-05,2.9000000000000004e-05,3.31e-05,3.31e-05,3.4000000000000007e-05,3.52e-05,3.61e-05,3.71e-05,6.690000000000001e-06,2.9900000000000002e-05,3e-05,3.0200000000000002e-05,3.03e-05,3.05e-05,3.07e-05,3.08e-05,3.1e-05,3.11e-05,3.13e-05,3.15e-05,3.16e-05,3.18e-05,3.2e-05,3.2099999999999994e-05,3.2300000000000006e-05
ROU,2.22e-05,2.23e-05,2.2700000000000003e-05,2.3199999999999998e-05,2.4e-05,2.5e-05,2.6300000000000002e-05,2.77e-05,2.93e-05,3.11e-05,3.31e-05,3.53e-05,3.7699999999999995e-05,4.02e-05,4.29e-05,4.58e-05,4.880000000000001e-05,5.2e-05,5.53e-05,5.88e-05,6.24e-05,6.610000000000001e-05,7.000000000000001e-05,7.4e-05,7.81e-05,8.23e-05,8.66e-05,9.1e-05,9.55e-05,0.0001,0.000105,0.00011,0.000114,0.000119,0.000124,0.00012900000000000002,0.000134,0.00014000000000000001,0.000145,0.00015,0.000161,0.000167,0.00017199999999999998,0.00017800000000000002,0.000185,0.000191,0.00019800000000000002,0.000204,0.00021100000000000003,0.00021899999999999998,0.00022600000000000002,0.000234,0.000244,0.000256,0.00026700000000000004,0.00027899999999999995,0.000289,0.000299,0.000306,0.000311,0.000313,0.000311,0.000306,0.000299,0.00029,0.00028100000000000005,0.00027100000000000003,0.000262,0.000255,0.00025,0.000248,0.000249,0.000252,0.000256,0.000261,0.000268,0.000275,0.00028399999999999996,0.00029299999999999997,0.000303,0.000313,0.000329,0.00035299999999999996,0.00038500000000000003,0.00042,0.00045700000000000005,0.000492,0.0005250000000000001,0.0005520000000000001,0.00057,0.000578,0.00058,0.0005809999999999999,0.0005809999999999999,0.000582,0.000582,0.000583,0.000583,0.000584,0.000585,0.0005870000000000001,0.000593,0.000607,0.000629,0.0006550000000000001,0.000686,0.0007190000000000001,0.000754,0.0007890000000000001,0.000822,0.000852,0.0008759999999999999,0.0008950000000000001,0.0009109999999999999,0.0009270000000000001,0.000945,0.0009670000000000001,0.000996,0.00103,0.00109,0.00115,0.00157,0.00161,0.00167,0.00172,0.00182,0.00193,0.002,0.00199,0.0020299999999999997,0.0020099999999999996,0.00185,0.0020299999999999997,0.0020299999999999997,0.0020299999999999997,0.00202,0.00202,0.00202,0.00199,0.00268,0.00168,0.000918,0.00151,0.0015400000000000001,0.00168,0.0017900000000000001,0.0016,0.0016899999999999999,0.0016,0.0008490000000000001,0.0007859999999999999,0.000806,0.001,0.000748,0.000795,0.00085,0.00091,0.0008370000000000001,0.00058,0.000174,1.05e-06,0.000162,7.170000000000001e-05,0.0,0.0,0.0,0.0,0.0
SVK,1.19e-06,1.19e-06,1.2099999999999998e-06,1.24e-06,1.2900000000000001e-06,1.34e-06,1.4e-06,1.48e-06,1.57e-06,1.6600000000000002e-06,1.77e-06,1.8899999999999997e-06,2.02e-06,2.15e-06,2.3e-06,2.45e-06,2.6100000000000004e-06,2.78e-06,2.96e-06,3.15e-06,3.3399999999999998e-06,3.54e-06,3.75e-06,3.96e-06,4.18e-06,4.4e-06,4.6400000000000005e-06,4.87e-06,5.11e-06,5.36e-06,5.6100000000000005e-06,5.86e-06,6.120000000000001e-06,6.39e-06,6.65e-06,6.92e-06,7.190000000000001e-06,7.4700000000000005e-06,7.75e-06,8.020000000000001e-06,8.63e-06,8.920000000000001e-06,9.23e-06,9.55e-06,9.88e-06,1.02e-05,1.06e-05,1.09e-05,1.13e-05,1.17e-05,1.21e-05,1.25e-05,1.3100000000000002e-05,1.3700000000000001e-05,1.43e-05,1.49e-05,1.55e-05,1.6e-05,1.6400000000000002e-05,1.67e-05,1.68e-05,1.67e-05,1.6400000000000002e-05,1.6e-05,1.55e-05,1.5e-05,1.4500000000000002e-05,1.4e-05,1.36e-05,1.34e-05,1.33e-05,1.33e-05,1.35e-05,1.3700000000000001e-05,1.4e-05,1.43e-05,1.47e-05,1.52e-05,1.57e-05,1.62e-05,1.68e-05,1.76e-05,1.8900000000000002e-05,2.06e-05,2.2499999999999998e-05,2.4400000000000004e-05,2.64e-05,2.8100000000000002e-05,2.95e-05,3.05e-05,3.09e-05,3.1e-05,3.11e-05,3.11e-05,3.11e-05,3.12e-05,3.12e-05,3.12e-05,3.13e-05,3.13e-05,3.14e-05,3.17e-05,3.2500000000000004e-05,3.36e-05,3.51e-05,3.6700000000000004e-05,3.85e-05,4.04e-05,4.22e-05,4.4e-05,4.5600000000000004e-05,4.69e-05,4.79e-05,4.880000000000001e-05,4.96e-05,5.0600000000000003e-05,5.18e-05,5.33e-05,5.54e-05,5.81e-05,6.16e-05,8.400000000000001e-05,8.599999999999999e-05,8.939999999999999e-05,9.22e-05,9.74e-05,0.00010300000000000001,0.000107,0.000106,0.00010800000000000001,0.00010800000000000001,9.900000000000001e-05,0.000109,0.000109,0.000109,0.00010800000000000001,0.00010800000000000001,0.00010800000000000001,0.000107,0.00010099999999999999,8.76e-05,8.08e-05,7.77e-05,8.999999999999999e-05,8.999999999999999e-05,8.999999999999999e-05,8.999999999999999e-05,8.999999999999999e-05,8.999999999999999e-05,0.00012,0.00015,0.00017999999999999998,0.00123,0.00135,0.00138,0.0014399999999999999,0.0024900000000000005,0.00252,0.0025499999999999997,0.0024,9.06e-05,0.000127,0.00012900000000000002,0.00012,0.000126,0.00012,4.3400000000000005e-05,0.00012
SWE,2.98e-08,2.9899999999999996e-08,3.01e-08,3.04e-08,3.09e-08,3.1399999999999997e-08,3.21e-08,3.3000000000000004e-08,3.39e-08,3.4899999999999995e-08,3.61e-08,3.7299999999999997e-08,3.87e-08,4.01e-08,4.17e-08,4.3300000000000004e-08,4.5000000000000006e-08,4.68e-08,4.8700000000000006e-08,5.07e-08,5.27e-08,5.4799999999999994e-08,5.6999999999999994e-08,5.920000000000001e-08,6.15e-08,6.38e-08,6.620000000000001e-08,6.87e-08,7.120000000000002e-08,7.37e-08,7.63e-08,7.890000000000001e-08,8.159999999999999e-08,8.430000000000001e-08,8.7e-08,8.97e-08,9.25e-08,9.520000000000002e-08,9.8e-08,1.01e-07,1.04e-07,1.0800000000000001e-07,1.1100000000000001e-07,1.15e-07,1.18e-07,1.21e-07,1.25e-07,1.28e-07,1.3200000000000002e-07,1.35e-07,1.38e-07,1.4199999999999997e-07,1.46e-07,1.5e-07,1.54e-07,1.58e-07,1.6200000000000002e-07,1.65e-07,1.68e-07,1.7e-07,1.7e-07,1.7e-07,1.68e-07,1.65e-07,1.6200000000000002e-07,1.58e-07,1.54e-07,1.5100000000000002e-07,1.48e-07,1.47e-07,1.46e-07,1.47e-07,1.48e-07,1.5100000000000002e-07,1.54e-07,1.57e-07,1.6100000000000003e-07,1.64e-07,1.67e-07,1.68e-07,1.69e-07,1.7e-07,1.7e-07,1.7e-07,1.7e-07,1.7e-07,1.7e-07,1.71e-07,1.71e-07,1.71e-07,1.71e-07,1.7e-07,1.68e-07,1.66e-07,1.63e-07,1.6e-07,1.57e-07,1.54e-07,1.5100000000000002e-07,1.5e-07,1.49e-07,1.49e-07,1.5e-07,1.5100000000000002e-07,1.52e-07,1.53e-07,1.54e-07,1.55e-07,1.56e-07,1.57e-07,1.57e-07,1.57e-07,1.57e-07,1.57e-07,1.57e-07,1.57e-07,1.57e-07,1.57e-07,1.57e-07,1.57e-07,1.57e-07,1.56e-07,1.43e-07,1.4199999999999997e-07,1.34e-07,1.39e-07,1.36e-07,1.33e-07,1.3100000000000002e-07,1.36e-07,1.3700000000000002e-07,1.36e-07,1.3200000000000002e-07,1.26e-07,1.01e-07,1.1599999999999999e-07,1.18e-07,1.1299999999999999e-07,1.0800000000000001e-07,1.05e-07,1.15e-07,1.1299999999999999e-07,9.940000000000002e-08,1.03e-07,1.21e-07,1.3200000000000002e-07,1.28e-07,1.24e-07,1.2e-07,1.22e-07,1.2e-07,1.28e-07,1.33e-07,1.0800000000000001e-07,1.58e-07,1.15e-07,1.1299999999999999e-07,9.92e-08,9.640000000000002e-08,3.14e-07,1.0900000000000001e-07,1.28e-07,1.88e-07,7.099999999999999e-08,1.53e-07,5.1e-07,2.19e-07,1.15e-07
UKR,9.63e-08,9.679999999999999e-08,9.83e-08,1.01e-07,1.04e-07,1.0900000000000001e-07,1.1399999999999999e-07,1.2e-07,1.27e-07,1.35e-07,1.4400000000000002e-07,1.53e-07,1.63e-07,1.74e-07,1.8600000000000002e-07,1.9900000000000002e-07,2.1200000000000002e-07,2.2599999999999999e-07,2.4e-07,2.55e-07,2.71e-07,2.8700000000000007e-07,3.04e-07,3.2100000000000003e-07,3.39e-07,3.5700000000000003e-07,3.76e-07,3.9500000000000003e-07,4.1500000000000005e-07,4.3499999999999996e-07,4.55e-07,4.76e-07,4.97e-07,5.180000000000001e-07,5.389999999999999e-07,5.610000000000001e-07,5.83e-07,6.06e-07,6.28e-07,6.51e-07,7.4e-07,8.78e-07,1.01e-06,1.15e-06,1.28e-06,1.4e-06,1.5300000000000002e-06,1.65e-06,1.77e-06,1.8800000000000002e-06,1.99e-06,2.1100000000000006e-06,2.2399999999999997e-06,2.37e-06,2.5e-06,2.62e-06,2.73e-06,2.83e-06,2.8999999999999998e-06,2.95e-06,2.97e-06,2.9100000000000005e-06,2.75e-06,2.51e-06,2.21e-06,1.9e-06,1.5800000000000001e-06,1.2900000000000001e-06,1.05e-06,8.880000000000001e-07,8.28e-07,8.95e-07,1.08e-06,1.3800000000000001e-06,1.77e-06,2.2399999999999997e-06,2.77e-06,3.35e-06,3.96e-06,4.6e-06,5.24e-06,6e-06,7e-06,8.17e-06,9.450000000000001e-06,1.0800000000000002e-05,1.2200000000000002e-05,1.35e-05,1.47e-05,1.58e-05,1.66e-05,1.73e-05,1.7899999999999998e-05,1.84e-05,1.88e-05,1.92e-05,1.96e-05,2.01e-05,2.0700000000000002e-05,2.14e-05,2.22e-05,2.34e-05,2.5300000000000002e-05,2.76e-05,3.04e-05,3.34e-05,3.66e-05,3.99e-05,4.31e-05,4.63e-05,4.92e-05,5.17e-05,5.37e-05,5.54e-05,5.71e-05,5.89e-05,6.12e-05,6.4e-05,6.759999999999999e-05,7.22e-05,7.81e-05,0.000102,0.000106,0.00011,0.000117,0.000125,0.000132,0.00013800000000000002,0.000143,0.000149,0.000153,0.000156,0.000163,0.000169,0.00017999999999999998,0.00021,0.000223,0.000234,0.000247,0.000254,0.00032500000000000004,0.00028000000000000003,0.00028100000000000005,0.000248,0.00016399999999999997,0.00016600000000000002,0.00016600000000000002,0.000157,0.000169,0.000205,0.000213,0.000232,0.000243,0.000246,0.00025,0.000249,0.00025100000000000003,0.00021100000000000003,0.00023600000000000002,0.00037200000000000004,0.000462,0.000637,0.0005440000000000001,0.0005329999999999999,0.000423,0.00032500000000000004,0.00037600000000000003,0.00029299999999999997
ZAF,0.0032400000000000003,0.00327,0.00331,0.00335,0.0033900000000000002,0.0034300000000000003,0.0034700000000000004,0.0035099999999999997,0.0035600000000000002,0.0036000000000000003,0.00364,0.00368,0.0037300000000000002,0.00377,0.00381,0.00386,0.0039,0.00394,0.0039900000000000005,0.004030000000000001,0.00408,0.00412,0.00417,0.00422,0.00426,0.00431,0.00436,0.0044,0.00445,0.0045000000000000005,0.00455,0.0046,0.00464,0.004690000000000001,0.00474,0.00479,0.00484,0.004889999999999999,0.004940000000000001,0.0049900000000000005,0.00504,0.00509,0.00514,0.005200000000000001,0.00525,0.00531,0.00538,0.00544,0.00552,0.00559,0.00567,0.00577,0.005900000000000001,0.00605,0.00622,0.0064,0.00659,0.0067800000000000004,0.00696,0.00714,0.00731,0.00747,0.00763,0.00779,0.00795,0.00811,0.00827,0.00843,0.00859,0.008740000000000001,0.00889,0.00903,0.00917,0.00931,0.00945,0.00958,0.009720000000000001,0.009859999999999999,0.01,0.010199999999999999,0.0103,0.0105,0.0107,0.0109,0.0111,0.011300000000000001,0.0115,0.0117,0.0119,0.012199999999999999,0.0125,0.0128,0.0131,0.0135,0.013900000000000001,0.014400000000000001,0.0149,0.0154,0.016,0.0165,0.0171,0.0177,0.0184,0.019,0.0197,0.0205,0.0213,0.0222,0.023100000000000002,0.0242,0.0253,0.0267,0.028399999999999998,0.0305,0.032799999999999996,0.0353,0.037899999999999996,0.0405,0.0431,0.0455,0.047799999999999995,0.050100000000000006,0.0525,0.055,0.0575,0.06,0.0623,0.06440000000000001,0.0663,0.0678,0.0688,0.0696,0.07050000000000001,0.0713,0.0721,0.0729,0.0736,0.0743,0.075,0.0755,0.076,0.077,0.079,0.082,0.0858,0.0903,0.0955,0.101,0.107,0.113,0.107,0.107,0.109,0.109,0.113,0.10400000000000001,0.101,0.10400000000000001,0.10400000000000001,0.115,0.114,0.113,0.113,0.117,0.113,0.113,0.113,0.114
