### META ###
ID,Emissions|CH4|IPC2D__Historic|third_party__PRIMAP_2019
category,IPC2D
creator,AG
entity,Emissions|CH4
modified,2020/06/21-10:25:31
original code,CH4_IPC2D_HISTTP
pathway,Historic|third_party
scenario,Historic|third_party
source,PRIMAP_2019
source_name,PRIMAP
source_year,2019
unit,Mt CH4
unitTo,Mt CH4
variable,Emissions|CH4|IPC2D
### DATA ###
country,1850,1851,1852,1853,1854,1855,1856,1857,1858,1859,1860,1861,1862,1863,1864,1865,1866,1867,1868,1869,1870,1871,1872,1873,1874,1875,1876,1877,1878,1879,1880,1881,1882,1883,1884,1885,1886,1887,1888,1889,1890,1891,1892,1893,1894,1895,1896,1897,1898,1899,1900,1901,1902,1903,1904,1905,1906,1907,1908,1909,1910,1911,1912,1913,1914,1915,1916,1917,1918,1919,1920,1921,1922,1923,1924,1925,1926,1927,1928,1929,1930,1931,1932,1933,1934,1935,1936,1937,1938,1939,1940,1941,1942,1943,1944,1945,1946,1947,1948,1949,1950,1951,1952,1953,1954,1955,1956,1957,1958,1959,1960,1961,1962,1963,1964,1965,1966,1967,1968,1969,1970,1971,1972,1973,1974,1975,1976,1977,1978,1979,1980,1981,1982,1983,1984,1985,1986,1987,1988,1989,1990,1991,1992,1993,1994,1995,1996,1997,1998,1999,2000,2001,2002,2003,2004,2005,2006,2007,2008,2009,2010,2011,2012,2013,2014,2015,2016,2017
CHE,2.35e-10,2.69e-10,3.03e-10,3.3799999999999997e-10,3.7299999999999995e-10,4.0799999999999994e-10,4.44e-10,4.8e-10,5.17e-10,5.54e-10,5.91e-10,6.29e-10,6.670000000000001e-10,7.05e-10,7.440000000000001e-10,7.83e-10,8.220000000000001e-10,8.620000000000001e-10,9.02e-10,9.42e-10,9.83e-10,1.02e-09,1.06e-09,1.1099999999999999e-09,1.15e-09,1.19e-09,1.23e-09,1.27e-09,1.3200000000000002e-09,1.3599999999999999e-09,1.4e-09,1.4500000000000002e-09,1.49e-09,1.53e-09,1.58e-09,1.62e-09,1.6700000000000002e-09,1.7099999999999999e-09,1.75e-09,1.8e-09,2.8100000000000004e-09,3.01e-09,3.2499999999999997e-09,3.54e-09,3.86e-09,4.220000000000001e-09,4.6100000000000004e-09,5.0200000000000004e-09,5.4600000000000006e-09,5.9100000000000005e-09,6.39e-09,6.94e-09,7.61e-09,8.38e-09,9.21e-09,1.01e-08,1.0900000000000002e-08,1.17e-08,1.2500000000000001e-08,1.31e-08,1.3600000000000001e-08,1.4000000000000001e-08,1.4300000000000002e-08,1.46e-08,1.49e-08,1.51e-08,1.54e-08,1.56e-08,1.59e-08,1.62e-08,1.6500000000000002e-08,1.69e-08,1.72e-08,1.7600000000000002e-08,1.8100000000000003e-08,1.85e-08,1.9e-08,1.95e-08,2e-08,2.0600000000000002e-08,2.13e-08,2.2100000000000003e-08,2.3e-08,2.4100000000000004e-08,2.53e-08,2.6500000000000002e-08,2.78e-08,2.9100000000000002e-08,3.04e-08,3.1600000000000005e-08,3.27e-08,3.37e-08,3.46e-08,3.54e-08,3.6200000000000007e-08,3.7e-08,3.78e-08,3.87e-08,3.98e-08,4.1e-08,4.24e-08,4.47e-08,4.810000000000001e-08,5.24e-08,5.720000000000001e-08,6.22e-08,6.71e-08,7.140000000000002e-08,7.5e-08,7.730000000000001e-08,7.82e-08,7.82e-08,7.82e-08,7.82e-08,7.82e-08,7.82e-08,7.82e-08,7.82e-08,7.82e-08,7.82e-08,7.82e-08,7.44e-08,7.67e-08,8.41e-08,8.890000000000001e-08,7.3e-08,7.71e-08,7.200000000000001e-08,7.380000000000001e-08,8.04e-08,7.36e-08,7.209999999999999e-08,6.320000000000001e-08,6.210000000000001e-08,6.83e-08,7.020000000000002e-08,6.600000000000001e-08,6.600000000000001e-08,7.03e-08,7.159999999999999e-08,7.52e-08,7.03e-08,6.26e-08,5.829999999999999e-08,5.2e-08,5.06e-08,5.24e-08,5.400000000000001e-08,5.6899999999999993e-08,6.01e-08,6.04e-08,5.89e-08,5.770000000000001e-08,4.8e-08,4.5500000000000004e-08,4.46e-08,4.19e-08,4.03e-08,3.87e-08,3.53e-08,3.510000000000001e-08,3.37e-08,3.29e-08,3.12e-08,2.78e-08,2.6e-08,2.62e-08,2.23e-08
DNK,3.85e-08,4.4e-08,4.96e-08,5.53e-08,6.1e-08,6.68e-08,7.27e-08,7.859999999999999e-08,8.46e-08,9.059999999999999e-08,9.670000000000001e-08,1.03e-07,1.0900000000000001e-07,1.15e-07,1.22e-07,1.28e-07,1.35e-07,1.4099999999999998e-07,1.48e-07,1.54e-07,1.6100000000000003e-07,1.68e-07,1.74e-07,1.8100000000000002e-07,1.88e-07,1.95e-07,2.02e-07,2.0899999999999998e-07,2.1600000000000003e-07,2.23e-07,2.3e-07,2.3700000000000002e-07,2.44e-07,2.5099999999999996e-07,2.58e-07,2.66e-07,2.73e-07,2.7999999999999997e-07,2.8700000000000007e-07,2.9500000000000003e-07,4.6e-07,4.92e-07,5.33e-07,5.79e-07,6.32e-07,6.91e-07,7.54e-07,8.22e-07,8.939999999999999e-07,9.68e-07,1.05e-06,1.1399999999999999e-06,1.25e-06,1.37e-06,1.5100000000000002e-06,1.65e-06,1.79e-06,1.92e-06,2.04e-06,2.14e-06,2.22e-06,2.29e-06,2.34e-06,2.39e-06,2.43e-06,2.47e-06,2.51e-06,2.55e-06,2.6e-06,2.65e-06,2.7000000000000004e-06,2.7600000000000003e-06,2.82e-06,2.89e-06,2.96e-06,3.0300000000000002e-06,3.1100000000000003e-06,3.19e-06,3.28e-06,3.38e-06,3.49e-06,3.61e-06,3.7700000000000003e-06,3.94e-06,4.139999999999999e-06,4.34e-06,4.5500000000000005e-06,4.77e-06,4.970000000000001e-06,5.1700000000000005e-06,5.35e-06,5.5200000000000005e-06,5.66e-06,5.7900000000000005e-06,5.92e-06,6.05e-06,6.19e-06,6.34e-06,6.5099999999999995e-06,6.71e-06,6.940000000000001e-06,7.3099999999999995e-06,7.870000000000001e-06,8.58e-06,9.37e-06,1.02e-05,1.1e-05,1.17e-05,1.23e-05,1.27e-05,1.2800000000000001e-05,1.2800000000000001e-05,1.2800000000000001e-05,1.2800000000000001e-05,1.2800000000000001e-05,1.2800000000000001e-05,1.2800000000000001e-05,1.2800000000000001e-05,1.2800000000000001e-05,1.2800000000000001e-05,1.2800000000000001e-05,1.2200000000000002e-05,1.25e-05,1.38e-05,1.4500000000000002e-05,1.2e-05,1.26e-05,1.18e-05,1.21e-05,1.32e-05,1.21e-05,1.18e-05,1.03e-05,1.02e-05,1.12e-05,1.15e-05,1.0800000000000002e-05,1.0800000000000002e-05,1.15e-05,1.17e-05,1.21e-05,1.25e-05,1.09e-05,1.2e-05,1.1e-05,1.49e-05,1.66e-05,1.68e-05,1.5e-05,1.4200000000000001e-05,1.5e-05,1.93e-05,1.78e-05,1.47e-05,1.94e-05,2.12e-05,1.9699999999999998e-05,2.4299999999999998e-05,2.14e-05,1.41e-05,1.7500000000000002e-05,2.09e-05,1.76e-05,1.83e-05,1.85e-05,1.8e-05,1.8599999999999998e-05,1.93e-05
EARTH,7.440000000000001e-07,8.51e-07,9.59e-07,1.07e-06,1.1800000000000001e-06,1.2900000000000001e-06,1.41e-06,1.5199999999999998e-06,1.64e-06,1.75e-06,1.8699999999999999e-06,1.99e-06,2.1100000000000006e-06,2.2300000000000002e-06,2.3600000000000003e-06,2.48e-06,2.6e-06,2.73e-06,2.86e-06,2.9800000000000003e-06,3.1100000000000003e-06,3.24e-06,3.3700000000000003e-06,3.5e-06,3.64e-06,3.7700000000000003e-06,3.9e-06,4.04e-06,4.17e-06,4.31e-06,4.44e-06,4.58e-06,4.7200000000000005e-06,4.86e-06,5e-06,5.14e-06,5.28e-06,5.420000000000001e-06,5.56e-06,5.7000000000000005e-06,8.890000000000001e-06,9.52e-06,1.03e-05,1.12e-05,1.2200000000000002e-05,1.34e-05,1.46e-05,1.59e-05,1.73e-05,1.87e-05,2.02e-05,2.2e-05,2.41e-05,2.65e-05,2.92e-05,3.1899999999999996e-05,3.46e-05,3.71e-05,3.95e-05,4.1500000000000006e-05,4.2999999999999995e-05,4.43e-05,4.53e-05,4.62e-05,4.7100000000000006e-05,4.79e-05,4.8599999999999995e-05,4.94e-05,5.0299999999999996e-05,5.1200000000000004e-05,5.23e-05,5.3400000000000004e-05,5.4600000000000006e-05,5.59e-05,5.72e-05,5.86e-05,6.0100000000000004e-05,6.17e-05,6.35e-05,6.54e-05,6.74e-05,6.99e-05,7.280000000000001e-05,7.630000000000001e-05,8e-05,8.400000000000001e-05,8.81e-05,9.22e-05,9.62e-05,0.0001,0.00010400000000000001,0.000107,0.000109,0.00011199999999999998,0.000115,0.000117,0.00012,0.000123,0.000126,0.00013000000000000002,0.000134,0.00014099999999999998,0.000152,0.00016600000000000002,0.00018100000000000004,0.000197,0.000212,0.00022600000000000002,0.000237,0.000245,0.000248,0.000248,0.000248,0.000248,0.000248,0.000248,0.000248,0.000248,0.000248,0.000248,0.000248,0.000235,0.000243,0.000266,0.00028100000000000005,0.000231,0.000244,0.000228,0.000234,0.000255,0.00023300000000000003,0.000228,0.0002,0.000197,0.00021600000000000002,0.000222,0.00020899999999999998,0.00020899999999999998,0.000223,0.000227,0.000193,0.000204,0.00021700000000000002,0.00020300000000000003,0.000197,0.00019899999999999999,0.000182,0.00019500000000000002,0.0002,0.00017600000000000002,0.00017600000000000002,0.00020800000000000001,0.000183,0.000153,0.00016800000000000002,0.00017800000000000002,0.000151,0.000143,0.000137,0.000131,0.00011199999999999998,0.000109,9.61e-05,8.53e-05,7.14e-05,7.99e-05,8.44e-05,9.080000000000001e-05
EU28,7.440000000000001e-07,8.51e-07,9.59e-07,1.07e-06,1.1800000000000001e-06,1.2900000000000001e-06,1.4e-06,1.5199999999999998e-06,1.64e-06,1.75e-06,1.8699999999999999e-06,1.99e-06,2.1100000000000006e-06,2.2300000000000002e-06,2.35e-06,2.48e-06,2.6e-06,2.73e-06,2.86e-06,2.9800000000000003e-06,3.1100000000000003e-06,3.24e-06,3.3700000000000003e-06,3.5e-06,3.6299999999999995e-06,3.7700000000000003e-06,3.9e-06,4.04e-06,4.17e-06,4.31e-06,4.44e-06,4.58e-06,4.7200000000000005e-06,4.86e-06,4.99e-06,5.13e-06,5.27e-06,5.41e-06,5.56e-06,5.7000000000000005e-06,8.890000000000001e-06,9.52e-06,1.03e-05,1.12e-05,1.2200000000000002e-05,1.34e-05,1.46e-05,1.59e-05,1.73e-05,1.87e-05,2.02e-05,2.2e-05,2.41e-05,2.65e-05,2.92e-05,3.1899999999999996e-05,3.46e-05,3.71e-05,3.95e-05,4.1500000000000006e-05,4.2999999999999995e-05,4.4200000000000004e-05,4.53e-05,4.62e-05,4.7100000000000006e-05,4.78e-05,4.8599999999999995e-05,4.94e-05,5.02e-05,5.1200000000000004e-05,5.22e-05,5.3400000000000004e-05,5.4600000000000006e-05,5.59e-05,5.72e-05,5.86e-05,6.0100000000000004e-05,6.17e-05,6.34e-05,6.53e-05,6.74e-05,6.98e-05,7.280000000000001e-05,7.620000000000001e-05,8e-05,8.400000000000001e-05,8.81e-05,9.22e-05,9.62e-05,0.0001,0.00010400000000000001,0.000107,0.000109,0.00011199999999999998,0.000114,0.000117,0.00012,0.000123,0.000126,0.00013000000000000002,0.000134,0.00014099999999999998,0.000152,0.00016600000000000002,0.00018100000000000004,0.000197,0.000212,0.00022600000000000002,0.000237,0.000245,0.000248,0.000248,0.000248,0.000248,0.000248,0.000248,0.000248,0.000248,0.000248,0.000248,0.000248,0.000235,0.000243,0.000266,0.00028100000000000005,0.000231,0.000244,0.000228,0.000234,0.000255,0.00023300000000000003,0.000228,0.0002,0.00019600000000000002,0.00021600000000000002,0.000222,0.00020899999999999998,0.00020899999999999998,0.000223,0.000227,0.000193,0.000204,0.00021700000000000002,0.00020300000000000003,0.000197,0.00019899999999999999,0.000182,0.00019500000000000002,0.0002,0.00017600000000000002,0.00017600000000000002,0.00020800000000000001,0.000183,0.000153,0.00016800000000000002,0.00017800000000000002,0.000151,0.000143,0.00013600000000000003,0.000131,0.00011199999999999998,0.000109,9.61e-05,8.53e-05,7.14e-05,7.98e-05,8.43e-05,9.080000000000001e-05
FIN,3.85e-08,4.4e-08,4.96e-08,5.520000000000001e-08,6.1e-08,6.68e-08,7.26e-08,7.85e-08,8.45e-08,9.059999999999999e-08,9.670000000000001e-08,1.03e-07,1.0900000000000001e-07,1.15e-07,1.22e-07,1.28e-07,1.35e-07,1.4099999999999998e-07,1.48e-07,1.54e-07,1.6100000000000003e-07,1.68e-07,1.74e-07,1.8100000000000002e-07,1.88e-07,1.95e-07,2.02e-07,2.0899999999999998e-07,2.1600000000000003e-07,2.23e-07,2.3e-07,2.3700000000000002e-07,2.44e-07,2.5099999999999996e-07,2.58e-07,2.65e-07,2.73e-07,2.7999999999999997e-07,2.8700000000000007e-07,2.94e-07,4.59e-07,4.92e-07,5.32e-07,5.79e-07,6.32e-07,6.900000000000001e-07,7.54e-07,8.22e-07,8.930000000000001e-07,9.68e-07,1.0400000000000002e-06,1.1399999999999999e-06,1.25e-06,1.37e-06,1.5100000000000002e-06,1.65e-06,1.79e-06,1.92e-06,2.04e-06,2.14e-06,2.22e-06,2.29e-06,2.34e-06,2.39e-06,2.43e-06,2.47e-06,2.51e-06,2.55e-06,2.6e-06,2.65e-06,2.7000000000000004e-06,2.7600000000000003e-06,2.82e-06,2.89e-06,2.96e-06,3.0300000000000002e-06,3.1100000000000003e-06,3.19e-06,3.28e-06,3.38e-06,3.4799999999999997e-06,3.61e-06,3.7600000000000004e-06,3.94e-06,4.13e-06,4.34e-06,4.5500000000000005e-06,4.76e-06,4.970000000000001e-06,5.1700000000000005e-06,5.35e-06,5.510000000000001e-06,5.66e-06,5.7900000000000005e-06,5.92e-06,6.05e-06,6.19e-06,6.34e-06,6.5099999999999995e-06,6.71e-06,6.940000000000001e-06,7.3099999999999995e-06,7.870000000000001e-06,8.57e-06,9.36e-06,1.02e-05,1.1e-05,1.17e-05,1.23e-05,1.27e-05,1.2800000000000001e-05,1.2800000000000001e-05,1.2800000000000001e-05,1.2800000000000001e-05,1.2800000000000001e-05,1.2800000000000001e-05,1.2800000000000001e-05,1.2800000000000001e-05,1.2800000000000001e-05,1.2800000000000001e-05,1.2800000000000001e-05,1.2200000000000002e-05,1.25e-05,1.38e-05,1.4500000000000002e-05,1.2e-05,1.26e-05,1.18e-05,1.21e-05,1.32e-05,1.2e-05,1.18e-05,1.03e-05,1.02e-05,1.12e-05,1.15e-05,1.0800000000000002e-05,1.0800000000000002e-05,1.15e-05,1.17e-05,1.13e-05,9.07e-06,9.21e-06,9.110000000000001e-06,1e-05,9.72e-06,8.63e-06,7.77e-06,7.5500000000000006e-06,7.270000000000001e-06,7.03e-06,7.3e-06,7.090000000000001e-06,5.62e-06,5.13e-06,4.68e-06,5.14e-06,5.9e-06,5.47e-06,5.7900000000000005e-06,4.76e-06,4.75e-06,5.01e-06,5.55e-06,4.71e-06,5.950000000000001e-06,6.0600000000000004e-06,5.84e-06
FRA,4.96e-07,5.67e-07,6.389999999999999e-07,7.12e-07,7.860000000000001e-07,8.609999999999999e-07,9.369999999999999e-07,1.01e-06,1.0900000000000002e-06,1.17e-06,1.25e-06,1.33e-06,1.41e-06,1.4900000000000001e-06,1.57e-06,1.65e-06,1.7399999999999999e-06,1.82e-06,1.9e-06,1.99e-06,2.0699999999999997e-06,2.16e-06,2.25e-06,2.34e-06,2.4199999999999997e-06,2.51e-06,2.6e-06,2.6899999999999997e-06,2.78e-06,2.8699999999999996e-06,2.96e-06,3.0500000000000004e-06,3.15e-06,3.24e-06,3.33e-06,3.4200000000000003e-06,3.52e-06,3.61e-06,3.7e-06,3.8e-06,5.93e-06,6.35e-06,6.87e-06,7.4700000000000005e-06,8.15e-06,8.91e-06,9.72e-06,1.06e-05,1.15e-05,1.25e-05,1.35e-05,1.46e-05,1.6100000000000002e-05,1.77e-05,1.94e-05,2.12e-05,2.3e-05,2.47e-05,2.6300000000000002e-05,2.76e-05,2.87e-05,2.95e-05,3.0200000000000002e-05,3.08e-05,3.14e-05,3.1899999999999996e-05,3.24e-05,3.29e-05,3.35e-05,3.41e-05,3.48e-05,3.56e-05,3.6400000000000004e-05,3.7199999999999996e-05,3.8100000000000005e-05,3.91e-05,4.01e-05,4.1099999999999996e-05,4.23e-05,4.36e-05,4.49e-05,4.66e-05,4.85e-05,5.08e-05,5.33e-05,5.6e-05,5.8700000000000004e-05,6.15e-05,6.41e-05,6.67e-05,6.900000000000001e-05,7.11e-05,7.3e-05,7.47e-05,7.630000000000001e-05,7.8e-05,7.98e-05,8.18e-05,8.400000000000001e-05,8.65e-05,8.95e-05,9.43e-05,0.000102,0.000111,0.000121,0.000131,0.00014199999999999998,0.000151,0.000158,0.000163,0.000165,0.000165,0.000165,0.000165,0.000165,0.000165,0.000165,0.000165,0.000165,0.000165,0.000165,0.000157,0.000162,0.00017800000000000002,0.00018800000000000002,0.000154,0.000163,0.000152,0.000156,0.00017,0.000155,0.000152,0.000133,0.000131,0.00014400000000000003,0.00014800000000000002,0.00013900000000000002,0.00013900000000000002,0.00014800000000000002,0.000151,0.000127,0.000126,0.000126,0.000119,0.00011199999999999998,0.000102,9.410000000000001e-05,8.690000000000001e-05,8.02e-05,7.5e-05,6.850000000000001e-05,6.24e-05,5.54e-05,4.9000000000000005e-05,4.33e-05,3.68e-05,3.12e-05,2.6300000000000002e-05,2.12e-05,1.76e-05,1.5e-05,1.3100000000000002e-05,1.13e-05,1.0500000000000001e-05,9.6e-06,8.779999999999999e-06,8.43e-06,7.66e-06
MCO,6.1e-11,6.97e-11,7.86e-11,8.76e-11,9.67e-11,1.06e-10,1.15e-10,1.25e-10,1.34e-10,1.44e-10,1.5300000000000001e-10,1.6300000000000003e-10,1.73e-10,1.8300000000000001e-10,1.93e-10,2.03e-10,2.1300000000000001e-10,2.24e-10,2.3399999999999997e-10,2.45e-10,2.55e-10,2.66e-10,2.7600000000000003e-10,2.8700000000000004e-10,2.98e-10,3.0899999999999997e-10,3.2000000000000003e-10,3.3100000000000005e-10,3.42e-10,3.53e-10,3.64e-10,3.75e-10,3.87e-10,3.98e-10,4.09e-10,4.2100000000000005e-10,4.32e-10,4.44e-10,4.55e-10,4.67e-10,7.290000000000001e-10,7.809999999999999e-10,8.440000000000001e-10,9.179999999999999e-10,1e-09,1.1000000000000001e-09,1.2e-09,1.3e-09,1.42e-09,1.53e-09,1.66e-09,1.8e-09,1.98e-09,2.18e-09,2.3900000000000002e-09,2.61e-09,2.83e-09,3.0400000000000003e-09,3.2300000000000002e-09,3.4000000000000003e-09,3.53e-09,3.63e-09,3.7100000000000002e-09,3.79e-09,3.86e-09,3.92e-09,3.98e-09,4.05e-09,4.120000000000001e-09,4.1999999999999996e-09,4.28e-09,4.38e-09,4.48e-09,4.58e-09,4.69e-09,4.8e-09,4.93e-09,5.06e-09,5.2e-09,5.3600000000000005e-09,5.52e-09,5.72e-09,5.97e-09,6.2500000000000005e-09,6.56e-09,6.88e-09,7.22e-09,7.56e-09,7.890000000000001e-09,8.199999999999999e-09,8.49e-09,8.74e-09,8.97e-09,9.18e-09,9.39e-09,9.59e-09,9.81e-09,1.01e-08,1.0300000000000001e-08,1.06e-08,1.1e-08,1.16e-08,1.2500000000000001e-08,1.3600000000000001e-08,1.4800000000000002e-08,1.6100000000000002e-08,1.74e-08,1.85e-08,1.95e-08,2.01e-08,2.0300000000000003e-08,2.0300000000000003e-08,2.0300000000000003e-08,2.0300000000000003e-08,2.0300000000000003e-08,2.0300000000000003e-08,2.0300000000000003e-08,2.0300000000000003e-08,2.0300000000000003e-08,2.0300000000000003e-08,2.0300000000000003e-08,1.93e-08,1.99e-08,2.1800000000000003e-08,2.3100000000000002e-08,1.9e-08,2e-08,1.8700000000000002e-08,1.91e-08,2.0900000000000002e-08,1.91e-08,1.8700000000000002e-08,1.6399999999999998e-08,1.6100000000000002e-08,1.77e-08,1.8199999999999998e-08,1.7100000000000004e-08,1.7100000000000004e-08,1.8199999999999998e-08,1.86e-08,1.39e-08,1.59e-08,1.8199999999999998e-08,1.69e-08,1.8000000000000002e-08,1.7499999999999998e-08,1.73e-08,1.63e-08,1.6e-08,1.6399999999999998e-08,1.54e-08,1.5e-08,1.52e-08,1.4300000000000002e-08,1.3699999999999999e-08,1.2700000000000001e-08,1.29e-08,1.28e-08,1.1900000000000002e-08,1e-08,8.16e-09,8.590000000000001e-09,9.25e-09,9.25e-09,8.76e-09,8.260000000000001e-09,8.18e-09,8.450000000000001e-09
NLD,1.7e-08,1.94e-08,2.1899999999999998e-08,2.44e-08,2.6899999999999996e-08,2.95e-08,3.21e-08,3.4700000000000006e-08,3.7400000000000004e-08,4e-08,4.270000000000001e-08,4.5500000000000004e-08,4.820000000000001e-08,5.1e-08,5.379999999999999e-08,5.660000000000001e-08,5.95e-08,6.23e-08,6.52e-08,6.81e-08,7.11e-08,7.4e-08,7.7e-08,8e-08,8.3e-08,8.61e-08,8.909999999999998e-08,9.22e-08,9.53e-08,9.840000000000001e-08,1.01e-07,1.05e-07,1.0800000000000001e-07,1.1100000000000001e-07,1.1399999999999999e-07,1.17e-07,1.2e-07,1.24e-07,1.27e-07,1.3000000000000003e-07,2.0299999999999998e-07,2.1800000000000002e-07,2.3500000000000003e-07,2.56e-07,2.79e-07,3.05e-07,3.3300000000000003e-07,3.63e-07,3.9500000000000003e-07,4.280000000000001e-07,4.6200000000000003e-07,5.019999999999999e-07,5.51e-07,6.06e-07,6.660000000000001e-07,7.280000000000001e-07,7.89e-07,8.480000000000001e-07,9.01e-07,9.470000000000001e-07,9.83e-07,1.01e-06,1.03e-06,1.06e-06,1.08e-06,1.0900000000000002e-06,1.11e-06,1.1300000000000002e-06,1.15e-06,1.17e-06,1.19e-06,1.22e-06,1.25e-06,1.28e-06,1.31e-06,1.34e-06,1.37e-06,1.41e-06,1.4499999999999999e-06,1.4900000000000001e-06,1.54e-06,1.6000000000000001e-06,1.6600000000000002e-06,1.7399999999999999e-06,1.83e-06,1.92e-06,2.0100000000000002e-06,2.1100000000000006e-06,2.2e-06,2.2799999999999998e-06,2.37e-06,2.44e-06,2.5e-06,2.56e-06,2.62e-06,2.6700000000000003e-06,2.73e-06,2.8e-06,2.8800000000000004e-06,2.97e-06,3.07e-06,3.23e-06,3.4799999999999997e-06,3.79e-06,4.139999999999999e-06,4.5e-06,4.85e-06,5.1700000000000005e-06,5.420000000000001e-06,5.59e-06,5.66e-06,5.66e-06,5.66e-06,5.66e-06,5.66e-06,5.66e-06,5.66e-06,5.66e-06,5.66e-06,5.66e-06,5.66e-06,5.379999999999999e-06,5.54e-06,6.09e-06,6.43e-06,5.28e-06,5.58e-06,5.21e-06,5.3400000000000005e-06,5.820000000000001e-06,5.32e-06,5.21e-06,4.57e-06,4.49e-06,4.94e-06,5.08e-06,4.77e-06,4.77e-06,5.09e-06,5.1799999999999995e-06,6.100000000000001e-06,6.15e-06,6.19e-06,6.24e-06,6.28e-06,6.3100000000000006e-06,6.3299999999999995e-06,6.370000000000001e-06,6.409999999999999e-06,6.45e-06,9.74e-06,9.820000000000001e-06,9.88e-06,9.93e-06,9.96e-06,9.990000000000001e-06,1e-05,1e-05,1.01e-05,1.01e-05,1.2e-05,1.21e-05,1.21e-05,1.21e-05,1.2200000000000002e-05,1.2200000000000002e-05,1.23e-05,1.24e-05
PRT,1.54e-07,1.76e-07,1.98e-07,2.21e-07,2.44e-07,2.67e-07,2.9100000000000005e-07,3.14e-07,3.38e-07,3.63e-07,3.87e-07,4.12e-07,4.37e-07,4.6200000000000003e-07,4.870000000000001e-07,5.13e-07,5.389999999999999e-07,5.650000000000001e-07,5.91e-07,6.170000000000001e-07,6.440000000000001e-07,6.71e-07,6.98e-07,7.249999999999999e-07,7.52e-07,7.8e-07,8.07e-07,8.349999999999999e-07,8.63e-07,8.91e-07,9.19e-07,9.480000000000001e-07,9.76e-07,1e-06,1.03e-06,1.06e-06,1.0900000000000002e-06,1.1199999999999999e-06,1.15e-06,1.1800000000000001e-06,1.84e-06,1.97e-06,2.13e-06,2.3200000000000002e-06,2.5300000000000003e-06,2.7600000000000003e-06,3.0200000000000003e-06,3.29e-06,3.58e-06,3.88e-06,4.18e-06,4.5500000000000005e-06,4.99e-06,5.49e-06,6.040000000000001e-06,6.6e-06,7.15e-06,7.68e-06,8.17e-06,8.58e-06,8.9e-06,9.16e-06,9.37e-06,9.57e-06,9.74e-06,9.900000000000002e-06,1.01e-05,1.02e-05,1.04e-05,1.06e-05,1.0800000000000002e-05,1.11e-05,1.13e-05,1.1599999999999999e-05,1.18e-05,1.21e-05,1.24e-05,1.2800000000000001e-05,1.3100000000000002e-05,1.35e-05,1.3899999999999999e-05,1.4500000000000002e-05,1.5100000000000001e-05,1.58e-05,1.66e-05,1.74e-05,1.8200000000000002e-05,1.91e-05,1.9900000000000003e-05,2.0700000000000002e-05,2.14e-05,2.2100000000000002e-05,2.26e-05,2.3199999999999998e-05,2.37e-05,2.42e-05,2.48e-05,2.54e-05,2.61e-05,2.69e-05,2.7799999999999998e-05,2.93e-05,3.15e-05,3.43e-05,3.75e-05,4.08e-05,4.39e-05,4.68e-05,4.91e-05,5.0700000000000006e-05,5.1200000000000004e-05,5.1200000000000004e-05,5.1200000000000004e-05,5.1200000000000004e-05,5.1200000000000004e-05,5.1200000000000004e-05,5.1200000000000004e-05,5.1200000000000004e-05,5.1200000000000004e-05,5.1200000000000004e-05,5.1200000000000004e-05,4.87e-05,5.02e-05,5.5100000000000004e-05,5.8200000000000005e-05,4.79e-05,5.05e-05,4.72e-05,4.83e-05,5.27e-05,4.82e-05,4.72e-05,4.1400000000000003e-05,4.07e-05,4.4699999999999996e-05,4.6e-05,4.3200000000000007e-05,4.3200000000000007e-05,4.61e-05,4.69e-05,3.6200000000000006e-05,5.04e-05,6.47e-05,5.71e-05,5.71e-05,6.66e-05,5.61e-05,7.71e-05,9.04e-05,7.33e-05,7.560000000000001e-05,0.000109,9.32e-05,7.37e-05,9.04e-05,0.000106,8.47e-05,7.64e-05,7.829999999999999e-05,8.33e-05,6.28e-05,5.84e-05,5e-05,3.88e-05,2.6300000000000002e-05,3.48e-05,3.9e-05,4.5600000000000004e-05
