### META ###
ID,Emissions|N2O|IPC2H__Historic|third_party__PRIMAP_2019
category,IPC2H
creator,AG
entity,Emissions|N2O
modified,2020/06/21-10:25:53
original code,N2O_IPC2H_HISTTP
pathway,Historic|third_party
scenario,Historic|third_party
source,PRIMAP_2019
source_name,PRIMAP
source_year,2019
unit,Mt N2O
unitTo,Mt N2O
variable,Emissions|N2O|IPC2H
### DATA ###
country,1850,1851,1852,1853,1854,1855,1856,1857,1858,1859,1860,1861,1862,1863,1864,1865,1866,1867,1868,1869,1870,1871,1872,1873,1874,1875,1876,1877,1878,1879,1880,1881,1882,1883,1884,1885,1886,1887,1888,1889,1890,1891,1892,1893,1894,1895,1896,1897,1898,1899,1900,1901,1902,1903,1904,1905,1906,1907,1908,1909,1910,1911,1912,1913,1914,1915,1916,1917,1918,1919,1920,1921,1922,1923,1924,1925,1926,1927,1928,1929,1930,1931,1932,1933,1934,1935,1936,1937,1938,1939,1940,1941,1942,1943,1944,1945,1946,1947,1948,1949,1950,1951,1952,1953,1954,1955,1956,1957,1958,1959,1960,1961,1962,1963,1964,1965,1966,1967,1968,1969,1970,1971,1972,1973,1974,1975,1976,1977,1978,1979,1980,1981,1982,1983,1984,1985,1986,1987,1988,1989,1990,1991,1992,1993,1994,1995,1996,1997,1998,1999,2000,2001,2002,2003,2004,2005,2006,2007,2008,2009,2010,2011,2012,2013,2014,2015,2016,2017
EARTH,0.0,0.0,0.0,0.0,0.0,0.0,0.0,0.0,0.0,0.0,0.0,0.0,0.0,0.0,0.0,0.0,0.0,0.0,0.0,0.0,0.0,0.0,0.0,0.0,0.0,0.0,0.0,0.0,0.0,0.0,0.0,0.0,0.0,0.0,0.0,0.0,0.0,0.0,0.0,0.0,0.0,0.0,0.0,0.0,0.0,0.0,0.0,0.0,0.0,0.0,0.0,0.0,0.0,0.0,0.0,0.0,0.0,0.0,0.0,0.0,0.0,0.0,0.0,0.0,0.0,0.0,0.0,0.0,0.0,0.0,0.0,0.0,0.0,0.0,0.0,0.0,0.0,0.0,0.0,0.0,0.0,5.36e-07,2.03e-06,4.32e-06,7.22e-06,1.06e-05,1.4200000000000001e-05,1.8e-05,2.1700000000000002e-05,2.51e-05,2.82e-05,3.09e-05,3.32e-05,3.5499999999999996e-05,3.7699999999999995e-05,3.99e-05,4.24e-05,4.52e-05,4.83e-05,5.2e-05,5.64e-05,6.28e-05,7.22e-05,8.42e-05,9.83e-05,0.000114,0.000131,0.000149,0.000167,0.000185,0.00020199999999999998,0.000221,0.000242,0.00026500000000000004,0.000289,0.000313,0.00033600000000000004,0.000358,0.00037799999999999997,0.000394,0.000407,0.000415,0.00043,0.000454,0.000476,0.00045700000000000005,0.000449,0.00045299999999999995,0.00045000000000000004,0.00045799999999999997,0.000446,0.000423,0.000383,0.000373,0.00037799999999999997,0.000363,0.00034,0.00033,0.000319,0.000305,0.000334,0.00034899999999999997,0.000348,0.000384,0.00039700000000000005,0.000436,0.000447,0.000513,0.000483,0.000524,0.000602,0.000507,0.000503,0.0005809999999999999,0.000628,0.0006879999999999999,0.000805,0.000936,0.000863,0.000708,0.000757,0.0010400000000000001,0.000918,0.0008590000000000001,0.000925,0.000987,0.000989,0.0011200000000000001
ESP,0.0,0.0,0.0,0.0,0.0,0.0,0.0,0.0,0.0,0.0,0.0,0.0,0.0,0.0,0.0,0.0,0.0,0.0,0.0,0.0,0.0,0.0,0.0,0.0,0.0,0.0,0.0,0.0,0.0,0.0,0.0,0.0,0.0,0.0,0.0,0.0,0.0,0.0,0.0,0.0,0.0,0.0,0.0,0.0,0.0,0.0,0.0,0.0,0.0,0.0,0.0,0.0,0.0,0.0,0.0,0.0,0.0,0.0,0.0,0.0,0.0,0.0,0.0,0.0,0.0,0.0,0.0,0.0,0.0,0.0,0.0,0.0,0.0,0.0,0.0,0.0,0.0,0.0,0.0,0.0,0.0,4.1e-10,1.55e-09,3.3e-09,5.52e-09,8.09e-09,1.0900000000000002e-08,1.3699999999999999e-08,1.66e-08,1.92e-08,2.1600000000000005e-08,2.3600000000000003e-08,2.5400000000000002e-08,2.71e-08,2.8800000000000003e-08,3.05e-08,3.24e-08,3.45e-08,3.6900000000000006e-08,3.98e-08,4.3099999999999996e-08,4.820000000000001e-08,5.570000000000001e-08,6.530000000000001e-08,7.66e-08,8.92e-08,1.03e-07,1.17e-07,1.3100000000000002e-07,1.4500000000000001e-07,1.59e-07,1.73e-07,1.88e-07,2.04e-07,2.2e-07,2.3700000000000002e-07,2.5299999999999995e-07,2.69e-07,2.8399999999999995e-07,2.97e-07,3.09e-07,3.18e-07,3.3e-07,3.5e-07,3.81e-07,3.76e-07,3.6400000000000003e-07,3.67e-07,3.7e-07,3.7e-07,3.5700000000000003e-07,3.38e-07,3.15e-07,3.1299999999999996e-07,3.16e-07,3.05e-07,2.8900000000000006e-07,2.77e-07,2.61e-07,2.46e-07,2.7999999999999997e-07,2.2599999999999999e-07,2.23e-07,2.54e-07,2.6000000000000005e-07,4.810000000000001e-08,1.1599999999999999e-07,1.8100000000000002e-07,2.17e-07,1.5e-07,1.1e-07,1.63e-07,1.4400000000000002e-07,1.0800000000000001e-07,6.29e-08,1.1399999999999999e-07,9.740000000000001e-08,1.0000000000000001e-07,1.1100000000000001e-07,4.270000000000001e-08,1.67e-07,1.05e-07,2.1600000000000003e-07,2.1200000000000002e-07,4.11e-07,6.85e-07,5.54e-07,1.3999999999999998e-07
EU28,0.0,0.0,0.0,0.0,0.0,0.0,0.0,0.0,0.0,0.0,0.0,0.0,0.0,0.0,0.0,0.0,0.0,0.0,0.0,0.0,0.0,0.0,0.0,0.0,0.0,0.0,0.0,0.0,0.0,0.0,0.0,0.0,0.0,0.0,0.0,0.0,0.0,0.0,0.0,0.0,0.0,0.0,0.0,0.0,0.0,0.0,0.0,0.0,0.0,0.0,0.0,0.0,0.0,0.0,0.0,0.0,0.0,0.0,0.0,0.0,0.0,0.0,0.0,0.0,0.0,0.0,0.0,0.0,0.0,0.0,0.0,0.0,0.0,0.0,0.0,0.0,0.0,0.0,0.0,0.0,0.0,3.34e-07,1.26e-06,2.6899999999999997e-06,4.5e-06,6.5900000000000004e-06,8.85e-06,1.12e-05,1.35e-05,1.57e-05,1.76e-05,1.92e-05,2.0700000000000002e-05,2.2100000000000002e-05,2.34e-05,2.48e-05,2.64e-05,2.8100000000000002e-05,3.01e-05,3.24e-05,3.51e-05,3.92e-05,4.53e-05,5.31e-05,6.24e-05,7.27e-05,8.37e-05,9.53e-05,0.000107,0.00011800000000000001,0.00012900000000000002,0.00014099999999999998,0.000153,0.00016600000000000002,0.000179,0.000193,0.00020600000000000002,0.00021899999999999998,0.000231,0.000242,0.000252,0.000259,0.000269,0.000285,0.000311,0.000306,0.00029600000000000004,0.000299,0.000301,0.000302,0.000291,0.000275,0.000257,0.000255,0.000257,0.000248,0.000235,0.00022500000000000002,0.000212,0.0002,0.000214,0.00022899999999999998,0.000228,0.000234,0.000232,0.00023300000000000003,0.00023,0.000246,0.00024100000000000003,0.000245,0.00027200000000000005,0.000269,0.000266,0.00028199999999999997,0.00027699999999999996,0.00027600000000000004,0.00027899999999999995,0.00027800000000000004,0.00027,0.000261,0.00026700000000000004,0.00026000000000000003,0.00027200000000000005,0.00027100000000000003,0.000275,0.00027600000000000004,0.00027600000000000004,0.00028199999999999997
SWE,0.0,0.0,0.0,0.0,0.0,0.0,0.0,0.0,0.0,0.0,0.0,0.0,0.0,0.0,0.0,0.0,0.0,0.0,0.0,0.0,0.0,0.0,0.0,0.0,0.0,0.0,0.0,0.0,0.0,0.0,0.0,0.0,0.0,0.0,0.0,0.0,0.0,0.0,0.0,0.0,0.0,0.0,0.0,0.0,0.0,0.0,0.0,0.0,0.0,0.0,0.0,0.0,0.0,0.0,0.0,0.0,0.0,0.0,0.0,0.0,0.0,0.0,0.0,0.0,0.0,0.0,0.0,0.0,0.0,0.0,0.0,0.0,0.0,0.0,0.0,0.0,0.0,0.0,0.0,0.0,0.0,3.3300000000000003e-07,1.26e-06,2.68e-06,4.49e-06,6.58e-06,8.84e-06,1.12e-05,1.35e-05,1.56e-05,1.7500000000000002e-05,1.92e-05,2.0700000000000002e-05,2.2e-05,2.34e-05,2.48e-05,2.6300000000000002e-05,2.8100000000000002e-05,3e-05,3.24e-05,3.51e-05,3.92e-05,4.53e-05,5.31e-05,6.23e-05,7.26e-05,8.36e-05,9.510000000000001e-05,0.000107,0.00011800000000000001,0.00012900000000000002,0.00014099999999999998,0.000153,0.00016600000000000002,0.000179,0.000193,0.00020600000000000002,0.00021899999999999998,0.000231,0.000242,0.00025100000000000003,0.000259,0.000268,0.000285,0.00031,0.000306,0.00029600000000000004,0.000298,0.000301,0.000301,0.000291,0.000275,0.000257,0.000255,0.000257,0.000248,0.000235,0.00022500000000000002,0.000212,0.0002,0.000214,0.000228,0.000227,0.000234,0.000232,0.00023300000000000003,0.00023,0.000246,0.00024100000000000003,0.000245,0.00027200000000000005,0.000269,0.000266,0.00028199999999999997,0.00027699999999999996,0.00027600000000000004,0.00027800000000000004,0.00027800000000000004,0.00027,0.00026000000000000003,0.00026700000000000004,0.00026000000000000003,0.00027200000000000005,0.00027100000000000003,0.000275,0.00027600000000000004,0.000275,0.00028199999999999997
USA,0.0,0.0,0.0,0.0,0.0,0.0,0.0,0.0,0.0,0.0,0.0,0.0,0.0,0.0,0.0,0.0,0.0,0.0,0.0,0.0,0.0,0.0,0.0,0.0,0.0,0.0,0.0,0.0,0.0,0.0,0.0,0.0,0.0,0.0,0.0,0.0,0.0,0.0,0.0,0.0,0.0,0.0,0.0,0.0,0.0,0.0,0.0,0.0,0.0,0.0,0.0,0.0,0.0,0.0,0.0,0.0,0.0,0.0,0.0,0.0,0.0,0.0,0.0,0.0,0.0,0.0,0.0,0.0,0.0,0.0,0.0,0.0,0.0,0.0,0.0,0.0,0.0,0.0,0.0,0.0,0.0,2.02e-07,7.66e-07,1.6300000000000003e-06,2.72e-06,3.99e-06,5.36e-06,6.7799999999999995e-06,8.17e-06,9.48e-06,1.06e-05,1.1599999999999999e-05,1.25e-05,1.34e-05,1.4200000000000001e-05,1.5100000000000001e-05,1.6e-05,1.7100000000000002e-05,1.83e-05,1.9699999999999998e-05,2.13e-05,2.36e-05,2.69e-05,3.1e-05,3.5900000000000005e-05,4.1400000000000003e-05,4.7300000000000005e-05,5.36e-05,6e-05,6.65e-05,7.3e-05,8.02e-05,8.91e-05,9.89e-05,0.000109,0.00012,0.00013000000000000002,0.00013900000000000002,0.000146,0.000152,0.000155,0.000156,0.000161,0.000169,0.00016600000000000002,0.000151,0.000153,0.000155,0.000149,0.000156,0.000155,0.00014800000000000002,0.000126,0.00011800000000000001,0.00012,0.000115,0.000105,0.000105,0.000107,0.000105,0.00012,0.00012,0.00012,0.00015,0.000165,0.00020300000000000003,0.00021700000000000002,0.00026700000000000004,0.00024100000000000003,0.00028000000000000003,0.00033,0.000238,0.000237,0.000299,0.000351,0.00041200000000000004,0.000527,0.000657,0.000593,0.000447,0.00049,0.0007790000000000001,0.0006459999999999999,0.000588,0.0006500000000000001,0.00071,0.000713,0.000838
