### META ###
ID,Production|Rice_paddy__Historic__FAO_2020
category,Rice_paddy
creator,AG
entity,Production
pathway,Historic
scenario,Historic
source,FAO_2020
unit,tonnes
variable,Production|Rice_paddy
### DATA ###
region,1961,1962,1963,1964,1965,1966,1967,1968,1969,1970,1971,1972,1973,1974,1975,1976,1977,1978,1979,1980,1981,1982,1983,1984,1985,1986,1987,1988,1989,1990,1991,1992,1993,1994,1995,1996,1997,1998,1999,2000,2001,2002,2003,2004,2005,2006,2007,2008,2009,2010,2011,2012,2013,2014,2015,2016,2017
AFG,319000.0,319000.0,319000.0,380000.0,380000.0,337000.0,396000.0,402000.0,407000.0,366000.0,350000.0,400000.0,420000.0,420000.0,435000.0,448000.0,400000.0,428000.0,439000.0,415000.0,390000.0,364000.0,350000.0,334000.0,317000.0,336000.0,324000.0,343000.0,320000.0,333000.0,335000.0,300000.0,300000.0,342000.0,390000.0,340000.0,400000.0,450000.0,280000.0,260000.0,242000.0,388000.0,434000.0,463000.0,485000.0,540000.0,552000.0,612000.0,645000.0,672000.0,672000.0,500000.0,512094.0,537000.0,410000.0,356565.0,338420.0
AGO,29000.0,23000.0,25000.0,26000.0,32000.0,30000.0,33000.0,15148.0,15945.0,29950.0,27791.0,20347.0,29051.0,16779.0,20000.0,20000.0,20000.0,15000.0,13000.0,11000.0,10000.0,10000.0,8000.0,8000.0,5000.0,5000.0,2000.0,2000.0,3000.0,3000.0,4000.0,4000.0,4000.0,21000.0,19000.0,14000.0,12000.0,10000.0,7402.0,5776.0,5335.0,4890.0,10831.0,13000.0,8650.0,3831.0,4635.0,8414.0,14291.0,17697.0,23209.0,21492.0,37608.0,42288.0,45322.0,61000.0,63000.0
ALB,4603.0,5683.0,9135.0,8173.0,10225.0,10524.0,11254.0,12807.0,14276.0,14924.0,10760.0,12000.0,15168.0,12000.0,13500.0,14000.0,14400.0,14800.0,15520.0,13000.0,13900.0,11900.0,13000.0,12600.0,12000.0,11000.0,10600.0,8830.0,8450.0,7000.0,2283.0,960.0,585.0,,,,,,,,,,,,,,,,,,,,,,,,
ARG,149000.0,182300.0,178200.0,190000.0,267600.0,165300.0,217000.0,282900.0,345000.0,407000.0,288000.0,294000.0,260000.0,316000.0,351000.0,309000.0,320000.0,310000.0,312000.0,266000.0,286300.0,437200.0,337100.0,480400.0,400000.0,438600.0,371000.0,383400.0,490000.0,428100.0,347600.0,732700.0,608300.0,607600.0,926200.0,986000.0,1205140.0,1011135.0,1658200.0,903630.0,873183.0,709295.0,717630.0,1060083.0,956253.0,1193492.0,1080070.0,1245800.0,1334155.0,1243259.0,1748075.0,1567971.0,1563450.0,1581810.0,1558100.0,1404980.0,1328340.0
AUS,118000.0,139000.0,140000.0,146000.0,158000.0,187000.0,221000.0,228000.0,267000.0,250000.0,301000.0,248000.0,309000.0,409000.0,387000.0,417000.0,530000.0,489697.0,692151.0,613163.0,760000.0,857000.0,520000.0,634000.0,864000.0,687000.0,549000.0,761000.0,805000.0,924000.0,787000.0,1122000.0,955000.0,1082000.0,1137000.0,951200.0,1388000.0,1330900.0,1389800.0,1100700.0,1643403.0,1192202.0,438111.0,553114.0,338885.0,1002654.0,162806.0,17614.0,60868.0,196684.0,723283.0,918733.0,1161115.0,819276.0,690390.0,273942.0,807304.0
AZE,,,,,,,,,,,,,,,,,,,,,,,,,,,,,,,,622.0,1124.0,1029.0,3807.0,8070.0,10797.0,11608.0,15874.0,22335.0,18365.0,16640.0,15651.0,10243.0,8308.0,5085.0,3575.0,3740.0,4353.0,3930.0,3695.0,3749.0,4833.0,2679.0,2834.0,5406.0,15916.0
BDI,3000.0,2750.0,2680.0,2880.0,2178.0,1967.0,1400.0,4600.0,3446.0,5047.0,4277.0,4785.0,4800.0,6186.0,6738.0,6700.0,7500.0,6300.0,9000.0,10000.0,10000.0,9000.0,9000.0,18000.0,20000.0,21000.0,28000.0,35000.0,40000.0,40000.0,40200.0,40400.0,40200.0,38228.0,26819.0,41810.0,65102.0,41000.0,58630.0,51678.0,60920.0,62648.0,61256.0,64532.0,67947.0,68311.0,70911.0,70846.0,78432.0,83019.0,91415.0,64620.0,41454.0,67377.0,38674.0,146633.0,96365.0
BEN,756.0,738.0,872.0,1007.0,1479.0,1526.0,1253.0,1779.0,2605.0,4840.0,5400.0,6615.0,8000.0,9910.0,13504.0,18400.0,18400.0,7500.0,10300.0,10186.0,8530.0,8792.0,5300.0,7500.0,6748.0,8538.0,8141.0,9708.0,8976.0,10940.0,10282.0,10390.0,9955.0,13686.0,17219.0,22259.0,26891.0,35562.0,34040.0,49245.0,54901.0,63219.0,54183.0,64699.0,78329.0,61818.0,72960.0,109371.0,150604.0,124975.0,219626.0,216644.0,362589.0,234145.0,204310.0,281428.0,304008.0
BFA,30171.0,45220.0,25000.0,34000.0,24700.0,30000.0,43540.0,40905.0,39068.0,36285.0,36879.0,33604.0,31100.0,35200.0,39900.0,45449.0,37610.0,39721.0,46922.0,40212.0,45238.0,42800.0,40000.0,40993.0,50334.0,37949.0,21790.0,39080.0,41841.0,47800.0,38600.0,46700.0,53809.0,61009.0,84025.0,111807.0,89516.0,88998.0,94209.0,103087.0,109868.0,89104.0,95494.0,74501.0,93516.0,113700.0,68916.0,195102.0,213584.0,270658.0,240866.0,319390.0,305382.0,347501.0,325138.0,384690.0,325566.0
BGD,14426184.0,13304520.0,15934944.0,15753588.0,15750540.0,14363000.0,16757000.0,17015504.0,18007296.0,16714900.0,14896689.0,15133678.0,17862704.0,16929568.0,19142624.0,17628320.0,19451488.0,19582160.0,19109472.0,20821008.0,20445872.0,21324640.0,21761008.0,21933456.0,22556288.0,23110032.0,23120624.0,23316464.0,26784480.0,26777904.0,27242000.0,27373000.0,26928000.0,25124000.0,26399000.0,28182000.0,28152000.0,29710000.0,34430000.0,37627500.0,36269000.0,37593000.0,38361420.0,36235976.0,39795616.0,40773000.0,43181000.0,46742000.0,48144000.0,50061200.0,50627000.0,50497000.0,51534000.0,51806593.0,51805464.0,50452866.0,48980000.0
BGR,36490.0,39037.0,42316.0,31460.0,33490.0,48358.0,57120.0,38929.0,58157.0,66171.0,66988.0,60294.0,61896.0,57969.0,67700.0,41213.0,67735.0,61115.0,73385.0,67382.0,73514.0,74890.0,74309.0,61113.0,54570.0,62407.0,52993.0,45558.0,42723.0,25188.0,20833.0,14499.0,10842.0,3076.0,4984.0,8832.0,11333.0,10277.0,7000.0,16784.0,18706.0,17955.0,23659.0,28116.0,20163.0,20008.0,30576.0,38645.0,43441.0,57432.0,59619.0,54896.0,56121.0,54155.0,67684.0,64773.0,58523.0
BLZ,848.0,750.0,1225.0,2045.0,2372.0,1420.0,1615.0,2875.0,3470.0,3493.0,4548.0,5799.0,8165.0,7530.0,4853.0,6305.0,8589.0,6350.0,6668.0,8618.0,10830.0,7938.0,6123.0,5672.0,5578.0,4404.0,4593.0,5551.0,5042.0,4614.0,4791.0,6679.0,9745.0,6359.0,9628.0,12757.0,16727.0,9452.0,12619.0,9847.0,12121.0,10949.0,12752.0,10441.0,17760.0,11855.0,17775.0,11780.0,20615.0,20523.0,19081.0,12318.0,20505.0,16259.0,12663.0,16203.0,18751.0
BOL,34320.0,38571.0,42857.0,47142.0,51286.0,51714.0,56651.0,73560.0,83375.0,72530.0,85335.0,85200.0,77800.0,85200.0,126560.0,113045.0,121335.0,89315.0,76125.0,95225.0,101225.0,86660.0,61725.0,163863.0,173156.0,136760.0,164230.0,171485.0,226852.0,211263.0,240770.0,229292.0,222594.0,247333.0,264612.0,343520.0,255586.0,296253.0,256789.0,299083.0,332437.0,259452.0,423278.0,331336.0,479246.0,446462.0,352104.0,337800.0,410994.0,442017.0,428007.0,474664.0,442912.0,484057.0,527341.0,406954.0,472238.0
BRA,5392477.0,5556834.0,5740065.0,6344931.0,7579649.0,5801814.0,6791990.0,6652388.0,6394285.0,7553083.0,6593179.0,6760641.0,7160127.0,6764038.0,7781538.0,9757079.0,8993696.0,7296142.0,7595214.0,9775720.0,8228326.0,9734553.0,7741753.0,9027367.0,9024555.0,10404680.0,10425100.0,11806450.0,11029800.0,7420931.0,9488007.0,10006292.0,10107310.0,10540789.0,11226064.0,8652328.0,8351665.0,7716090.0,11709694.0,11134588.0,10184185.0,10445986.0,10334603.0,13277008.0,13192863.0,11526685.0,11060741.0,12061465.0,12651144.0,11235986.0,13476994.0,11549881.0,11782549.0,12175602.0,12301201.0,10622189.0,12469516.0
BRN,4908.0,5245.0,3868.0,3441.0,2946.0,3408.0,5523.0,5522.0,6782.0,6781.0,4381.0,4000.0,6116.0,9766.0,9882.0,7230.0,4259.0,3836.0,4615.0,2747.0,2494.0,2366.0,2676.0,3270.0,1082.0,1540.0,1080.0,1930.0,1560.0,930.0,880.0,740.0,790.0,785.0,508.0,446.0,446.0,446.0,200.0,299.0,350.0,372.0,547.0,620.0,851.0,886.0,983.0,911.0,891.0,1072.0,1480.0,1756.0,1237.0,1382.0,1983.0,1579.0,2349.0
BTN,37000.0,38000.0,39000.0,40000.0,41000.0,42000.0,43000.0,44000.0,45000.0,46000.0,47000.0,48000.0,49000.0,50000.0,51000.0,52000.0,53000.0,54000.0,55000.0,56600.0,57400.0,58500.0,60000.0,66001.0,62000.0,63000.0,65000.0,43141.0,43000.0,55157.0,37793.0,39262.0,41655.0,45000.0,50000.0,49473.0,49184.0,48076.0,46958.0,44300.0,40000.0,37391.0,44902.0,54324.0,67982.0,72513.0,74432.0,77391.0,66393.0,71637.0,78730.0,78014.0,78730.0,76621.0,80261.0,83332.0,86385.0
CAF,3000.0,3300.0,4300.0,6000.0,6500.0,6500.0,7600.0,9800.0,12320.0,7000.0,7080.0,6500.0,6050.0,12608.0,11672.0,12000.0,18000.0,12565.0,12442.0,13005.0,15000.0,15000.0,12000.0,17000.0,12730.0,8982.0,11421.0,14103.0,14746.0,7821.0,7664.0,8000.0,7800.0,8034.0,10000.0,15000.0,17000.0,18500.0,21000.0,23100.0,25300.0,27400.0,29700.0,31900.0,46200.0,40000.0,37595.0,37971.0,39110.0,39000.0,40000.0,42000.0,29679.0,12822.0,10180.0,11608.0,12923.0
CHL,104720.0,78480.0,79270.0,80440.0,79956.0,76700.0,84000.0,93488.0,36719.0,76234.0,67100.0,86284.0,54953.0,34350.0,76380.0,97640.0,120010.0,104790.0,181170.0,95440.0,99740.0,131180.0,115560.0,165010.0,156649.0,126667.0,147033.0,162251.0,185186.0,136012.0,117115.0,133531.0,130629.0,133080.0,145899.0,152795.0,87552.0,104375.0,61000.0,135060.0,143261.0,141927.0,140849.0,119265.0,116832.0,160315.0,110268.0,121400.0,127311.0,94673.0,130375.0,149788.0,130307.0,134884.0,163560.0,174008.0,127866.0
CHN,56217596.0,65675296.0,76439287.0,85853775.0,90705628.0,98403988.0,96734821.0,97716770.0,97998501.0,113101872.0,118129217.0,116428568.0,124584102.0,127010746.0,128726268.0,129231908.0,131917523.0,140023847.0,146846141.0,142876522.0,146959846.0,164741383.0,172008870.0,181095752.0,171318871.0,174720521.0,176662482.0,171441919.0,182485246.0,191614680.0,186124638.0,188291880.0,179746933.0,177994395.0,187297968.0,197032897.0,202771843.0,200571557.0,200403308.0,189814060.0,179304887.0,176342195.0,162304280.0,180522603.0,182055138.0,183276048.0,187397460.0,193352875.0,196681177.0,197212003.0,202667169.0,205936129.0,205201696.0,208239610.0,213723732.0,212681776.0,214430049.0
CIV,156000.0,229000.0,219000.0,248000.0,250000.0,275600.0,344600.0,365400.0,303000.0,315600.0,385000.0,320000.0,335000.0,406000.0,496000.0,460000.0,477000.0,504000.0,534000.0,420000.0,390000.0,450000.0,360000.0,514000.0,540000.0,560000.0,580000.0,623000.0,654000.0,687000.0,657000.0,660000.0,676000.0,678181.0,691700.0,705488.0,585000.0,597684.0,609625.0,621805.0,634228.0,646899.0,659824.0,681521.0,703931.0,715898.0,606310.0,679969.0,687721.0,1206153.0,873016.0,1561905.0,1934154.0,2053520.0,2153000.0,2055000.0,2120000.0
CMR,3583.0,9048.0,10750.0,14099.0,13250.0,15794.0,22191.0,15847.0,12129.0,13727.0,13840.0,8845.0,11867.0,24079.0,29906.0,48060.0,42805.0,76466.0,49000.0,45576.0,50608.0,77180.0,88955.0,61000.0,107399.0,90000.0,65100.0,54325.0,61665.0,55199.0,36400.0,52500.0,29000.0,36200.0,35300.0,36100.0,37000.0,53200.0,67470.0,61271.0,62011.0,44548.0,47175.0,49958.0,58369.0,64525.0,68267.0,72009.0,134659.0,153078.0,174089.0,181818.0,194094.0,153246.0,278281.0,359320.0,360000.0
COD,70800.0,74100.0,60000.0,55000.0,48880.0,90663.0,100423.0,186700.0,170000.0,179800.0,183900.0,196200.0,199100.0,201300.0,207800.0,212700.0,213700.0,213300.0,227400.0,234300.0,245400.0,250940.0,271317.0,286012.0,312000.0,315000.0,330000.0,350000.0,370000.0,392300.0,393900.0,403300.0,429810.0,426170.0,365818.0,347947.0,322099.0,362657.0,350000.0,337800.0,326025.0,314430.0,314780.0,315130.0,315480.0,315830.0,316180.0,316530.0,316880.0,318144.0,318750.0,645184.0,811218.0,1019979.0,1021815.0,1010980.0,917564.0
COG,3500.0,3550.0,3700.0,4000.0,5000.0,6000.0,7000.0,8000.0,6000.0,4000.0,5000.0,6701.0,5229.0,6668.0,3800.0,3880.0,3900.0,3500.0,3000.0,2726.0,2840.0,2201.0,1638.0,1278.0,920.0,1208.0,1047.0,1065.0,1083.0,1387.0,1438.0,1488.0,1539.0,1594.0,1101.0,1138.0,980.0,979.0,1273.0,1301.0,1351.0,1403.0,1200.0,1242.0,1100.0,1100.0,1100.0,1300.0,1500.0,1495.0,1205.0,1203.0,1196.0,1191.0,1187.0,1184.0,1180.0
COL,473600.0,585000.0,550000.0,600000.0,672000.0,680000.0,661500.0,786300.0,694485.0,752595.0,904348.0,1043284.0,1175871.0,1569940.0,1622230.0,1480720.0,1401626.0,1878024.0,1829811.0,1784118.0,1877736.0,2023261.0,1813534.0,1714660.0,1741600.0,1520949.0,1864500.0,1775400.0,2101800.0,2116600.0,1738600.0,1734950.0,1590062.0,1657212.0,1742547.0,1661336.0,1830286.0,1897740.0,2185232.0,2237270.0,2156310.0,2063030.0,2417190.0,2496720.0,2206512.0,1965414.0,2117165.0,2412852.0,2479921.0,1988191.0,2009945.0,2317710.0,1996580.0,2206525.0,2488519.0,3059204.0,2989001.0
COM,9000.0,9000.0,10000.0,11000.0,12000.0,13000.0,12000.0,11000.0,10000.0,10000.0,8000.0,9000.0,10000.0,11000.0,12000.0,12000.0,13000.0,13000.0,13000.0,13000.0,13000.0,13000.0,13000.0,13200.0,13000.0,13000.0,13000.0,13000.0,15000.0,15085.0,16000.0,16500.0,17000.0,17016.0,17203.0,17378.0,17546.0,17714.0,17310.0,15192.0,16984.0,17304.0,17637.0,17974.0,18000.0,20000.0,17000.0,20000.0,21263.0,24000.0,26500.0,27000.0,29000.0,30178.0,31374.0,32821.0,34132.0
CRI,60400.0,65100.0,69000.0,78000.0,85300.0,89700.0,95000.0,107400.0,93800.0,79600.0,91700.0,88800.0,104010.0,126710.0,195636.0,149711.0,168621.0,197824.0,219579.0,230628.0,222471.0,146225.0,246819.0,222740.0,224452.0,184810.0,153737.0,205464.0,157034.0,217643.0,213179.0,202518.0,172773.0,205444.0,183184.0,236525.0,248528.0,238999.0,264317.0,266420.0,216699.0,189768.0,183637.0,197211.0,183254.0,194261.0,179728.0,221474.0,259656.0,267772.0,278975.0,214418.0,224570.0,224157.0,195744.0,203931.0,152180.0
CUB,206908.0,230920.0,236900.0,122958.0,54970.0,63999.0,72093.0,113749.0,224615.0,374523.0,353128.0,318016.0,335608.0,436627.0,446710.0,451078.0,455774.0,457458.0,425100.0,477834.0,460887.0,519752.0,517644.0,554760.0,524320.0,570517.0,466039.0,488857.0,536381.0,473673.0,427617.0,376328.0,185602.0,387600.0,396100.0,572900.0,614200.0,441600.0,559000.0,552800.0,601000.0,692000.0,715800.0,488900.0,367600.0,434200.0,439600.0,436000.0,563600.0,454400.0,566400.0,641600.0,672600.0,584800.0,418037.0,514045.0,404733.0
DOM,112856.0,111300.0,117849.0,143058.0,167446.0,177912.0,167452.0,181406.0,195000.0,210000.0,212000.0,214000.0,225900.0,259441.0,218611.0,312228.0,308041.0,351020.0,376739.0,397698.0,400460.0,446913.0,500543.0,507377.0,493756.0,456660.0,507861.0,421193.0,474213.0,427597.0,466171.0,565653.0,442531.0,375807.0,486741.0,474220.0,508539.0,474595.0,566501.0,581410.0,721668.0,730705.0,608329.0,576621.0,644940.0,713821.0,748986.0,778511.0,780139.0,850228.0,874690.0,663981.0,723637.0,532028.0,535797.0,556870.0,588283.0
DZA,9512.0,8000.0,6659.0,5014.0,5530.0,5550.0,4558.0,6110.0,6711.0,2166.0,1568.0,2218.0,2447.0,2520.0,1600.0,1279.0,1409.0,291.0,1000.0,1200.0,1200.0,1200.0,1200.0,1200.0,1200.0,1240.0,1300.0,1480.0,1480.0,1540.0,1500.0,1410.0,1290.0,1244.0,1158.0,1073.0,300.0,492.0,456.0,437.0,419.0,400.0,425.0,414.0,390.0,360.0,348.0,334.0,320.0,312.0,320.0,300.0,320.0,320.0,275.0,238.0,214.0
ECU,203000.0,209000.0,211000.0,239990.0,265545.0,278200.0,239980.0,146720.0,274340.0,230090.0,197665.0,191425.0,234530.0,266330.0,363675.0,355525.0,327622.0,225273.0,318471.0,380614.0,434395.0,384356.0,273502.0,437166.0,397354.0,575869.0,780776.0,954530.0,867395.0,840361.0,557346.0,1029558.0,1239762.0,1420470.0,1290518.0,1398346.0,1471778.0,1042992.0,1289684.0,1246634.0,1255990.0,1432811.0,1384715.0,1778380.0,1471064.0,1501238.0,1734135.0,1442052.0,1579406.0,1706193.0,1477941.0,1565535.0,1516045.0,1379954.0,1652793.0,1534537.0,1066614.0
EGY,1142000.0,2038000.0,2219000.0,2036000.0,1789000.0,1678000.0,2278000.0,2591000.0,2561000.0,2604000.0,2533690.0,2507000.0,2275000.0,2241688.0,2423446.0,2300032.0,2272309.0,2351000.0,2511000.0,2382100.0,2236362.0,2440513.0,2442000.0,2236436.0,2311300.0,2445000.0,2406000.0,2132000.0,2679000.0,3167421.0,3447812.0,3909706.0,4160762.0,4583007.0,4788097.0,4895388.0,5480010.0,4474110.0,5816960.0,6000490.0,5226703.0,6105456.0,6176266.0,6352370.0,6125300.0,6755000.0,6876830.0,7253373.0,5520482.0,4329503.0,5675027.0,5911086.0,5724106.0,5467392.0,4817964.0,5308873.0,6380000.0
ESP,393500.0,392400.0,398600.0,398060.0,349634.0,375400.0,365878.0,362134.0,410500.0,381642.0,360900.0,345800.0,386500.0,366900.0,378700.0,406200.0,379200.0,401244.0,427000.0,433200.0,444000.0,401900.0,224000.0,440400.0,462253.0,496318.0,483269.0,506600.0,341700.0,571330.0,581836.0,552600.0,323093.0,407600.0,329500.0,734000.0,775588.0,796300.0,845100.0,827051.0,876148.0,818920.0,855000.0,883131.0,824114.0,724351.0,723426.0,665200.0,913754.0,927817.0,927554.0,899602.0,872500.0,861103.0,847026.0,835400.0,835178.0
ETH,,,,,,,,,,,,,,,,,,,,,,,,,,,,,,,,,10000.0,9076.0,11000.0,9766.0,12000.0,13000.0,14000.0,15000.0,15412.0,15412.0,13000.0,12000.0,11244.0,11244.0,11244.0,71394.0,103128.0,90412.0,88619.0,121042.0,92363.0,131821.0,139780.0,136001.0,140335.0
EU28,1591293.0,1523010.0,1465144.0,1552267.0,1298111.0,1467716.0,1635739.0,1486864.0,1821586.0,1740243.0,1762572.0,1542864.0,1915753.0,1843101.0,1852079.0,1598417.0,1424536.0,1757468.0,1970801.0,1791056.0,1715603.0,1831674.0,1682637.0,1918064.0,2126434.0,2222693.0,2093997.0,2167715.0,2085253.0,2369446.0,2264663.0,2236082.0,2037852.0,2253098.0,2156158.0,2711356.0,2755966.0,2678005.0,2722871.0,2487020.0,2575901.0,2635004.0,2709424.0,2888461.0,2674145.0,2612330.0,2780382.0,2599146.0,3175591.0,3067726.0,3117760.0,3159889.0,2921913.0,2834622.0,3021546.0,2980246.0,2983820.0
FJI,22760.0,22455.0,21947.0,17984.0,14326.0,14326.0,14733.0,17600.0,17273.0,20400.0,17340.0,17340.0,15760.0,17279.0,22928.0,20275.0,17966.0,16105.0,18717.0,17846.0,16972.0,20302.0,16160.0,22246.0,27574.0,24219.0,23477.0,32147.0,31827.0,26477.0,29038.0,22479.0,22284.0,18019.0,18496.0,17370.0,17385.0,5092.0,17301.0,13170.0,14612.0,12852.0,15504.0,14358.0,15189.0,12732.0,14870.0,11595.0,11637.0,7664.0,7914.0,4653.0,6873.0,6843.0,7000.0,6888.0,9081.0
FRA,133690.0,130230.0,117390.0,121900.0,97830.0,102340.0,116990.0,84810.0,95390.0,90680.0,76510.0,41450.0,69330.0,49250.0,42400.0,30400.0,24110.0,36790.0,30000.0,25300.0,20100.0,27100.0,38000.0,35600.0,61560.0,60020.0,59500.0,74896.0,105825.0,121300.0,115042.0,127737.0,131042.0,128509.0,127305.0,120279.0,127088.0,113823.0,110256.0,115958.0,102810.0,105227.0,106723.0,115110.0,102306.0,94782.0,97316.0,111523.0,137132.0,120170.0,130400.0,124091.0,80801.0,83492.0,80858.0,81075.0,85408.0
FSM,6.0,6.0,7.0,7.0,7.0,12.0,24.0,33.0,45.0,52.0,63.0,70.0,73.0,75.0,78.0,80.0,83.0,85.0,87.0,90.0,93.0,95.0,90.0,95.0,90.0,90.0,90.0,90.0,90.0,102.0,,,,,90.0,93.0,94.0,96.0,97.0,99.0,100.0,102.0,104.0,106.0,107.0,109.0,100.0,120.0,128.0,137.0,145.0,160.0,165.0,153.0,155.0,156.0,159.0
GAB,785.0,553.0,673.0,997.0,1017.0,550.0,562.0,596.0,258.0,595.0,635.0,800.0,900.0,440.0,350.0,400.0,470.0,600.0,950.0,850.0,967.0,900.0,800.0,662.0,500.0,746.0,209.0,479.0,760.0,800.0,1000.0,735.0,400.0,800.0,830.0,867.0,897.0,929.0,961.0,1000.0,1018.0,1046.0,1075.0,1107.0,1139.0,1171.0,1100.0,1283.0,1351.0,1421.0,1492.0,1700.0,1700.0,1676.0,1651.0,1644.0,1678.0
GHA,30400.0,31000.0,32514.0,42877.0,32615.0,38000.0,52327.0,65332.0,60963.0,48800.0,54900.0,70100.0,62000.0,73200.0,71100.0,69800.0,109000.0,108000.0,93000.0,78000.0,97000.0,36000.0,40000.0,65000.0,80000.0,69600.0,80700.0,95000.0,73700.0,80900.0,150900.0,131500.0,157400.0,162300.0,201720.0,215720.0,197100.0,193600.0,209750.0,248700.0,274596.0,280000.0,238810.0,241807.0,287000.0,250000.0,185340.0,301920.0,391440.0,491603.0,463975.0,481134.0,569524.0,604000.0,641492.0,687679.0,721465.0
GIN,210940.0,220270.0,230015.0,240190.0,250810.0,261905.0,273490.0,285585.0,298215.0,311405.0,325180.0,339565.0,354580.0,370265.0,386640.0,403740.0,421600.0,440250.0,459720.0,480055.0,501290.0,523460.0,546610.0,570790.0,596035.0,622395.0,649925.0,678670.0,708690.0,740035.0,772765.0,806945.0,842635.0,879905.0,918825.0,959460.0,1001900.0,1046215.0,1092490.0,1140809.0,1033519.0,1088669.0,1146763.0,1207956.0,1272415.0,1340313.0,1401592.0,1534088.0,1455932.0,1613730.0,1792801.0,1918841.0,2053359.0,1970515.0,2047365.0,2136242.0,2229649.0
GMB,29465.0,30481.0,30990.0,36578.0,36883.0,36900.0,20321.0,37000.0,36578.0,40642.0,40642.0,30000.0,25500.0,26100.0,27200.0,18000.0,17200.0,28300.0,29400.0,42700.0,39500.0,33700.0,26100.0,27200.0,23100.0,24460.0,20430.0,29490.0,21230.0,21431.0,20528.0,19413.0,12056.0,20267.0,18952.0,18185.0,13000.0,18800.0,31700.0,34100.0,32600.0,20452.0,20500.0,32600.0,17934.0,31024.0,11395.0,38300.0,79000.0,99890.0,51136.0,54219.0,69704.0,46674.0,50832.0,55737.0,51081.0
GNB,50000.0,50000.0,50000.0,45000.0,47000.0,48000.0,45000.0,45000.0,27500.0,35000.0,27000.0,32000.0,28000.0,35000.0,67000.0,80000.0,60000.0,40000.0,40000.0,42000.0,80000.0,103150.0,85000.0,105000.0,105000.0,110000.0,105000.0,98297.0,110238.0,123314.0,123264.0,123612.0,125907.0,131017.0,133266.0,120207.0,99940.0,87200.0,80300.0,106081.0,85056.0,87865.0,88380.0,89192.0,98340.0,106000.0,127250.0,148757.0,181894.0,209240.0,175213.0,198504.0,209717.0,133000.0,170000.0,186000.0,187281.0
GRC,81247.0,68388.0,76861.0,106759.0,104461.0,80138.0,93425.0,102468.0,101404.0,78757.0,70494.0,74000.0,84458.0,105000.0,102000.0,69000.0,94000.0,95000.0,86700.0,80100.0,85900.0,82500.0,86300.0,95000.0,103765.0,121000.0,137000.0,125000.0,106202.0,99000.0,89000.0,106000.0,149476.0,191364.0,211599.0,221906.0,217377.0,189518.0,170465.0,140043.0,150187.0,165532.0,162443.0,168311.0,164966.0,179166.0,195340.0,185296.0,214964.0,208210.0,250685.0,230662.0,235939.0,229381.0,263646.0,177280.0,185250.0
GTM,12563.0,16359.0,18032.0,19900.0,13151.0,14698.0,20706.0,25061.0,14505.0,22663.0,38008.0,30407.0,25074.0,19644.0,27539.0,24104.0,24835.0,26344.0,36929.0,42334.0,33000.0,49010.0,45770.0,44450.0,38400.0,47932.0,58935.0,34736.0,44896.0,44427.0,47486.0,40436.0,47650.0,38810.0,30581.0,21358.0,21942.0,30692.0,48398.0,45223.0,28939.0,19219.0,19754.0,22004.0,24952.0,22407.0,21682.0,23972.0,28703.0,29624.0,30404.0,31135.0,32246.0,33616.0,32826.0,33747.0,33000.0
GUF,385.0,620.0,60.0,70.0,75.0,130.0,90.0,20.0,60.0,15.0,40.0,24.0,100.0,100.0,100.0,100.0,150.0,335.0,800.0,360.0,550.0,450.0,2476.0,5022.0,7810.0,8750.0,13030.0,14295.0,16422.0,21649.0,28500.0,24315.0,27549.0,25190.0,25276.0,30977.0,31243.0,24896.0,19883.0,19612.0,31544.0,22407.0,23461.0,25529.0,17774.0,15073.0,9597.0,7523.0,6563.0,5405.0,8700.0,8700.0,9000.0,3474.0,3360.0,3580.0,3580.0
GUY,215103.0,220991.0,163616.0,299507.0,246046.0,279901.0,222635.0,176000.0,191106.0,209697.0,185140.0,158566.0,168991.0,280524.0,292000.0,173000.0,355000.0,305000.0,240490.0,281762.0,275956.0,298334.0,246000.0,301833.0,256167.0,275500.0,243398.0,226761.0,237183.0,155740.0,251321.0,286000.0,336207.0,378432.0,525500.0,543437.0,568168.0,522907.0,562260.0,448740.0,495862.0,443654.0,546183.0,500911.0,420365.0,472363.0,458653.0,507036.0,553522.0,556193.0,619198.0,649320.0,823930.0,635238.0,687784.0,534450.0,630104.0
HKG,29891.0,19428.0,14500.0,12060.0,20800.0,16630.0,12196.0,17707.0,19082.0,16239.0,10650.0,7822.0,7000.0,3080.0,3540.0,3450.0,1380.0,350.0,100.0,70.0,30.0,20.0,12.0,24.0,15.0,11.0,5.0,3.0,3.0,2.0,,,,,,,0.0,0.0,0.0,0.0,0.0,0.0,0.0,0.0,0.0,,0.0,0.0,0.0,0.0,0.0,0.0,0.0,0.0,0.0,0.0,0.0
HND,11928.0,12336.0,10588.0,9859.0,10474.0,11195.0,11968.0,12794.0,13678.0,14622.0,15632.0,16711.0,19913.0,21288.0,34584.0,27519.0,29200.0,27032.0,31655.0,35865.0,36644.0,21916.0,46265.0,48597.0,45640.0,34253.0,59292.0,31917.0,46544.0,43970.0,54204.0,36742.0,30463.0,36609.0,34555.0,40134.0,50303.0,27760.0,12446.0,7262.0,11172.0,8781.0,26736.0,22409.0,21077.0,25973.0,46661.0,49544.0,44883.0,42186.0,49224.0,53755.0,49643.0,51574.0,53797.0,56160.0,58912.0
HTI,55000.0,60000.0,64000.0,68000.0,72000.0,76000.0,77000.0,77000.0,83000.0,80000.0,81000.0,92000.0,118477.0,119400.0,107500.0,131000.0,90481.0,113548.0,122116.0,119710.0,115800.0,113400.0,123940.0,124195.0,129195.0,135112.0,120830.0,120509.0,123900.0,129900.0,120000.0,125478.0,110000.0,105000.0,100000.0,120000.0,160000.0,101320.0,125000.0,130000.0,103000.0,107000.0,108500.0,105000.0,105000.0,110000.0,130000.0,110000.0,128300.0,141075.0,144063.0,147599.0,169300.0,143650.0,137000.0,152695.0,179000.0
HUN,38182.0,36355.0,48104.0,34888.0,21423.0,30955.0,43094.0,41119.0,50058.0,44639.0,67306.0,61420.0,68711.0,55782.0,68543.0,32269.0,35491.0,23313.0,41146.0,23906.0,39202.0,48390.0,46869.0,33097.0,38061.0,46530.0,39733.0,47404.0,28434.0,39356.0,20426.0,15041.0,12851.0,15059.0,13300.0,7009.0,7303.0,7647.0,7487.0,11255.0,7707.0,9768.0,11194.0,9595.0,9441.0,7801.0,9916.0,9985.0,11722.0,5893.0,9075.0,11270.0,8640.0,7910.0,9412.0,10767.0,9528.0
IDN,12084000.0,13004000.0,11595000.0,12306000.0,12975000.0,13650000.0,13222000.0,17162800.0,18020200.0,19331000.0,20190000.0,19393600.0,21489500.0,22473008.0,22339200.0,23300944.0,23347136.0,25771600.0,26282656.0,29651904.0,32774176.0,33583696.0,35303008.0,38136448.0,39032944.0,39726768.0,40078192.0,41676176.0,44725584.0,45178752.0,44688240.0,48240008.0,48181088.0,46641500.0,49744140.0,51101504.0,49377056.0,49236700.0,50866388.0,51898000.0,50460800.0,51489696.0,52137600.0,54088468.0,54151096.0,54454936.0,57157436.0,60251072.0,64398888.0,66469392.0,65756904.0,69056128.0,71279712.0,70846465.0,75397841.0,79355000.0,81382000.0
IND,53494496.0,49825552.0,55497008.0,58962000.0,45883504.0,45657008.0,56418304.0,59641808.0,60644544.0,63337808.0,64602000.0,58867952.0,66077008.0,59650000.0,73352000.0,63051904.0,79005600.0,80608496.0,63475696.0,80312000.0,79883008.0,70771696.0,90048000.0,87552800.0,95817696.0,90779408.0,85338704.0,106368800.0,110310608.0,111517408.0,112042000.0,109001200.0,120400000.0,122640000.0,115440000.0,122500000.0,123700000.0,129055000.0,134495904.0,127464896.0,139900000.0,107730304.0,132789000.0,124697104.0,137690096.0,139136992.0,144570000.0,148036000.0,135672992.0,143963008.0,157900000.0,157800000.0,159200000.0,157200000.0,156540000.0,163700000.0,168500000.0
IRN,600000.0,851000.0,861000.0,923000.0,1022000.0,1098000.0,960000.0,980000.0,1020000.0,1056000.0,1046000.0,1200000.0,1334000.0,1313000.0,1430000.0,1566300.0,1399750.0,1527311.0,1248160.0,1310550.0,1623669.0,1605152.0,1215581.0,1483976.0,1776085.0,1783930.0,1803282.0,1418324.0,1854012.0,1981019.0,2356593.0,2360138.0,2280764.0,2258969.0,2300901.0,2684767.0,2350124.0,2770574.0,2348241.0,1972505.0,1990223.0,2887541.0,2931138.0,2542443.0,2736843.0,2612175.0,2664237.0,2070003.0,2137006.0,2489999.0,1893013.0,2360000.0,2449995.0,2347291.0,2347701.0,2921046.0,2639101.0
IRQ,68453.0,113100.0,143216.0,184350.0,178434.0,182087.0,314921.0,353500.0,318000.0,180200.0,306700.0,268000.0,156620.0,69290.0,60540.0,163360.0,199240.0,172000.0,157800.0,166900.0,162200.0,163400.0,110500.0,108700.0,148900.0,141200.0,195900.0,140600.0,231800.0,228800.0,189103.0,180000.0,206000.0,383000.0,315000.0,270000.0,244000.0,300000.0,180000.0,60000.0,128000.0,250000.0,90000.0,250000.0,309000.0,363000.0,393000.0,248157.0,173074.0,155829.0,235118.0,361339.0,451849.0,403028.0,109209.0,181320.0,265852.0
ITA,699800.0,663000.0,564300.0,624000.0,508900.0,621000.0,744700.0,648100.0,861900.0,818500.0,892300.0,751000.0,1027300.0,1025700.0,991500.0,884700.0,682400.0,947200.0,1107200.0,967700.0,893300.0,1007800.0,1021300.0,1008800.0,1122700.0,1137200.0,1064300.0,1093300.0,1245900.0,1290700.0,1235600.0,1271581.0,1305100.0,1360520.0,1320850.0,1424000.0,1442419.0,1393524.0,1427100.0,1229767.0,1272952.0,1371100.0,1402350.0,1523436.0,1412957.0,1419129.0,1540087.0,1388900.0,1620400.0,1516400.0,1490150.0,1601478.0,1433111.0,1386100.0,1518229.0,1598027.0,1587346.0
JAM,4877.0,5080.0,5588.0,2743.0,2439.0,1390.0,737.0,601.0,711.0,610.0,486.0,161.0,244.0,290.0,2661.0,1984.0,1311.0,2409.0,1217.0,2389.0,1860.0,1536.0,3387.0,5364.0,4260.0,2471.0,2257.0,1731.0,516.0,220.0,562.0,506.0,269.0,253.0,158.0,30.0,29.0,30.0,31.0,12.0,33.0,10.0,14.0,10.0,3.0,2.0,65.0,100.0,150.0,264.0,235.0,301.0,42.0,22.0,18.0,14.0,1.0
JPN,16160440.0,16927100.0,16648830.0,16356100.0,16126060.0,16564000.0,18782000.0,18779010.0,18200000.0,16493000.0,14148000.0,15450500.0,15778000.0,15964000.0,17097010.0,15228000.0,17006000.0,15736000.0,14948000.0,12189000.0,12824000.0,12838000.0,12958000.0,14848000.0,14578000.0,14559000.0,13284000.0,12419000.0,12934000.0,13124000.0,12005000.0,13216000.0,9793000.0,14976000.0,13435000.0,12930000.0,12531000.0,11200000.0,11468800.0,11863000.0,11320000.0,11111000.0,9740000.0,10912000.0,11342000.0,10695000.0,10893000.0,11028750.0,10592000.0,10604000.0,10500000.0,10654000.0,10758000.0,10549000.0,9986000.0,10055000.0,9780000.0
KAZ,,,,,,,,,,,,,,,,,,,,,,,,,,,,,,,,467000.0,403000.0,283000.0,184450.0,226240.0,255350.0,236070.0,199300.0,214300.0,198700.0,199089.0,273340.0,275849.0,284570.0,288780.0,294350.0,254710.0,306960.0,373150.0,346758.0,350831.0,344305.0,377041.0,422225.0,447830.0,489485.0
KEN,14530.0,15200.0,13000.0,13200.0,14100.0,16600.0,15938.0,18747.0,22700.0,28500.0,30000.0,34943.0,36128.0,33210.0,32113.0,40425.0,41415.0,42526.0,37466.0,38415.0,37207.0,41207.0,44554.0,50462.0,38709.0,45662.0,45000.0,50000.0,56680.0,41088.0,50500.0,44203.0,47000.0,47000.0,44000.0,50620.0,41075.0,41829.0,52711.0,52349.0,45000.0,45000.0,40502.0,49295.0,62677.0,64840.0,47256.0,21881.0,42202.0,85536.0,111229.0,138204.0,125256.0,112263.0,116473.0,101510.0,81198.0
KGZ,,,,,,,,,,,,,,,,,,,,,,,,,,,,,,,,2800.0,2400.0,3900.0,6700.0,9200.0,11700.0,11023.0,15066.0,18991.0,16557.0,20811.0,18342.0,18344.0,17067.0,18713.0,17269.0,17700.0,20710.0,20861.0,19432.0,23069.0,27220.0,28230.0,30208.0,34847.0,38180.0
KHM,2383000.0,2039000.0,2622000.0,2760000.0,2500000.0,2376000.0,2457000.0,3251000.0,2503000.0,3814000.0,2732000.0,1927000.0,1050000.0,635000.0,1080000.0,1100000.0,1000000.0,1000000.0,538000.0,1717000.0,1490000.0,1949000.0,2039000.0,1260000.0,1812000.0,2093000.0,1815000.0,2500000.0,2672000.0,2500000.0,2400000.0,2221000.0,2383350.0,2223500.0,3447800.0,3404000.0,3414917.0,3509871.0,4040900.0,4026092.0,4099016.0,3822509.0,4710957.0,4170284.0,5986200.0,6264123.0,6727000.0,7175473.0,7585870.0,8245320.0,8779000.0,9290940.0,9390000.0,9324000.0,9335000.0,9952000.0,10350000.0
KOR,4679000.0,4074000.0,5079000.0,5344000.0,4867000.0,5448000.0,5008000.0,4442000.0,5688000.0,5476000.0,5557000.0,5496000.0,5850000.0,6174000.0,6485000.0,7249000.0,8348000.0,8532000.0,7880937.0,5311406.0,7148703.0,7307855.0,7607540.0,7970330.0,7855262.0,7871368.0,7595760.0,8260162.0,8099953.0,7721968.0,7292534.0,7256894.0,6403875.0,6826167.0,6388773.0,7122866.0,7314885.0,6790125.0,7065900.0,7196582.0,7406517.0,6687225.0,6151202.0,6736925.0,6434972.0,6305492.0,5961493.0,6468281.0,6502249.0,5810817.0,5615916.0,5405155.0,5631689.0,5637682.0,5771026.0,5624607.0,5284348.0
LAO,540000.0,510000.0,520000.0,735000.0,740000.0,754000.0,811000.0,771000.0,895503.0,903231.0,811284.0,816830.0,883510.0,904714.0,910000.0,660938.0,692700.0,723800.0,866940.0,1053097.0,1154665.0,1092350.0,1100587.0,1321096.0,1395177.0,1449301.0,1207156.0,1003389.0,1404100.0,1491495.0,1223830.0,1502361.0,1250630.0,1577023.0,1417829.0,1413500.0,1660000.0,1674500.0,2102815.0,2201700.0,2334700.0,2416500.0,2375100.0,2529000.0,2568000.0,2663700.0,2710050.0,2969910.0,3144800.0,3070640.0,3065760.0,3489210.0,3414560.0,4002425.0,4102000.0,4148800.0,4039779.0
LBR,115000.0,120000.0,125000.0,130000.0,135000.0,141000.0,142000.0,152000.0,163000.0,190000.0,200000.0,210000.0,225000.0,248000.0,229000.0,245000.0,256000.0,244000.0,249000.0,243000.0,269000.0,284000.0,290000.0,298000.0,289000.0,288000.0,297700.0,297700.0,294090.0,180000.0,100000.0,110000.0,65000.0,50000.0,56200.0,94450.0,168400.0,209400.0,196300.0,183400.0,145000.0,110000.0,100000.0,110000.0,154800.0,164000.0,231800.0,295150.0,293000.0,296090.0,290117.0,291000.0,270000.0,237000.0,286000.0,311289.0,302692.0
LKA,923024.0,1029194.0,1045908.0,1074049.0,764158.0,980746.0,1158154.0,1359542.0,1375959.0,1615932.0,1395780.0,1312450.0,1312420.0,1602311.0,1154161.0,1252624.0,1677294.0,1890493.0,1917223.0,2133199.0,2229346.0,2155629.0,2483526.0,2419700.0,2661211.0,2588177.0,2127832.0,2476613.0,2063437.0,2538000.0,2389000.0,2339700.0,2570000.0,2683690.0,2809890.0,2061520.0,2239370.0,2692340.0,2857100.0,2859900.0,2695080.0,2859480.0,3071200.0,2628000.0,3246000.0,3342000.0,3131000.0,3875000.0,3651670.0,4300620.0,3894890.0,3845941.0,4621000.0,3381000.0,3230796.0,2961867.0,1620544.0
MAR,15000.0,17000.0,20000.0,25000.0,21000.0,24800.0,27500.0,41000.0,51000.0,40000.0,2700.0,13900.0,10440.0,12250.0,29200.0,17960.0,23810.0,22000.0,19000.0,28740.0,19340.0,3640.0,3980.0,4540.0,1730.0,20480.0,48950.0,33380.0,4410.0,3340.0,24580.0,22100.0,53500.0,69550.0,3470.0,53360.0,32040.0,20020.0,34650.0,25200.0,39580.0,26530.0,16900.0,29500.0,42840.0,34000.0,33150.0,44520.0,50040.0,50520.0,17840.0,69554.0,37716.0,33051.0,63298.0,53354.0,57698.0
MDG,1465000.0,1552000.0,1559000.0,1648080.0,1589345.0,1602800.0,1706400.0,1796500.0,1844000.0,1945900.0,1893000.0,1923600.0,1913300.0,2013445.0,1972100.0,2042500.0,2067265.0,1922000.0,2044935.0,2108910.0,2011480.0,1969905.0,2147000.0,2131100.0,2177680.0,2230205.0,2178000.0,2149000.0,2380000.0,2420000.0,2342200.0,2450000.0,2550000.0,2357000.0,2450000.0,2500000.0,2558000.0,2447000.0,2570000.0,2480470.0,2662465.0,2603965.0,2800000.0,3030000.0,3392459.0,3487930.0,3595755.0,3914175.0,4540435.0,4737965.0,4300185.0,4550649.0,3610626.0,3977863.0,3722304.0,3815849.0,3100000.0
MEX,332944.0,288972.0,296373.0,274430.0,377531.0,372227.0,417888.0,347249.0,394938.0,405385.0,369167.0,403192.0,450575.0,491608.0,716628.0,463432.0,567338.0,401780.0,493794.0,445364.0,709611.0,515741.0,421050.0,487133.0,807529.0,544632.0,590999.0,456548.0,527118.0,394388.0,347245.0,394022.0,287180.0,373616.0,367030.0,394075.0,469455.0,458112.0,394434.0,351447.0,226639.0,227194.0,273300.0,278500.0,291149.0,337250.0,294697.0,224371.0,263028.0,216676.0,173461.0,178787.0,179776.0,232159.0,236018.0,254043.0,265567.0
MKD,,,,,,,,,,,,,,,,,,,,,,,,,,,,,,,,42698.0,9433.0,8713.0,6447.0,22274.0,24600.0,22663.0,17430.0,18433.0,7900.0,8860.0,13042.0,14676.0,12570.0,13949.0,15355.0,16140.0,19870.0,25700.0,26964.0,24361.0,27921.0,30500.0,30527.0,24792.0,17080.0
MLI,185000.0,190000.0,165000.0,157800.0,162000.0,158000.0,169300.0,135700.0,156500.0,169400.0,156800.0,110000.0,125000.0,220000.0,259000.0,227000.0,199000.0,158292.0,240116.0,131553.0,134755.0,152633.0,216000.0,109354.0,213841.0,225138.0,236568.0,287797.0,337749.0,282366.0,454349.0,410018.0,427609.0,469127.0,476090.0,627405.0,575745.0,717856.0,727140.0,742808.0,940938.0,693203.0,938217.0,718086.0,945823.0,1053236.0,1082384.0,1624246.0,1614408.0,1296154.0,1741472.0,2076423.0,1977669.0,2166830.0,2331053.0,2780905.0,2780905.0
MMR,6834100.0,7664700.0,7782900.0,8507700.0,8055100.0,6636400.0,7769400.0,8022900.0,7984700.0,8161900.0,8175000.0,7356800.0,8601900.0,8583400.0,9207700.0,9319300.0,9462000.0,10528300.0,10447900.0,13317400.0,14146600.0,14373400.0,14288100.0,14255500.0,14317048.0,14127100.0,13638400.0,13167100.0,13806500.0,13971800.0,12992900.0,14603000.0,16495000.0,17907700.0,17669600.0,17397000.0,16391200.0,16807800.0,20126038.0,20986900.0,21569200.0,21460700.0,22770200.0,24360900.0,27245800.0,30435000.0,30954000.0,32058500.0,32165800.0,32065100.0,28552100.0,26216600.0,26372100.0,26423300.0,26210318.0,25672832.0,25624866.0
MOZ,85000.0,85000.0,100000.0,105000.0,93000.0,79000.0,85000.0,78426.0,88500.0,98757.0,110743.0,100000.0,119000.0,120000.0,101000.0,45000.0,68000.0,52000.0,70000.0,75000.0,78000.0,80000.0,82000.0,84000.0,86000.0,93000.0,90000.0,93000.0,95000.0,96355.0,56341.0,32618.0,65615.0,101212.0,112982.0,139000.0,180218.0,191000.0,186087.0,180806.0,166945.0,93362.0,117491.0,91242.0,64634.0,97610.0,103007.0,88177.0,179000.0,257527.0,271402.0,203102.0,114012.0,155741.0,128197.0,107977.0,110000.0
MRT,500.0,500.0,600.0,700.0,650.0,700.0,400.0,514.0,497.0,1370.0,1370.0,2500.0,3000.0,3000.0,3840.0,3960.0,3600.0,3300.0,9300.0,10800.0,15000.0,20000.0,22000.0,20000.0,25000.0,33000.0,52900.0,50949.0,55067.0,51796.0,41678.0,50718.0,64925.0,45400.0,52813.0,66748.0,80942.0,101900.0,86463.0,76200.0,58809.0,77409.0,79000.0,85530.0,72000.0,70462.0,82165.0,82163.0,53569.0,134447.0,158021.0,184217.0,202547.0,293219.0,223285.0,218656.0,249990.0
MUS,,,,,,,,118.0,813.0,906.0,1084.0,1149.0,883.0,668.0,496.0,465.0,275.0,197.0,38.0,159.0,127.0,10.0,145.0,275.0,135.0,175.0,40.0,20.0,20.0,19.0,10.0,5.0,,,,,,,,,,,,,,,,79.0,161.0,156.0,316.0,831.0,646.0,1186.0,657.0,352.0,160.0
MWI,9404.0,4601.0,4603.0,4717.0,5443.0,11000.0,12000.0,9100.0,17200.0,21772.0,30800.0,41700.0,68000.0,61000.0,77000.0,90000.0,85000.0,92000.0,44000.0,38000.0,36000.0,37000.0,25948.0,34886.0,34265.0,37407.0,28432.0,32321.0,45690.0,43280.0,63175.0,23798.0,65357.0,41128.0,52077.0,72629.0,65690.0,68679.0,92833.0,71601.0,93150.0,92027.0,88184.0,49722.0,41270.0,91450.0,113166.0,114885.0,135988.0,110106.0,117733.0,110964.0,125156.0,132002.0,111437.0,83757.0,121079.0
MYS,1089075.0,1125343.0,1190214.0,1109782.0,1255608.0,1226678.0,1205068.0,1433953.0,1590596.0,1681415.0,1816922.0,1837324.0,1979944.0,2095000.0,1997000.0,1995000.0,1898000.0,1498000.0,2095000.0,2044604.0,2019900.0,1883604.0,1734325.0,1571674.0,1745367.0,1718215.0,1626699.0,1696239.0,1743444.0,1884984.0,1926354.0,2012732.0,2104447.0,2138788.0,2127271.0,2228489.0,2119615.0,1944240.0,2036641.0,2140800.0,2094995.0,2197351.0,2257000.0,2264000.0,2314000.0,2187000.0,2375000.0,2353000.0,2511043.0,2464830.0,2575988.0,2599382.0,2603654.0,1834831.0,2741404.0,2739606.0,2901894.0
NER,9550.0,11196.0,10050.0,11790.0,11704.0,20500.0,32522.0,39033.0,38000.0,37100.0,27300.0,31800.0,46309.0,30176.0,29320.0,28700.0,26600.0,31600.0,23763.0,29900.0,38900.0,41200.0,44800.0,48700.0,56700.0,75300.0,60754.0,52900.0,76953.0,72260.0,74695.0,47600.0,78700.0,62000.0,51000.0,51200.0,83200.0,58200.0,61989.0,60453.0,76400.0,75467.0,58080.0,72367.0,56221.0,60360.0,60158.0,61025.0,79207.0,102820.0,74133.0,71289.0,87106.0,103941.0,90831.0,104392.0,112632.0
NGA,133000.0,257000.0,195000.0,220000.0,231000.0,199000.0,385000.0,353000.0,325000.0,343000.0,388000.0,447000.0,487000.0,525000.0,504000.0,218000.0,408000.0,515000.0,750000.0,1090000.0,1241000.0,1250000.0,1280000.0,1300000.0,1430000.0,1416322.0,1780000.0,2081000.0,3303000.0,2500000.0,3226000.0,3260000.0,3065000.0,2427000.0,2920000.0,3122000.0,3268000.0,3275000.0,3277000.0,3298000.0,2752000.0,2928000.0,3116000.0,3334000.0,3567000.0,4042000.0,3186000.0,4179000.0,3546250.0,4472520.0,4612614.0,5432930.0,4823330.0,6002831.0,6256228.0,11346076.0,9864277.0
NIC,38659.0,36848.0,46600.0,48400.0,53500.0,63200.0,68000.0,86800.0,67483.0,80739.0,81784.0,74262.0,78481.0,79971.0,89000.0,56641.0,76203.0,85246.0,114605.0,112000.0,163826.0,176267.0,171000.0,138000.0,143992.0,111770.0,127980.0,111468.0,104310.0,120890.0,131150.0,154000.0,201201.0,189056.0,232456.0,230323.0,256588.0,290250.0,205610.0,289600.0,246201.0,293456.0,297530.0,258510.0,316713.0,319569.0,269869.0,285066.0,334516.0,453990.0,413321.0,418656.0,371934.0,369048.0,365096.0,418079.0,422612.0
NPL,2108000.0,2108321.0,2109000.0,2201000.0,2207000.0,2007300.0,2119429.0,2178255.0,2241233.0,2304204.0,2343826.0,2010446.0,2416054.0,2452268.0,2604751.0,2386272.0,2282430.0,2339280.0,2059930.0,2464310.0,2560080.0,1832620.0,2756980.0,2709430.0,2804490.0,2372020.0,2981780.0,3283210.0,3389670.0,3502160.0,3222540.0,2584900.0,3495590.0,2906180.0,3578830.0,3710650.0,3640860.0,3699770.0,3834290.0,4216465.0,4164687.0,4132600.0,4132500.0,4455722.0,4289827.0,4209279.0,3680839.0,4299264.0,4523693.0,4023823.0,4460278.0,5072248.0,4504503.0,5047047.0,4788612.0,4299079.0,5230327.0
PAK,1690000.0,1643000.0,1788000.0,2025000.0,1975000.0,2047000.0,2248000.0,3048000.0,3601000.0,3298400.0,3392600.0,3495212.0,3681984.0,3470148.0,3926184.0,4106178.0,4424406.0,4908000.0,4823700.0,4684800.0,5144550.0,5167050.0,5009250.0,4972800.0,4378400.0,5230000.0,4861400.0,4800300.0,4830150.0,4891200.0,4864650.0,4674150.0,5992050.0,5169750.0,5949750.0,6457200.0,6499500.0,7011400.0,7733417.0,7203900.0,5823000.0,6717750.0,7271400.0,7537200.0,8320800.0,8157600.0,8345100.0,10428000.0,10324050.0,7234950.0,9240600.0,8303850.0,10467150.0,10504200.0,10201840.0,10273500.0,11174700.0
PAN,108905.0,109703.0,111146.0,127743.0,151472.0,140105.0,150926.0,163038.0,165243.0,131160.0,136175.0,125221.0,162049.0,178334.0,184797.0,144435.0,186189.0,162384.0,160550.0,169720.0,195160.0,176310.0,199420.0,174595.0,186144.0,180252.0,180061.0,182851.0,207159.0,222294.0,197026.0,198541.0,210003.0,223865.0,221779.0,230560.0,153485.0,232375.0,224341.0,253557.0,338168.0,355396.0,402461.0,283486.0,289197.0,289238.0,293039.0,314118.0,299503.0,275025.0,291120.0,248205.0,287396.0,255136.0,281980.0,255105.0,310000.0
PER,331877.0,391361.0,269860.0,351475.0,290520.0,374032.0,461420.0,286195.0,444432.0,586721.0,591111.0,482326.0,483471.0,494237.0,536835.0,570415.0,594010.0,467758.0,560399.0,441233.0,760176.0,825730.0,799032.0,1139997.0,878279.0,725915.0,1168600.0,1129240.0,1091430.0,966101.0,814168.0,829373.0,967627.0,1401393.0,1141550.0,1203168.0,1459830.0,1548780.0,1955027.0,1892100.0,2026970.0,2118679.0,2132405.0,1844896.0,2468357.0,2362260.0,2256000.0,2775800.0,2991157.0,2831374.0,2624458.0,3043330.0,3050934.0,2896613.0,3151408.0,3165749.0,3038524.0
PHL,3910100.0,3966980.0,3842860.0,3992400.0,4072636.0,4094020.0,4560700.0,4444656.0,5464075.0,5578405.0,5324875.0,4609505.0,5158898.0,5615265.0,6112039.0,6542610.0,7254390.0,7211620.0,7684795.0,7646490.0,7910735.0,8533730.0,7294910.0,7828880.0,8805600.0,9246790.0,8539852.0,8970919.0,9458772.0,9885000.0,9673262.0,9128940.0,9434208.0,10538054.0,10540649.0,11283568.0,11268963.0,8554824.0,11786625.0,12389412.0,12954870.0,13270653.0,13499884.0,14496784.0,14603005.0,15326706.0,16240194.0,16815548.0,16266417.0,15772319.0,16684062.0,18032525.0,18439420.0,18967826.0,18149838.0,17627245.0,19276347.0
PNG,1600.0,1600.0,1600.0,1500.0,1500.0,1500.0,1500.0,1471.0,1793.0,1675.0,2244.0,1547.0,1056.0,1146.0,1740.0,2000.0,1247.0,999.0,728.0,512.0,319.0,500.0,600.0,600.0,600.0,600.0,600.0,600.0,600.0,620.0,620.0,620.0,630.0,650.0,650.0,650.0,600.0,600.0,650.0,700.0,800.0,805.0,800.0,800.0,800.0,800.0,800.0,800.0,802.0,822.0,823.0,828.0,833.0,838.0,843.0,849.0,854.0
PRI,2900.0,2900.0,3200.0,3300.0,3300.0,3500.0,4000.0,4400.0,4500.0,4600.0,4600.0,4600.0,4600.0,4600.0,4800.0,4800.0,5400.0,5400.0,5800.0,5800.0,6400.0,6400.0,6263.0,4833.0,5136.0,5539.0,1967.0,1600.0,160.0,,,,,,,,,6.0,8.0,10.0,12.0,14.0,16.0,18.0,,,,26.0,29.0,33.0,37.0,41.0,46.0,49.0,293.0,158.0,84.0
PRK,1809000.0,1897100.0,2072500.0,2176100.0,1905000.0,2128300.0,1976800.0,1913000.0,2343400.0,2327500.0,2407200.0,2311500.0,2598500.0,2710000.0,2813700.0,2853600.0,3060900.0,2957200.0,3060100.0,2646400.0,3044900.0,2010000.0,2064000.0,2193000.0,2113000.0,2387000.0,2219000.0,2129000.0,2142000.0,1800000.0,4120000.0,4500000.0,4787000.0,3177000.0,2016000.0,1426000.0,1527000.0,2307000.0,2343000.0,1690000.0,2060200.0,2186000.0,2244000.0,2370000.0,2583400.0,2478500.0,1869500.0,2862000.0,2336000.0,2426000.0,2479000.0,2861000.0,2901000.0,2626000.0,2948200.0,2536400.0,2383277.0
PRT,177384.0,173500.0,166273.0,181400.0,136557.0,154025.0,146035.0,149023.0,175805.0,194677.0,161574.0,163900.0,167558.0,129500.0,132736.0,97235.0,95000.0,134906.0,145270.0,154768.0,111887.0,143394.0,109059.0,134054.0,146525.0,146618.0,141702.0,143357.0,144269.0,156072.0,170477.0,109704.0,69000.0,131741.0,124554.0,172230.0,164189.0,161774.0,151650.0,142611.0,145932.0,145905.0,147802.0,155799.0,125947.0,148673.0,156203.0,150680.0,161761.0,170216.0,185016.0,187028.0,180155.0,167322.0,184918.0,169289.0,179777.0
PRY,18700.0,16800.0,16000.0,20000.0,21600.0,10100.0,18170.0,20802.0,27157.0,45218.0,47200.0,38800.0,41614.0,50688.0,55869.0,56748.0,68677.0,58233.0,56894.0,40800.0,44500.0,63100.0,72641.0,79700.0,97207.0,62406.0,105239.0,81394.0,87466.0,85701.0,33917.0,44180.0,68358.0,72146.0,80146.0,76282.0,81465.0,80921.0,128093.0,101049.0,106179.0,104973.0,110250.0,125000.0,102000.0,126000.0,130000.0,144692.0,215000.0,315213.0,408246.0,396000.0,617400.0,804000.0,857771.0,858000.0,924000.0
ROU,31000.0,20100.0,51300.0,53800.0,45816.0,55500.0,68497.0,60281.0,68372.0,65177.0,66500.0,45000.0,50000.0,53000.0,68500.0,37400.0,46600.0,57900.0,60100.0,38700.0,47700.0,45700.0,82800.0,110000.0,137000.0,152600.0,115500.0,131600.0,70200.0,66500.0,31449.0,38920.0,36448.0,15229.0,24066.0,23100.0,10669.0,5142.0,3813.0,3551.0,1459.0,597.0,253.0,4963.0,14251.0,18420.0,27518.0,48917.0,72418.0,61588.0,65261.0,50862.0,54646.0,45159.0,49773.0,43635.0,42810.0
RUS,,,,,,,,,,,,,,,,,,,,,,,,,,,,,,,,753630.0,687523.0,523232.0,461920.0,388976.0,328072.0,412166.0,443394.0,584312.0,495536.0,488133.0,448116.0,469802.0,570816.0,680610.0,704544.0,738300.0,912969.0,1060658.0,1055574.0,1051891.0,934943.0,1048566.0,1109762.0,1080886.0,986620.0
RWA,,,,,,,207.0,662.0,1144.0,1360.0,1477.0,1638.0,2508.0,2229.0,2583.0,2668.0,3265.0,3288.0,3494.0,4430.0,5757.0,5586.0,7153.0,7919.0,4000.0,8440.0,6116.0,6892.0,8100.0,9305.0,16400.0,16100.0,13200.0,4500.0,2300.0,6596.0,9805.0,7935.0,8919.0,11654.0,15610.0,20976.0,27891.0,46191.0,62194.0,62932.0,62000.0,82000.0,81081.0,67253.0,80541.0,84079.0,93746.0,72723.0,97435.0,110544.0,108958.0
SAU,2800.0,2120.0,2248.0,2500.0,4200.0,3000.0,3000.0,3000.0,3000.0,3000.0,1520.0,68.0,180.0,180.0,200.0,200.0,460.0,385.0,538.0,88.0,,,,,,,,,,,,,,,,,,,,,,,,,,,,,,,,,,,,,
SDN,,,,,,,,,,,,,,,,,,,,,,,,,,,,,,,,,,,,,,,,,,,,,,,,,,,,24000.0,25000.0,16900.0,32000.0,28000.0,27422.0
SEN,83100.0,77000.0,106000.0,110000.0,122275.0,125338.0,137500.0,58300.0,155900.0,90500.0,108200.0,36700.0,64340.0,116975.0,115707.0,115200.0,62918.0,147045.0,96567.0,64658.0,127032.0,118571.0,108540.0,135828.0,147005.0,142792.0,135793.0,146405.0,168227.0,181119.0,169800.0,177346.0,193374.0,162228.0,155152.0,148780.0,173702.0,123519.0,364000.0,202293.0,206989.0,172395.0,231805.0,201744.0,279080.0,190493.0,193379.0,408219.0,502104.0,604043.0,405824.0,469649.0,436153.0,559021.0,906348.0,863875.0,714354.0
SLB,200.0,220.0,240.0,260.0,280.0,305.0,152.0,2032.0,1422.0,1930.0,2997.0,1321.0,1219.0,1220.0,1237.0,3829.0,6269.0,7658.0,10224.0,14256.0,13866.0,10538.0,9481.0,7137.0,5954.0,6500.0,,,,925.0,2589.0,2596.0,2604.0,2611.0,2619.0,2570.0,1932.0,1300.0,3240.0,4524.0,2083.0,2267.0,1947.0,2500.0,3000.0,3250.0,2800.0,2800.0,2500.0,2617.0,2777.0,2751.0,2759.0,2766.0,2774.0,2781.0,2789.0
SLE,264000.0,314976.0,331000.0,373000.0,399000.0,434000.0,468000.0,426100.0,507000.0,450000.0,464000.0,479000.0,479000.0,518700.0,570600.0,580000.0,600000.0,620000.0,500000.0,513000.0,500000.0,523500.0,460200.0,504137.0,430000.0,524989.0,465675.0,493000.0,517800.0,503700.0,503700.0,478515.0,486300.0,405200.0,355500.0,391700.0,411300.0,328310.0,247235.0,199134.0,300000.0,422066.0,445633.0,542000.0,738000.0,1062320.0,588004.0,680097.0,888417.0,1026671.0,1129338.0,1141417.0,1255559.0,1204020.0,871693.0,1560363.0,1400000.0
SLV,17882.0,25634.0,20637.0,33077.0,34875.0,50427.0,77847.0,79616.0,35682.0,44231.0,54846.0,35632.0,37237.0,32094.0,60720.0,35701.0,32800.0,50807.0,58245.0,60720.0,50130.0,35420.0,43240.0,63337.0,68890.0,46938.0,42069.0,57270.0,63719.0,61691.0,61438.0,71962.0,74474.0,64639.0,51106.0,55292.0,66055.0,51377.0,57364.0,47204.0,37720.0,29098.0,22515.0,26519.0,25984.0,31011.0,31540.0,35218.0,40188.0,34479.0,25589.0,28325.0,36254.0,41838.0,38782.0,27617.0,26000.0
SOM,,,,,,,,,,1000.0,1400.0,2600.0,1600.0,1700.0,3300.0,3600.0,8000.0,11400.0,12400.0,16100.0,19500.0,19000.0,3900.0,4200.0,10600.0,11900.0,12000.0,12000.0,19700.0,15000.0,10000.0,15000.0,5000.0,1650.0,2000.0,2888.0,2809.0,2000.0,2000.0,2000.0,4000.0,12000.0,12000.0,18000.0,14509.0,14339.0,16000.0,10014.0,5200.0,8580.0,4270.0,5356.0,1970.0,600.0,2450.0,1375.0,2222.0
SWZ,4173.0,5767.0,6709.0,6314.0,5942.0,6568.0,6359.0,5625.0,7983.0,7348.0,7111.0,5639.0,4537.0,3614.0,4418.0,5073.0,5000.0,5000.0,5000.0,5000.0,3000.0,1614.0,1593.0,2574.0,3000.0,3000.0,3000.0,3000.0,3000.0,3312.0,3000.0,1839.0,1000.0,916.0,1000.0,265.0,411.0,105.0,100.0,170.0,78.0,53.0,117.0,117.0,117.0,117.0,117.0,117.0,117.0,117.0,117.0,117.0,117.0,117.0,117.0,117.0,117.0
SYR,500.0,1091.0,1138.0,1200.0,2100.0,2130.0,2115.0,7612.0,2426.0,1192.0,445.0,414.0,20.0,2397.0,5218.0,1147.0,150.0,100.0,100.0,90.0,100.0,100.0,100.0,100.0,100.0,100.0,100.0,100.0,100.0,117.0,126.0,141.0,152.0,173.0,175.0,100.0,,,,,,,,,,,,,,,,,,,,,
TCD,23000.0,23500.0,34000.0,38000.0,25000.0,36955.0,32305.0,35000.0,36650.0,39454.0,51185.0,40000.0,42000.0,36630.0,38950.0,50000.0,20000.0,20700.0,25700.0,46800.0,43800.0,23300.0,18029.0,12374.0,7824.0,14880.0,19497.0,73863.0,105974.0,66027.0,117725.0,108211.0,23104.0,90548.0,78978.0,97728.0,112288.0,100230.0,158282.0,92624.0,112167.0,134880.0,126024.0,91083.0,145667.0,112380.0,106378.0,173992.0,130704.0,186118.0,172687.0,188911.0,378426.0,304112.0,243478.0,257701.0,263555.0
TGO,19000.0,17788.0,22927.0,27500.0,15678.0,18000.0,28030.0,18000.0,15000.0,14580.0,23790.0,13000.0,12500.0,13810.0,15120.0,15250.0,15519.0,17005.0,14642.0,14700.0,14512.0,16304.0,10033.0,17760.0,15185.0,19805.0,23192.0,28682.0,27722.0,25149.0,39789.0,25265.0,33769.0,50080.0,51226.0,76515.0,86211.0,86663.0,81061.0,62306.0,62048.0,69242.0,62048.0,68515.0,72858.0,76284.0,74843.0,85540.0,121295.0,110109.0,112233.0,160939.0,260418.0,147930.0,140952.0,137106.0,140519.0
THA,10150000.0,11250000.0,12171000.0,11600000.0,11164000.0,13500000.0,11198000.0,12410000.0,13410000.0,13850000.0,13744000.0,12413000.0,14899000.0,13386000.0,15300000.0,15068000.0,13921000.0,17470000.0,15758000.0,17368096.0,17774320.0,16878512.0,19548944.0,19904816.0,20263872.0,18868160.0,18428272.0,21262896.0,20601008.0,17193216.0,20400000.0,19917299.0,18447260.0,21110714.0,22015481.0,22331638.0,23580080.0,22998414.0,24171412.0,25843878.0,29099915.0,28321137.0,29820271.0,28873975.0,30648248.0,29990602.0,32477032.0,32022992.0,32397856.0,35702946.0,38102720.0,38100189.0,36762277.0,32620160.0,27702191.0,26652995.0,33383382.0
TJK,,,,,,,,,,,,,,,,,,,,,,,,,,,,,,,,20184.0,22700.0,20000.0,21600.0,20722.0,44161.0,40289.0,47326.0,81978.0,39776.0,50200.0,59415.0,51445.0,62404.0,48536.0,52109.0,53989.0,63416.0,76854.0,76875.0,82378.0,78039.0,79933.0,85807.0,96476.0,97763.0
TKM,,,,,,,,,,,,,,,,,,,,,,,,,,,,,,,,63823.0,87800.0,92000.0,78600.0,40800.0,26900.0,13700.0,33300.0,27300.0,39000.0,80000.0,109500.0,110000.0,120000.0,135000.0,28730.0,30690.0,29760.0,30600.0,22650.0,129000.0,132000.0,130000.0,130000.0,130000.0,130000.0
TLS,16757.0,15300.0,14000.0,12696.0,9536.0,11764.0,15291.0,21566.0,12767.0,12553.0,10524.0,16145.0,19486.0,23000.0,25000.0,24000.0,26000.0,28000.0,28000.0,30000.0,32000.0,33000.0,36000.0,42000.0,40000.0,40000.0,42054.0,37246.0,40452.0,46675.0,66890.0,52657.0,51766.0,41461.0,46696.0,52607.0,37968.0,36848.0,33585.0,51000.0,53845.0,53656.0,65433.0,34994.0,58887.0,55410.0,60420.0,80257.0,120775.0,112925.0,98297.0,119166.0,87332.0,88824.0,71541.0,79136.0,86880.0
TTO,10160.0,10600.0,10400.0,10300.0,10200.0,10000.0,10500.0,10179.0,10224.0,10301.0,10546.0,12291.0,12291.0,17961.0,20298.0,21432.0,21137.0,14205.0,17050.0,9541.0,2993.0,3392.0,3307.0,3946.0,3960.0,4421.0,6609.0,7479.0,12008.0,13532.0,16000.0,22022.0,16204.0,17514.0,10193.0,17858.0,6796.0,7037.0,3110.0,6256.0,3262.0,3882.0,1720.0,1720.0,2082.0,1555.0,2413.0,2677.0,2226.0,2259.0,2663.0,2122.0,2859.0,2912.0,1900.0,1823.0,2300.0
TUR,233300.0,275000.0,216700.0,166700.0,216700.0,250000.0,233300.0,205000.0,211300.0,266700.0,291700.0,203300.0,265000.0,250000.0,250000.0,263300.0,275000.0,316700.0,375000.0,238300.0,330000.0,350000.0,315000.0,280000.0,270000.0,275000.0,275000.0,262500.0,330000.0,230000.0,200000.0,215000.0,225000.0,200000.0,250000.0,280000.0,275000.0,315000.0,340000.0,350000.0,360000.0,360000.0,372000.0,490000.0,600000.0,696000.0,648000.0,753325.0,750000.0,860000.0,900000.0,880000.0,900000.0,830000.0,920000.0,920000.0,900000.0
TWN,2547705.0,2670860.0,2659779.0,2841715.0,2964828.0,2997358.0,3037617.0,3169063.0,2914411.0,3095633.0,2913559.0,3065738.0,2842094.0,3102658.0,3162728.0,3423450.0,3351135.0,3093497.0,3096041.0,2966452.0,3004808.0,3141363.0,3143850.0,2840720.0,2749848.0,2496510.0,2402477.0,2331916.0,2355243.0,2283670.0,2311638.0,2069880.0,2232933.0,2061403.0,2071968.0,1930897.0,2041843.0,1859157.0,1916300.0,1906060.0,1723895.0,1803187.0,1648280.0,1433611.0,1467138.0,1558048.0,1363460.0,1457175.0,1578169.0,1451011.0,1666273.0,1700229.0,1589504.0,1732210.0,1581732.0,1587776.0,1754049.0
TZA,94000.0,104000.0,183000.0,147322.0,72954.0,133082.0,109687.0,104000.0,126000.0,132000.0,171000.0,187000.0,301000.0,223000.0,265000.0,346000.0,314000.0,387000.0,262000.0,291000.0,200000.0,320000.0,349231.0,355385.0,427692.0,547692.0,644615.0,615385.0,718461.0,740000.0,624615.0,392220.0,641000.0,614300.0,622600.0,806800.0,549700.0,849100.0,728600.0,781538.0,867692.0,984615.0,1096923.0,1058462.0,1167692.0,1206154.0,1341846.0,1420570.0,1334800.0,2650120.0,2248320.0,1800551.0,2194750.0,2621034.0,2979860.0,3005924.0,2871963.0
UGA,3200.0,4000.0,1650.0,2300.0,4750.0,6198.0,7824.0,2868.0,4767.0,11440.0,22000.0,15700.0,8700.0,15000.0,16000.0,29000.0,21000.0,25700.0,15000.0,17000.0,15000.0,19000.0,22000.0,20000.0,19000.0,21000.0,20000.0,23000.0,45000.0,54000.0,61000.0,68000.0,74000.0,77000.0,77000.0,82000.0,80000.0,90000.0,95000.0,109000.0,114000.0,120000.0,132000.0,121000.0,153000.0,154000.0,162000.0,177857.0,205765.0,218111.0,233000.0,212000.0,214000.0,237000.0,237008.0,245422.0,261620.0
UKR,,,,,,,,,,,,,,,,,,,,,,,,,,,,,,,,91762.0,68000.0,79000.0,80100.0,82046.0,65000.0,63600.0,63600.0,89700.0,68900.0,75400.0,84000.0,80400.0,93000.0,99500.0,108000.0,100700.0,142900.0,148000.0,169900.0,159800.0,145050.0,50880.0,62510.0,64700.0,63940.0
URY,60866.0,60704.0,76992.0,47138.0,90042.0,83746.0,115617.0,104456.0,134496.0,138611.0,122158.0,127995.0,136917.0,157940.0,185535.0,216521.0,228276.0,225646.0,247973.0,287558.0,330287.0,418885.0,323116.0,339760.0,420700.0,394218.0,335486.0,380592.0,537217.0,347300.0,492600.0,605400.0,701800.0,659700.0,806100.0,973500.0,1023800.0,864158.0,1328222.0,1209139.0,1030198.0,939489.0,905700.0,1262600.0,1214500.0,1292400.0,1145700.0,1330000.0,1287200.0,1148738.0,1643000.0,1424000.0,1359500.0,1348300.0,1304000.0,1409600.0,1360000.0
USA,2458000.0,2996000.0,3187000.0,3319000.0,3460000.0,3856422.0,4054142.0,4723777.0,4168674.0,3801311.0,3890351.0,3875428.0,4207728.0,5097717.0,5825774.0,5245678.0,4500680.0,6040490.0,5985020.0,6629250.0,8289040.0,6968900.0,4523200.0,6296300.0,6122000.0,6049000.0,5879000.0,7253000.0,7007400.0,7080000.0,7228770.0,8149150.0,7081030.0,8971110.0,7886660.0,7783600.0,8300380.0,8366190.0,9345230.0,8657810.0,9764480.0,9568990.0,9067180.0,10539760.0,10107540.0,8826230.0,8998730.0,9241170.0,9972230.0,11027010.0,8388780.0,9069080.0,8616120.0,10079500.0,8724530.0,10167050.0,8084290.0
UZB,,,,,,,,,,,,,,,,,,,,,,,,,,,,,,,,583000.0,581700.0,528400.0,327600.0,356500.0,416700.0,373300.0,442900.0,173300.0,90000.0,185600.0,350800.0,188100.0,171700.0,224000.0,197800.0,113700.0,194700.0,249800.0,119758.0,325718.0,340219.0,356097.0,425745.0,212000.0,395422.0
VCT,,,,,,,,,,,,,,,,,,,,,,,,,,,,14.0,12.0,11.0,,,,,,,,,,,,,,,,,,,,,,,,,,,
VEN,80658.0,103133.0,131117.0,165753.0,199900.0,194955.0,223052.0,244592.0,243874.0,226233.0,153038.0,164691.0,301899.0,296552.0,362925.0,206288.0,495940.0,501600.0,613584.0,618908.0,681292.0,608523.0,449475.0,407841.0,471722.0,321527.0,373247.0,383266.0,415800.0,495000.0,610508.0,622620.0,723406.0,728054.0,756950.0,779906.0,792239.0,701168.0,720193.0,676775.0,761064.0,668164.0,678890.0,974091.0,1004518.0,1122870.0,1054857.0,1092268.0,1100511.0,899584.0,1018258.0,1045878.0,1084012.0,1158056.0,802015.0,276633.0,405000.0
VNM,8997400.0,9747040.0,9622670.0,9697030.0,9369700.0,8463500.0,9188400.0,8366150.0,8815000.0,10173300.0,10447000.0,10748200.0,11125000.0,11023290.0,10293600.0,11827200.0,10597100.0,9789900.0,11362900.0,11647400.0,12415200.0,14390200.0,14743300.0,15505600.0,15874800.0,16002900.0,15102600.0,17000000.0,18996304.0,19225104.0,19621904.0,21590304.0,22836600.0,23528300.0,24963700.0,26396700.0,27523900.0,29408143.0,31393800.0,32529500.0,32108400.0,34447200.0,34568800.0,36148900.0,35832900.0,35849500.0,35942700.0,38729800.0,38950200.0,40005600.0,42398344.0,43737598.0,44039100.0,44974206.0,45090562.0,43112010.0,42763682.0
ZAF,2540.0,2177.0,1814.0,1900.0,2000.0,2000.0,2000.0,2000.0,2000.0,2000.0,2000.0,3000.0,3000.0,3000.0,3000.0,3000.0,3000.0,3000.0,3000.0,3000.0,3000.0,3000.0,3000.0,3000.0,3000.0,3000.0,3000.0,3000.0,3000.0,2260.0,3050.0,3051.0,3052.0,3054.0,3055.0,3056.0,3058.0,3029.0,2900.0,3000.0,3200.0,3000.0,3200.0,3123.0,3119.0,3118.0,3300.0,3000.0,3067.0,3064.0,3067.0,3000.0,3000.0,3056.0,3065.0,3066.0,3067.0
ZMB,,,,,,,,191.0,417.0,454.0,470.0,530.0,506.0,761.0,1742.0,2413.0,1860.0,2925.0,1852.0,2213.0,2673.0,5272.0,9631.0,9271.0,11233.0,11207.0,8242.0,9701.0,11734.0,9213.0,14602.0,8283.0,13993.0,6358.0,12110.0,13296.0,12473.0,6399.0,14700.0,13936.0,11645.0,13500.0,15500.0,17189.0,13337.0,13964.0,18317.0,24023.0,41929.0,51656.0,49410.0,45321.0,44747.0,49640.0,25514.0,26675.0,38423.0
ZWE,1000.0,1000.0,2540.0,2600.0,2600.0,2600.0,3000.0,3500.0,4000.0,4726.0,3000.0,1900.0,800.0,600.0,419.0,257.0,216.0,333.0,350.0,350.0,374.0,97.0,122.0,719.0,143.0,291.0,595.0,520.0,545.0,468.0,450.0,400.0,500.0,463.0,400.0,441.0,446.0,400.0,472.0,500.0,600.0,598.0,700.0,632.0,625.0,600.0,625.0,637.0,650.0,664.0,678.0,700.0,700.0,710.0,728.0,732.0,741.0
