### META ###
ID,Emissions|CO2|FOLU|Burning_biomass__Historic__FAO_2020
category,FOLU|Burning_biomass
creator,AG
entity,Emissions|CO2
modified,2021/05/06-02:56:14
pathway,Historic
scenario,Historic
source,FAO_2020
unit,Mt CO2
variable,Emissions|CO2|FOLU|Burning_biomass
### DATA ###
region,1990,1991,1992,1993,1994,1995,1996,1997,1998,1999,2000,2001,2002,2003,2004,2005,2006,2007,2008,2009,2010,2011,2012,2013,2014,2015,2016,2017,2018,2019
BRN,0.2644554,0.2644554,0.2644554,0.2644554,0.2644554,0.2644554,0.0989101,0.2283766,3.1621628,0.0386697,0.0502416,0.041065,0.0,0.1190889,0.0051331,0.0256655,0.0,0.0,0.0,0.0205324,0.008983000000000001,0.0,0.0,0.0,0.0718632,0.0418134,0.0461979,0.0,0.0,0.0081279
IDN,200.0302932,200.0302932,200.0302932,200.0302932,200.0302932,200.0302932,51.533603400000004,738.9931637000001,156.6948726,78.9587838,23.8830863,27.816899799999998,392.07637520000003,120.280493,380.3456726,172.277642,469.2727792,32.2949014,23.9061134,309.12087640000004,18.7773233,153.655707,162.01111600000002,139.0562726,388.8487865,423.6636093,43.6963068,17.4792306,153.5763176,322.5071039
KHM,0.0,0.0,0.0,0.0,0.0,0.0,0.0,0.0,0.0,0.0,0.0,0.0,0.0,0.0,0.0,0.0,0.0,0.0,0.0,0.0,0.0,0.0,0.0,0.0,0.0,0.0,0.0,0.0,0.0,0.0
LAO,0.0,0.0,0.0,0.0,0.0,0.0,0.0,0.0,0.0,0.0,0.0,0.0,0.0,0.0,0.0,0.0,0.0,0.0,0.0,0.0,0.0,0.0,0.0,0.0,0.0,0.0,0.0,0.0,0.0,0.0
MMR,2.5394344,2.5394344,2.5394344,2.5394344,2.5394344,2.5394344,1.3144443000000001,0.9628971000000001,1.6414442,1.6628634,1.6691278999999999,1.9475394,1.3938498,2.4676825,4.481317,1.7656864,3.5862358,3.1540414,1.5343082,3.0515732,4.4597751,1.5363234000000001,1.9101547,3.2960887,2.9422926000000005,4.6033614,3.4996430999999997,1.7099075000000001,4.0531156,2.3027525
MYS,7.2504459,7.2504459,7.2504459,7.2504459,7.2504459,7.2504459,4.365337800000001,5.6591846,24.479384300000003,3.8118555,3.7859159,0.1013796,5.2911608,4.922952,11.2249139,13.082698500000001,3.3561769,7.5066889,3.3600816,16.1532165,9.067665000000002,6.7443482,4.3738761,5.1959429,17.7964376,6.1356511000000005,6.7826255,0.184787,4.6903678,5.9380548
PHL,0.0,0.0,0.0,0.0,0.0,0.0,0.0,0.0,0.0,0.0,0.0,0.0,0.0,0.0,0.0,0.0,0.0,0.0,0.0,0.0,0.0,0.0,0.0,0.0,0.0,0.0,0.0,0.0,0.0,0.0
SGP,0.0,0.0,0.0,0.0,0.0,0.0,0.0,0.0,0.0,0.0,0.0,0.0,0.0,0.0,0.0,0.0,0.0,0.0,0.0,0.0,0.0,0.0,0.0,0.0,0.0,0.0,0.0,0.0,0.0,0.0
THA,0.2906957,0.2906957,0.2906957,0.2906957,0.2906957,0.2906957,0.0223197,0.0372646,0.17060540000000002,0.0263177,0.0221003,0.0,0.33881259999999996,0.0,1.4681783000000002,0.0,0.0,0.0,0.0,0.0,0.3490797,0.0,0.0,0.0,0.45174430000000004,0.0,0.0205341,0.0,0.0,0.0
TLS,0.0,0.0,0.0,0.0,0.0,0.0,0.0,0.0,0.0,0.0,0.0,0.0,0.0,0.0,0.0,0.0,0.0,0.0,0.0,0.0,0.0,0.0,0.0,0.0,0.0,0.0,0.0,0.0,0.0,0.0
VNM,0.4495421,0.4495421,0.4495421,0.4495421,0.4495421,0.4495421,0.2488243,0.1734193,0.3408443,0.2971052,0.2175283,0.0,2.3105235,0.0,0.3491483,0.44156270000000003,0.0,0.041075600000000004,0.0,0.010269,0.2361858,0.0308068,0.0,1.7559997,0.5442673,0.0,0.1848448,0.0,0.0,0.0102692
