### META ###
ID,Emissions|CH4|Agriculture|Land_use__Historic__FAO_2020
category,Agriculture|Land_use
creator,AG
entity,Emissions|CH4
modified,2021/05/06-02:56:15
pathway,Historic
scenario,Historic
source,FAO_2020
unit,Mt CH4
variable,Emissions|CH4|Agriculture|Land_use
### DATA ###
region,1990,1991,1992,1993,1994,1995,1996,1997,1998,1999,2000,2001,2002,2003,2004,2005,2006,2007,2008,2009,2010,2011,2012,2013,2014,2015,2016,2017
ABW,0.0,0.0,0.0,0.0,0.0,0.0,0.0,0.0,0.0,0.0,0.0,0.0,0.0,0.0,0.0,0.0,0.0,0.0,0.0,0.0,0.0,0.0,0.0,0.0,0.0,0.0,0.0,0.0
AFG,0.0,0.0,0.0,0.0,0.0,0.0,0.0,0.0,0.0,0.0,0.0,0.0,0.0,0.0,0.0,0.0,0.0,0.0,0.0,0.0,0.0,0.0,0.0,0.0,0.0,0.0,0.0,0.0
AGO,0.6972468,0.6972468,0.6972468,0.6972468,0.6972468,0.6972468,1.0543688,0.9761023000000001,1.180323,1.0851895999999999,0.9751127,0.6347979,0.6950444,0.7447229,0.8549879,0.8314681,0.5847624,0.7978199,0.5803137,0.6186280000000001,0.625121,0.9287375,0.6319937,0.7445016000000001,0.5811255,0.7724454,0.5294796,0.5294796
AIA,0.0,0.0,0.0,0.0,0.0,0.0,0.0,0.0,0.0,0.0,0.0,0.0,0.0,0.0,0.0,0.0,0.0,0.0,0.0,0.0,0.0,0.0,0.0,0.0,0.0,0.0,0.0,0.0
ALB,0.0,0.0,0.0,0.0,0.0,0.0,2.19e-05,2.18e-05,2.4400000000000004e-05,2.19e-05,2.9000000000000004e-05,0.0001178,0.0,3.09e-05,0.0,0.0,1.03e-05,0.0006086,9.7e-06,0.0,6.2e-06,0.0006359,0.0,0.0,0.0,0.00011960000000000001,0.0,0.0
ARE,0.0,0.0,0.0,0.0,0.0,0.0,0.0,0.0,0.0,0.0,0.0,0.0,0.0,0.0,0.0,0.0,0.0,0.0,0.0,0.0,0.0,0.0,0.0,0.0,0.0,0.0,0.0,0.0
ARG,0.21671100000000001,0.21671100000000001,0.21671100000000001,0.21671100000000001,0.21671100000000001,0.21671100000000001,0.1021741,0.1139297,0.1265234,0.1461355,0.0886363,0.18949080000000001,0.2337469,0.3089441,0.4106417,0.25540039999999997,0.2992807,0.23825040000000003,0.2642086,0.29514670000000004,0.1122187,0.1455437,0.2729192,0.159765,0.0959982,0.06646439999999999,0.1193565,0.1193565
ARM,,,0.0,0.0,0.0,0.0,0.0,0.0,0.0,0.0,0.0,0.0,0.0,0.0,0.0,0.0,0.0,0.0,0.0,0.0,0.0,0.0,0.0,0.0,0.0,0.0,0.0,0.0
ASM,0.0,0.0,0.0,0.0,0.0,0.0,0.0,0.0,0.0,0.0,0.0,0.0,0.0,0.0,0.0,0.0,0.0,0.0,0.0,0.0,0.0,0.0,0.0,0.0,0.0,0.0,0.0,0.0
ATG,0.0,0.0,0.0,0.0,0.0,0.0,0.0,0.0,0.0,0.0,0.0,0.0,0.0,0.0,0.0,0.0,0.0,0.0,0.0,0.0,0.0,0.0,0.0,0.0,0.0,0.0,0.0,0.0
AUS,0.019871200000000002,0.019871200000000002,0.019871200000000002,0.019871200000000002,0.019871200000000002,0.019871200000000002,0.013503600000000001,0.0125333,0.009999000000000001,0.013848300000000001,0.0121968,0.053284,0.0368669,0.0535882,0.0040412,0.0052321,0.0276754,0.019837900000000002,0.004444,0.0303659,0.0007046,0.008059,0.0124626,0.0313871,0.0083269,0.008932800000000001,0.0127308,0.0127308
AUT,0.0,0.0,0.0,0.0,0.0,0.0,2e-06,1.7e-06,1.8e-06,1.8e-06,1.7e-06,0.0,0.0,0.0,0.0002121,0.0,0.0,0.0,7.07e-05,0.0,0.0,0.0,0.0,0.0,0.0,0.0,1.5e-06,1.5e-06
AZE,,,0.0,0.0,0.0,0.0,0.0,0.0,0.0,0.0,0.0,0.0,0.0,0.0,0.0,0.0,0.0,0.0,0.0,0.0,0.0,0.0,0.0,0.0,0.0,0.0,0.0,0.0
BDI,0.017048100000000004,0.017048100000000004,0.017048100000000004,0.017048100000000004,0.017048100000000004,0.017048100000000004,0.0117268,0.0128216,0.015032400000000001,0.0126437,0.0145192,0.0185558,0.0278907,0.0301872,0.022494399999999998,0.0158711,0.0151412,0.0102858,0.0159432,0.0180031,0.016687300000000002,0.0146622,0.0123423,0.014827400000000001,0.011537,0.0112201,0.017120999999999997,0.017120999999999997
BEL,,,,,,,,,,,8.3e-06,0.0,0.0,0.0,0.0,0.0,2.65e-05,0.0,0.0,0.0,0.0,0.0008263000000000001,0.0,0.0,5.9e-06,0.0,0.0,0.0
BEN,0.0016631,0.0016631,0.0016631,0.0016631,0.0016631,0.0016631,0.011207100000000001,0.0071147,0.018955100000000003,0.0145477,0.015028600000000001,0.001216,0.0006238,0.0007185000000000001,0.0028426000000000002,0.0022267000000000003,0.0010265,0.0019502999999999999,0.0010581,0.0019819,0.00043430000000000004,0.0004106,0.0036164,0.0009791,0.0011212,0.0035533,0.0028504999999999997,0.0028504999999999997
BFA,0.0001056,0.0001056,0.0001056,0.0001056,0.0001056,0.0001056,0.0042067,0.0039549,0.012842300000000001,0.010516000000000001,0.0063784,0.0001105,0.00033160000000000004,0.0001105,0.0002843,0.0002132,0.0,7.9e-06,0.0,0.0001421,0.0,9.48e-05,0.0002053,3.16e-05,5.53e-05,4.74e-05,5.53e-05,5.53e-05
BGD,0.012490399999999999,0.012490399999999999,0.012490399999999999,0.012490399999999999,0.012490399999999999,0.012490399999999999,0.004160700000000001,0.0038220000000000003,0.0042342000000000005,0.0056338000000000004,0.0029081000000000003,0.0088119,0.00033900000000000005,0.0055252,0.0147241,0.006072,0.0233418,0.009078099999999999,0.0175124,0.0097655,0.0213991,0.0165534,0.0074266,0.0196306,0.0233691,0.0118574,0.0044399,0.0044399
BGR,0.0006246,0.0006246,0.0006246,0.0006246,0.0006246,0.0006246,0.0003202,0.00028399999999999996,0.0003969,0.0003634,0.0005727999999999999,0.0027621000000000004,0.0001147,0.0004145,0.0008747000000000001,0.00020730000000000002,0.0009658000000000001,0.0009173,0.0007482,0.0002087,0.0001161,0.000835,0.0008453000000000001,0.00040720000000000003,6.32e-05,0.0002029,0.0003102,0.0003102
BHR,0.0,0.0,0.0,0.0,0.0,0.0,0.0,0.0,0.0,0.0,0.0,0.0,0.0,0.0,0.0,0.0,0.0,0.0,0.0,0.0,0.0,0.0,0.0,0.0,0.0,0.0,0.0,0.0
BHS,0.0022345999999999998,0.0022345999999999998,0.0022345999999999998,0.0022345999999999998,0.0022345999999999998,0.0022345999999999998,0.0013331999999999999,0.0015751,0.0016097,0.0012299,0.0012543,0.0007421999999999999,0.0020214,0.0003395,0.0039005999999999997,0.0020372,0.0017687,0.0008449,0.0029215,0.0018556,0.0011212,0.0054956,0.0007896,0.0062063,0.0008844,0.0010818000000000002,0.0037427000000000003,0.0037427000000000003
BIH,,,0.0005439,0.0005439,0.0005439,0.0005439,0.0008487,0.0003283,0.0005411000000000001,0.0016657,0.0011716,0.0005567,0.0,0.0034435,0.0,0.0,0.0,0.0013609,0.0002887,0.0,0.0,0.001464,0.0007629000000000001,0.0,0.0,0.0005361000000000001,0.0002887,0.0002887
BLR,,,0.0130084,0.0130084,0.0130084,0.0130084,0.0034917,0.0029678,0.003197,0.004629100000000001,0.003915500000000001,0.005128000000000001,0.0717966,0.0247683,0.0032399,0.0065033,0.0162363,0.0027153,0.001899,0.005395,0.0022612,0.0020208,0.0208509,0.0040435,0.0184625,0.0221463,0.0006678,0.0006678
BLZ,0.0274228,0.0274228,0.0274228,0.0274228,0.0274228,0.0274228,0.0076905,0.0049203,0.0094476,0.007241399999999999,0.0079333,0.010373799999999999,0.0334115,0.0483422,0.006950400000000001,0.032249200000000006,0.019364799999999998,0.0444544,0.0288686,0.0128881,0.0341526,0.0579929,0.004478,0.052305700000000004,0.0073809,0.024758400000000003,0.0207928,0.0207928
BMU,0.0,0.0,0.0,0.0,0.0,0.0,0.0,0.0,0.0,0.0,0.0,0.0,0.0,0.0,0.0,0.0,0.0,0.0,0.0,0.0,0.0,0.0,0.0,0.0,0.0,0.0,0.0,0.0
BOL,0.26356470000000004,0.26356470000000004,0.26356470000000004,0.26356470000000004,0.26356470000000004,0.26356470000000004,0.18770679999999998,0.19885239999999998,0.19827140000000001,0.3510277,0.0863754,0.07194840000000001,0.2202671,0.0861612,0.5556182000000001,0.380477,0.1826741,0.39592140000000003,0.18164760000000002,0.0823238,0.9761202,0.3315531,0.1300472,0.07982070000000001,0.0868323,0.1337978,0.32182530000000004,0.32182530000000004
BRA,0.6415869000000001,0.6415869000000001,0.6415869000000001,0.6415869000000001,0.6415869000000001,0.6415869000000001,0.3529478,0.43002,0.765447,0.5806358,0.08657580000000001,0.33135230000000004,0.8701506000000001,0.8420657,0.8813154,1.0430507,0.46647930000000004,1.0166864,0.353301,0.2733074,1.0254926,0.2584246,0.5153795999999999,0.1955635,0.4269173,0.9655631,0.8003408,0.8003408
BRB,0.0,0.0,0.0,0.0,0.0,0.0,0.0,0.0,0.0,0.0,0.0,0.0,0.0,0.0,0.0,0.0,0.0,0.0,0.0,0.0,0.0,0.0,0.0,0.0,0.0,0.0,0.0,0.0
BRN,5.97e-05,5.97e-05,5.97e-05,5.97e-05,5.97e-05,5.97e-05,0.001527,0.0036339000000000002,0.0477437,0.0005919,0.0007802,0.0005675,0.0,0.0016710000000000002,0.0001657,0.0004966,0.0,7.9e-06,0.0,0.0003232,0.00019700000000000002,0.0,0.0,0.0,0.0010326,0.0007567,0.001269,0.001269
BTN,0.00033650000000000005,0.00033650000000000005,0.00033650000000000005,0.00033650000000000005,0.00033650000000000005,0.00033650000000000005,0.0001821,0.00023610000000000002,0.0003192,0.0006817,0.0003429,0.0,5.08e-05,0.0001026,0.000229,8.690000000000001e-05,0.0001862,0.0010473,6.32e-05,0.0003237,0.0002211,0.0002043,0.0015754999999999999,9.71e-05,0.0003736,0.0006241,0.0001983,0.0001983
BWA,0.3610057,0.3610057,0.3610057,0.3610057,0.3610057,0.3610057,0.4817843,0.5846341,0.6719965999999999,0.5306217000000001,0.4221918,0.2764479,1.116194,0.6592826,0.116001,0.5439121,0.17541990000000002,0.5765374000000001,0.1385392,0.0784898,0.0310492,0.0800659,0.0821148,0.3844108,0.0955117,0.9908941,0.431221,0.431221
CAF,0.0279499,0.0279499,0.0279499,0.0279499,0.0279499,0.0279499,0.0417583,0.12065139999999999,0.1895242,0.1588267,0.1337492,0.028923200000000003,0.013454800000000001,0.0370323,0.017323599999999998,0.035721600000000006,0.0151681,0.0191084,0.034259300000000006,0.0191715,0.0259226,0.0265938,0.0293255,0.0276992,0.0152314,0.028938600000000002,0.0733248,0.0733248
CAN,0.5298587,0.5298587,0.5298587,0.5298587,0.5298587,0.5298587,0.3152305,0.170407,1.0152777,0.4394436,0.1616844,0.0879253,0.6619313,0.7048456,0.3993548,0.3819362,0.5063374,0.3560524,0.4374499,0.0885868,0.6486115,0.29120389999999996,0.5925034,1.0621371,0.725583,1.0587010000000001,0.4745793,0.4745793
CHE,0.0,0.0,0.0,0.0,0.0,0.0,1.0000000000000001e-07,1.0000000000000001e-07,1.0000000000000001e-07,1.0000000000000001e-07,0.0,0.0,0.0,0.0,0.0,0.0,0.0,0.0,0.0,5.9e-06,0.0,0.0,0.0,0.0,8.8e-06,0.0,0.0,0.0
CHL,2.95e-05,2.95e-05,2.95e-05,2.95e-05,2.95e-05,2.95e-05,2.66e-05,3.06e-05,3.16e-05,3.37e-05,0.0,5.9e-06,0.0,0.0,0.0,0.0,0.0,0.0,0.0,0.0,0.0,0.0003535,0.0,2.36e-05,0.0,2.95e-05,5.89e-05,5.89e-05
CHN,0.0036957,0.0036957,0.0036957,0.0036957,0.0036957,0.0036957,0.0041402,0.0024222000000000002,0.003193,0.0022795999999999997,0.0030623,0.0028566,0.0033439999999999998,0.004336700000000001,0.0061294,0.0024790999999999997,0.0004488,0.0026538,0.0021944,0.0030055,0.0013442,0.0016334,0.0020915,0.0021747999999999997,0.0178159,0.0039798,0.0026434,0.0026434
CIV,0.0153916,0.0153916,0.0153916,0.0153916,0.0153916,0.0153916,0.0040531,0.009942500000000002,0.0221251,0.0219827,0.0169276,0.0226852,0.0058034,0.006779,0.014347,0.0100899,0.0101269,0.0385368,0.0155437,0.0239385,0.008392799999999999,0.0067112,0.034385399999999997,0.0075858,0.0063469,0.0085806,0.0264118,0.0264118
CMR,0.0876467,0.0876467,0.0876467,0.0876467,0.0876467,0.0876467,0.0473367,0.045106299999999995,0.1056708,0.0694526,0.0614904,0.0413941,0.032319200000000006,0.10408750000000001,0.0822557,0.13102780000000003,0.048023800000000005,0.07796810000000001,0.1255117,0.0875793,0.0780912,0.0786628,0.0541811,0.1556337,0.07073860000000001,0.11188880000000001,0.1229828,0.1229828
COD,0.4163259,0.4163259,0.4163259,0.4163259,0.4163259,0.4163259,0.7580513999999999,0.9424355000000001,0.9802107999999999,0.7976900000000001,0.7064715,0.2765809,0.2439298,0.3553286,0.4165771,0.46422430000000003,0.34243840000000003,0.4325892,0.40119520000000003,0.4199377,0.3913513,0.4654357,0.420311,0.5603698,0.4431589,0.4375009,0.5902858,0.5902858
COG,0.2923309,0.2923309,0.2923309,0.2923309,0.2923309,0.2923309,0.032065199999999995,0.0330628,0.028985,0.0310596,0.0239293,0.09383140000000001,0.06505129999999999,0.2037883,0.30917290000000003,0.4076319,0.3915612,0.3700659,0.2970317,0.2370131,0.27667230000000004,0.387241,0.3502965,0.39115350000000004,0.167094,0.346077,0.3836123,0.3836123
COK,0.0,0.0,0.0,0.0,0.0,0.0,0.0,0.0,0.0,0.0,0.0,0.0,0.0,0.0,0.0,0.0,0.0,0.0,0.0,0.0,0.0,0.0,0.0,0.0,0.0,0.0,0.0,0.0
COL,0.0555497,0.0555497,0.0555497,0.0555497,0.0555497,0.0555497,0.0057097,0.015263400000000002,0.0154376,0.0102867,0.020999,0.0133995,0.0086266,0.09431650000000001,0.12445180000000002,0.009877,0.0154588,0.0795642,0.024983,0.012983100000000001,0.011473,0.019004200000000002,0.0177222,0.025012100000000002,0.0857541,0.0589257,0.28724360000000004,0.28724360000000004
COM,0.0001649,0.0001649,0.0001649,0.0001649,0.0001649,0.0001649,5.4800000000000004e-05,5.47e-05,5.69e-05,5.27e-05,4.7e-06,0.0,0.0,8.690000000000001e-05,0.0,0.0018288,3.16e-05,5.25e-05,0.0001895,3.05e-05,3.95e-05,7.9e-06,7.9e-06,1.58e-05,0.0001258,0.0001974,2.37e-05,2.37e-05
CPV,0.0,0.0,0.0,0.0,0.0,0.0,0.0,0.0,0.0,0.0,0.0,0.0,0.0,0.0,0.0,0.0,0.0,0.0,0.0,0.0,0.0,0.0,0.0,0.0,0.0,0.0,0.0,0.0
CRI,0.002521,0.002521,0.002521,0.002521,0.002521,0.002521,0.0005653,0.0008963,0.0017450000000000002,0.0010115,0.0010466,0.001542,0.00047880000000000004,0.0107598,0.0006073,0.0009539,0.0007886999999999999,0.0021442,0.0007027,0.0005545,0.0019084000000000002,0.0001342,0.0019861,0.0037216999999999997,0.0023129,0.0040076,0.007732300000000001,0.007732300000000001
CUB,0.0033489,0.0033489,0.0033489,0.0033489,0.0033489,0.0033489,0.0015365,0.0012474,0.0026387999999999997,0.0026743,0.0037299000000000004,0.0013581,0.0031032000000000004,0.0007027,0.0038138,0.0063958,0.0040822,0.0023767000000000003,0.0014055,0.0043349,0.0023925,0.0060641,0.0022583000000000004,0.0035532,0.0029294,0.0056692999999999995,0.0031425999999999997,0.0031425999999999997
CYM,5e-07,5e-07,5e-07,5e-07,5e-07,5e-07,0.0,0.0,0.0,0.0,0.0,7.9e-06,0.0,0.0,0.0,0.0,0.0,0.0,0.0,0.0,0.0,0.0,0.0,0.0,0.0,0.0,0.0,0.0
CYP,0.0,0.0,0.0,0.0,0.0,0.0,0.0,0.0,0.0,0.0,0.0,0.0,0.0,0.0,0.0,0.0,0.0,0.0,0.0,0.0,0.0,0.0,0.0,0.0,0.0,0.0,0.0,0.0
CZE,,,,3e-06,3e-06,3e-06,1.9e-06,1.8e-06,1.9e-06,1.9e-06,9e-07,0.0,0.0,0.0,0.0,4.4e-06,0.0,0.0,0.0,5.9e-06,2.8999999999999998e-06,2.8999999999999998e-06,0.0,0.0,3.2300000000000006e-05,0.0,0.0,0.0
DEU,0.0,0.0,0.0,0.0,0.0,0.0,9.130000000000001e-05,8.730000000000001e-05,9.080000000000001e-05,9.070000000000001e-05,8.7e-05,1.32e-05,5.74e-05,7.07e-05,0.0,2.3500000000000002e-05,5.9e-06,2.8999999999999998e-06,0.0008014,0.0,0.0,2.36e-05,1.5e-06,0.0,4.4e-06,0.0001179,2.8999999999999998e-06,2.8999999999999998e-06
DJI,0.0,0.0,0.0,0.0,0.0,0.0,0.0,0.0,0.0,0.0,0.0,0.0,0.0,0.0,0.0,0.0,0.0,0.0,0.0,0.0,0.0,0.0,0.0,0.0,0.0,0.0,0.0,0.0
DMA,0.0,0.0,0.0,0.0,0.0,0.0,0.0,0.0,0.0,0.0,0.0,0.0,0.0,0.0,0.0,0.0,0.0,0.0,0.0,0.0,0.0,0.0,0.0,0.0,0.0,0.0,0.0,0.0
DNK,0.0,0.0,0.0,0.0,0.0,0.0,8.4e-06,7.100000000000001e-06,7.6e-06,7.4e-06,6.5e-06,1.18e-05,7.4e-06,1.47e-05,9.56e-05,1.5e-06,0.0,6.03e-05,8.1e-05,0.0,0.0,1.5e-06,0.0,0.0,0.0,1.47e-05,0.0,0.0
DOM,0.0002701,0.0002701,0.0002701,0.0002701,0.0002701,0.0002701,0.0001081,0.000211,0.0003781,0.0003705,0.000567,0.0,3.95e-05,0.0003079,0.0001184,0.0003948,7.9e-06,7.9e-05,9.48e-05,0.0001737,0.00016020000000000002,0.0007343,8.690000000000001e-05,0.0001421,0.0001342,0.0018476999999999999,0.0,0.0
DZA,0.0,0.0,0.0,0.0,0.0,0.0,0.0,0.0,0.0,0.0,0.0,0.0,0.0,0.0,0.0,0.0,0.0,0.0,0.0,0.0,0.0,0.0,0.0,0.0,0.0,0.0,0.0,0.0
ECU,0.0006020999999999999,0.0006020999999999999,0.0006020999999999999,0.0006020999999999999,0.0006020999999999999,0.0006020999999999999,3.01e-05,2.29e-05,2.69e-05,2.11e-05,2.05e-05,6.32e-05,2.37e-05,9.48e-05,0.00036320000000000005,0.0006791000000000001,0.0004185,0.0004896,8.690000000000001e-05,0.0005132,0.0008605,0.0016187,0.0005922,0.000458,0.00016580000000000002,0.0011133,0.0020924,0.0020924
EGY,0.0,0.0,0.0,0.0,0.0,0.0,0.0,0.0,0.0,0.0,0.0,0.0,0.0,0.0,0.0,0.0,0.0,0.0,0.0,0.0,0.0,0.0,0.0,0.0,0.0,0.0,0.0,0.0
ERI,,,,8.87e-05,8.87e-05,8.87e-05,5.9e-06,5.5e-06,5.5e-06,5.5e-06,5.5e-06,0.0,0.0,0.0,0.0,0.0,0.0,0.00015759999999999998,0.0,0.0012609,0.0,0.0,0.0,0.0,0.0,0.0,0.0,0.0
ESP,0.0005592,0.0005592,0.0005592,0.0005592,0.0005592,0.0005592,0.0004939,0.0006644999999999999,0.00143,0.0002964,0.0011718,0.0005892,5.89e-05,0.0013846000000000002,0.0007071,0.0009133,0.0010606,2.06e-05,0.0,5.89e-05,0.00017680000000000001,0.0032406,0.0,0.0,0.0006187,0.0001178,0.0,0.0
EST,,,0.0,0.0,0.0,0.0,0.0002232,0.00013450000000000002,0.0001347,0.0001315,9.93e-05,0.0,0.0030918,0.0005948,0.00034460000000000003,0.0,0.0016158,0.0,0.0001237,0.0,3.54e-05,5.9e-06,0.0001311,0.0003063,4.8599999999999995e-05,0.00011630000000000001,2.95e-05,2.95e-05
ETH,,,,0.1397599,0.1397599,0.1397599,0.07786960000000001,0.0634873,0.0948564,0.09522459999999999,0.060296100000000005,0.11979290000000001,0.20150040000000002,0.1810933,0.1725709,0.0846673,0.155682,0.0600789,0.1342411,0.118107,0.11353629999999999,0.100958,0.1790644,0.2199919,0.1112833,0.1144215,0.1691693,0.1691693
EU28,0.009844799999999999,0.009844799999999999,0.0099015,0.009904999999999999,0.009904999999999999,0.009904999999999999,0.007350799999999999,0.0059159,0.0080351,0.0059166,0.0071785,0.0122387,0.0178903,0.0330591,0.0065321,0.0077075,0.0134019,0.027266,0.0115466,0.0050961,0.0075004,0.0286372,0.0324278,0.0059936,0.0081686,0.0073972,0.0033898,0.0033898
FIN,0.0,0.0,0.0,0.0,0.0,0.0,0.0005177000000000001,0.00012989999999999999,0.0001282,0.000128,0.00015570000000000002,0.00040510000000000003,6.18e-05,0.0013322000000000002,0.0,2.65e-05,0.0011139,0.00024870000000000003,0.0005895000000000001,0.0003706,0.000125,0.0006211,0.0,0.00011169999999999999,0.0002401,0.00016930000000000002,0.00029110000000000003,0.00029110000000000003
FJI,0.0005517,0.0005517,0.0005517,0.0005517,0.0005517,0.0005517,0.00017580000000000002,0.0004053,0.0005034,0.0001235,2e-06,0.0001026,0.0,0.000987,0.0,0.0,0.0,0.0001421,0.0002369,0.0025267,0.0006395999999999999,0.0,0.0,0.0,0.0018556,0.0019582,0.000379,0.000379
FLK,0.0,0.0,0.0,0.0,0.0,0.0,0.0001278,0.0001762,0.0001539,0.0001694,6.2e-06,0.0019625,0.0008663,0.0,0.0005127,0.0,0.0,0.0,1.77e-05,0.0,0.0,0.0,0.0014851,0.0,0.0,0.0,0.0,0.0
FRA,0.0001017,0.0001017,0.0001017,0.0001017,0.0001017,0.0001017,9.54e-05,8.640000000000001e-05,9.27e-05,9.080000000000001e-05,8.51e-05,0.0003029,0.0001148,0.0002443,0.000374,0.0001088,0.0001264,8.8e-06,0.0001088,2.8999999999999998e-06,2.94e-05,9.410000000000001e-05,5.2900000000000005e-05,2.95e-05,5.9e-06,2.3500000000000002e-05,0.0,0.0
FRO,0.0,0.0,0.0,0.0,0.0,0.0,0.0,0.0,0.0,0.0,0.0,0.0,0.0,0.0,0.0,0.0,0.0,0.0,0.0,0.0,0.0,0.0,0.0,0.0,0.0,0.0,0.0,0.0
FSM,0.0,0.0,0.0,0.0,0.0,0.0,0.0,0.0,0.0,0.0,0.0,0.0,0.0,0.0,0.0,0.0,0.0,0.0,0.0,0.0,0.0,0.0,0.0,0.0,0.0,0.0,0.0,0.0
GAB,0.013927199999999999,0.013927199999999999,0.013927199999999999,0.013927199999999999,0.013927199999999999,0.013927199999999999,0.0019597,0.00116,0.0011489,0.0011735,0.0009477,0.0018869000000000002,0.0029294,0.004839400000000001,0.017710200000000002,0.01244,0.0200631,0.016307400000000003,0.0367077,0.0063877,0.0087208,0.0238163,0.017205300000000003,0.020089700000000002,0.0065023,0.0140771,0.0131517,0.0131517
GBR,0.0,0.0,0.0,0.0,0.0,0.0,0.0006319,0.0005116000000000001,0.000487,0.0005368,0.0004873,0.0011309,0.0,0.0112703,0.0,0.0013227,0.0009074,0.0059327,0.0,0.0004773,0.0013402000000000002,0.0013919,0.0043194,0.0,0.0,0.001137,0.0,0.0
GEO,,,0.0,0.0,0.0,0.0,0.0,0.0,0.0,0.0,0.0,0.0,0.0,0.0,0.0,0.0,0.0,0.0,0.0,0.0,0.0,0.0,0.0,0.0,0.0,0.0,0.0,0.0
GHA,0.013822300000000001,0.013822300000000001,0.013822300000000001,0.013822300000000001,0.013822300000000001,0.013822300000000001,0.0045133000000000005,0.0159101,0.0367294,0.023195,0.0256803,0.0239094,0.0082671,0.0034979,0.011994,0.0112203,0.010936,0.014978700000000001,0.0081882,0.0165342,0.0123889,0.008733000000000001,0.0196453,0.0125672,0.0060088,0.0121285,0.0401593,0.0401593
GIB,0.0,0.0,0.0,0.0,0.0,0.0,0.0,0.0,0.0,0.0,0.0,0.0,0.0,0.0,0.0,0.0,0.0,0.0,0.0,0.0,0.0,0.0,0.0,0.0,0.0,0.0,0.0,0.0
GIN,0.044006500000000004,0.044006500000000004,0.044006500000000004,0.044006500000000004,0.044006500000000004,0.044006500000000004,0.0123318,0.014073200000000001,0.0277879,0.0239463,0.0161541,0.0348095,0.0171871,0.0402447,0.0678628,0.041729300000000004,0.0664053,0.0720967,0.020699600000000002,0.0383714,0.028328199999999998,0.043769300000000004,0.0509888,0.0289559,0.0420935,0.0701838,0.0403786,0.0403786
GLP,0.0,0.0,0.0,0.0,0.0,0.0,0.0,0.0,0.0,0.0,0.0,0.0,0.0,0.0,0.0,0.0,0.0,0.0,0.0,0.0,0.0,0.0,0.0,0.0,0.0,0.0,0.0,0.0
GMB,0.0008137999999999999,0.0008137999999999999,0.0008137999999999999,0.0008137999999999999,0.0008137999999999999,0.0008137999999999999,0.0013827000000000002,0.0023937,0.0012031000000000001,0.0047114,0.0027995000000000003,0.0055667,0.0018635,0.0005053,0.0001026,0.0002132,0.0002764,0.0003474,0.00015790000000000002,0.0006001,0.0012081,0.0009080000000000001,0.0006948999999999999,0.00016580000000000002,0.0001263,0.0001184,0.00016580000000000002,0.00016580000000000002
GNB,0.0033819,0.0033819,0.0033819,0.0033819,0.0033819,0.0033819,0.00022850000000000002,0.0017039,0.008994400000000001,0.0155905,0.0075366999999999995,0.0188399,0.005314,0.0027004000000000004,0.0011449000000000001,0.0010186,0.0013658,0.0018003000000000001,0.0011765,0.004098,0.0051243999999999994,0.0028741,0.0030794000000000004,0.0011053999999999999,0.0013739,0.0019977000000000003,0.0010975,0.0010975
GNQ,6.9e-06,6.9e-06,6.9e-06,6.9e-06,6.9e-06,6.9e-06,1.07e-05,1.07e-05,1.07e-05,1.07e-05,0.0,0.0,0.0,0.0,0.0,0.0,2.37e-05,7.9e-06,1.58e-05,0.0,7.9e-06,1.58e-05,7.9e-06,7.9e-06,2.37e-05,0.0,0.0,0.0
GRC,0.000826,0.000826,0.000826,0.000826,0.000826,0.000826,0.0002287,0.0002047,0.0007032000000000001,0.00020899999999999998,0.00028460000000000003,0.0022387,4.26e-05,9.520000000000001e-05,0.0013452,0.0009889,0.0006418000000000001,0.0006106000000000001,0.0031486,0.0003499,0.0001161,0.0010075000000000001,0.000603,0.0014058999999999999,0.0002881,0.0001388,0.0001955,0.0001955
GRD,5e-07,5e-07,5e-07,5e-07,5e-07,5e-07,7e-07,9e-07,2.0000000000000002e-07,7e-07,6e-07,0.0,0.0,0.0,0.0,0.0,0.0,0.0,0.0,0.0,0.0,0.0,0.0,0.0,0.0,0.0,7.9e-06,7.9e-06
GRL,0.0,0.0,0.0,0.0,0.0,0.0,0.0,0.0,0.0,0.0,0.0,0.0,0.0,0.0,0.0,0.0,0.0,0.0,0.0,0.0,0.0,0.0,0.0,0.0,0.0,0.0,0.0,0.0
GTM,0.044011299999999996,0.044011299999999996,0.044011299999999996,0.044011299999999996,0.044011299999999996,0.044011299999999996,0.0270037,0.0187179,0.0731186,0.0204575,0.0489341,0.0035741,0.0318899,0.1830786,0.0054895,0.1176382,0.0167514,0.0644628,0.0216701,0.052453400000000004,0.026111699999999998,0.0226164,0.0196013,0.0435378,0.010017300000000002,0.0314138,0.053874000000000005,0.053874000000000005
GUF,0.0017768999999999999,0.0017768999999999999,0.0017768999999999999,0.0017768999999999999,0.0017768999999999999,0.0017768999999999999,0.0007555,0.0007149,0.0008067,0.0008388,0.000123,0.0011348,0.0027897,0.0033651,0.0069667,0.0019006000000000001,0.0004021,0.0006935,0.0037911999999999998,0.002246,0.0020097,2.37e-05,0.0002997,2.37e-05,9.48e-05,0.00082,0.0018689,0.0018689
GUM,0.0,0.0,0.0,0.0,0.0,0.0,0.0,0.0,0.0,0.0,0.0,0.0,0.0,0.0,0.0,0.0,0.0,0.0,0.0,0.0,0.0,0.0,0.0,0.0,0.0,0.0,0.0,0.0
GUY,0.11094490000000001,0.11094490000000001,0.11094490000000001,0.11094490000000001,0.11094490000000001,0.11094490000000001,0.0227136,0.0212618,0.0589987,0.0093682,0.0071856,0.0396554,0.054423000000000006,0.33344799999999997,0.0313035,0.121172,0.0469524,0.0401995,0.0621057,0.0823385,0.1986544,0.0446108,0.08853029999999999,0.0663883,0.1444144,0.2537575,0.1671643,0.1671643
HKG,0.0,0.0,0.0,0.0,0.0,0.0,0.0,0.0,0.0,0.0,0.0,0.0,0.0,0.0,0.0,0.0,0.0,0.0,0.0,0.0,0.0,0.0,0.0,0.0,0.0,0.0,0.0,0.0
HND,0.0314223,0.0314223,0.0314223,0.0314223,0.0314223,0.0314223,0.0070485,0.018522,0.022656500000000003,0.0139141,0.0148321,0.0034714,0.0060213,0.100505,0.0025741,0.0768479,0.0145839,0.0166786,0.018832,0.0266056,0.0183977,0.0585011,0.0045401999999999994,0.03721050000000001,0.0519852,0.0220395,0.0439621,0.0439621
HRV,,,5.67e-05,5.67e-05,5.67e-05,5.67e-05,9.4e-06,8.7e-06,3.26e-05,1.66e-05,0.0001522,0.0,0.0,0.0,0.0,0.0,0.0,0.0009073,0.0,0.0,0.0,0.0,0.0,0.0,0.0,0.0,0.0,0.0
HTI,3e-06,3e-06,3e-06,3e-06,3e-06,3e-06,6.3e-06,4.3e-06,4.9e-06,4e-06,1.24e-05,0.0,0.0,0.0,7.9e-06,0.0,0.0,3.16e-05,0.0,0.0,7.9e-06,0.0,0.0,0.0,0.0,0.0,0.0,0.0
HUN,0.000699,0.000699,0.000699,0.000699,0.000699,0.000699,0.0001138,9.58e-05,0.0001493,0.0001044,0.00025180000000000005,0.0018853,0.0002842,0.0008441,0.0005494,0.0,0.0007158,0.0015599000000000001,0.0009559,6.47e-05,0.0,0.0009558,0.0018339,0.0,0.0014361,9.86e-05,0.0,0.0
IDN,2.8892701,2.8892701,2.8892701,2.8892701,2.8892701,2.8892701,0.7070413,10.4722328,2.8505053,1.0791482000000001,0.3251685,0.37674779999999997,5.5154015,1.6443161,5.3475634,2.4233141999999996,6.783487500000001,0.45655130000000005,0.3389572,4.3711014,0.2545074,2.1146207,2.2638096,1.8985530000000002,5.682201200000001,6.1594513,0.5977380000000001,0.5977380000000001
IMN,0.0,0.0,0.0,0.0,0.0,0.0,0.0,0.0,0.0,0.0,1.0000000000000001e-07,0.0,0.0,0.0,0.0,0.0,0.0,0.0,0.0,0.0,0.0,0.0,0.0,0.0,0.0,0.0,0.0,0.0
IND,0.075301,0.075301,0.075301,0.075301,0.075301,0.075301,0.0274045,0.0202271,0.019997499999999998,0.032795000000000005,0.0215206,0.022479600000000002,0.0097867,0.0564264,0.09427920000000001,0.0540464,0.0750336,0.0618991,0.0575607,0.1367968,0.16578800000000002,0.0577956,0.08597830000000001,0.0816767,0.10026049999999999,0.0592748,0.0857328,0.0857328
IRL,0.0,0.0,0.0,0.0,0.0,0.0,0.0004879,0.0003762,0.0003737,0.0003737,0.0003737,0.0,0.0,0.0003121,0.0,0.00048459999999999996,0.0002385,0.0012942000000000001,0.0,0.0,0.0042169,0.0019774000000000003,6.0400000000000004e-05,0.0,0.0,0.0016991,2.95e-05,2.95e-05
IRN,0.0,0.0,0.0,0.0,0.0,0.0,0.0,0.0,0.0,0.0,0.0,0.0,0.0,0.0,0.0,0.0,0.0,0.0,0.0,0.0,0.0,0.0,0.0,0.0,0.0,0.0,0.0,0.0
IRQ,0.0,0.0,0.0,0.0,0.0,0.0,0.0,0.0,0.0,0.0,0.0,0.0,0.0,0.0,0.0,0.0,0.0,0.0,0.0,0.0,0.0,0.0,0.0,0.0,0.0,0.0,0.0,0.0
ISL,0.0,0.0,0.0,0.0,0.0,0.0,2.96e-05,2.2800000000000002e-05,2.2800000000000002e-05,2.2800000000000002e-05,2.2800000000000002e-05,0.0,0.0,0.0,0.0,0.0,0.0019094000000000001,0.0,0.0,0.0,0.0,0.0,0.0,0.0,0.0,0.0,0.0,0.0
ISR,0.0,0.0,0.0,0.0,0.0,0.0,0.0,0.0,0.0,0.0,0.0,0.0,0.0,0.0,0.0,0.0,0.0,0.0,0.0,0.0,0.0,0.0,0.0,0.0,0.0,0.0,0.0,0.0
ITA,0.0008486,0.0008486,0.0008486,0.0008486,0.0008486,0.0008486,4.5400000000000006e-05,4.45e-05,4.6e-05,4.2000000000000004e-05,5e-07,0.0010608,0.0013260000000000001,0.0029968,7.960000000000001e-05,0.0,0.0027316,0.0,0.0005304,0.0014321,0.0,0.0009547000000000001,2.65e-05,0.0,0.00061,0.0,0.0018299000000000002,0.0018299000000000002
JAM,0.000632,0.000632,0.000632,0.000632,0.000632,0.000632,0.00027,0.0001876,0.00020250000000000002,0.00022470000000000001,0.0004864,0.0008195,0.0002523,7.879999999999999e-05,0.0,0.00025269999999999996,0.0023404,0.0017651,1.58e-05,0.0016392,1.58e-05,0.0001026,0.0007092000000000001,0.000796,3.95e-05,0.00031580000000000003,0.0009693000000000001,0.0009693000000000001
JOR,0.0,0.0,0.0,0.0,0.0,0.0,0.0,0.0,0.0,0.0,0.0,0.0,0.0,0.0,0.0,0.0,0.0,0.0,0.0,0.0,0.0,0.0,0.0,0.0,0.0,0.0,0.0,0.0
JPN,0.0003062,0.0003062,0.0003062,0.0003062,0.0003062,0.0003062,0.0002385,0.000186,0.0001861,0.00018570000000000001,0.0001851,0.0,0.0,0.0005095,1.47e-05,0.0004653,0.000692,0.0003975,0.0002855,0.0006976,0.0001649,2.94e-05,0.0,0.0004946999999999999,0.0005649,0.0005830999999999999,0.0,0.0
KAZ,,,5.5e-06,5.5e-06,5.5e-06,5.5e-06,8.7e-06,0.00048330000000000004,9e-06,7.100000000000001e-06,7e-07,0.0,0.0,2.3500000000000002e-05,2.8999999999999998e-06,5.9e-06,0.0,0.0,2.94e-05,0.0,0.0,0.0,2.06e-05,0.0,5.9e-06,0.0,0.0,0.0
KEN,0.006082,0.006082,0.006082,0.006082,0.006082,0.006082,0.0048341,0.0067815,0.0063046,0.0076818,0.0038738,0.0001074,0.0014365,0.0031509000000000003,0.0012093000000000002,0.0026473,0.011825100000000002,0.0034463,0.014916200000000001,0.0085939,0.0003474,0.010080500000000001,0.0280418,0.0015676000000000002,0.0008162000000000001,0.0062886,0.0028368000000000004,0.0028368000000000004
KGZ,,,0.0,0.0,0.0,0.0,0.0,0.0,0.0,0.0,0.0,0.0,0.0,0.0,0.0,0.0,0.0,0.0,0.0,0.0,0.0,0.0,0.0,0.0,0.0,0.0,0.0,0.0
KHM,0.0285062,0.0285062,0.0285062,0.0285062,0.0285062,0.0285062,0.0048259,0.0308134,0.0693845,0.0409365,0.0304349,0.0065141999999999995,0.011275499999999999,0.017087,0.0275731,0.028259799999999998,0.0285286,0.0288678,0.0238854,0.021848299999999998,0.0209798,0.0347109,0.0245645,0.0412962,0.0365112,0.045015400000000004,0.0591806,0.0591806
KIR,0.0,0.0,0.0,0.0,0.0,0.0,0.0,0.0,0.0,0.0,0.0,0.0,0.0,0.0,0.0,0.0,0.0,0.0,0.0,0.0,0.0,0.0,0.0,0.0,0.0,0.0,0.0,0.0
KNA,0.0,0.0,0.0,0.0,0.0,0.0,0.0,0.0,0.0,0.0,0.0,0.0,0.0,0.0,0.0,0.0,0.0,0.0,0.0,0.0,0.0,0.0,0.0,0.0,0.0,0.0,0.0,0.0
KOR,0.0,0.0,0.0,0.0,0.0,0.0,0.0,0.0,0.0,0.0,0.0,0.0,0.0,0.0,0.0,0.0,0.0,0.0,0.0,0.0,0.0,0.0,0.0,0.0,0.0,0.0,0.0,0.0
KWT,0.0,0.0,0.0,0.0,0.0,0.0,0.0,0.0,0.0,0.0,0.0,0.0,0.0,0.0,0.0,0.0,0.0,0.0,0.0,0.0,0.0,0.0,0.0,0.0,0.0,0.0,0.0,0.0
LAO,0.1085054,0.1085054,0.1085054,0.1085054,0.1085054,0.1085054,0.0387047,0.028311,0.059859499999999996,0.0473412,0.029925300000000002,0.011438499999999999,0.053710900000000006,0.046590000000000006,0.23062549999999998,0.1033027,0.038589599999999995,0.1958262,0.0439865,0.061508400000000005,0.2341856,0.0463779,0.0814632,0.154953,0.10368139999999999,0.12827180000000002,0.2015759,0.2015759
LBN,0.0,0.0,0.0,0.0,0.0,0.0,0.0,0.0,0.0,0.0,0.0,0.0,0.0,0.0,0.0,0.0,0.0,0.0,0.0,0.0,0.0,0.0,0.0,0.0,0.0,0.0,0.0,0.0
LBR,0.0299883,0.0299883,0.0299883,0.0299883,0.0299883,0.0299883,0.0013560000000000002,0.0009494000000000001,0.0014659,0.0011603000000000002,0.0010381000000000001,0.0001974,3.16e-05,0.014568,0.009017200000000001,0.0013423,0.023561699999999998,0.0102174,0.0084566,0.1481508,0.0086619,0.0130756,0.016817000000000002,0.0111806,0.0582567,0.1477738,0.008504,0.008504
LBY,0.0,0.0,0.0,0.0,0.0,0.0,0.0,0.0,0.0,0.0,0.0,0.0,0.0,0.0,0.0,0.0,0.0,0.0,0.0,0.0,0.0,0.0,0.0,0.0,0.0,0.0,0.0,0.0
LCA,0.0,0.0,0.0,0.0,0.0,0.0,0.0,0.0,0.0,0.0,0.0,0.0,0.0,0.0,0.0,0.0,0.0,0.0,0.0,0.0,0.0,0.0,0.0,0.0,0.0,0.0,0.0,0.0
LKA,0.0011877,0.0011877,0.0011877,0.0011877,0.0011877,0.0011877,0.0010163,0.0003947,0.0009084,0.0015153,0.0005358,7.9e-05,0.000608,0.0008579,0.0017845,0.0021082,0.0010344,0.0015555000000000002,0.0004185,0.0007659,0.0005448,0.0014923,0.0046979,0.000379,0.0014843999999999999,0.0003474,0.0008449,0.0008449
LSO,0.0,0.0,0.0,0.0,0.0,0.0,0.0,0.0,0.0,0.0,0.0,0.0,0.0,0.0,0.0,0.0,0.0,0.0,0.0,0.0,0.0,0.0,0.0,0.0,0.0,0.0,0.0,0.0
LTU,,,0.0,0.0,0.0,0.0,4.62e-05,5.67e-05,4.06e-05,0.00016250000000000002,4.49e-05,1.76e-05,0.0004679,0.0011704,0.0001324,6.18e-05,0.0001251,3.68e-05,0.0004932000000000001,0.0007468,8.8e-06,0.0003845,8.8e-06,0.0,3.09e-05,0.0002254,0.0,0.0
LUX,,,,,,,,,,,0.0,0.0,0.0,0.0,0.0,0.0,2.8999999999999998e-06,0.0,0.0,0.0,0.0,0.0,0.0,0.0,0.0,0.0,0.0,0.0
LVA,,,0.0,0.0,0.0,0.0,0.0001858,6.62e-05,5.9e-05,6.79e-05,0.0001071,0.0003297,0.0028484,0.0024846,0.0004623,1.5e-06,0.0005421,9.7e-05,0.0,7.94e-05,0.00016350000000000002,0.0,4.5600000000000004e-05,0.00042280000000000003,0.0006422,0.0002017,2.06e-05,2.06e-05
MAC,0.0,0.0,0.0,0.0,0.0,0.0,0.0,0.0,0.0,0.0,0.0,0.0,0.0,0.0,0.0,0.0,0.0,0.0,0.0,0.0,0.0,0.0,0.0,0.0,0.0,0.0,0.0,0.0
MAR,0.0,0.0,0.0,0.0,0.0,0.0,0.0,0.0,0.0,0.0,0.0,0.0,0.0,0.0,0.0,0.0,0.0,0.0,0.0,0.0,0.0,0.0,0.0,0.0,0.0,0.0,0.0,0.0
MDA,,,0.0001694,0.0001694,0.0001694,0.0001694,0.0,0.0,0.0,0.0,0.0,0.0,0.0,0.0004419,0.0,0.0,0.0001473,0.0008543,0.0,2.95e-05,0.0,5.89e-05,8.840000000000001e-05,0.0002946,0.0,0.0007954,0.0,0.0
MDG,0.0650344,0.0650344,0.0650344,0.0650344,0.0650344,0.0650344,0.0443086,0.033415,0.0460147,0.041919899999999996,0.020397,0.08350629999999999,0.0154581,0.0285391,0.0477258,0.07067230000000001,0.0402709,0.0595357,0.023128,0.0931526,0.0949924,0.104548,0.0493943,0.098182,0.0737449,0.0850211,0.07267850000000001,0.07267850000000001
MDV,0.0,0.0,0.0,0.0,0.0,0.0,0.0,0.0,0.0,0.0,0.0,0.0,0.0,0.0,0.0,0.0,0.0,0.0,0.0,0.0,0.0,0.0,0.0,0.0,0.0,0.0,0.0,0.0
MEX,0.05997160000000001,0.05997160000000001,0.05997160000000001,0.05997160000000001,0.05997160000000001,0.05997160000000001,0.0372741,0.0370702,0.17841970000000001,0.0681879,0.0667484,0.012444100000000001,0.0409092,0.19300989999999998,0.014765499999999999,0.0851347,0.0705352,0.049055100000000004,0.0463179,0.07333020000000001,0.028780899999999998,0.0963628,0.019060900000000002,0.0780125,0.0122806,0.0733381,0.066208,0.066208
MHL,,0.0,0.0,0.0,0.0,0.0,0.0,0.0,0.0,0.0,0.0,0.0,0.0,0.0,0.0,0.0,0.0,0.0,0.0,0.0,0.0,0.0,0.0,0.0,0.0,0.0,0.0,0.0
MKD,,,0.0,0.0,0.0,0.0,0.0,0.0,0.0,0.0,4.0000000000000003e-07,0.0,0.0,0.0,0.0,0.0,0.0,0.0,0.0,0.0,0.0,0.0,0.0,0.0,0.0,0.0,0.0,0.0
MLI,0.0005858,0.0005858,0.0005858,0.0005858,0.0005858,0.0005858,0.0263781,0.0266729,0.052224,0.0402742,0.0366115,0.0015871,0.0014529,0.0003,0.0027952,0.0005606,0.000379,0.0001026,0.0001184,0.0006238,0.0001421,0.0002211,0.0005685,0.0001184,6.32e-05,0.0001263,0.0002132,0.0002132
MLT,0.0,0.0,0.0,0.0,0.0,0.0,0.0,0.0,0.0,0.0,0.0,0.0,0.0,0.0,0.0,0.0,0.0,0.0,0.0,0.0,0.0,0.0,0.0,0.0,0.0,0.0,0.0,0.0
MMR,0.4063092,0.4063092,0.4063092,0.4063092,0.4063092,0.4063092,0.21735310000000002,0.2055939,0.2850956,0.2841329,0.1695758,0.17161410000000002,0.1259727,0.2712147,0.6721291,0.4310863,0.3882252,0.7052711,0.2881876,0.4743024,0.5844396000000001,0.2557429,0.40860199999999997,0.3799562,0.505601,0.49703250000000004,0.3415693,0.3415693
MNE,,,,,,,,,,,,,,,,,0.0,0.0001237,0.0,0.0,0.0,0.0006392,4.12e-05,0.0,0.0,0.0,0.0,0.0
MNG,0.020836900000000002,0.020836900000000002,0.020836900000000002,0.020836900000000002,0.020836900000000002,0.020836900000000002,0.0202457,0.0651246,0.016430499999999997,0.0148833,0.0409616,0.0100033,0.0360165,0.0002984,0.009899,0.0031076000000000003,0.0692371,0.0613384,0.054589900000000004,0.0070678,0.00018229999999999999,0.0126449,0.0139091,0.0087583,0.0043688,0.0370381,0.0049304,0.0049304
MOZ,0.0556807,0.0556807,0.0556807,0.0556807,0.0556807,0.0556807,0.0159633,0.013794,0.0271921,0.017497,0.0036391,0.23914670000000002,0.114121,0.08245010000000001,0.0376876,0.0559117,0.034474,0.040064300000000004,0.0315445,0.0254015,0.0217772,0.0123888,0.025362,0.046547,0.0374192,0.0434439,0.0431517,0.0431517
MRT,0.0,0.0,0.0,0.0,0.0,0.0,0.0,0.0,0.0,0.0,0.0,0.0,0.0,0.0,0.0,0.0,0.0,0.0,0.0,0.0,0.0,0.0,0.0,0.0,0.0,0.0,0.0,0.0
MSR,1e-06,1e-06,1e-06,1e-06,1e-06,1e-06,0.0,0.0,0.0,0.0,0.0,0.0,0.0,0.0,0.0,0.0,0.0,0.0,0.0,0.0,1.58e-05,0.0,0.0,0.0,0.0,0.0,0.0,0.0
MTQ,0.0,0.0,0.0,0.0,0.0,0.0,0.0,0.0,0.0,0.0,0.0,0.0,0.0,0.0,0.0,0.0,0.0,0.0,0.0,0.0,0.0,0.0,0.0,0.0,0.0,0.0,0.0,0.0
MUS,7.4e-06,7.4e-06,7.4e-06,7.4e-06,7.4e-06,7.4e-06,0.0,0.0,0.0,0.0,0.0,0.0,1.58e-05,7.9e-06,0.0,0.0,7.11e-05,0.0,0.0,0.0,7.9e-06,0.0,7.9e-06,7.9e-06,0.0,0.0,0.0,0.0
MWI,0.0139579,0.0139579,0.0139579,0.0139579,0.0139579,0.0139579,0.014355000000000001,0.0124857,0.013746600000000001,0.0116036,0.012321,0.0214244,0.0082805,0.018515999999999998,0.0047255000000000005,0.018872800000000002,0.0020412,0.0043144,0.0093761,0.0079204,0.0241288,0.0098659,0.0188396,0.012743299999999999,0.0143249,0.0248156,0.023136700000000003,0.023136700000000003
MYS,0.1074225,0.1074225,0.1074225,0.1074225,0.1074225,0.1074225,0.062181,0.08346200000000001,0.43293020000000004,0.0529579,0.052979500000000006,0.0022635999999999997,0.0735591,0.0696761,0.1618078,0.1837336,0.0484035,0.10228430000000001,0.0459098,0.2326238,0.1278419,0.1010284,0.0608196,0.0742505,0.2476488,0.08582530000000001,0.1010833,0.1010833
MYT,0.0,0.0,0.0,0.0,0.0,0.0,3.6e-06,4.1000000000000006e-06,4.1000000000000006e-06,3e-06,0.0,0.0,0.0,0.0,0.0,0.0,0.0,0.0,0.0,0.0,0.0,0.0,0.0,0.0,0.0,0.0,0.0,0.0
NAM,0.0008323,0.0008323,0.0008323,0.0008323,0.0008323,0.0008323,0.0097905,0.0089321,0.011709,0.0111121,0.0161599,0.0005358,0.0006619000000000001,0.0004255,0.0009456,0.0004886,0.0003467,0.0009141,0.0010086,0.0011661999999999998,0.0004886,0.0010873999999999999,0.0013238000000000002,0.0010717,0.0007407000000000001,0.0012293,0.0008826000000000001,0.0008826000000000001
NCL,0.0001184,0.0001184,0.0001184,0.0001184,0.0001184,0.0001184,8.05e-05,0.0002953,0.0001838,5.61e-05,4.4e-06,0.0,0.0005764,0.0,0.0004659,0.0004106,0.00016580000000000002,0.0,0.0,0.0,0.0,1.58e-05,0.0,1.58e-05,5.53e-05,0.0001105,7.9e-05,7.9e-05
NER,0.0,0.0,0.0,0.0,0.0,0.0,0.0,0.0,0.0,0.0,0.0,0.0,0.0,0.0,0.0,0.0,0.0,0.0,0.0,0.0,0.0,0.0,0.0,0.0,0.0,0.0,0.0,0.0
NFK,0.0,0.0,0.0,0.0,0.0,0.0,0.0,0.0,0.0,0.0,0.0,0.0,0.0,0.0,0.0,0.0,0.0,0.0,0.0,0.0,0.0,0.0,0.0,0.0,0.0,0.0,0.0,0.0
NGA,0.0181505,0.0181505,0.0181505,0.0181505,0.0181505,0.0181505,0.248917,0.2166208,0.25164949999999997,0.2105156,0.219297,0.015136799999999999,0.006648500000000001,0.025283000000000003,0.017860800000000003,0.018816199999999998,0.0092778,0.0112281,0.044802100000000004,0.0072249,0.0158394,0.0061352,0.0138733,0.0165264,0.0076512,0.016897500000000003,0.0572066,0.0572066
NIC,0.018429200000000003,0.018429200000000003,0.018429200000000003,0.018429200000000003,0.018429200000000003,0.018429200000000003,0.0033953000000000004,0.0059138,0.0217256,0.005368400000000001,0.0062347,0.0026135999999999998,0.0018792,0.042820000000000004,0.0020609,0.04541,0.010035800000000001,0.006561600000000001,0.016897500000000003,0.0070827,0.0225431,0.014441800000000001,0.0047376,0.0275729,0.0358005,0.0142681,0.0401421,0.0401421
NIU,0.0,0.0,0.0,0.0,0.0,0.0,0.0,0.0,0.0,0.0,0.0,0.0,0.0,0.0,0.0,0.0,0.0,0.0,0.0,0.0,0.0,0.0,0.0,0.0,0.0,0.0,0.0,0.0
NLD,0.0,0.0,0.0,0.0,0.0,0.0,7.5e-06,5.7999999999999995e-06,5.7999999999999995e-06,5.7999999999999995e-06,5.7999999999999995e-06,0.0,0.0,0.0,0.0,0.0,2.65e-05,2.95e-05,0.0,0.0,0.0,0.0,0.0,0.0,0.0,0.0,0.0,0.0
NOR,0.0,0.0,0.0,0.0,0.0,0.0,6.09e-05,6.03e-05,4.31e-05,5.1200000000000004e-05,3.69e-05,0.0,3.2300000000000006e-05,4.41e-05,0.0,0.0,0.0002308,2.06e-05,0.0004998,0.0,0.0,0.0,0.0,0.0,0.0,0.0,0.0,0.0
NPL,0.0609541,0.0609541,0.0609541,0.0609541,0.0609541,0.0609541,0.0122136,0.0087729,0.014623100000000002,0.0192471,0.0155597,0.0273322,0.0058367,0.0642022,0.0504882,0.0600208,0.0299317,0.0200343,0.0474284,0.07136669999999999,0.0773479,0.042276,0.08365560000000001,0.08487789999999999,0.0836426,0.011607200000000002,0.2152167,0.2152167
NRU,0.0,0.0,0.0,0.0,0.0,0.0,0.0,0.0,0.0,0.0,0.0,0.0,0.0,0.0,0.0,0.0,0.0,0.0,0.0,0.0,0.0,0.0,0.0,0.0,0.0,0.0,0.0,0.0
NZL,0.0,0.0,0.0,0.0,0.0,0.0,5.7000000000000005e-06,5.1e-06,4e-06,5.1e-06,6e-07,0.0,0.0,0.0,0.0,0.0,0.0,0.0002829,0.00038300000000000004,0.0001473,0.0,0.0,8.840000000000001e-05,0.0,0.0,0.0,0.0,0.0
OMN,0.0,0.0,0.0,0.0,0.0,0.0,0.0,0.0,0.0,0.0,0.0,0.0,0.0,0.0,0.0,0.0,0.0,0.0,0.0,0.0,0.0,0.0,0.0,0.0,0.0,0.0,0.0,0.0
PAK,0.0,0.0,0.0,0.0,0.0,0.0,0.0,0.0,0.0,0.0,0.0,0.0,0.0,0.0,0.0,0.0,0.0,0.0,0.0,0.0,0.0,0.0,0.0,0.0,0.0,0.0,0.0,0.0
PAN,0.004011300000000001,0.004011300000000001,0.004011300000000001,0.004011300000000001,0.004011300000000001,0.004011300000000001,0.0003613,0.0003187,0.0005183,0.0003181,0.0005331,0.0010332,0.0038931,0.0174648,0.0068521,0.0007176,0.003455,0.0020425,0.001895,0.0044295,0.0003946,0.0003,0.0038032,0.0028792,0.0015712999999999999,0.008301000000000001,0.0051482,0.0051482
PCN,0.0,0.0,0.0,0.0,0.0,0.0,0.0,0.0,0.0,0.0,0.0,0.0,0.0,0.0,0.0,0.0,0.0,0.0,0.0,0.0,0.0,0.0,0.0,0.0,0.0,0.0,0.0,0.0
PER,0.0165323,0.0165323,0.0165323,0.0165323,0.0165323,0.0165323,0.0036772999999999997,0.0101365,0.0119552,0.006093200000000001,0.0030135,0.0014325000000000002,0.0047288,0.013932499999999999,0.0051129,0.056463400000000004,0.0115545,0.0416696,0.009530799999999999,0.0046581,0.0331253,0.0077253999999999995,0.0199449,0.0154771,0.0098958,0.0161111,0.0131538,0.0131538
PHL,0.006280300000000001,0.006280300000000001,0.006280300000000001,0.006280300000000001,0.006280300000000001,0.006280300000000001,0.0010115,0.001549,0.0043658,0.0011348,0.0015094000000000002,0.0015318,0.0043507,0.0063958,0.0055351,0.008275000000000001,0.0033084,0.0052271999999999996,0.0024793,0.0040743,0.0113545,0.0049824000000000005,0.0041454000000000005,0.0039954000000000005,0.009459400000000001,0.0112518,0.0141181,0.0141181
PLW,,0.0,0.0,0.0,0.0,0.0,0.0,0.0,0.0,0.0,0.0,0.0,0.0,0.0,0.0,0.0,0.0,0.0,0.0,0.0,0.0,0.0,0.0,0.0,0.0,0.0,0.0,0.0
PNG,0.2197946,0.2197946,0.2197946,0.2197946,0.2197946,0.2197946,0.08252670000000001,1.4091088,0.10593230000000001,0.10383289999999999,0.1008623,0.0536695,0.2685826,0.16401320000000003,0.5439697,0.1237755,0.2547312,0.1004065,0.16119540000000002,0.1183266,0.1976204,0.0990928,0.1142307,0.13060360000000001,0.235024,0.8438184,0.10765330000000001,0.10765330000000001
POL,0.0006501,0.0006501,0.0006501,0.0006501,0.0006501,0.0006501,0.000345,0.0004087,0.0003432,0.00043680000000000005,0.0004185,0.0003696,0.0016064,0.0034224999999999998,0.0002738,0.0004367,0.0001926,0.0001529,0.00046489999999999997,0.00040649999999999996,0.0004616,0.0009145,0.0009262000000000001,0.0003131,9.850000000000001e-05,0.0003059,5.59e-05,5.59e-05
PRI,6.0100000000000004e-05,6.0100000000000004e-05,6.0100000000000004e-05,6.0100000000000004e-05,6.0100000000000004e-05,6.0100000000000004e-05,1.41e-05,5.61e-05,3.8e-05,0.0001626,9.4e-06,0.0,0.0,0.0,0.0,0.0,0.0,1.58e-05,2.37e-05,0.0,0.0001184,4.74e-05,0.0004021,3.16e-05,0.0002601,6.32e-05,0.0,0.0
PRK,0.000359,0.000359,0.000359,0.000359,0.000359,0.000359,6.73e-05,3.85e-05,7.03e-05,6.82e-05,0.0,0.00017680000000000001,0.0,0.0,0.0024746,0.0,0.0001473,0.0,0.0013257000000000002,0.0002946,0.0,0.0009133,0.0,0.0,0.0004124,0.0,0.0,0.0
PRT,0.0001515,0.0001515,0.0001515,0.0001515,0.0001515,0.0001515,0.0001591,0.0001273,0.0001881,0.00016120000000000002,8.9e-05,2.3e-06,7.52e-05,0.0014861,4.97e-05,0.0004938000000000001,2.8999999999999998e-06,2.58e-05,1.2e-06,1.2e-06,0.0001185,1.73e-05,4.6399999999999996e-05,2.1600000000000003e-05,7.6e-06,1.1599999999999999e-05,6.36e-05,6.36e-05
PRY,0.0421899,0.0421899,0.0421899,0.0421899,0.0421899,0.0421899,0.0210918,0.022025700000000002,0.0193892,0.0642487,0.014032500000000002,0.0338581,0.0734803,0.0748543,0.0505346,0.08290040000000001,0.0434441,0.096513,0.0225669,0.027944,0.0237354,0.0284494,0.0413673,0.0303128,0.013802199999999999,0.0103596,0.0209166,0.0209166
PSE,0.0,0.0,0.0,0.0,0.0,0.0,0.0,0.0,0.0,0.0,0.0,0.0,0.0,0.0,0.0,0.0,0.0,0.0,0.0,0.0,0.0,0.0,0.0,0.0,0.0,0.0,0.0,0.0
PYF,1.18e-05,1.18e-05,1.18e-05,1.18e-05,1.18e-05,1.18e-05,6.31e-05,6.31e-05,0.00014099999999999998,6.96e-05,1.29e-05,0.0,0.0,0.0,0.0,0.0,0.0,0.0,0.0,0.0,0.0,0.0001895,0.0,0.0,0.0,0.0,0.0,0.0
QAT,0.0,0.0,0.0,0.0,0.0,0.0,0.0,0.0,0.0,0.0,0.0,0.0,0.0,0.0,0.0,0.0,0.0,0.0,0.0,0.0,0.0,0.0,0.0,0.0,0.0,0.0,0.0,0.0
ROU,0.005384000000000001,0.005384000000000001,0.005384000000000001,0.005384000000000001,0.005384000000000001,0.005384000000000001,0.0032627000000000003,0.0025585,0.0028458000000000003,0.0026290000000000003,0.0027481,0.0011195,0.0077185,0.0049198,0.0010310999999999999,0.0026219999999999998,0.0012962,0.0153325,0.0034174,0.0008809,0.0005892,0.015329599999999999,0.023521,0.0029755,0.0020621999999999997,0.0027692000000000003,0.0005597,0.0005597
RUS,,,1.0817379,1.0817379,1.0817379,1.0817379,0.8081834999999999,0.2901345,0.9104853,0.4570514,0.527475,0.9897222000000001,1.0407714000000001,1.7621248,0.6921915000000001,1.0815709999999998,0.8803609,0.6040958000000001,2.4500387999999997,0.9832043,1.0064225,0.8284958,1.5147978000000002,0.9965481,0.9370174,0.43507229999999997,1.1053721,1.1053721
RWA,0.0091205,0.0091205,0.0091205,0.0091205,0.0091205,0.0091205,0.0033868,0.0045222,0.004361100000000001,0.003383,0.0020522,0.0042474999999999995,0.0035862,0.0208023,0.009101699999999999,0.0149788,0.0107645,0.0009882,0.013227800000000001,0.0047501,0.0073224,0.0059291000000000005,0.0030686,0.0119276,0.0012829,0.0179654,0.0159843,0.0159843
SAU,0.0,0.0,0.0,0.0,0.0,0.0,0.0,0.0,0.0,0.0,0.0,0.0,0.0,0.0,0.0,0.0,0.0,0.0,0.0,0.0,0.0,0.0,0.0,0.0,0.0,0.0,0.0,0.0
SDN,,,,,,,,,,,,,,,,,,,,,,,1.58e-05,3.16e-05,4.74e-05,6.32e-05,2.37e-05,2.37e-05
SEN,0.0073803,0.0073803,0.0073803,0.0073803,0.0073803,0.0073803,0.0045899,0.011282400000000001,0.028866199999999998,0.0350652,0.0237375,0.029231100000000003,0.01126,0.0021635,0.0007896,0.0015712999999999999,0.0046271,0.0064668,0.0046981,0.0078091,0.0144892,0.0150656,0.0101701,0.0024004,0.0026925,0.0024083000000000004,0.0022425,0.0022425
SGP,5e-07,5e-07,5e-07,5e-07,5e-07,5e-07,1.6000000000000001e-06,2.2e-06,1.7e-06,1.2e-06,4.0000000000000003e-07,0.0,0.0,0.0,0.0,0.0,0.0,0.0,0.0,0.0,0.0,7.9e-06,0.0,0.0,0.0,0.0,0.0,0.0
SHN,0.0,0.0,0.0,0.0,0.0,0.0,0.0,0.0,0.0,0.0,0.0,0.0,0.0,0.0,0.0,0.0,0.0,0.0,0.0,0.0,0.0,0.0,0.0,0.0,0.0,0.0,0.0,0.0
SLB,5e-07,5e-07,5e-07,5e-07,5e-07,5e-07,0.0,0.0,0.0,0.0,0.0,0.0,7.9e-06,0.0,0.0,0.0,0.0,0.0,0.0,0.0,0.0,0.0,0.0,0.0,0.0,0.0,0.0,0.0
SLE,0.0491986,0.0491986,0.0491986,0.0491986,0.0491986,0.0491986,0.0023245,0.0030079,0.0073417000000000005,0.0050462,0.0048821,0.0107859,0.0044455,0.0613441,0.08827760000000001,0.022401,0.1156765,0.0550984,0.021019200000000002,0.0689795,0.0128231,0.0143549,0.0595991,0.0252119,0.0763701,0.1214644,0.029325800000000003,0.029325800000000003
SLV,0.0001184,0.0001184,0.0001184,0.0001184,0.0001184,0.0001184,1.6000000000000001e-06,4.66e-05,5e-05,2.2e-06,5.4199999999999996e-05,4.74e-05,0.0,0.0,2.37e-05,2.37e-05,3.95e-05,0.0,0.0,7.9e-06,1.58e-05,0.0,7.9e-06,0.0007343,4.74e-05,0.0009159000000000001,3.16e-05,3.16e-05
SOM,3.5e-06,3.5e-06,3.5e-06,3.5e-06,3.5e-06,3.5e-06,0.0,0.0,0.0,0.0,0.0,0.0,0.0,0.0,0.0,0.0,0.0,7.9e-06,1.58e-05,0.0,7.9e-06,0.0,0.0,0.0,0.0,1.58e-05,7.9e-06,7.9e-06
SPM,0.0,0.0,0.0,0.0,0.0,0.0,0.0,0.0,0.0,0.0,0.0,0.0,0.0,0.0,0.0,0.0,0.0,0.0,0.0,0.0,0.0,0.0,0.0,0.0,0.0,0.0,0.0,0.0
SRB,,,,,,,,,,,,,,,,,2.23e-05,4.4e-06,9e-07,3.2800000000000004e-05,0.0,3.65e-05,6e-07,0.0,0.0,0.0,0.0,0.0
SSD,,,,,,,,,,,,,,,,,,,,,,,2.2627869,1.4748530000000002,0.7133704000000001,1.2644739,1.3053264,1.3053264
STP,0.0,0.0,0.0,0.0,0.0,0.0,0.0,0.0,0.0,0.0,0.0,0.0,0.0,0.0,0.0,0.0,0.0,0.0,0.0,0.0,0.0,0.0,0.0,0.0,0.0,0.0,0.0,0.0
SVK,,,,5e-07,5e-07,5e-07,1.4e-06,1.2e-06,1.4e-06,1.3e-06,7.3e-06,0.0,0.0,1.5e-06,0.0,0.0,0.0,0.0,0.0,0.0,0.0,0.0,5.9e-06,0.0,0.0,0.0,0.0,0.0
SVN,,,0.0,0.0,0.0,0.0,0.0,0.0,0.0,0.0,0.0,0.0,0.0,0.0,0.0,0.0,0.0,0.0,0.0,0.0,0.0,5.3e-05,0.0,0.0,0.0,0.0,0.0,0.0
SWE,0.0,0.0,0.0,0.0,0.0,0.0,6.14e-05,4.46e-05,0.0004666,4.97e-05,1.8599999999999998e-05,0.0,1.44e-05,0.0,6e-07,1.03e-05,0.0010637,2.83e-05,1.18e-05,1.03e-05,0.0,0.0,0.0,0.0,0.0019739000000000002,4.74e-05,0.0,0.0
SWZ,2e-06,2e-06,2e-06,2e-06,2e-06,2e-06,0.0004425,0.000424,0.0004637,0.0003216,0.00031979999999999997,2.7000000000000004e-06,0.0,8e-06,0.0,0.0,0.0,0.0,2.7000000000000004e-06,0.0,2.7000000000000004e-06,8e-06,2.7000000000000004e-06,2.7000000000000004e-06,2.7000000000000004e-06,0.0,0.0,0.0
SYC,0.0,0.0,0.0,0.0,0.0,0.0,0.0,0.0,0.0,0.0,0.0,0.0,0.0,0.0,0.0,0.0,0.0,0.0,0.0,0.0,0.0,0.0,0.0,0.0,0.0,0.0,0.0,0.0
SYR,0.0,0.0,0.0,0.0,0.0,0.0,0.0,0.0,0.0,0.0,0.0,0.0,0.0,0.0,0.0,0.0,0.0,0.0,0.0,0.0,0.0,0.0,0.0,0.0,0.0,0.0,0.0,0.0
TCA,3.9e-06,3.9e-06,3.9e-06,3.9e-06,3.9e-06,3.9e-06,5.7000000000000005e-06,4.3e-06,4.3e-06,4.3e-06,4.3e-06,0.0,0.0,0.0,0.0,0.0,0.0,0.0,0.0,6.32e-05,0.0,0.0,0.0,0.0,0.0,0.0,0.0,0.0
TCD,0.0006464999999999999,0.0006464999999999999,0.0006464999999999999,0.0006464999999999999,0.0006464999999999999,0.0006464999999999999,0.027471000000000002,0.023448,0.0311309,0.017508,0.0060206999999999995,0.0026766999999999997,0.0008686000000000001,0.0001184,0.0004422,0.00033160000000000004,0.0006317,0.0007264000000000001,3.95e-05,5.53e-05,0.0006001,0.001066,0.0013502000000000002,0.0002053,0.0003395,0.0002922,0.0006001,0.0006001
TGO,0.0014642,0.0014642,0.0014642,0.0014642,0.0014642,0.0014642,0.0028087,0.0035942,0.0068146000000000005,0.0097003,0.0017228000000000002,0.0009949,0.0012871,0.0004501,0.0011053999999999999,0.002203,0.0010581,0.0013107,0.0013265,0.0038454,0.0007027,0.001295,0.0013265,0.0015081,0.0007185000000000001,0.0029295000000000002,0.001366,0.001366
THA,0.0804172,0.0804172,0.0804172,0.0804172,0.0804172,0.0804172,0.0424717,0.041675800000000006,0.1003997,0.057265,0.034299500000000004,0.0234275,0.0497603,0.035153,0.1822427,0.0970813,0.0465943,0.1436677,0.06494459999999999,0.076378,0.07730100000000001,0.016929,0.0841082,0.0500528,0.12124760000000001,0.09051980000000001,0.1272673,0.1272673
TJK,,,0.0,0.0,0.0,0.0,0.0,0.0,0.0,0.0,0.0,0.0,0.0,0.0,0.0,0.0,0.0,0.0,0.0,0.0,0.0,0.0,0.0,0.0,0.0,0.0,0.0,0.0
TKL,0.0,0.0,0.0,0.0,0.0,0.0,0.0,0.0,0.0,0.0,0.0,0.0,0.0,0.0,0.0,0.0,0.0,0.0,0.0,0.0,0.0,0.0,0.0,0.0,0.0,0.0,0.0,0.0
TKM,,,0.0,0.0,0.0,0.0,0.0,0.0,0.0,0.0,0.0,0.0,0.0,0.0,0.0,0.0,0.0,0.0,0.0,0.0,0.0,0.0,0.0,0.0,0.0,0.0,0.0,0.0
TLS,0.00018010000000000001,0.00018010000000000001,0.00018010000000000001,0.00018010000000000001,0.00018010000000000001,0.00018010000000000001,1.4500000000000002e-05,0.00020810000000000002,1.29e-05,8.54e-05,0.0,0.00025269999999999996,0.0005922,2.37e-05,0.0001342,2.37e-05,0.0001184,7.11e-05,0.0002606,0.00043430000000000004,0.0,0.00016580000000000002,0.0004185,7.9e-06,0.0001737,0.0002053,0.0,0.0
TON,0.0,0.0,0.0,0.0,0.0,0.0,0.0,0.0,0.0,0.0,0.0,0.0,0.0,0.0,0.0,0.0,0.0,0.0,0.0,0.0,0.0,0.0,0.0,0.0,0.0,0.0,0.0,0.0
TTO,9.48e-05,9.48e-05,9.48e-05,9.48e-05,9.48e-05,9.48e-05,0.00013539999999999998,9.95e-05,0.0002119,0.00012080000000000001,0.00021740000000000003,1.58e-05,0.0,9.48e-05,0.0,0.0,7.9e-06,7.9e-05,4.74e-05,7.11e-05,0.0005290000000000001,0.0,0.0,1.58e-05,0.0001105,7.11e-05,0.0004738,0.0004738
TUN,0.0,0.0,0.0,0.0,0.0,0.0,0.0,0.0,0.0,0.0,0.0,0.0,0.0,0.0,0.0,0.0,0.0,0.0,0.0,0.0,0.0,0.0,0.0,0.0,0.0,0.0,0.0,0.0
TUR,2.2e-06,2.2e-06,2.2e-06,2.2e-06,2.2e-06,2.2e-06,6.100000000000001e-06,3.4e-06,3.6e-06,3.3e-06,4.3e-06,2.8999999999999998e-06,1.5e-06,0.0,0.0,2.8999999999999998e-06,0.0,8.8e-06,4.4e-06,0.0,2.8999999999999998e-06,4.4e-06,5.9e-06,0.0,1.5e-06,0.0,0.0,0.0
TUV,0.0,0.0,0.0,0.0,0.0,0.0,0.0,0.0,0.0,0.0,0.0,0.0,0.0,0.0,0.0,0.0,0.0,0.0,0.0,0.0,0.0,0.0,0.0,0.0,0.0,0.0,0.0,0.0
TWN,0.0,0.0,0.0,0.0,0.0,0.0,0.0,0.0,0.0,0.0,0.0,0.0,0.0,0.0,0.0,0.0,0.0,0.0,0.0,0.0,0.0,0.0,0.0,0.0,0.0,0.0,0.0,0.0
TZA,0.6248319,0.6248319,0.6248319,0.6248319,0.6248319,0.6248319,0.6586375000000001,0.5239671,0.6530325,0.5993962,0.38419830000000005,0.7527211,0.5676962999999999,0.7321168,0.7635267,0.9098821,0.6432908,0.7167204,0.7047933000000001,0.5980151,0.572918,0.5885237,0.5218827,0.4635103,0.4617618,0.5352209,0.46473000000000003,0.46473000000000003
UGA,0.0350327,0.0350327,0.0350327,0.0350327,0.0350327,0.0350327,0.0335558,0.0395133,0.0517163,0.0565861,0.042138800000000004,0.014470499999999999,0.036324,0.0477859,0.0607249,0.0624206,0.0399301,0.0062052,0.023454799999999998,0.0298008,0.0210291,0.0317496,0.034420400000000004,0.035568300000000004,0.039648600000000006,0.0429842,0.0340067,0.0340067
UKR,,,0.0309723,0.0309723,0.0309723,0.0309723,0.0093757,0.0087501,0.008887800000000001,0.008020300000000001,0.00449,0.0125169,0.062220700000000004,0.0217829,0.021534,0.016793,0.0182364,0.0273785,0.0335606,0.0310723,0.014453,0.0249645,0.0481628,0.0032159,0.0622972,0.0868198,0.010548400000000001,0.010548400000000001
URY,0.00012770000000000001,0.00012770000000000001,0.00012770000000000001,0.00012770000000000001,0.00012770000000000001,0.00012770000000000001,7.39e-05,7.149999999999999e-05,0.00015,6.93e-05,7.630000000000001e-05,0.0,0.0,8.840000000000001e-05,0.0,0.0011838999999999999,0.0,5.9e-06,0.000106,0.0001119,1.18e-05,0.0004241,2.36e-05,5.9e-06,5.9e-06,6.48e-05,1.18e-05,1.18e-05
USA,1.1475299,1.1475299,1.1475299,1.1475299,1.1475299,1.1475299,0.5667778,0.4346936,0.504256,0.7154517,0.4930059,0.8161404,1.1760524,0.9241627,1.5369344,1.1997582,1.1915547,2.2612862000000002,0.8756993,1.1005172,1.0960678000000001,1.5272236000000001,1.0198918,0.8648686,1.0622794,1.0332495,0.6747920000000001,0.6747920000000001
UZB,,,0.0,0.0,0.0,0.0,0.0,0.0,0.0,0.0,0.0,0.0,0.0,0.0,0.0,0.0,0.0,0.0,0.0,0.0,0.0,0.0,0.0,0.0,0.0,0.0,0.0,0.0
VCT,0.0,0.0,0.0,0.0,0.0,0.0,0.0,0.0,0.0,0.0,0.0,0.0,0.0,0.0,0.0,0.0,0.0,0.0,0.0,0.0,0.0,0.0,0.0,0.0,0.0,0.0,0.0,0.0
VEN,0.16607490000000003,0.16607490000000003,0.16607490000000003,0.16607490000000003,0.16607490000000003,0.16607490000000003,0.0611776,0.0637916,0.1288423,0.0691165,0.0737035,0.302663,0.0311525,0.3096417,0.0495303,0.0977682,0.16139830000000002,0.2202308,0.10722190000000001,0.0580828,0.3626851,0.012458,0.017731000000000004,0.27154629999999996,0.1200061,0.1880062,0.3470769,0.3470769
VGB,0.0,0.0,0.0,0.0,0.0,0.0,0.0,0.0,0.0,0.0,0.0,0.0,0.0,0.0,0.0,0.0,0.0,0.0,0.0,0.0,0.0,0.0,0.0,0.0,0.0,0.0,0.0,0.0
VIR,0.0,0.0,0.0,0.0,0.0,0.0,0.0,0.0,0.0,0.0,0.0,0.0,0.0,0.0,0.0,0.0,0.0,0.0,0.0,0.0,0.0,0.0,0.0,0.0,0.0,0.0,0.0,0.0
VNM,0.028764900000000003,0.028764900000000003,0.028764900000000003,0.028764900000000003,0.028764900000000003,0.028764900000000003,0.0088325,0.0066289999999999995,0.0170617,0.0134634,0.008241,0.0048245,0.046816699999999996,0.0236594,0.026869,0.0437584,0.011948499999999999,0.021327600000000002,0.0194817,0.0117154,0.0428964,0.0284091,0.026990300000000002,0.0416703,0.042502899999999996,0.0345373,0.032831400000000004,0.032831400000000004
VUT,3.2099999999999994e-05,3.2099999999999994e-05,3.2099999999999994e-05,3.2099999999999994e-05,3.2099999999999994e-05,3.2099999999999994e-05,2e-06,1.84e-05,1.9e-06,2.6e-06,0.0,0.0,0.0,0.0002211,0.0,0.0,0.0,0.0,0.0,0.0,0.0,0.0,0.0,0.0,0.0,0.0002922,0.0,0.0
WLF,0.0,0.0,0.0,0.0,0.0,0.0,0.0,0.0,0.0,0.0,0.0,0.0,0.0,0.0,0.0,0.0,0.0,0.0,0.0,0.0,0.0,0.0,0.0,0.0,0.0,0.0,0.0,0.0
WSM,1.18e-05,1.18e-05,1.18e-05,1.18e-05,1.18e-05,1.18e-05,6.18e-05,6.18e-05,0.00013969999999999998,6.83e-05,1.29e-05,0.0,0.0,0.0,0.0,0.0,0.0,0.0,0.0,0.0,0.0,0.0001895,0.0,0.0,0.0,0.0,0.0,0.0
YEM,0.0,0.0,0.0,0.0,0.0,0.0,0.0,0.0,0.0,0.0,0.0,0.0,0.0,0.0,0.0,0.0,0.0,0.0,0.0,0.0,0.0,0.0,0.0,0.0,0.0,0.0,0.0,0.0
ZAF,0.0202611,0.0202611,0.0202611,0.0202611,0.0202611,0.0202611,0.008777100000000001,0.0075518,0.0109315,0.0088507,0.0083492,0.0102844,0.0195257,0.0195531,0.0194934,0.0253401,0.0207769,0.019382100000000003,0.0193911,0.0272655,0.0237197,0.021528099999999998,0.0248312,0.0171803,0.0279706,0.0246537,0.0032817,0.0032817
ZMB,3.6100014000000002,3.6100014000000002,3.6100014000000002,3.6100014000000002,3.6100014000000002,3.6100014000000002,3.4869692,3.1391466,3.1872894,2.8610214000000003,3.2164125,3.0225831,3.4712132,3.6407172,3.7641709999999997,4.4632032,3.7253535,3.4407408999999998,3.602828,3.0807394,3.5018723,3.4583404,3.6312098,3.7417285000000002,3.4832279,3.7674166000000002,3.9646777,3.9646777
ZWE,0.0,0.0,0.0,0.0,0.0,0.0,0.0,0.0,0.0,0.0,0.0,0.0,0.0,0.0,0.0,0.0,0.0,0.0,0.0,0.0,0.0,0.0,0.0,0.0,0.0,0.0,0.0,0.0
