### META ###
ID,Emissions|GHG|Agriculture|Cultivation_organic_soils__Historic__FAO_2020
category,Agriculture|Cultivation_organic_soils
creator,AG
entity,Emissions|GHG
modified,2021/05/06-02:56:14
pathway,Historic
scenario,Historic
source,FAO_2020
unit,Mt CO2eq
variable,Emissions|GHG|Agriculture|Cultivation_organic_soils
### DATA ###
region,1990,1991,1992,1993,1994,1995,1996,1997,1998,1999,2000,2001,2002,2003,2004,2005,2006,2007,2008,2009,2010,2011,2012,2013,2014,2015,2016,2017,2018,2030,2050
AGO,0.052125300000000006,0.052125300000000006,0.052125300000000006,0.052125300000000006,0.052125300000000006,0.0519309,0.0517364,0.051825699999999995,0.0523559,0.053837600000000006,0.0551483,0.055016800000000005,0.055016800000000005,0.05483,0.0548431,0.054318399999999996,0.0540899,0.0540899,0.0538125,0.0536191,0.0535548,0.053361000000000006,0.053361000000000006,0.053361000000000006,0.053199300000000005,0.0530218,0.0526444,0.0526444,0.0520558,0.0520558,0.0520558
ALB,0.014594900000000001,0.014594900000000001,0.014594900000000001,0.014594900000000001,0.014594900000000001,0.014594900000000001,0.014594900000000001,0.014594900000000001,0.0145889,0.0145819,0.0145819,0.0145808,0.0145808,0.0145808,0.0145689,0.0145689,0.0145689,0.0145689,0.0145689,0.0145689,0.0145689,0.0145689,0.0145689,0.0145618,0.0145618,0.0145547,0.0145161,0.0145161,0.0142616,0.0142616,0.0142616
ARG,1.1275385000000002,1.1275385000000002,1.1275385000000002,1.1275385000000002,1.1275385000000002,1.1293257,1.1291382,1.1293922,1.1307736,1.1322872,1.1351214,1.1420705,1.1476481,1.1498828,1.1486249,1.1461613,1.1470475,1.1483227999999999,1.1502693,1.1504018,1.1513009,1.1511407999999999,1.1511203,1.1503679,1.1482993,1.1482401,1.1487781,1.1488533,1.1526055,1.1526055,1.1526055
AUS,0.4604453,0.4604453,0.4604453,0.4604453,0.46015730000000005,0.4649409,0.4661887,0.4681905,0.47019740000000004,0.4720567,0.4730019,0.47277030000000003,0.4721409,0.4715607,0.4704314,0.47002120000000003,0.4690666,0.4686336,0.4683756,0.4682212,0.46796210000000005,0.4678332,0.4678073,0.4676907,0.46728620000000004,0.46728620000000004,0.466798,0.46661290000000005,0.4665703,0.4665703,0.4665703
AUT,0.0447915,0.0447915,0.0447915,0.0447915,0.0447703,0.0447121,0.0446943,0.044305000000000004,0.044294400000000005,0.04621840000000001,0.0476575,0.0470383,0.0477727,0.0478284,0.0485344,0.049213099999999996,0.049213099999999996,0.049213099999999996,0.049213099999999996,0.0494366,0.0498891,0.0498891,0.049868,0.049868,0.0498892,0.0498892,0.0497407,0.0497407,0.0497407,0.0497407,0.0497407
BDI,0.4885645,0.4885645,0.4885645,0.4885645,0.4885645,0.5078066,0.5093597,0.5136204,0.5177897,0.5264172,0.5263529,0.5255855,0.5255995,0.5255058,0.5243443999999999,0.5256296,0.5262518,0.5263139,0.5264639,0.5261527,0.5263561,0.5265787000000001,0.5265787000000001,0.5267955,0.5267834,0.5267834,0.523072,0.5222541,0.5205116000000001,0.5205116000000001,0.5205116000000001
BEL,,,,,,,,,,,0.031280999999999996,0.0310277,0.030606200000000004,0.0302077,0.029914100000000002,0.0299411,0.030049,0.030185,0.0302065,0.0302242,0.030306,0.0303302,0.0303344,0.0303344,0.0303569,0.0303569,0.0302112,0.0300454,0.0299821,0.0299821,0.0299821
BGD,2.6945148,2.6945148,2.6945148,2.6945148,2.6945148,2.6968962000000003,2.6966108,2.6943240999999998,2.6815683,2.6607901000000003,2.6461095,2.6409911000000004,2.6335068,2.6307667,2.6180538,2.6179425000000003,2.618591,2.623428,2.621781,2.6230289,2.6251007,2.6136792,2.6129571,2.6070171,2.5985286000000003,2.5971455000000003,2.5989726,2.5993831000000003,2.5986178,2.5986178,2.5986178
BGR,0.1558182,0.1558182,0.1558182,0.1558182,0.1557942,0.1562353,0.1559567,0.1556813,0.15541990000000003,0.1550404,0.1548769,0.1546111,0.1543941,0.1541317,0.1538641,0.1536249,0.1535349,0.1531337,0.15280359999999998,0.1525671,0.1522849,0.1521102,0.1519203,0.15168500000000001,0.1513585,0.151201,0.151096,0.1510024,0.1505983,0.1505983,0.1505983
BIH,,,0.018161899999999998,0.018161899999999998,0.018161899999999998,0.0180935,0.017956600000000003,0.017956600000000003,0.018108000000000003,0.0180803,0.0180803,0.0180803,0.0180803,0.0182315,0.0182315,0.0182315,0.0182315,0.0182315,0.0182315,0.0181632,0.0181632,0.0181632,0.0181632,0.0180118,0.0173641,0.0173641,0.0173641,0.0173641,0.0173641,0.0173641,0.0173641
BLR,,,5.8618215000000005,5.8618215000000005,5.8612038,5.8365488999999995,5.8386826,5.850004200000001,5.8680562,5.9101590999999996,5.9178478,5.9109372,5.900061200000001,5.8883066,5.862976300000001,5.8539763,5.842459600000001,5.8352822,5.7990009,5.7852949,5.7863104000000005,5.8017657,5.8033117,5.807716999999999,5.8081602000000006,5.8081408,5.7625547,5.74541,5.739897,5.739897,5.739897
BLZ,0.040328499999999996,0.040328499999999996,0.040328499999999996,0.040328499999999996,0.040328499999999996,0.039674799999999996,0.039674799999999996,0.0390587,0.0390587,0.0381457,0.035479100000000006,0.0349196,0.0346886,0.033853900000000006,0.0342651,0.0346637,0.0349529,0.0360394,0.0376718,0.0390607,0.0396575,0.040242,0.0402228,0.0402033,0.0396055,0.0396055,0.0406334,0.0424071,0.0432873,0.0432873,0.0432873
BRA,0.0841957,0.0841957,0.0841957,0.0841957,0.0841957,0.0854379,0.0857246,0.0863884,0.08803820000000001,0.0907594,0.0904427,0.0906086,0.0912473,0.0914485,0.1081946,0.1081946,0.1081946,0.1081946,0.1081946,0.1081946,0.1081946,0.1081946,0.1081946,0.1081946,0.10826000000000001,0.10826000000000001,0.1085315,0.11191079999999999,0.1127808,0.1127808,0.1127808
BRN,0.044715200000000004,0.044715200000000004,0.044715200000000004,0.044715200000000004,0.044715200000000004,0.0457713,0.0457713,0.046038800000000005,0.046520200000000005,0.0469882,0.047362499999999995,0.0450498,0.0445419,0.0425098,0.0419486,0.0404913,0.0403309,0.0396759,0.0391948,0.0385664,0.0381253,0.0378579,0.0378312,0.0371362,0.0361871,0.035959899999999996,0.036187199999999996,0.0355054,0.0359866,0.0359866,0.0359866
BWA,0.0762024,0.0762024,0.0762024,0.0762024,0.0762024,0.0762024,0.0762024,0.0762024,0.07766110000000001,0.0818068,0.0844983,0.08541620000000001,0.08633289999999999,0.0871233,0.0908831,0.0908831,0.0903771,0.0903766,0.0909135,0.0893318,0.0889526,0.0885739,0.0885739,0.0885739,0.0878132,0.0878132,0.0884139,0.08803430000000001,0.08803430000000001,0.08803430000000001,0.08803430000000001
CAF,0.0054516,0.0054516,0.0054516,0.0054516,0.0054516,0.0054516,0.005398,0.005398,0.0053411,0.0054616,0.0054616,0.0054616,0.0054616,0.0054616,0.0054616,0.0054616,0.0057762,0.0059033,0.0059669,0.0059669,0.0060104,0.006328299999999999,0.0065191,0.0065191,0.0067701,0.0067701,0.007406000000000001,0.0076603,0.0077239000000000006,0.0077239000000000006,0.0077239000000000006
CAN,4.862215600000001,4.862215600000001,4.862215600000001,4.862215600000001,4.861909300000001,4.9132923,4.9271246,4.863810000000001,4.969194900000001,5.004176800000001,5.0349759999999995,5.0462037,5.054892799999999,5.0541983,5.0595037000000005,5.042266,5.0297913,5.0132769,5.0046812,5.0039856,5.0090649,5.015407000000001,5.0208435,5.023465,5.0252403,5.0278818,5.0379406,5.044906200000001,5.0873636,5.0873636,5.0873636
CHE,0.1480281,0.1480281,0.1480281,0.1480281,0.147748,0.1473717,0.1466991,0.1459061,0.14561670000000002,0.1453023,0.1460078,0.1389134,0.13447309999999998,0.1331527,0.1320406,0.1320512,0.1319744,0.13211009999999998,0.132085,0.1321305,0.1325093,0.13329490000000002,0.13329490000000002,0.1333816,0.1340367,0.1340367,0.13393010000000002,0.1339403,0.1338659,0.1338659,0.1338659
CHL,0.1759107,0.1759107,0.1759107,0.1759107,0.1759107,0.17598570000000002,0.17598570000000002,0.1759365,0.1761308,0.1772471,0.177696,0.17742660000000002,0.1769755,0.1768835,0.17705420000000002,0.1770409,0.1769908,0.1770421,0.1769648,0.176457,0.1763834,0.17649019999999999,0.1762394,0.17622730000000003,0.17580420000000002,0.17580420000000002,0.1783823,0.1795687,0.18331460000000002,0.18331460000000002,0.18331460000000002
CHN,0.5630448,0.5630448,0.5630448,0.5630448,0.5630448,0.5687865000000001,0.5698637,0.5700877000000001,0.5713097,0.5742881,0.5754539,0.5772789,0.5769859,0.5778271,0.5793348,0.5798110000000001,0.5796062,0.5800076000000001,0.5811166,0.5820889,0.5818466,0.5829865999999999,0.5829816,0.5827455,0.5831698000000001,0.5831698000000001,0.5834666,0.5834661999999999,0.5834661999999999,0.5834661999999999,0.5834661999999999
CIV,0.27321480000000004,0.27321480000000004,0.27321480000000004,0.27321480000000004,0.2730729,0.29644180000000003,0.2996259,0.3044787,0.3093105,0.3095111,0.3129866,0.3157611,0.31586939999999997,0.3162953,0.3168637,0.31661989999999995,0.3161958,0.3171958,0.317301,0.31765679999999996,0.3189025,0.3190361,0.31923500000000005,0.3200399,0.3214811,0.3214811,0.3220523,0.3224298,0.3228056,0.3228056,0.3228056
CMR,0.18746010000000002,0.18746010000000002,0.18746010000000002,0.18746010000000002,0.18746010000000002,0.1877577,0.1877577,0.1878645,0.18974690000000002,0.19236930000000002,0.19765710000000003,0.1989717,0.19939300000000001,0.1993128,0.2011824,0.2011155,0.2015306,0.2018991,0.203273,0.2061563,0.2097854,0.2114617,0.21428210000000003,0.2149547,0.2146511,0.214571,0.222248,0.221957,0.2199566,0.2199566,0.2199566
COD,0.06795820000000001,0.06795820000000001,0.06795820000000001,0.06795820000000001,0.06795820000000001,0.0681283,0.0685341,0.068344,0.068344,0.0676936,0.0673434,0.0669331,0.0669331,0.066773,0.0666129,0.0666129,0.0666129,0.06645269999999999,0.06645269999999999,0.06645269999999999,0.0662626,0.0662626,0.0662626,0.0662626,0.0662626,0.06610250000000001,0.06622990000000001,0.06622990000000001,0.06603969999999999,0.06603969999999999,0.06603969999999999
COG,0.4195278,0.4195278,0.4195278,0.4195278,0.4195278,0.41616190000000003,0.4094897,0.40469170000000004,0.40547730000000004,0.40723590000000004,0.39006060000000004,0.3669369,0.3665045,0.3627292,0.3613675,0.36335789999999996,0.3660527,0.36222000000000004,0.3683746,0.3673823,0.37089550000000004,0.3819169,0.40695420000000004,0.412136,0.41939139999999997,0.41939139999999997,0.42592450000000004,0.42978530000000004,0.4327956,0.4327956,0.4327956
COL,0.08982670000000001,0.08982670000000001,0.08982670000000001,0.08982670000000001,0.08982670000000001,0.0953707,0.0953707,0.0953707,0.0984598,0.1011837,0.1074624,0.1097879,0.1131772,0.11550320000000001,0.1227474,0.1227474,0.1227474,0.1241092,0.1260359,0.1267003,0.1283945,0.13171690000000003,0.13171690000000003,0.13347730000000002,0.13347730000000002,0.13347730000000002,0.1341095,0.13500630000000002,0.13500630000000002,0.13500630000000002,0.13500630000000002
CRI,0.029765200000000002,0.029765200000000002,0.029765200000000002,0.029765200000000002,0.029765200000000002,0.029765200000000002,0.029765200000000002,0.029765200000000002,0.029765200000000002,0.029765200000000002,0.029765200000000002,0.029765200000000002,0.0291728,0.0281857,0.0281857,0.0281857,0.0281857,0.0281857,0.0281857,0.0281857,0.0281857,0.0281857,0.0281857,0.028146,0.0246833,0.0246833,0.0246833,0.0240579,0.0235315,0.0235315,0.0235315
CZE,,,,0.043935800000000004,0.0438881,0.0436902,0.043576000000000004,0.043866999999999996,0.0437694,0.043485300000000005,0.0430496,0.0427671,0.042403100000000006,0.041713,0.0414936,0.0414565,0.041419,0.0414245,0.041414900000000004,0.0413332,0.0413429,0.0413709,0.0413741,0.0413724,0.0413448,0.0413448,0.0412181,0.041281000000000005,0.0414306,0.0414306,0.0414306
DEU,4.3637414,4.3637414,4.3637414,4.3637414,4.3608723000000005,4.3673174,4.3622368,4.3604419,4.188338,4.349558600000001,4.343992,4.3381276,4.322415299999999,4.3033102,4.2824156,4.2835862,4.2835685,4.2849222000000005,4.2836416,4.2835886,4.2843426000000004,4.2843952,4.2842287,4.2833269000000005,4.2778114,4.277498,4.270476800000001,4.2691672,4.2719753,4.2719753,4.2719753
DNK,0.3317898,0.3317898,0.3317898,0.3317898,0.3317383,0.33210019999999996,0.3317579,0.3315695,0.3315103,0.3289285,0.3289203,0.3291667,0.3288412,0.32858099999999996,0.32836919999999997,0.3284155,0.32830309999999996,0.3285892,0.32852210000000004,0.3284989,0.3289626,0.32914030000000005,0.3291441,0.32911130000000005,0.32881420000000006,0.32878809999999997,0.3281381,0.3279999,0.3278609,0.3278609,0.3278609
ECU,0.0043562,0.0043562,0.0043562,0.0043562,0.0043562,0.0043562,0.0043562,0.0043562,0.0043562,0.0043562,0.0043562,0.0047284,0.0047284,0.0047284,0.0150605,0.0150605,0.0150605,0.0150605,0.0150605,0.0150605,0.0150605,0.0150605,0.0150605,0.0150605,0.0150605,0.0150605,0.0150605,0.0150605,0.0150605,0.0150605,0.0150605
ERI,,,,0.0006144,0.0006144,0.0006144,0.0006144,0.0006144,0.0006144,0.0006144,0.0006144,0.0006144,0.0006144,0.0006144,0.0006144,0.0006144,0.0006144,0.0006144,0.0006144,0.0006144,0.0006144,0.0006144,0.0006144,0.0006144,0.0006144,0.0006144,0.0006144,0.0006144,0.0006144,0.0006144,0.0006144
ESP,0.0570532,0.0570532,0.0570532,0.0570532,0.0568593,0.0566409,0.0566409,0.0566409,0.060310499999999996,0.0660343,0.0679695,0.067168,0.0733111,0.0735098,0.07480020000000001,0.0746764,0.0745527,0.0731558,0.0731558,0.0730818,0.0728514,0.07239,0.07239,0.0719653,0.07176690000000001,0.07176690000000001,0.0709728,0.0701466,0.0699158,0.0699158,0.0699158
EST,,,0.5721174,0.5721174,0.5721102,0.5853174,0.5869955,0.5894125,0.608852,0.6530932,0.6703075000000001,0.6763564,0.6817427,0.6832963999999999,0.6924841,0.6943627,0.6962257,0.7002065000000001,0.7025068,0.7059457,0.7145829,0.7187382999999999,0.7200068000000001,0.7211545,0.7202999,0.7202753000000001,0.7119022,0.7114657,0.7163398,0.7163398,0.7163398
ETH,,,,0.9158727,0.9158727,0.9189259,0.9199949000000001,0.9193239,0.9234137,0.9317268000000001,0.9312567,0.9376460000000001,0.9435726,0.9406052,0.9439834,0.9492016,0.9490329000000001,0.9492646,0.9549855,0.9638507,0.9656070999999999,0.9686255,0.9680297000000001,0.9676910000000001,0.9527496,0.9527496,0.9482032,0.9445675,0.9385498,0.9385498,0.9385498
FIN,1.6130632,1.6130632,1.6130632,1.6130632,1.6128833,1.6151755,1.6167355,1.6212541,1.6312674999999999,1.669421,1.724892,1.7374056,1.7544977,1.7698829999999999,1.8090103,1.8200804000000002,1.8267358999999999,1.8348593000000002,1.8464349,1.865616,1.8811709,1.9008831000000002,1.9111001,1.9135419,1.9212189000000002,1.9212551000000002,1.9439937,1.9639907,2.0399256,2.0399256,2.0399256
FJI,0.0149946,0.0149946,0.0149946,0.0149946,0.0149946,0.0149946,0.0149946,0.0149946,0.0149946,0.0149946,0.0149946,0.0149946,0.0149946,0.015052,0.015052,0.0151029,0.0149851,0.0149246,0.01481,0.0146348,0.0146348,0.0143481,0.0143481,0.0143481,0.014564800000000001,0.014507500000000001,0.0146159,0.0146159,0.0146159,0.0146159,0.0146159
FLK,0.7154304,0.7154304,0.7154304,0.7154304,1.0593293000000001,1.0593293000000001,1.0593293000000001,1.0593293000000001,1.0594104,1.0591982,1.0591612000000001,1.0581575,1.0580398,1.0580398,1.0580336,1.0575854,1.0574733,1.0573492000000002,1.0573927,1.0570513000000001,1.0571513,1.0571513,1.0571513,1.0572826,1.0572826,1.0572826,1.0572826,1.0572826,1.0572826,1.0572826,1.0572826
FRA,0.8481401,0.8481401,0.8481401,0.8481401,0.8475671,0.8484556,0.8479777000000001,0.8462258,0.8451904,0.8421569,0.8403932,0.837076,0.8314171,0.8253484,0.8158813,0.8157078,0.8156125,0.8152528,0.8144296000000001,0.8138650000000001,0.8138031,0.8139279,0.8138986,0.8137433,0.8132527,0.8132527,0.8128778999999999,0.8128056,0.8139923,0.8139923,0.8139923
FRO,0.043934,0.043934,0.043934,0.043934,0.043934,0.043934,0.043882800000000007,0.043882800000000007,0.043882800000000007,0.043882800000000007,0.043882800000000007,0.043882800000000007,0.043882800000000007,0.043882800000000007,0.043882800000000007,0.043882800000000007,0.043882800000000007,0.043882800000000007,0.043882800000000007,0.043882800000000007,0.043882800000000007,0.043882800000000007,0.043882800000000007,0.043882800000000007,0.043882800000000007,0.043882800000000007,0.043882800000000007,0.043882800000000007,0.043882800000000007,0.043882800000000007,0.043882800000000007
GAB,0.07207590000000001,0.07207590000000001,0.07207590000000001,0.07207590000000001,0.07207590000000001,0.0719989,0.071905,0.0718782,0.07213939999999999,0.0765619,0.0771355,0.0794089,0.080244,0.0818567,0.0839221,0.0839791,0.0839623,0.0839624,0.08386539999999999,0.0836611,0.0831348,0.08357429999999999,0.0834771,0.08363129999999999,0.0839968,0.0839968,0.0845098,0.0849154,0.0859178,0.0859178,0.0859178
GHA,0.013913,0.013913,0.013913,0.013913,0.013913,0.0141668,0.014228600000000001,0.014228600000000001,0.014228600000000001,0.014228600000000001,0.0146295,0.0148733,0.0148783,0.014881700000000001,0.0146362,0.0146362,0.0146045,0.014539300000000002,0.0138196,0.0133136,0.0131315,0.0131098,0.012809200000000001,0.0121412,0.0119375,0.0119375,0.0119342,0.0120161,0.0123768,0.0123768,0.0123768
GIN,0.1426571,0.1426571,0.1426571,0.1426571,0.1425253,0.1409494,0.1404488,0.1400259,0.1408913,0.14006639999999998,0.1376521,0.13613319999999998,0.1348661,0.13365090000000002,0.1329384,0.1332815,0.1330889,0.1326523,0.1321105,0.13199539999999998,0.13270220000000002,0.1332166,0.1334668,0.13371750000000002,0.13442240000000003,0.13442240000000003,0.1346727,0.13533799999999999,0.1365845,0.1365845,0.1365845
GNB,0.00016450000000000001,0.00016450000000000001,0.00016450000000000001,0.00016450000000000001,0.00016450000000000001,0.0001119,0.0001119,0.0001119,0.0001119,0.0001119,0.0001119,0.0001119,0.0001119,0.0001119,0.0001119,0.0001119,0.0001119,0.0001119,0.0001119,0.0001119,0.0001119,0.0001119,0.0001119,0.0001119,0.0001119,0.0001119,0.0001119,0.0001119,0.0001119,0.0001119,0.0001119
GNQ,6.37e-05,6.37e-05,6.37e-05,6.37e-05,6.37e-05,6.37e-05,6.37e-05,6.37e-05,6.37e-05,6.37e-05,6.37e-05,6.37e-05,6.37e-05,6.37e-05,6.37e-05,6.37e-05,6.37e-05,6.37e-05,6.37e-05,6.37e-05,6.37e-05,6.37e-05,6.37e-05,6.37e-05,6.37e-05,6.37e-05,6.37e-05,6.37e-05,6.37e-05,6.37e-05,6.37e-05
GRC,0.1760871,0.1760871,0.1760871,0.1760871,0.1760634,0.1767191,0.1765947,0.1765573,0.1764783,0.17626730000000002,0.17600559999999998,0.1758887,0.1757768,0.17558580000000001,0.1754374,0.1753771,0.1752417,0.17505320000000002,0.1748168,0.17466890000000002,0.1745959,0.1744522,0.1743501,0.1741637,0.174018,0.1738608,0.173734,0.1732771,0.1724269,0.1724269,0.1724269
GUY,0.39770190000000005,0.39770190000000005,0.39770190000000005,0.39770190000000005,0.3975752,0.447107,0.479861,0.49203600000000003,0.4950732,0.5192234,0.5210451,0.5238617000000001,0.5252129,0.5247059000000001,0.5798029,0.5782169,0.5774576,0.5770645,0.5769845,0.5766448000000001,0.576339,0.5762733,0.5743619,0.5733827,0.5718111,0.571598,0.571598,0.5712782999999999,0.5716853,0.5716853,0.5716853
HRV,,,0.0014637,0.0014637,0.0014637,0.0014637,0.0014637,0.0014637,0.0014637,0.0013953,0.0013953,0.0014894,0.0014210000000000002,0.0014210000000000002,0.001147,0.001147,0.001147,0.0013096000000000002,0.0013096000000000002,0.0013096000000000002,0.0013096000000000002,0.0013096000000000002,0.0013096000000000002,0.0013096000000000002,0.0013096000000000002,0.0013096000000000002,0.0013096000000000002,0.0013096000000000002,0.0013096000000000002,0.0013096000000000002,0.0013096000000000002
HUN,0.7630907,0.7630907,0.7630907,0.7630907,0.7629546,0.7651756000000001,0.764934,0.7635318,0.7622379,0.7615375000000001,0.7621519999999999,0.7602582,0.7574196,0.7520953,0.7444218,0.7444341,0.7445068,0.7444849,0.7432546,0.7429746,0.7432356,0.7434208999999999,0.7434913000000001,0.7434913000000001,0.7431500999999999,0.7431500999999999,0.7424533,0.7422578,0.7410021000000001,0.7410021000000001,0.7410021000000001
IDN,29.757994,29.757994,29.757994,29.757994,29.7553237,30.006044600000003,30.0140906,30.1861998,30.426455699999998,30.5690225,30.558644400000002,30.4724781,30.6793103,31.0295777,31.2329823,31.8253118,32.5275631,33.3099695,33.804808599999994,34.065475899999996,34.64089,35.1482131,35.5442112,35.7424942,36.1053704,36.0975503,36.5869189,36.735119,36.979623999999994,36.979623999999994,36.979623999999994
IMN,0.004159500000000001,0.004159500000000001,0.004159500000000001,0.004159500000000001,0.004159500000000001,0.004159500000000001,0.004159500000000001,0.004159500000000001,0.004159500000000001,0.0040855,0.0040786,0.0040717999999999996,0.004065000000000001,0.004065000000000001,0.004026,0.004029,0.004029,0.004029,0.004029,0.004029,0.004029,0.004029,0.004029,0.004028,0.004028,0.004028,0.004028,0.004028,0.0039558,0.0039558,0.0039558
IND,0.7807317,0.7807317,0.7807317,0.7807317,0.7810467,0.7827994,0.7823894,0.7818844,0.7819007,0.7775210000000001,0.774057,0.7726344,0.7718801,0.7709408,0.7698830000000001,0.7684929,0.768304,0.7681421,0.7678368000000001,0.7693755,0.768917,0.7682237000000001,0.7678884,0.7676318,0.7664262000000001,0.7661924,0.7651110999999999,0.7650357,0.7649355000000001,0.7649355000000001,0.7649355000000001
IRL,2.1845714,2.1845714,2.1845714,2.1845714,2.1845515,2.178862,2.1749598000000003,2.165795,2.1647255,2.1593252,2.1548182000000002,2.1520441,2.1481964,2.1440263,2.1373913,2.1358596,2.1353983,2.1333031,2.1306452,2.1262056,2.1247163999999996,2.1248461,2.1241843,2.1234585000000004,2.1201673000000003,2.120129,2.1166384,2.1166896000000004,2.1159511,2.1159511,2.1159511
ISL,0.1574794,0.1574794,0.1574794,0.1574794,0.1574794,0.1574794,0.1574794,0.1574794,0.1573966,0.1573552,0.1573552,0.1573552,0.1573552,0.1573552,0.1573552,0.1573552,0.1573552,0.1573552,0.1573552,0.1573552,0.1573552,0.1573552,0.1573552,0.1573552,0.1573552,0.1573552,0.1573552,0.1573552,0.15769350000000001,0.15769350000000001,0.15769350000000001
ITA,0.0905446,0.0905446,0.0905446,0.0905446,0.0905446,0.0905446,0.0905446,0.0905446,0.0905552,0.0905552,0.0905552,0.0907613,0.0909674,0.0909674,0.0909674,0.0907828,0.0907828,0.0905982,0.0905982,0.0905982,0.0905982,0.0905982,0.0905982,0.0905982,0.0905982,0.0905982,0.0905982,0.0905982,0.0903958,0.0903958,0.0903958
JAM,0.0312627,0.0312627,0.0312627,0.0312627,0.0312627,0.032244300000000004,0.032728700000000006,0.032728700000000006,0.035812500000000004,0.0398516,0.0412404,0.0419413,0.0419413,0.0415338,0.0415338,0.0415338,0.042068600000000005,0.0418647,0.0418647,0.0421196,0.04260390000000001,0.0428587,0.0447834,0.0447834,0.0445412,0.0445412,0.0445412,0.0445412,0.0445412,0.0445412,0.0445412
JPN,0.7167316,0.7167316,0.7167316,0.7167316,0.7109945000000001,0.7147051,0.7108405,0.708842,0.7066513999999999,0.7089521999999999,0.7071309,0.7042796,0.7027428,0.7013762,0.7021172,0.6918671000000001,0.684827,0.6659551,0.6548728,0.6395986,0.627279,0.6181732,0.6104126,0.6013847,0.5925077,0.5874251,0.5869053000000001,0.5859211000000001,0.5857304000000001,0.5857304000000001,0.5857304000000001
KEN,0.0353979,0.0353979,0.0353979,0.0353979,0.0353979,0.0365421,0.036793599999999996,0.036793599999999996,0.036793599999999996,0.036793599999999996,0.036793599999999996,0.0372765,0.0372765,0.0372765,0.0372765,0.0372765,0.0372765,0.0372765,0.0372765,0.037034500000000005,0.037034500000000005,0.037034500000000005,0.037034500000000005,0.0368067,0.0368067,0.0368067,0.0368067,0.0368067,0.0364672,0.0364672,0.0364672
LBR,0.0139266,0.0139266,0.0139266,0.0139266,0.0139266,0.0141072,0.0141707,0.014287699999999999,0.014842800000000001,0.0155782,0.017155899999999998,0.0182791,0.018406099999999998,0.0185231,0.018994499999999997,0.018994499999999997,0.018994499999999997,0.018994499999999997,0.018994499999999997,0.0190513,0.0189878,0.019051400000000003,0.019051400000000003,0.019051400000000003,0.0190113,0.0190113,0.0189711,0.018773900000000003,0.0187003,0.0187003,0.0187003
LKA,0.2448918,0.2448918,0.2448918,0.2448918,0.24462540000000002,0.2451097,0.24471340000000003,0.2447003,0.2445504,0.2438509,0.2436515,0.24469210000000002,0.24479900000000002,0.2453564,0.24558660000000002,0.2447643,0.2443215,0.2415302,0.2407477,0.2399185,0.2393089,0.2384665,0.2369079,0.23554239999999999,0.2328993,0.23185319999999998,0.2319198,0.23222980000000001,0.23229640000000001,0.23229640000000001,0.23229640000000001
LTU,,,1.4146096000000001,1.4146096000000001,1.4143888,1.4057865,1.4007456,1.3978964,1.3951491,1.3877846999999999,1.3867502999999999,1.3834718000000001,1.3811262,1.3794686999999999,1.3741062,1.3719704,1.3721031000000001,1.3727703,1.3722759000000002,1.3684213,1.3683162,1.3684146000000001,1.3685331,1.368622,1.3608602,1.3606814,1.3500713000000002,1.3487666,1.3488365,1.3488365,1.3488365
LUX,,,,,,,,,,,0.0007452,0.0007452,0.0007149,0.0006944000000000001,0.0006944000000000001,0.0006944000000000001,0.0006944000000000001,0.0006944000000000001,0.0006944000000000001,0.0006944000000000001,0.0006944000000000001,0.0006944000000000001,0.0006944000000000001,0.0006944000000000001,0.0007046,0.0007046,0.0007046,0.0007046,0.0007046,0.0007046,0.0007046
LVA,,,0.6472952000000001,0.6472952000000001,0.6472795,0.6677396,0.6686121,0.6731547000000001,0.6778882,0.6992678,0.7314045,0.7362771,0.737607,0.7418247,0.7508039,0.7521289999999999,0.7568089,0.7620987,0.7709068,0.7723947,0.7787561,0.7853907000000001,0.7869149,0.7863633999999999,0.7782437,0.7782437,0.7687989000000001,0.7682384,0.7707437,0.7707437,0.7707437
MDA,,,0.024558700000000003,0.024558700000000003,0.024558700000000003,0.025182700000000002,0.0249669,0.0249669,0.0249669,0.0245441,0.0245441,0.024456600000000002,0.024456600000000002,0.0238088,0.022991800000000003,0.022991800000000003,0.022991800000000003,0.022991800000000003,0.022991800000000003,0.022991800000000003,0.0227759,0.0225945,0.0225945,0.0225945,0.0225945,0.0225945,0.0225945,0.0225945,0.0225945,0.0225945,0.0225945
MDG,0.7934576,0.7934576,0.7934576,0.7934576,0.7934576,0.8024883,0.8036164,0.8072271,0.8084256000000001,0.8217008,0.8225684,0.8239899,0.8238852000000001,0.8225966,0.8247462000000001,0.8252256,0.8268428,0.8283728,0.827684,0.8271606,0.8289873,0.8335139999999999,0.8341453000000001,0.8331578,0.8336614,0.8335599,0.8335032,0.8335032,0.8346160000000001,0.8346160000000001,0.8346160000000001
MMR,2.1927566,2.1927566,2.1927566,2.1927566,2.192574,2.1924539,2.1908976,2.187687,2.1860399000000004,2.1807056,2.1797338,2.1796245,2.1793891,2.1777063,2.1760925,2.1772127,2.1778682,2.1782793000000003,2.1774479,2.1777098,2.17791,2.1771770000000004,2.1770932,2.175999,2.1743135000000002,2.1727006,2.1654956000000003,2.1629679,2.1605952000000004,2.1605952000000004,2.1605952000000004
MNE,,,,,,,,,,,,,,,,,0.0030815,0.0030815,0.0030815,0.0030815,0.0030815,0.0030815,0.0030815,0.0030815,0.0030815,0.0030815,0.0030815,0.0030815,0.0030815,0.0030815,0.0030815
MNG,4.1187881,4.1187881,4.1187881,4.1187881,4.118627099999999,4.1203008,4.124747,4.1314465,4.136624,4.1410962,4.142765000000001,4.1378146,4.1376407,4.1393804,4.149814800000001,4.152038800000001,4.1555306000000005,4.160354000000001,4.1606931000000005,4.1631821,4.163837900000001,4.1747383000000005,4.1785055,4.181444000000001,4.1818731,4.1819024,4.1522455,4.1418377,4.1403776,4.1403776,4.1403776
MWI,0.12195600000000001,0.12195600000000001,0.12195600000000001,0.12195600000000001,0.12195600000000001,0.12232559999999999,0.1226916,0.1230546,0.1244677,0.12555650000000002,0.1260102,0.1267511,0.12706510000000001,0.1266295,0.1272343,0.1272343,0.1266556,0.1267184,0.1277144,0.1268986,0.1265949,0.1268328,0.126889,0.12552549999999998,0.1221439,0.1221439,0.12233190000000001,0.12264530000000001,0.12227930000000001,0.12227930000000001,0.12227930000000001
MYS,3.3280358999999997,3.3280358999999997,3.3280358999999997,3.3280358999999997,3.326242,3.3149764,3.2524461000000002,3.2589953,3.2878344000000004,3.3442968,3.422096,3.4953076000000003,3.5450759999999994,3.5801726,3.6541718000000003,3.7312313,3.8530745000000004,4.0402112,4.2781626,4.4470192,4.5809296999999995,4.645983,4.7053822,4.7371754,4.8819586,4.8767688,4.9472109,4.9762008,5.0021758,5.0021758,5.0021758
NAM,0.000994,0.000994,0.000994,0.000994,0.000994,0.000994,0.000994,0.000994,0.000994,0.000994,0.000994,0.000994,0.000994,0.000994,0.000994,0.000994,0.000994,0.000994,0.000994,0.000994,0.000994,0.000994,0.000994,0.000994,0.000994,0.000994,0.000994,0.000994,0.000994,0.000994,0.000994
NIC,0.013555300000000001,0.013555300000000001,0.013555300000000001,0.013555300000000001,0.013555300000000001,0.013555300000000001,0.013555300000000001,0.013555300000000001,0.012963100000000002,0.012963100000000002,0.0123708,0.0123708,0.0123708,0.0123708,0.0123708,0.0123708,0.0128972,0.0128972,0.0128972,0.0128972,0.012305,0.012305,0.011778499999999999,0.011778499999999999,0.009673000000000001,0.009673000000000001,0.009673000000000001,0.009673000000000001,0.009673000000000001,0.009673000000000001,0.009673000000000001
NLD,1.2084694,1.2084694,1.2084694,1.2084694,1.2073196000000002,1.2072415,1.2076535,1.2065543,1.2057003,1.2048305000000001,1.2039349,1.1980081,1.1856271999999999,1.1780717,1.1722375,1.1719486,1.1718811,1.1717108,1.1718834999999999,1.1718834999999999,1.1719115,1.1719015,1.1717998,1.1717998,1.1708900000000002,1.1707934,1.1697021,1.1693783000000002,1.1680369000000002,1.1680369000000002,1.1680369000000002
NOR,0.9683497,0.9683497,0.9683497,0.9683497,0.9662261,0.9593594000000001,0.9576543000000001,0.9564807,0.9569888999999999,0.9672297,0.9766367,0.9828574,0.9839446000000001,0.9871788,0.990005,0.9934516999999999,0.9962316,1.0003051,1.0040466000000001,1.0117403,1.0185906,1.0266823999999999,1.0293412000000002,1.0297012,1.0374767999999999,1.0377084,1.0407305,1.041758,1.0511762000000002,1.0511762000000002,1.0511762000000002
NPL,0.41124079999999996,0.41124079999999996,0.41124079999999996,0.41124079999999996,0.4344585,0.426526,0.4254406,0.4256352,0.42791320000000005,0.4669563,0.4697963,0.47434840000000006,0.4738718,0.4726069,0.4715056,0.469858,0.46962580000000004,0.4686902,0.4680551,0.4679411,0.4679581,0.4676826,0.4676556,0.4678861,0.46852170000000004,0.4684371,0.46046929999999997,0.45829230000000004,0.45843720000000004,0.45843720000000004,0.45843720000000004
NZL,0.4632541,0.4632541,0.4632541,0.4632541,0.4631475,0.4710385,0.4704847,0.47019720000000004,0.4697136,0.4696395,0.46901,0.46940820000000005,0.4692283,0.4691581,0.46884960000000003,0.46866420000000003,0.468315,0.46829950000000004,0.4684249,0.4682151,0.46830320000000003,0.46829919999999997,0.4683155,0.46895420000000004,0.4688316,0.4687117,0.4682506,0.4682036,0.4680929,0.4680929,0.4680929
PAN,0.1082551,0.1082551,0.1082551,0.1082551,0.1082551,0.1082551,0.1082551,0.1082551,0.1082551,0.1082551,0.1082551,0.1082551,0.1082551,0.1082551,0.1082551,0.1082551,0.1081354,0.10800920000000001,0.10800920000000001,0.10775660000000001,0.10775660000000001,0.10775660000000001,0.10775660000000001,0.10775660000000001,0.10775660000000001,0.10775660000000001,0.1078629,0.1078629,0.1078629,0.1078629,0.1078629
PER,0.006619,0.006619,0.006619,0.006619,0.006619,0.0067791,0.0074466,0.0076074,0.007448,0.0083657,0.008471600000000001,0.009723200000000001,0.0099749,0.0099864,0.0188388,0.0183855,0.017838899999999998,0.017438600000000002,0.017438600000000002,0.017438600000000002,0.017278500000000002,0.017278500000000002,0.017278500000000002,0.0170383,0.0170383,0.0170383,0.0170383,0.01729,0.01729,0.01729,0.01729
PNG,2.7171722,2.7171722,2.7171722,2.7171722,2.7171722,2.9552494,2.9518822,2.9702519,3.0353601,3.1758965,3.3217189,3.3733156,3.4063586,3.3903593,3.4059415,3.3799782,3.3498094000000003,3.3278205,3.2667246,3.2404958,3.2377851,3.2339622,3.2317684,3.2228239,3.2107243,3.2107243,3.1861794,3.1839993,3.2032406,3.2032406,3.2032406
POL,4.2184615999999995,4.2184615999999995,4.2184615999999995,4.2184615999999995,4.2174397,4.2016272,4.1312862,4.1646762,4.0592976,4.1403306,4.1347214999999995,4.1249488,4.114844199999999,4.1003318,4.0817588,4.0814284,4.0811905,4.0810995,4.0792921,4.0747229,4.0741777,4.0755306000000004,4.0753496,4.0745246,4.0694996,4.069331200000001,4.0575421,4.0557426,4.0596528,4.0596528,4.0596528
PRI,0.0216819,0.0216819,0.0216819,0.0216819,0.0215309,0.0185501,0.0175327,0.0165076,0.0165076,0.0162055,0.016054500000000003,0.015331200000000001,0.0151802,0.0137654,0.013344000000000002,0.0130499,0.012755800000000001,0.0124537,0.0118894,0.0118894,0.011738400000000001,0.0115953,0.0115953,0.011444300000000001,0.0120403,0.0120403,0.0120403,0.0120403,0.0120403,0.0120403,0.0120403
PRK,0.0152715,0.0152715,0.0152715,0.0152715,0.0152715,0.0152715,0.0152715,0.0152715,0.0152715,0.0152715,0.0152715,0.0152715,0.0152715,0.015016700000000001,0.0149148,0.0153916,0.0153916,0.0158683,0.0158683,0.0158683,0.0158683,0.0168214,0.0175367,0.0176222,0.017960999999999998,0.018438,0.017960999999999998,0.017960999999999998,0.017960999999999998,0.017960999999999998,0.017960999999999998
PRT,0.048124400000000005,0.048124400000000005,0.048124400000000005,0.048124400000000005,0.0480849,0.0479134,0.0478602,0.0478374,0.0478132,0.0469714,0.0467767,0.0466762,0.0467285,0.0469187,0.0479989,0.0480576,0.048229100000000004,0.048169,0.048121899999999995,0.048135700000000003,0.0483646,0.0482868,0.0482828,0.048147300000000004,0.048015,0.0479053,0.0470304,0.046845500000000005,0.0464368,0.0464368,0.0464368
ROU,0.0744857,0.0744857,0.0744857,0.0744857,0.0744857,0.0742863,0.0742863,0.07406270000000001,0.07406270000000001,0.0746548,0.0746548,0.0746548,0.0746548,0.07425369999999999,0.07356059999999999,0.07356059999999999,0.07405790000000001,0.0737967,0.0736435,0.0742546,0.0745607,0.0745607,0.07497530000000001,0.07497530000000001,0.0747506,0.0747506,0.0747506,0.0749566,0.0745798,0.0745798,0.0745798
RUS,,,7.104455700000001,7.104455700000001,7.1033919,7.0921289,7.0829274,7.0801476,6.9724411,7.1494911000000005,7.1680048,7.1543013,7.1544208,7.1357441,7.132788000000001,7.120687,7.0999119,7.077177,7.0633292,7.0460335,7.0719603,7.104509,7.1458717,7.1441705,7.1339235,7.1392805,7.1794965,7.203457500000001,7.3101847,7.3101847,7.3101847
RWA,0.2636933,0.2636933,0.2636933,0.2636933,0.2636933,0.2653844,0.2648535,0.2644138,0.26453879999999996,0.264405,0.2643718,0.2630107,0.2620523,0.2620854,0.261409,0.2618845,0.2618845,0.2619867,0.2621637,0.2621637,0.26201990000000003,0.2617572,0.2618899,0.2618899,0.2618899,0.2618899,0.260515,0.2599493,0.2583594,0.2583594,0.2583594
SLB,8.21e-05,8.21e-05,8.21e-05,8.21e-05,8.21e-05,8.21e-05,8.21e-05,8.21e-05,8.21e-05,8.21e-05,8.21e-05,8.21e-05,8.21e-05,8.21e-05,8.21e-05,8.21e-05,8.21e-05,8.21e-05,8.21e-05,8.21e-05,8.21e-05,8.21e-05,8.21e-05,8.21e-05,8.21e-05,8.21e-05,8.21e-05,8.21e-05,8.21e-05,8.21e-05,8.21e-05
SRB,,,,,,,,,,,,,,,,,0.00032500000000000004,0.00032500000000000004,0.00032500000000000004,0.00032500000000000004,0.00032500000000000004,0.00032500000000000004,0.00032500000000000004,0.00032500000000000004,0.00032500000000000004,0.00032500000000000004,0.00032500000000000004,0.00032500000000000004,0.00032500000000000004,0.00032500000000000004,0.00032500000000000004
SSD,,,,,,,,,,,,,,,,,,,,,,,2.1339857,2.1322596,2.1228811000000003,2.1228811000000003,2.1271063,2.1261161000000004,2.1222734,,
SVK,,,,0.0098105,0.0098105,0.009777300000000001,0.0097402,0.0096982,0.0096389,0.0093844,0.0093816,0.0093816,0.009298400000000002,0.0092266,0.009218500000000001,0.009218500000000001,0.009244400000000002,0.0092586,0.0092586,0.009304,0.009304,0.009323600000000001,0.009312999999999998,0.009312999999999998,0.0093163,0.0093163,0.0093257,0.0093506,0.009367100000000001,0.009367100000000001,0.009367100000000001
SVN,,,0.0174943,0.0174943,0.0174943,0.0174943,0.0174943,0.0174943,0.0174943,0.022955,0.022955,0.023212800000000002,0.023212800000000002,0.023212800000000002,0.023049,0.023049,0.0230736,0.0230736,0.0233523,0.0240089,0.024245799999999998,0.024245799999999998,0.024245799999999998,0.024245799999999998,0.0247757,0.0247757,0.024789600000000002,0.024789600000000002,0.0247548,0.0247548,0.0247548
SWE,1.1406393000000001,1.1406393000000001,1.1406393000000001,1.1406393000000001,1.1404143,1.1431682,1.1440446,1.1457053000000001,1.1504616,1.1633073,1.1869001000000001,1.1892628,1.1920827,1.2014106,1.2212359,1.2478110000000002,1.2571795,1.2677055000000002,1.2843204000000001,1.3112049,1.34657,1.3800165,1.3879762,1.3905499000000001,1.4048134,1.4077641,1.4290326,1.4587982,1.5720309,1.5720309,1.5720309
THA,0.2138262,0.2138262,0.2138262,0.2138262,0.2138262,0.2000401,0.1918799,0.1889999,0.181959,0.18057220000000002,0.17870540000000001,0.1844634,0.18537,0.18537,0.1883024,0.1878224,0.1888357,0.190382,0.1917149,0.1912348,0.1922211,0.1922211,0.1922211,0.1922211,0.1927541,0.1927541,0.1927541,0.1927541,0.1927541,0.1927541,0.1927541
TUR,5.9499999999999996e-05,5.9499999999999996e-05,5.9499999999999996e-05,5.9499999999999996e-05,5.9499999999999996e-05,5.9499999999999996e-05,5.9499999999999996e-05,5.9499999999999996e-05,5.9499999999999996e-05,5.9499999999999996e-05,5.9499999999999996e-05,5.9499999999999996e-05,5.9499999999999996e-05,5.9499999999999996e-05,5.9499999999999996e-05,5.9499999999999996e-05,5.9499999999999996e-05,5.9499999999999996e-05,5.9499999999999996e-05,5.9499999999999996e-05,5.9499999999999996e-05,5.9499999999999996e-05,5.9499999999999996e-05,5.9499999999999996e-05,5.9499999999999996e-05,5.9499999999999996e-05,5.9499999999999996e-05,5.9499999999999996e-05,5.9499999999999996e-05,5.9499999999999996e-05,5.9499999999999996e-05
TZA,0.8128493,0.8128493,0.8128493,0.8128493,0.8128493,0.8124394,0.8129423000000001,0.8146808,0.8161591,0.8184372,0.8151265,0.8123161,0.8097009000000001,0.8082756000000001,0.8033861000000001,0.8035827000000001,0.8022503000000001,0.7980440999999999,0.7938112,0.7918499000000001,0.7925426,0.791694,0.7914797,0.7889709,0.787151,0.787151,0.7761489,0.7754898,0.7734323000000001,0.7734323000000001,0.7734323000000001
UGA,0.8878478000000001,0.8878478000000001,0.8878478000000001,0.8878478000000001,0.8877204000000001,0.8924314000000001,0.8924297,0.8917959,0.8921606000000001,0.8918454,0.8903548,0.8882573,0.8887854,0.8883092,0.8879119,0.8879488,0.8880644,0.8879244000000001,0.8882262,0.8872403000000001,0.8870332,0.8870332,0.8870332,0.8867782999999999,0.8867782999999999,0.8867782999999999,0.8866491999999999,0.8865989,0.885459,0.885459,0.885459
UKR,,,2.7496148,2.7496148,2.7484744,2.7489386,2.7107625,2.7242931,2.7273042999999997,2.6997932000000002,2.6888118,2.680027,2.6670778,2.6494968,2.6214042,2.6132545,2.6080066000000004,2.5988652,2.5833416000000002,2.5708321,2.5690699,2.5715033,2.5718831,2.5722429000000004,2.5729158,2.5729158,2.5632164,2.5575881,2.5572261,2.5572261,2.5572261
URY,0.0332113,0.0332113,0.0332113,0.0332113,0.0332113,0.0345027,0.0345027,0.0345027,0.0345027,0.0345577,0.0345077,0.0344554,0.034356000000000005,0.034356000000000005,0.034153300000000004,0.0342087,0.0342585,0.0342035,0.034333100000000005,0.034278100000000006,0.034228299999999996,0.0341926,0.0341427,0.0340878,0.033932899999999995,0.033932899999999995,0.034037399999999995,0.034037399999999995,0.034037399999999995,0.034037399999999995,0.034037399999999995
USA,8.3242957,8.3242957,8.3242957,8.3242957,8.3050642,8.3469511,8.339742399999999,8.3332441,8.34351,8.344541600000001,8.3540065,8.3413437,8.3416308,8.337951499999999,8.328179200000001,8.3200686,8.310048,8.308034900000001,8.3019172,8.295967,8.294710199999999,8.2893154,8.2788895,8.259389,8.2485888,8.241492000000001,8.212980100000001,8.210234,8.2311219,8.2311219,8.2311219
VEN,0.2132413,0.2132413,0.2132413,0.2132413,0.2132413,0.2109957,0.2106642,0.2104169,0.2106481,0.2221375,0.2222962,0.22477670000000002,0.22388919999999998,0.21536590000000003,0.22054870000000001,0.21896480000000001,0.2192224,0.2177789,0.2169435,0.21638970000000002,0.2181342,0.2188736,0.2188736,0.2241102,0.2485796,0.2485796,0.26078140000000005,0.2775569,0.29634679999999997,0.29634679999999997,0.29634679999999997
VNM,0.5353327000000001,0.5353327000000001,0.5353327000000001,0.5353327000000001,0.5353327000000001,0.5377658000000001,0.5377658000000001,0.5380834999999999,0.5376337999999999,0.5380838,0.5402527,0.5459682,0.5469475,0.5469475,0.5456508999999999,0.5456508999999999,0.5456508999999999,0.5456508999999999,0.5452016,0.5452016,0.5456514,0.5456514,0.5456514,0.5456514,0.5456514,0.5456514,0.5314407999999999,0.5185864,0.5158872999999999,0.5158872999999999,0.5158872999999999
ZAF,0.0786262,0.0786262,0.0786262,0.0786262,0.0786262,0.0789049,0.0796629,0.0802856,0.084119,0.08913979999999999,0.0901382,0.0904215,0.092637,0.0971994,0.09790890000000001,0.0980499,0.098023,0.0980504,0.098264,0.0983351,0.09839780000000001,0.098417,0.098417,0.0984295,0.0983382,0.0983382,0.0983719,0.0984431,0.0984681,0.0984681,0.0984681
ZMB,2.8417246,2.8417246,2.8417246,2.8417246,2.8417246,2.8417993000000004,2.8357846,2.8324377,2.8326246999999998,2.8362865000000004,2.8532714,2.8554687,2.8594174,2.8584174,2.8597968000000002,2.8570149000000002,2.8525163,2.8518548,2.8525618,2.8481844,2.8497929999999996,2.8491997000000002,2.8488493,2.8478163,2.8450721,2.8450721,2.8416331,2.8416331,2.8317207,2.8317207,2.8317207
