### META ###
ID,Emissions|GHG|FOLU|Burning_biomass__Historic__FAO_2020
category,FOLU|Burning_biomass
creator,AG
entity,Emissions|GHG
modified,2021/05/06-02:56:15
pathway,Historic
scenario,Historic
source,FAO_2020
unit,Mt CO2eq
variable,Emissions|GHG|FOLU|Burning_biomass
### DATA ###
region,1990,1991,1992,1993,1994,1995,1996,1997,1998,1999,2000,2001,2002,2003,2004,2005,2006,2007,2008,2009,2010,2011,2012,2013,2014,2015,2016,2017,2018,2019
ABW,0.0,0.0,0.0,0.0,0.0,0.0,0.0,0.0,0.0,0.0,0.0,0.0,0.0,0.0,0.0,0.0,0.0,0.0,0.0,0.0,0.0,0.0,0.0,0.0,0.0,0.0,0.0,0.0,0.0,0.0
AFG,0.0002589,0.0002589,0.0002589,0.0002589,0.0002589,0.0002589,0.00018010000000000001,0.0001067,0.0002918,8e-05,0.0006359,0.0,0.0,0.0,0.0,0.0,0.0,0.0,0.0,0.0,0.0,0.0,0.0,0.0,0.0,0.0,0.0,0.0,0.0,0.0
AGO,11.8401735,11.8401735,11.8401735,11.8401735,11.8401735,11.8401735,14.787254,13.191881299999999,17.787881700000003,16.575827,11.949048000000001,7.6905461,8.8172721,9.676545599999999,10.915721600000001,11.6117284,10.6702205,10.7613003,11.0425021,12.322855,12.867734200000001,11.235121300000001,11.9695911,10.765623900000001,11.2505813,12.1510906,11.3445662,13.7277489,8.7550832,12.2964398
AIA,0.0,0.0,0.0,0.0,0.0,0.0,0.0,0.0,0.0,0.0,0.0,0.0,0.0,0.0,0.0,0.0,0.0,0.0,0.0,0.0,0.0,0.0,0.0,0.0,0.0,0.0,0.0,0.0,0.0,0.0
ALB,0.0119317,0.0119317,0.0119317,0.0119317,0.0119317,0.0119317,0.0119185,0.0295927,0.0145614,0.0117689,0.0693352,0.0,0.0,0.0009827,0.0,0.0,0.0,0.0061426,0.0,0.0012281,0.0,0.0023341,0.0038079000000000003,0.0,0.0,0.0003686,0.0006142,0.0024565999999999998,0.0,0.0
AND,0.0,0.0,0.0,0.0,0.0,0.0,0.0,0.0,0.0,0.0,0.0,0.0,0.0,0.0,0.0,0.0,0.0,0.0,0.0,0.0,0.0,0.0,0.0,0.0,0.0,0.0,0.0,0.0,0.0,0.0
ARE,0.0,0.0,0.0,0.0,0.0,0.0,0.0,0.0,0.0,0.0,0.0,0.0,0.0,0.0,0.0,0.0,0.0,0.0,0.0,0.0,0.0,0.0,0.0,0.0,0.0,0.0,0.0,0.0,0.0,0.0
ARG,0.9398573,0.9398573,0.9398573,0.9398573,0.9398573,0.9398573,2.6783952,3.2329412000000004,2.9927731,4.2437142,1.9915714,0.30314569999999996,0.3192544,0.4485266,0.5902363,0.49929039999999997,0.4536309,0.4259028,0.509983,0.6361456,0.3713973,0.24803360000000002,0.3048671,0.8929497000000001,0.0872941,0.2291789,0.1790728,0.6292759,0.14113130000000002,0.1478631
ARM,,,0.0009497,0.0009497,0.0009497,0.0009497,0.0002333,0.0002428,0.002233,0.0002412,0.0,0.0007368,0.0,0.0,0.0003684,0.0,0.0028251,0.0002456,0.0003685,0.0,0.0037711000000000003,0.0,0.0009823,0.0,0.0,0.0003684,0.0,0.0001228,0.0019646999999999998,0.0004914
ASM,0.0,0.0,0.0,0.0,0.0,0.0,0.0,0.0,0.0,0.0,0.0,0.0,0.0,0.0,0.0,0.0,0.0,0.0,0.0,0.0,0.0,0.0,0.0,0.0,0.0,0.0,0.0,0.0,0.0,0.0
ATG,0.0,0.0,0.0,0.0,0.0,0.0,0.0,0.0,0.0,0.0,0.0,0.0,0.0,0.0,0.0,0.0,0.0,0.0,0.0,0.0,0.0,0.0,0.0,0.0,0.0,0.0,0.0,0.0,0.0,0.0
AUS,3.7472557,3.7472557,3.7472557,3.7472557,3.7472557,3.7472557,5.4955582000000005,8.2455602,6.4087952999999995,8.597383599999999,3.0359022,2.0944171000000003,4.044095400000001,7.132013700000001,0.7025908,0.6356832000000001,5.4982865,1.9775550000000002,0.428529,3.1739179,0.5116684,0.9875323,1.5381045999999998,2.6545279,2.03245,1.2616701000000001,1.6465336,1.0410308,1.6027702,19.1875609
AUT,0.0006254,0.0006254,0.0006254,0.0006254,0.0006254,0.0006254,0.0,0.0,0.0,0.0007088999999999999,8.07e-05,0.0,0.0001231,0.0006151,0.0,0.0030766,0.0,0.000123,0.0,0.000369,0.0,0.0,0.000369,0.0009842,0.0012303,0.0,0.00036909999999999997,0.0006151,0.0015993,0.00036909999999999997
AZE,,,0.0034434,0.0034434,0.0034434,0.0034434,0.0015032000000000001,0.0017924,0.0136337,0.0018773,0.0241413,0.0001228,0.0063864,0.0,0.0,0.0002456,0.0,0.001351,0.0002456,0.0,0.0042988,0.0002457,0.0002457,0.0001228,0.0009826000000000001,0.0002457,0.0,0.0044218,0.0030703,0.0004913000000000001
BDI,0.007010100000000001,0.007010100000000001,0.007010100000000001,0.007010100000000001,0.007010100000000001,0.007010100000000001,0.025151,0.0192815,0.0091313,0.021683499999999998,0.013831,0.0006533999999999999,0.0020992000000000003,0.0004687,0.0013237000000000001,0.0006107,0.0018321000000000001,0.0015878,0.0006107,0.0004886,0.0153897,0.0002443,0.0006107,0.0067177,0.0,0.0006107,0.0,0.0,0.0001221,0.0006107
BEL,,,,,,,,,,,0.000204,0.0,0.0,0.0,0.0001231,0.0,0.0,0.0,0.0,0.0,0.0,0.0,0.0,0.0,0.0004924,0.0,0.0,0.0,0.0,0.0
BEN,0.5007185000000001,0.5007185000000001,0.5007185000000001,0.5007185000000001,0.5007185000000001,0.5007185000000001,0.5658277,0.4719557,1.185631,1.000755,0.6885363,0.08193840000000001,0.0980008,0.050431800000000006,0.0363148,0.18290299999999998,0.09441809999999999,0.06741169999999999,0.0319158,0.044190600000000003,0.0068537,0.033859400000000005,0.0096156,0.0127868,0.0019436,0.0103316,0.0112524,0.0313027,0.027927,0.0540128
BFA,1.1358665000000001,1.1358665000000001,1.1358665000000001,1.1358665000000001,1.1358665000000001,1.1358665000000001,1.0439271,0.9831009,1.5451154,1.1675138,1.3675112999999999,0.0,0.0001023,0.0,0.0,0.0,0.0,0.0001023,0.0,0.0001023,0.0,0.0,0.0,0.0,0.0,0.0,0.0,0.0,0.0,0.0
BGD,0.0870051,0.0870051,0.0870051,0.0870051,0.0870051,0.0870051,0.08342100000000001,0.0863376,0.0664995,0.10077760000000001,0.0617766,0.17244040000000002,0.0030738,0.0571725,0.023260100000000002,0.0666002,0.3495046,0.0493873,0.13678790000000002,0.17295359999999999,0.0243885,0.0308426,0.0588165,0.23863620000000002,0.1998088,0.0300214,0.012705000000000001,0.0026643,0.040164200000000004,0.0200814
BGR,0.0066321,0.0066321,0.0066321,0.0066321,0.0066321,0.0066321,0.0084848,0.0076377,0.011793699999999999,0.0075636,0.0345938,0.0,0.0007376,0.0003687,0.0,0.0062680999999999995,0.001598,0.023473900000000002,0.0034416000000000004,0.0002458,0.0109387,0.008480399999999999,0.0009831,0.0041787000000000005,0.0024581,0.0050397,0.0023348,0.0027035,0.0006145,0.0019662
BHR,0.0,0.0,0.0,0.0,0.0,0.0,0.0,0.0,0.0,0.0,0.0,0.0,0.0,0.0,0.0,0.0,0.0,0.0,0.0,0.0,0.0,0.0,0.0,0.0,0.0,0.0,0.0,0.0,0.0,0.0
BHS,0.0422737,0.0422737,0.0422737,0.0422737,0.0422737,0.0422737,0.0829646,0.081954,0.0921935,0.0911923,0.1160949,0.0129309,0.0134479,0.0041002,0.0317023,0.0305394,0.0179798,0.0041005,0.0410051,0.027497,0.0113795,0.0455004,0.0069724,0.0536393,0.0118977,0.0146497,0.0332603,0.0686881,0.0061519,0.013532500000000001
BIH,,,0.014521200000000001,0.014521200000000001,0.014521200000000001,0.014521200000000001,0.0087506,0.0079719,0.0597061,0.0231345,0.13018620000000003,0.0028268,0.002582,0.0256939,0.009467399999999999,0.0017213,0.010449400000000001,0.0003688,0.0103281,0.0011065,0.0027048000000000003,0.020408100000000002,0.015366300000000001,0.0018442,0.0034419,0.0011063000000000002,0.0003688,0.0043026,0.0009835,0.0036882000000000004
BLR,,,0.0280209,0.0280209,0.0280209,0.0280209,0.037824800000000006,0.0345429,0.0373744,0.0485915,0.019307300000000003,0.0128119,0.1345261,0.0815459,0.0124435,0.0097309,0.045821,0.0016014,0.0049289,0.0030794999999999998,0.0049277,0.0017248,0.029315200000000003,0.005050600000000001,0.0557994,0.0193389,0.0077615,0.0004928,0.0526287,0.0113317
BLZ,0.0686398,0.0686398,0.0686398,0.0686398,0.0686398,0.0686398,0.0679923,0.0453652,0.11393510000000001,0.0639028,0.09912,0.0329667,0.058661700000000004,0.2121276,0.0016381,0.0742266,0.0192468,0.0991039,0.045252600000000004,0.0199643,0.0414628,0.30019450000000003,0.0086001,0.0963419,0.0115694,0.0419765,0.0351177,0.0751476,0.0202712,0.06317060000000001
BMU,0.0,0.0,0.0,0.0,0.0,0.0,0.0,0.0,0.0,0.0,0.0,0.0,0.0,0.0,0.0,0.0,0.0,0.0,0.0,0.0,0.0,0.0,0.0,0.0,0.0,0.0,0.0,0.0,0.0,0.0
BOL,5.0546354000000004,5.0546354000000004,5.0546354000000004,5.0546354000000004,5.0546354000000004,5.0546354000000004,5.9217218,6.308563100000001,6.2603521,10.9582444,2.6613476,1.8616398,4.875762,1.8493350000000002,10.9757208,5.0027585,6.0718742,9.535706099999999,3.7281883,1.4987363,17.0466047,3.6260746,2.7333637,1.1226614,0.6990455,2.2009654999999997,3.0153966000000003,1.5466197,1.8454051999999999,9.965163500000001
BRA,9.1607498,9.1607498,9.1607498,9.1607498,9.1607498,9.1607498,10.766808600000001,13.1530291,23.279177500000003,17.8037994,2.6282788,4.1400489,10.4793318,9.3788962,10.6563979,13.5079128,6.163645300000001,16.1711721,5.040986299999999,2.1188022,16.1017248,3.5565306000000003,7.1359253,2.0691246000000003,4.6285458,9.0659387,7.5504423,11.5304457,3.4307734,9.500256499999999
BRB,0.0,0.0,0.0,0.0,0.0,0.0,0.0,0.0,0.0,0.0,0.0,0.0,0.0,0.0,0.0,0.0,0.0,0.0,0.0,0.0,0.0,0.0,0.0,0.0,0.0,0.0,0.0,0.0,0.0,0.0
BRN,0.35393450000000004,0.35393450000000004,0.35393450000000004,0.35393450000000004,0.35393450000000004,0.35393450000000004,0.13388470000000002,0.3123904,4.2479494,0.0521911,0.0681443,0.0520183,0.0,0.1514801,0.006873000000000001,0.032421700000000005,0.0,0.0001023,0.0,0.026469200000000002,0.0113119,0.0,0.0,0.0,0.0921308,0.0528733,0.0587888,0.0,0.0,0.009987600000000001
BTN,0.0220104,0.0220104,0.0220104,0.0220104,0.0220104,0.0220104,0.0153028,0.0150355,0.0288716,0.049664099999999996,0.0198598,0.016045100000000003,0.0046144,0.0015781,0.011040300000000001,0.0104935,0.011792400000000001,0.07221670000000001,0.008924099999999999,0.0070441,0.0465379,0.021163900000000003,0.0689259,0.010091900000000001,0.0314408,0.0364747,0.017993500000000003,0.0101517,0.0054377,0.0015723
BWA,0.057092,0.057092,0.057092,0.057092,0.057092,0.057092,0.237578,0.2052147,0.26656040000000003,0.19201240000000003,0.0572126,0.0018346,0.00036690000000000003,0.0012231000000000002,0.0,0.0007339,0.0,0.0,0.00012230000000000002,0.00036690000000000003,0.0,0.0,0.00012230000000000002,0.0,0.0,0.0004892000000000001,0.0009785,0.0006115000000000001,0.0004892000000000001,0.0046478000000000005
CAF,14.8045893,14.8045893,14.8045893,14.8045893,14.8045893,14.8045893,2.1190195,4.896622000000001,7.7229786,6.4705081,4.9174896,16.489751799999997,14.6690104,23.1111065,15.192846900000001,20.231305799999998,19.1092975,20.8830816,19.5272143,13.6637326,18.705887999999998,19.8347069,18.121188,15.7139142,13.4315666,14.973145,20.015024,16.913661700000002,16.4381701,12.158912500000001
CAN,1.5301554000000002,1.5301554000000002,1.5301554000000002,1.5301554000000002,1.5301554000000002,1.5301554000000002,5.1387925999999995,2.6040951,9.8267784,4.1005013,2.1012125999999998,0.0742932,0.1149227,0.6036181,0.38931760000000004,0.15465199999999998,0.27863,0.1098758,0.11961719999999999,0.1960655,0.36230720000000005,0.310623,0.6447151,0.5745439999999999,0.5927092,1.4601250000000001,0.7677426,1.1707477,3.0553486,1.9724948
CHE,0.0005501000000000001,0.0005501000000000001,0.0005501000000000001,0.0005501000000000001,0.0005501000000000001,0.0005501000000000001,2.33e-05,1.72e-05,2.7e-05,2.12e-05,0.0,0.0,0.000738,0.000246,0.0,0.0,0.0,0.000246,0.0,0.0017223,0.0,0.0,0.0,0.0,0.0024602,0.0,0.0,0.0,0.0,0.0
CHL,0.1762877,0.1762877,0.1762877,0.1762877,0.1762877,0.1762877,0.11905929999999999,0.2359264,0.179018,0.19980099999999998,0.0897493,0.0276185,0.1096249,0.0833599,0.06678060000000001,0.112083,0.0731458,0.0845697,0.209354,0.0984472,0.0602711,0.1527808,0.1242354,0.0480114,0.1360095,0.5133087000000001,0.0931635,1.2153267,0.0381796,0.161081
CHN,0.7906072000000001,0.7906072000000001,0.7906072000000001,0.7906072000000001,0.7906072000000001,0.7906072000000001,1.1590889,1.2275791,1.4363863,1.3206645000000001,1.4943614,0.6783984000000001,0.39228280000000004,1.3994915,1.0622878,0.532179,0.4177582,0.5879346000000001,1.6633757,0.7185727000000001,0.7296123,0.42949180000000003,0.3496604,0.37239170000000005,0.5857049,0.5242007,0.5482935,0.2907838,0.6316676,0.4002425
CIV,0.11350230000000001,0.11350230000000001,0.11350230000000001,0.11350230000000001,0.11350230000000001,0.11350230000000001,0.11444970000000002,0.29217509999999997,0.6444994000000001,0.6490796000000001,0.49673280000000003,0.05791640000000001,0.0212146,0.0286424,0.0359036,0.0279253,0.0220949,0.1166239,0.0324264,0.020049,0.0114572,0.009002000000000001,0.0484315,0.010229100000000001,0.0064615,0.009053,0.04511010000000001,0.009655799999999999,0.0029665,0.0053391
CMR,1.1353775000000002,1.1353775000000002,1.1353775000000002,1.1353775000000002,1.1353775000000002,1.1353775000000002,1.5659793,1.5186021,3.5866496000000003,2.6197815,2.0476585,0.5577972999999999,0.7594945000000001,2.0652999,0.8797722,1.9180551000000001,0.7158049999999999,0.6601746000000001,1.1077209000000001,0.6939056,0.8832757,0.7746606,0.5806382,0.7067648000000001,0.4064214,0.439202,0.7197609,0.6971139,0.4893931,0.8551325000000001
COD,23.2479725,23.2479725,23.2479725,23.2479725,23.2479725,23.2479725,22.8992344,28.8542984,29.6393197,24.281041600000002,21.488598200000002,13.0096319,19.4638576,23.0436635,24.129017100000002,24.357685000000004,25.6622148,21.6621999,23.612531,23.2133854,24.044293699999997,24.623441200000002,22.9450853,23.4011854,22.2934497,24.5468064,24.747332500000002,23.7396974,20.3909637,21.9024058
COG,0.310526,0.310526,0.310526,0.310526,0.310526,0.310526,0.4224814,0.3958709,0.3192578,0.3574492,0.2829907,0.11862829999999999,0.08600669999999999,0.3571146,0.295551,0.30753339999999996,0.3592464,0.26601600000000003,0.2091284,0.23664580000000002,0.3487465,0.4423207,0.2830109,0.2993087,0.14227330000000002,0.3340089,0.5284189,0.2498978,0.42277170000000003,0.3788942
COK,0.0,0.0,0.0,0.0,0.0,0.0,0.0,0.0,0.0,0.0,0.0,0.0,0.0,0.0,0.0,0.0,0.0,0.0,0.0,0.0,0.0,0.0,0.0,0.0,0.0,0.0,0.0,0.0,0.0,0.0
COL,0.2847524,0.2847524,0.2847524,0.2847524,0.2847524,0.2847524,0.2079138,0.5340064,0.5556837,0.3403323,0.674529,0.0970195,0.0459329,0.23386400000000002,0.7147855,0.05535880000000001,0.1312986,0.5854096,0.160949,0.0794903,0.0629566,0.0844788,0.09683320000000001,0.1264553,0.26972179999999996,0.2783507,0.2919505,0.16768750000000002,0.8336013000000001,0.2054484
COM,0.0025162,0.0025162,0.0025162,0.0025162,0.0025162,0.0025162,0.0016489,0.0016464000000000001,0.0017143,0.0015860000000000002,0.0001431,0.0,0.0,0.0,0.0,0.0269109,0.0,0.000307,0.0010232000000000002,0.0006139,0.0002046,0.0,0.0,0.000307,0.0002046,0.0012279,0.0,0.0,0.0001023,0.0001023
CPV,0.0,0.0,0.0,0.0,0.0,0.0,0.0,0.0,0.0,0.0,0.0,0.0,0.0,0.0,0.0,0.0,0.0,0.0,0.0,0.0,0.0,0.0,0.0,0.0,0.0,0.0,0.0,0.0,0.0,0.0
CRI,0.0224288,0.0224288,0.0224288,0.0224288,0.0224288,0.0224288,0.011493,0.023327300000000002,0.045704,0.0223613,0.0217763,0.025260300000000003,0.0109154,0.021808599999999997,0.010551,0.0036715,0.0009804,0.0364217,0.0006139,0.0093203,0.010452600000000001,0.00040930000000000003,0.0327674,0.0360802,0.013104,0.0553037,0.054012000000000004,0.016346199999999998,0.026240600000000003,0.03753
CUB,0.043754100000000004,0.043754100000000004,0.043754100000000004,0.043754100000000004,0.043754100000000004,0.043754100000000004,0.053756700000000004,0.0457479,0.0887416,0.0984946,0.11801819999999999,0.0246869,0.038643300000000005,0.013031000000000001,0.045185699999999995,0.0735712,0.0502213,0.0253062,0.019469100000000003,0.0779498,0.0213873,0.0652707,0.0244954,0.035133899999999996,0.0133981,0.0501215,0.0129233,0.0356234,0.010743299999999999,0.0033580000000000003
CYM,0.0,0.0,0.0,0.0,0.0,0.0,0.0,0.0,0.0,0.0,0.0,0.0,0.0,0.0,0.0,0.0,0.0,0.0,0.0,0.0,0.0,0.0,0.0,0.0,0.0,0.0,0.0,0.0,0.0,0.0
CYP,6.759999999999999e-05,6.759999999999999e-05,6.759999999999999e-05,6.759999999999999e-05,6.759999999999999e-05,6.759999999999999e-05,0.0,0.00033800000000000003,0.0,0.0,0.0,0.0,0.0,0.0,0.0,0.0,0.0,0.0,0.0,0.0,0.0,0.0,0.0,0.0,0.0,0.0,0.0,0.0,0.0,0.0
CZE,,,,0.0006205000000000001,0.0006205000000000001,0.0006205000000000001,0.00030409999999999996,0.00029170000000000004,0.00030980000000000005,0.0003408,8.15e-05,0.0002462,0.0004925,0.0012309,0.0,0.0002462,0.0,0.0001231,0.0,0.0012308,0.00036930000000000003,0.0004924,0.0001231,0.0004924,0.0035693,0.0001231,0.0001231,0.0016002000000000002,0.0,0.0
DEU,0.0014049000000000002,0.0014049000000000002,0.0014049000000000002,0.0014049000000000002,0.0014049000000000002,0.0014049000000000002,0.00010140000000000001,8.350000000000001e-05,8.41e-05,8.41e-05,7.180000000000001e-05,0.0002461,0.0,0.006645900000000001,0.0003692,0.0003692,0.0,0.0029538000000000003,0.0,0.0015997,0.0,0.0012308,0.0003692,0.0001231,0.004800500000000001,0.0,0.0004923,0.0050473,0.000616,0.0
DJI,4.0000000000000003e-07,4.0000000000000003e-07,4.0000000000000003e-07,4.0000000000000003e-07,4.0000000000000003e-07,4.0000000000000003e-07,0.0,0.0,1.9e-06,0.0,0.0,0.0,0.0,0.0,0.0,0.0,0.0,0.0,0.0,0.0,0.0,0.0,0.0,0.0,0.0,0.0,0.0,0.0,0.0,0.0
DMA,0.0,0.0,0.0,0.0,0.0,0.0,0.0,0.0,0.0,0.0,0.0,0.0,0.0,0.0,0.0,0.0,0.0,0.0,0.0,0.0,0.0,0.0,0.0,0.0,0.0,0.0,0.0,0.0,0.0,0.0
DNK,0.0002453,0.0002453,0.0002453,0.0002453,0.0002453,0.0002453,0.00021510000000000002,0.0001883,0.0002027,0.0001967,0.000176,0.0,0.0,0.0,0.0,0.0,0.0,0.0,0.0,0.0,0.0,0.0,0.0,0.0,0.0,0.0,0.0,0.0,0.0004931,0.0
DOM,0.0149683,0.0149683,0.0149683,0.0149683,0.0149683,0.0149683,0.0199732,0.0476766,0.027609300000000003,0.029495999999999998,0.0306115,0.005381599999999999,0.0,0.0019598,0.002981,0.0711994,0.0016327000000000002,0.0023864000000000003,0.0044061000000000005,0.0053243000000000006,0.0042012,0.0016725000000000002,0.002469,0.0078704,0.0071961,0.0306436,0.0006116,0.0008192000000000001,0.0,0.004716000000000001
DZA,0.0784563,0.0784563,0.0784563,0.0784563,0.0784563,0.0784563,0.0914335,0.0675518,0.0714152,0.0747289,0.3672469,0.0054,0.0284713,0.0597681,0.0116587,0.0417256,0.050808500000000006,0.1777018,0.0962144,0.0220898,0.0090813,0.0824711,0.17475649999999998,0.011045000000000001,0.0235624,0.0033134,0.038902700000000005,0.26962220000000003,0.0,0.025525700000000002
ECU,0.009079,0.009079,0.009079,0.009079,0.009079,0.009079,0.0149812,0.0077499000000000005,0.012141500000000001,0.0068115,0.0014563,0.0164091,0.0041328,0.0021587999999999998,0.0019203,0.019043,0.0033462,0.0149472,0.0004289,0.0055589,0.0060507,0.0015936,0.035670099999999996,0.0014061,0.005641200000000001,0.0177753,0.0102062,0.0015879000000000002,0.0087972,0.0170264
EGY,0.0001504,0.0001504,0.0001504,0.0001504,0.0001504,0.0001504,0.0001905,0.0001793,0.0001905,0.0001916,0.0,0.0,0.0,0.0,0.0,0.0,0.0,0.0,0.0,0.0,0.0,0.0,0.0,0.0,0.0,0.0,0.0,0.0,0.0,0.0
ERI,,,,0.0081562,0.0081562,0.0081562,0.0,0.0,0.0,0.0118566,0.0289247,0.0,0.0,0.0,0.0,0.0,0.0,0.0,0.0,0.0,0.0,0.0,0.0,0.0,0.0,0.0,0.0,0.0,0.0,0.0
ESP,0.052439700000000006,0.052439700000000006,0.052439700000000006,0.052439700000000006,0.052439700000000006,0.052439700000000006,0.10864130000000001,0.2926491,0.1989574,0.0938944,0.1722688,0.0061442,0.013642200000000002,0.0267814,0.0227362,0.0539394,0.0609527,0.0155683,0.0023351,0.0122799,0.0022113999999999997,0.014255499999999999,0.025303799999999998,0.0046697,0.0067589,0.0205241,0.0219771,0.0589787,0.0033165,0.0197668
EST,,,0.0012481,0.0012481,0.0012481,0.0012481,0.0023578,0.0014716,0.0015026,0.0014516,0.0012219,0.0,0.004810399999999999,0.0044399,0.00037,0.0,0.0006168,0.0,0.0,0.0,0.0,0.0001234,0.00037,0.00024670000000000003,0.00012330000000000002,0.00012330000000000002,0.0,0.0001234,0.0006166,0.0
ETH,,,,1.2750215,1.2750215,1.2750215,0.8007168,2.4383535000000003,2.2952637,3.3732519,2.6636344,0.783385,0.9299368,1.2143625,1.1759987,1.3265133,1.2248478,1.3489854000000001,1.0651612,0.6878385,1.1046053999999998,1.1443307999999999,1.2051243999999999,0.9129629,0.9250259,0.8545625,0.8809407,0.9057910000000001,0.6852351999999999,0.6536883
FIN,0.0008742,0.0008742,0.0008742,0.0008742,0.0008742,0.0008742,0.005183200000000001,0.0017052,0.0008564000000000001,0.0008172,0.0011503000000000002,0.0004017,0.0,0.0001004,0.0,0.0,0.0016066000000000001,0.0002009,0.0007026000000000001,0.0001004,0.0009034,0.0010041,0.0,0.0003011,0.0,0.0001004,0.0002008,0.0,0.0002008,0.0002008
FJI,0.0059444,0.0059444,0.0059444,0.0059444,0.0059444,0.0059444,0.0052937,0.0122054,0.015161500000000001,0.0037193,6.0400000000000004e-05,0.0,0.0,0.0108529,0.0,0.0,0.0,0.0006143,0.0015359,0.02181,0.004403,0.0,0.0,0.0,0.0072698,0.008191700000000001,0.00010240000000000001,0.0008192000000000001,0.0022524000000000003,0.000819
FLK,6.65e-05,6.65e-05,6.65e-05,6.65e-05,6.65e-05,6.65e-05,6.63e-05,8.350000000000001e-05,6.54e-05,7.290000000000001e-05,4.43e-05,0.0,0.0,0.0,0.0,0.0,0.0,0.0,0.0,0.0,0.0,0.0,0.0,0.0,0.0,0.0,0.0,0.0,0.0,0.0
FRA,0.019794000000000003,0.019794000000000003,0.019794000000000003,0.019794000000000003,0.019794000000000003,0.019794000000000003,0.012719200000000002,0.0147949,0.0214568,0.019630500000000002,0.0329643,0.011797499999999999,0.0100778,0.052850299999999996,0.014502300000000001,0.0345359,0.000615,0.0030742,0.0148711,0.025193200000000002,0.010815400000000001,0.0035652,0.053443399999999995,0.00123,0.0169618,0.0043021000000000005,0.004179,0.063667,0.0017214,0.0460888
FRO,0.0,0.0,0.0,0.0,0.0,0.0,0.0,0.0,0.0,0.0,0.0,0.0,0.0,0.0,0.0,0.0,0.0,0.0,0.0,0.0,0.0,0.0,0.0,0.0,0.0,0.0,0.0,0.0,0.0,0.0
FSM,0.0,0.0,0.0,0.0,0.0,0.0,0.0,0.0,0.0,0.0,0.0,0.0,0.0,0.0,0.0,0.0,0.0,0.0,0.0,0.0,0.0,0.0,0.0,0.0,0.0,0.0,0.0,0.0,0.0,0.0
GAB,0.035875500000000005,0.035875500000000005,0.035875500000000005,0.035875500000000005,0.035875500000000005,0.035875500000000005,0.056171700000000005,0.0320948,0.031656300000000005,0.032571800000000005,0.026135000000000002,0.0038861,0.0126811,0.023828,0.08242669999999999,0.0423386,0.040088500000000006,0.0222942,0.0448955,0.027305,0.03068,0.059826000000000004,0.024134899999999997,0.040804400000000005,0.0206578,0.0388612,0.040395200000000006,0.0466535,0.0350773,0.041418300000000005
GEO,,,0.0055893,0.0055893,0.0055893,0.0055893,0.007561,0.0025438,0.0044977,0.0068651,0.0012743,0.0008602,0.0029493,0.0031953000000000003,0.004669800000000001,0.0039325,0.0055297,0.0011060000000000002,0.0060216,0.0012289000000000002,0.0176964,0.0007374,0.0002458,0.0068815000000000005,0.0011060000000000002,0.0065135,0.0009832,0.0023349000000000004,0.0,0.0398209
GHA,0.1744851,0.1744851,0.1744851,0.1744851,0.1744851,0.1744851,0.14285910000000002,0.4858596,1.2614348,0.7049252,0.7853673999999999,0.0147296,0.0142185,0.014544600000000001,0.0172862,0.0226055,0.0496298,0.049607700000000005,0.018718699999999998,0.0031709999999999998,0.0067513,0.0142188,0.0202304,0.0125808,0.005523500000000001,0.0136042,0.07640720000000001,0.0276187,0.0298682,0.0201514
GIB,0.0001358,0.0001358,0.0001358,0.0001358,0.0001358,0.0001358,0.0,0.0,0.0006791000000000001,0.0,0.0,0.0,0.0,0.0,0.0,0.0,0.0,0.0,0.0,0.0,0.0,0.0,0.0,0.0,0.0,0.0,0.0,0.0,0.0,0.0
GIN,0.20204060000000001,0.20204060000000001,0.20204060000000001,0.20204060000000001,0.20204060000000001,0.20204060000000001,0.186691,0.2984236,0.7037913,0.5192407,0.3142937,0.0467563,0.0753009,0.1564545,0.1508678,0.18509299999999998,0.21060230000000002,0.1754131,0.2044742,0.1599176,0.1280597,0.1681023,0.2193878,0.19010280000000002,0.1769964,0.2710634,0.1367805,0.0723364,0.0467892,0.048349600000000006
GLP,0.0,0.0,0.0,0.0,0.0,0.0,0.0,0.0,0.0,0.0,0.0,0.0,0.0,0.0,0.0,0.0,0.0,0.0,0.0,0.0,0.0,0.0,0.0,0.0,0.0,0.0,0.0,0.0,0.0,0.0
GMB,0.204995,0.204995,0.204995,0.204995,0.204995,0.204995,0.1442284,0.1657774,0.13693360000000002,0.36289150000000003,0.27758530000000003,0.0,0.0,0.0,0.0,0.0,0.0,0.0,0.0,0.0,0.0,0.0,0.0,0.0,0.0,0.0,0.0,0.0,0.000307,0.0
GNB,0.2678277,0.2678277,0.2678277,0.2678277,0.2678277,0.2678277,0.0068823,0.051318100000000005,0.27088979999999996,0.46954809999999997,0.2269861,0.13404480000000002,0.2205088,0.2617462,0.3484137,0.35138189999999997,0.46332940000000006,0.44120370000000003,0.29357310000000003,0.2438421,0.2869219,0.2094594,0.43887580000000004,0.2513109,0.3442244,0.45043880000000003,0.2253195,0.15369220000000003,0.14786080000000001,0.1360933
GNQ,0.00022090000000000003,0.00022090000000000003,0.00022090000000000003,0.00022090000000000003,0.00022090000000000003,0.00022090000000000003,0.000313,0.000313,0.000313,0.000313,0.0,0.0,0.0,0.0,0.0,0.0,0.00030680000000000003,0.0001023,0.00020449999999999998,0.0,0.0001023,0.00020449999999999998,0.0001023,0.0,0.00030680000000000003,0.0,0.0,0.00020449999999999998,0.00030680000000000003,0.0
GRC,0.022464400000000002,0.022464400000000002,0.022464400000000002,0.022464400000000002,0.022464400000000002,0.022464400000000002,0.027492100000000002,0.0325588,0.2057951,0.0170901,0.0467649,0.0001228,0.0007363,0.0,0.0006139,0.0,0.004788700000000001,0.0655506,0.0057681,0.0002456,0.0,0.0144948,0.0070009,0.0002455,0.0015961,0.0003683,0.015472200000000002,0.00933,0.0024559000000000004,0.0132612
GRD,1.88e-05,1.88e-05,1.88e-05,1.88e-05,1.88e-05,1.88e-05,2.1600000000000003e-05,2.57e-05,7.100000000000001e-06,2.23e-05,1.7500000000000002e-05,0.0,0.0,0.0,0.0,0.0,0.0,0.0,0.0,0.0,0.0,0.0,0.0,0.0,0.0,0.0,0.0,0.0,0.0,0.0
GRL,0.0,0.0,0.0,0.0,0.0,0.0,0.0,0.0,0.0,0.0,0.0,0.0,0.0,0.0,0.0,0.0,0.0,0.0,0.0,0.0,0.0,0.0,0.0,0.0,0.0,0.0,0.0,0.0,0.0,0.0
GTM,0.41847480000000004,0.41847480000000004,0.41847480000000004,0.41847480000000004,0.41847480000000004,0.41847480000000004,0.8206615,0.5723836,2.2920126,0.6323201,1.4872746,0.0174577,0.099594,1.4276755,0.025931100000000002,0.7662541,0.1007354,0.26738490000000004,0.1182585,0.3703408,0.0998539,0.0725698,0.0559566,0.1798165,0.0160463,0.1346892,0.1863241,0.1575673,0.022706700000000003,0.1195804
GUM,0.0,0.0,0.0,0.0,0.0,0.0,0.0,0.0,0.0,0.0,0.0,0.0,0.0,0.0,0.0,0.0,0.0,0.0,0.0,0.0,0.0,0.0,0.0,0.0,0.0,0.0,0.0,0.0,0.0,0.0
GUY,0.028773,0.028773,0.028773,0.028773,0.028773,0.028773,0.041680999999999996,0.056694800000000004,0.23963740000000003,0.020583100000000003,0.018532,0.0149738,0.0110828,0.0688429,0.0075058,0.010727800000000001,0.0032304,0.0064208,0.0032243,0.0076683,0.0416646,0.0039234000000000005,0.0062957,0.0058499,0.0075261,0.028988,0.0384842,0.0027982999999999997,0.0075427,0.0366741
HKG,0.0004802,0.0004802,0.0004802,0.0004802,0.0004802,0.0004802,0.00021360000000000001,0.0006453,0.0002118,0.0002118,8.36e-05,0.0,0.0,0.0001224,0.0003671,0.0,0.0,0.0,0.0,0.0020804,0.0,0.0001224,0.0,0.0003671,0.0008566,0.0,0.0,0.0,0.0,0.0
HND,0.3302768,0.3302768,0.3302768,0.3302768,0.3302768,0.3302768,0.2950185,0.6335200999999999,0.9024965,0.4967597,0.6307193,0.026040800000000003,0.0639191,1.0180117,0.0170714,0.7013672000000001,0.14077699999999999,0.16185570000000002,0.1687047,0.2941804,0.1959836,0.4627946,0.0388264,0.2734993,0.35897640000000003,0.21146610000000002,0.32316480000000003,0.0997923,0.1998329,0.2118638
HRV,,,0.0072314,0.0072314,0.0072314,0.0072314,0.0034771999999999997,0.013566900000000002,0.0649155,0.0030434999999999998,0.014970700000000002,0.0008607,0.0015985,0.0011067,0.0011068,0.0029509,0.0,0.0046723,0.0056563,0.0009836,0.000246,0.01623,0.0036887,0.0,0.0009836,0.0040556,0.0,0.0056553,0.000123,0.0019671000000000003
HTI,0.00023830000000000002,0.00023830000000000002,0.00023830000000000002,0.00023830000000000002,0.00023830000000000002,0.00023830000000000002,0.0001891,0.0001308,0.00014710000000000002,0.0001209,0.0003727,0.0,0.0,0.0,0.0,0.0,0.00036690000000000003,0.00010240000000000001,0.0,0.0,0.0,0.0,0.0,0.0,0.0,0.0,0.0,0.0,0.0,0.0
HUN,0.0019821,0.0019821,0.0019821,0.0019821,0.0019821,0.0019821,0.0003683,0.0003153,0.0022197000000000002,0.0003208,0.0008316,0.0002461,0.0,0.0008612,0.003076,0.0004922,0.011074400000000002,0.008243700000000001,0.000123,0.0011074,0.0,0.0001231,0.0011075,0.0,0.0046758,0.0,0.0,0.0002461,0.0,0.0002461
IDN,255.96132310000002,255.96132310000002,255.96132310000002,255.96132310000002,255.96132310000002,255.96132310000002,67.1584154,972.4814719,225.1533175,102.7470021,31.075602200000002,35.1489403,496.0829885,151.9616781,481.22935110000003,217.66053349999999,593.8464074999999,40.931759,30.2631899,391.11888319999997,23.7247405,194.04750190000001,204.8896723,175.5143492,491.5791188,536.8720875,55.2722005,22.063388200000002,193.8170995,408.43205670000003
IMN,4e-06,4e-06,4e-06,4e-06,4e-06,4e-06,0.0,0.0,0.0,0.0,2e-05,0.0,0.0,0.0,0.0,0.0,0.0,0.0,0.0,0.0,0.0,0.0,0.0,0.0,0.0,0.0,0.0,0.0,0.0,0.0
IND,3.916229,3.916229,3.916229,3.916229,3.916229,3.916229,1.5069711000000001,1.295577,1.3156542,2.730009,1.5549794,1.1190029,0.822688,3.3365037,5.0772617,2.9375166,2.9523532,5.1083021,2.9901158999999997,9.5698253,7.3841694,3.7277185,8.8428458,5.0378984,4.1504795,3.1776749,4.1618652,6.7726047,5.588639100000001,2.8288399
IRL,0.0009079000000000001,0.0009079000000000001,0.0009079000000000001,0.0009079000000000001,0.0009079000000000001,0.0009079000000000001,0.0014977,0.0011253,0.0011253,0.0011253,0.0011253,0.0,0.0,0.0003696,0.0,0.0,0.0,0.0007391,0.0,0.0,0.0,0.0,0.0,0.0,0.0,0.00024629999999999997,0.0,0.0011088,0.000616,0.0
IRN,0.010895799999999999,0.010895799999999999,0.010895799999999999,0.010895799999999999,0.010895799999999999,0.010895799999999999,0.0476911,0.0117683,0.0092241,0.0354388,0.009183400000000001,0.0004909000000000001,0.0,0.0,0.0,0.0012272000000000001,0.0,0.0012273000000000002,0.000491,0.0,0.0548622,0.0014728000000000002,0.0020865999999999997,0.00036820000000000006,0.0,0.0,0.0006137,0.006628,0.0020870000000000003,0.00036820000000000006
IRQ,0.0104644,0.0104644,0.0104644,0.0104644,0.0104644,0.0104644,0.0048754,0.0023032,0.002917,0.017206600000000002,0.0250201,0.0,0.0,0.0,0.0,0.0,0.0,0.0,0.0,0.0,0.0,0.0,0.0,0.0,0.0,0.0,0.0,0.0,0.0,0.0
ISL,0.0,0.0,0.0,0.0,0.0,0.0,0.0,0.0,0.0,0.0,0.0,0.0,0.0,0.0,0.0,0.0,0.0,0.0,0.0,0.0,0.0,0.0,0.0,0.0,0.0,0.0,0.0,0.0,0.0,0.0
ISR,1.59e-05,1.59e-05,1.59e-05,1.59e-05,1.59e-05,1.59e-05,1.9800000000000004e-05,1.9800000000000004e-05,1.9800000000000004e-05,1.9800000000000004e-05,0.0,0.0,0.0,0.0,0.0,0.0,0.0,0.0,0.0,0.0,0.0,0.0,0.0,0.0,0.0,0.0,0.0,0.0,0.0,0.0
ITA,0.0152376,0.0152376,0.0152376,0.0152376,0.0152376,0.0152376,0.019798100000000003,0.0223472,0.024962599999999998,0.0313035,0.049772199999999996,0.0042983000000000006,0.0018414,0.0087244,0.0046678,0.0009829,0.0013516,0.0514484,0.0087179,0.0104405,0.0008595,0.0081085,0.033284100000000004,0.0045465,0.0052832999999999995,0.0020903000000000002,0.004051300000000001,0.055758,0.0068838,0.0041803
JAM,0.0021148,0.0021148,0.0021148,0.0021148,0.0021148,0.0021148,0.0014866999999999999,0.0010701,0.0015544,0.0020807000000000004,0.0064164,0.0,0.0,0.0,0.0,0.0015359,0.0,0.0,0.00010240000000000001,0.0,0.0,0.0,0.0,0.00012230000000000002,0.00024460000000000004,0.0022527,0.0,0.0,0.0,0.0
JOR,0.0,0.0,0.0,0.0,0.0,0.0,0.0,0.0,0.0,0.0,0.0,0.0,0.0,0.0,0.0,0.0,0.0,0.0,0.0,0.0,0.0,0.0,0.0,0.0,0.0,0.0,0.0,0.0,0.0,0.0
JPN,0.0124035,0.0124035,0.0124035,0.0124035,0.0124035,0.0124035,0.0146821,0.011058199999999999,0.0112068,0.0130681,0.014900499999999999,0.0078478,0.011772399999999999,0.0096884,0.0053971,0.0112836,0.0085842,0.017658100000000003,0.0228178,0.0069903000000000005,0.0079708,0.0133669,0.004783000000000001,0.0067462,0.0359329,0.0111595,0.0046603,0.0115275,0.0206026,0.0139793
KAZ,,,0.043427900000000005,0.043427900000000005,0.043427900000000005,0.043427900000000005,0.1314958,0.3181015,0.15681309999999998,0.1016969,0.11911020000000001,0.0001232,0.0128108,0.0040637,0.0022177,0.0004928,0.00036930000000000003,0.0109421,0.0024629,0.0,0.0004925,0.0012313,0.0016011999999999999,0.0,0.0,0.0034476,0.0006154,0.0,0.0003466,0.000123
KEN,0.022407,0.022407,0.022407,0.022407,0.022407,0.022407,0.025023,0.13062549999999998,0.0453157,0.0977616,0.1483611,0.0017099,0.0010992,0.0024229,0.0008152000000000001,0.0061069,0.0017099,0.001835,0.0030534,0.0076946,0.0006533,0.0029313,0.0076946,0.0009771,0.0002443,0.0330991,0.0006107,0.0019542,0.0001221,0.0059648
KGZ,,,0.0034028,0.0034028,0.0034028,0.0034028,0.0004794,0.0120118,0.0071403,0.00040810000000000005,0.0002546,0.0,0.0,0.0,0.0,0.0001228,0.0,0.0,0.0,0.0,0.0,0.0,0.0,0.0,0.0,0.0,0.0,0.0,0.0,0.0
KHM,4.2493979,4.2493979,4.2493979,4.2493979,4.2493979,4.2493979,0.43922100000000003,1.4425007,4.5056845999999995,3.0147179,2.51276,3.7151756999999996,5.5229719,6.4064932,7.2923521000000004,4.4733766,6.2378119,6.089473600000001,5.3291553,5.5126144,4.0770371,5.457058699999999,4.1785334999999995,4.318481,4.0398292,4.5036349,4.0939141,3.7392494000000003,2.5308064,2.5526961999999997
KIR,0.0,0.0,0.0,0.0,0.0,0.0,0.0,0.0,0.0,0.0,0.0,0.0,0.0,0.0,0.0,0.0,0.0,0.0,0.0,0.0,0.0,0.0,0.0,0.0,0.0,0.0,0.0,0.0,0.0,0.0
KNA,0.0,0.0,0.0,0.0,0.0,0.0,0.0,0.0,0.0,0.0,0.0,0.0,0.0,0.0,0.0,0.0,0.0,0.0,0.0,0.0,0.0,0.0,0.0,0.0,0.0,0.0,0.0,0.0,0.0,0.0
KOR,0.0068741,0.0068741,0.0068741,0.0068741,0.0068741,0.0068741,0.0055831,0.0044742,0.0040934,0.006192700000000001,0.0233475,0.0009821,0.0077348,0.0108035,0.010925599999999999,0.0179241,0.0017188000000000001,0.0056465,0.0011049,0.010434100000000002,0.0019639,0.013748400000000001,0.0,0.0062615,0.0182903,0.0008593,0.0004909000000000001,0.0022096,0.0002456,0.0030687
KWT,0.0,0.0,0.0,0.0,0.0,0.0,0.0,0.0,0.0,0.0,0.0,0.0,0.0,0.0,0.0,0.0,0.0,0.0,0.0,0.0,0.0,0.0,0.0,0.0,0.0,0.0,0.0,0.0,0.0,0.0
LAO,1.9391377,1.9391377,1.9391377,1.9391377,1.9391377,1.9391377,2.1175488000000002,1.5869096,3.5151381,2.4398559,1.6413994,0.2991782,1.0425151000000001,1.3732275,4.9687724,2.4483634000000003,1.2271090999999998,5.3069614000000005,0.7734229,1.308251,3.8653923,0.6976104000000001,1.5577629,1.8462669,1.6903384000000001,1.5072534000000002,2.4327095,0.8423753,0.6538621000000001,1.3970817
LBN,8.56e-05,8.56e-05,8.56e-05,8.56e-05,8.56e-05,8.56e-05,0.0,0.0,0.0004281,0.0,0.0,0.0,0.0,0.0,0.0,0.0,0.0,0.0,0.0,0.0,0.0,0.0,0.0,0.0,0.0,0.0,0.0,0.0,0.0,0.0
LBR,0.11804980000000001,0.11804980000000001,0.11804980000000001,0.11804980000000001,0.11804980000000001,0.11804980000000001,0.04084,0.028595199999999998,0.0441488,0.0349451,0.0312665,0.0006137,0.0,0.068258,0.0224014,0.0005114,0.1504683,0.0158084,0.0577942,0.5886164,0.0408118,0.07323980000000001,0.034413200000000005,0.049915,0.3015328,0.7922002,0.05325,0.0551986,0.025061,0.1975719
LBY,0.0,0.0,0.0,0.0,0.0,0.0,0.0,0.0,0.0,0.0,0.0,0.0,0.0,0.0,0.0,0.0,0.0,0.0,0.0,0.0,0.0,0.0,0.0,0.0,0.0,0.0,0.0,0.0,0.0,0.0
LCA,0.0,0.0,0.0,0.0,0.0,0.0,0.0,0.0,0.0,0.0,0.0,0.0,0.0,0.0,0.0,0.0,0.0,0.0,0.0,0.0,0.0,0.0,0.0,0.0,0.0,0.0,0.0,0.0,0.0,0.0
LKA,0.013434699999999999,0.013434699999999999,0.013434699999999999,0.013434699999999999,0.013434699999999999,0.013434699999999999,0.0412895,0.0147139,0.0327999,0.0481553,0.0180184,0.0,0.0024432,0.008880800000000001,0.0012672000000000002,0.0006137,0.000733,0.0010229,0.0,0.0002046,0.0006933,0.0,0.0033074,0.0,0.0010229,0.0,0.0022503,0.0,0.0,0.0
LSO,0.019646300000000002,0.019646300000000002,0.019646300000000002,0.019646300000000002,0.019646300000000002,0.019646300000000002,0.0011211,0.012959199999999999,0.06980370000000001,0.0131724,0.001175,0.0,0.0,0.0,0.0,0.0,0.0,0.0,0.0,0.0,0.0,0.0,0.0,0.0,0.0,0.0,0.0,0.0,0.0,0.0
LTU,,,0.0008759,0.0008759,0.0008759,0.0008759,0.0002808,7.11e-05,0.00016889999999999999,0.0022984,6.41e-05,0.0,0.0017255,0.0033276,0.0006162,0.0,0.00012330000000000002,0.0,0.0011091,0.0012324,0.0,0.0,0.0,0.0,0.0,0.0001232,0.0,0.0,0.00024650000000000003,0.0
LUX,,,,,,,,,,,0.0,0.0,0.0,0.0,0.0,0.0,0.0,0.0,0.0,0.0,0.0,0.0,0.0,0.0,0.0,0.0,0.0,0.0001231,0.0,0.0
LVA,,,0.0025017,0.0025017,0.0025017,0.0025017,0.0007751,0.0010317,0.0008377,0.001238,0.0012538,0.0030821,0.0056711,0.018001000000000003,0.0025888,0.0,0.0,0.0004931,0.0,0.00024650000000000003,0.0009863,0.0,0.0,0.00024660000000000003,0.0,0.0016026,0.0,0.00012330000000000002,0.0018495,0.0
MAC,0.0,0.0,0.0,0.0,0.0,0.0,0.0,0.0,0.0,0.0,0.0,0.0,0.0,0.0,0.0,0.0,0.0,0.0,0.0,0.0,0.0,0.0,0.0,0.0,0.0,0.0,0.0,0.0,0.0,0.0
MAR,0.001887,0.001887,0.001887,0.001887,0.001887,0.001887,0.0017277,0.0010194000000000002,0.0011786000000000001,0.0023751,0.0002608,0.0,0.0,0.0004907000000000001,0.0026988,0.0031897,0.004661800000000001,0.000368,0.0002453,0.0004907000000000001,0.0,0.0,0.0051525,0.0,0.0007362,0.0,0.0030671,0.0009814000000000001,0.0,0.0034351
MDA,,,0.0031893,0.0031893,0.0031893,0.0031893,0.0003897,0.0003696,0.0003702,0.0003526,8.280000000000001e-05,0.0002364,0.0,0.0,0.0,0.0019683,0.000492,0.0034451,0.000246,0.0,0.0012304,0.0051669,0.0017221,0.0061465,0.031488800000000004,0.0014763,0.0,0.0022143,0.0002461,0.0029527999999999998
MDG,0.5597700999999999,0.5597700999999999,0.5597700999999999,0.5597700999999999,0.5597700999999999,0.5597700999999999,1.0669809000000001,0.6073683,0.8302604,0.8012152,0.15483760000000002,0.2784936,0.18210800000000002,0.2314881,0.3258372,0.7451506000000001,0.4826823,0.3553681,0.16659970000000002,0.4781712,0.9021637,0.9641556000000001,0.4114368,0.6655288,0.2995989,0.967579,0.6819124000000001,0.7784842,0.5666064000000001,0.4904567
MDV,0.0,0.0,0.0,0.0,0.0,0.0,0.0,0.0,0.0,0.0,0.0,0.0,0.0,0.0,0.0,0.0,0.0,0.0,0.0,0.0,0.0,0.0,0.0,0.0,0.0,0.0,0.0,0.0,0.0,0.0
MEX,2.0580909000000003,2.0580909000000003,2.0580909000000003,2.0580909000000003,2.0580909000000003,2.0580909000000003,1.5109213,1.7209217,9.273725,4.9203519,4.933313600000001,0.7390513,1.4672466,3.1528984,0.4901628,2.062358,1.5315625,1.0720532,1.5077504,1.4284757,0.7540919,2.1174987,1.0048927,2.1819021,0.18455660000000002,0.9828592,1.1931741,1.9025595000000002,0.8832259,2.3786293
MHL,,0.0,0.0,0.0,0.0,0.0,0.0,0.0,0.0,0.0,0.0,0.0,0.0,0.0,0.0,0.0,0.0,0.0,0.0,0.0,0.0,0.0,0.0,0.0,0.0,0.0,0.0,0.0,0.0,0.0
MKD,,,0.0043255,0.0043255,0.0043255,0.0043255,0.0039978,0.0041213,0.004477699999999999,0.0043661,0.0254372,0.0002457,0.0,0.0,0.0,0.0,0.0,0.0071259,0.0022113000000000002,0.0,0.0001229,0.0022113999999999997,0.0035629,0.0003686,0.0,0.0003686,0.0,0.0008601,0.0,0.0054059
MLI,1.8699223,1.8699223,1.8699223,1.8699223,1.8699223,1.8699223,1.2732051,1.7077508000000001,4.3884406,4.108951200000001,2.2119241,0.0005116000000000001,0.00030690000000000003,0.0007162,0.0006139,0.0010230999999999999,0.0012277,0.0014324,0.0006139,0.0002047,0.0011254,0.0004092,0.0010230999999999999,0.0001023,0.0005116000000000001,0.0002046,0.0013301,0.0007162,0.0002046,0.00030690000000000003
MLT,0.0,0.0,0.0,0.0,0.0,0.0,0.0,0.0,0.0,0.0,0.0,0.0,0.0,0.0,0.0,0.0,0.0,0.0,0.0,0.0,0.0,0.0,0.0,0.0,0.0,0.0,0.0,0.0,0.0,0.0
MMR,12.2558296,12.2558296,12.2558296,12.2558296,12.2558296,12.2558296,9.5366822,8.4905097,12.717602600000001,13.1053506,8.5567107,6.963488099999999,5.3384802,12.4098045,22.4583754,11.231832200000001,12.7574608,19.09841,8.4328812,17.0515431,19.8153228,8.5604546,13.0731842,12.5160265,14.463524,17.2792983,10.9020521,9.4350242,11.063969100000001,8.8819241
MNE,,,,,,,,,,,,,,,,,0.0,0.0014748,0.0001229,0.0,0.0,0.0043008,0.0044244,0.0,0.0002458,0.0033181,0.0,0.014254300000000001,0.0001229,0.0018434999999999999
MNG,0.15617240000000002,0.15617240000000002,0.15617240000000002,0.15617240000000002,0.15617240000000002,0.15617240000000002,0.2582886,1.4937689,0.7781096000000001,0.2377166,0.5922575000000001,0.0036926000000000003,0.0473201,0.009401099999999999,0.0,0.0007386000000000001,0.0040931,0.009832,0.0067863,0.049038899999999996,0.0004004,0.0362444,0.007022700000000001,0.00036930000000000003,0.0011707,0.0319716,0.0008013,0.0186572,0.0041848,0.0001002
MOZ,15.6754455,15.6754455,15.6754455,15.6754455,15.6754455,15.6754455,2.3402147,1.4649798,2.0438108,1.6873327,0.4190033,14.6391633,12.872662700000001,16.847725999999998,16.2407619,19.0035379,18.7711477,19.1996702,22.6804729,19.6273534,25.6941253,19.0920578,21.7348992,21.872897700000003,20.5206714,19.2677675,21.759077,19.976065600000002,20.970277300000003,17.4850146
MRT,5.3e-05,5.3e-05,5.3e-05,5.3e-05,5.3e-05,5.3e-05,6.94e-05,4.23e-05,5.4199999999999996e-05,5.5e-05,4.43e-05,0.0,0.0,0.0,0.0,0.0,0.0,0.0,0.0,0.0,0.0,0.0,0.0,0.0,0.0,0.0,0.0,0.0,0.0,0.0
MSR,5.1200000000000004e-05,5.1200000000000004e-05,5.1200000000000004e-05,5.1200000000000004e-05,5.1200000000000004e-05,5.1200000000000004e-05,0.0,0.0,0.0,0.0,0.0,0.0,0.0,0.0,0.0,0.0,0.0,0.0,0.0,0.0,0.0003071,0.0,0.0,0.0,0.0,0.0,0.0,0.0,0.0,0.0
MTQ,0.0,0.0,0.0,0.0,0.0,0.0,0.0,0.0,0.0,0.0,0.0,0.0,0.0,0.0,0.0,0.0,0.0,0.0,0.0,0.0,0.0,0.0,0.0,0.0,0.0,0.0,0.0,0.0,0.0,0.0
MUS,4.93e-05,4.93e-05,4.93e-05,4.93e-05,4.93e-05,4.93e-05,0.0,0.0,0.0002464,0.0,0.0,0.0,0.0,0.0,0.0,0.0,0.0,0.0,0.0,0.0,0.0,0.0,0.0,0.0,0.0,0.0,0.0,0.0,0.0,0.0
MWI,0.3316731,0.3316731,0.3316731,0.3316731,0.3316731,0.3316731,0.24528190000000002,0.14937209999999998,0.1968435,0.181416,0.0499859,0.2414609,0.2641479,0.4573494,0.30380599999999996,0.49658030000000003,0.2381145,0.3461131,0.4072812,0.1819585,0.5926799,0.35352530000000004,0.5378527000000001,0.3399535,0.46209730000000004,0.4256373,0.6125436999999999,0.2915434,0.3473983,0.237213
MYS,9.3893663,9.3893663,9.3893663,9.3893663,9.3893663,9.3893663,5.7621172,7.5530037000000005,34.9850306,4.98707,4.9661101,0.13594720000000002,6.6997128,6.2381813,14.2083954,16.5553682,4.277985,9.5023802,4.2677505,20.4737183,11.5052345,8.5178302,5.5322873,6.5685972,22.5105639,7.7603068,8.621474599999999,0.232797,5.9312190000000005,7.517176900000001
MYT,8.96e-05,8.96e-05,8.96e-05,8.96e-05,8.96e-05,8.96e-05,0.00010870000000000001,0.0001242,0.0001242,9.080000000000001e-05,0.0,0.0,0.0,0.0,0.0,0.0,0.0,0.0,0.0,0.0,0.0,0.0,0.0,0.0,0.0,0.0,0.0,0.0,0.0,0.0
NAM,0.016642900000000002,0.016642900000000002,0.016642900000000002,0.016642900000000002,0.016642900000000002,0.016642900000000002,0.0008916,0.0007864,0.0421449,0.070705,0.0962046,0.0,0.0,0.0,0.0,0.0,0.0,0.00024460000000000004,0.0004892000000000001,0.00036690000000000003,0.00012230000000000002,0.0,0.00024460000000000004,0.0,0.0,0.00012230000000000002,0.0,0.00012230000000000002,0.0,0.0039131999999999995
NCL,0.0032038,0.0032038,0.0032038,0.0032038,0.0032038,0.0032038,0.0024239,0.008892500000000001,0.005534600000000001,0.0016894,0.00013209999999999999,0.0,0.0014343,0.0,0.002049,0.0020492,0.0014341999999999998,0.0,0.0,0.0,0.0,0.0,0.0,0.0,0.0,0.0009221,0.0,0.0036879,0.0,0.0081959
NER,0.1253043,0.1253043,0.1253043,0.1253043,0.1253043,0.1253043,0.1310204,0.0795917,0.1988908,0.0910512,0.1259673,0.0,0.0,0.0,0.0,0.0,0.0,0.0,0.0,0.0,0.0,0.0,0.0,0.0,0.0,0.0,0.0,0.0,0.0,0.0
NFK,0.0,0.0,0.0,0.0,0.0,0.0,0.0,0.0,0.0,0.0,0.0,0.0,0.0,0.0,0.0,0.0,0.0,0.0,0.0,0.0,0.0,0.0,0.0,0.0,0.0,0.0,0.0,0.0,0.0,0.0
NGA,2.2795791,2.2795791,2.2795791,2.2795791,2.2795791,2.2795791,10.7861333,9.1689841,10.771261,9.1167313,10.108086300000002,0.4040884,0.334444,0.4765605,0.240121,0.7026764,0.3483907,0.2558556,0.2681242,0.1397498,0.21258660000000001,0.1440266,0.1028611,0.1718045,0.1214375,0.09113760000000001,0.2947496,0.2246009,0.0797038,0.14578370000000002
NIC,0.0997276,0.0997276,0.0997276,0.0997276,0.0997276,0.0997276,0.09962130000000001,0.180584,0.6654739,0.1631504,0.192934,0.0072032,0.004358,0.1537065,0.011501200000000001,0.1652533,0.0328904,0.0112776,0.0312346,0.0166815,0.0585386,0.038347400000000004,0.0187476,0.0756463,0.10090779999999999,0.0472801,0.10909310000000001,0.018216000000000003,0.07708150000000001,0.09699379999999999
NIU,0.0,0.0,0.0,0.0,0.0,0.0,0.0,0.0,0.0,0.0,0.0,0.0,0.0,0.0,0.0,0.0,0.0,0.0,0.0,0.0,0.0,0.0,0.0,0.0,0.0,0.0,0.0,0.0,0.0,0.0
NLD,2.5e-06,2.5e-06,2.5e-06,2.5e-06,2.5e-06,2.5e-06,0.0,5.400000000000001e-06,3.5e-06,3.5e-06,0.0,0.0,0.0,0.0,0.0,0.0,0.0,0.0,0.0,0.0,0.0,0.0,0.0,0.0,0.0,0.0,0.0,0.0,0.0,0.0
NOR,0.0022578,0.0022578,0.0022578,0.0022578,0.0022578,0.0022578,0.0029686,0.0029295000000000002,0.0032080000000000003,0.0032530000000000002,0.0021901000000000004,0.0,0.0,0.0,0.0,0.0,0.0012046,0.0011036,0.0,0.0,0.0,0.0,0.0,0.0,0.0,0.0,0.0,0.0,0.0012050000000000001,0.0
NPL,0.5768375,0.5768375,0.5768375,0.5768375,0.5768375,0.5768375,0.31116289999999996,0.2155521,0.3635994,0.47515620000000003,0.37536630000000004,0.3878962,0.08632290000000001,0.6633809,0.5442928,0.57813,0.3322417,0.22317009999999998,0.47583800000000004,0.6854533,0.8207827999999999,0.4793977,0.8342052,0.870891,0.8447074,0.1188055,2.105461,0.5090917,0.3632202,1.1398125000000001
NRU,0.0,0.0,0.0,0.0,0.0,0.0,0.0,0.0,0.0,0.0,0.0,0.0,0.0,0.0,0.0,0.0,0.0,0.0,0.0,0.0,0.0,0.0,0.0,0.0,0.0,0.0,0.0,0.0,0.0,0.0
NZL,0.0014307,0.0014307,0.0014307,0.0014307,0.0014307,0.0014307,0.0012986,0.0006367,0.000755,0.0006667999999999999,0.0032737,0.0024563000000000002,0.0001228,0.0013525,0.0003684,0.0,0.0,0.0040514999999999995,0.001476,0.000615,0.0003689,0.0,0.0017202,0.0019644,0.0,0.0,0.0,0.0022125,0.0,0.0009827
OMN,0.0,0.0,0.0,0.0,0.0,0.0,0.0,0.0,0.0,0.0,0.0,0.0,0.0,0.0,0.0,0.0,0.0,0.0,0.0,0.0,0.0,0.0,0.0,0.0,0.0,0.0,0.0,0.0,0.0,0.0
PAK,0.0038506,0.0038506,0.0038506,0.0038506,0.0038506,0.0038506,0.0018163,0.000642,0.0056281,0.0040321,0.0033510000000000002,0.0,0.0046604,0.0,0.0014717,0.0076039,0.000368,0.0130002,0.0,0.005028400000000001,0.0,0.0006131999999999999,0.0074812,0.0,0.0001227,0.0,0.0042925,0.0033114,0.0036793,0.0022075999999999997
PAN,0.012747099999999999,0.012747099999999999,0.012747099999999999,0.012747099999999999,0.012747099999999999,0.012747099999999999,0.0095008,0.0110839,0.0158701,0.0106531,0.0156507,0.0030687,0.0033757,0.0972307,0.0158898,0.0013298000000000001,0.0035804,0.0023926,0.0086955,0.0154468,0.0014322,0.00030690000000000003,0.0037026,0.0025773000000000003,0.0013298000000000001,0.012480100000000001,0.024775,0.000736,0.0013497,0.0246583
PER,0.1205007,0.1205007,0.1205007,0.1205007,0.1205007,0.1205007,0.1017952,0.1086323,0.1785375,0.1604662,0.0230561,0.0103241,0.0758908,0.1849867,0.0859097,0.4272142,0.0989476,0.2043593,0.0757869,0.0539562,0.2297896,0.0464353,0.15446510000000002,0.0963749,0.0858777,0.1006173,0.1158271,0.0382066,0.1066886,0.1278714
PHL,0.0540373,0.0540373,0.0540373,0.0540373,0.0540373,0.0540373,0.0467277,0.0621263,0.1911304,0.053800600000000004,0.060511600000000006,0.0034524,0.051602600000000005,0.0477647,0.05087680000000001,0.0900061,0.0265263,0.042331400000000005,0.019458700000000002,0.016037299999999997,0.1871487,0.0138471,0.009544700000000001,0.035469900000000006,0.0483837,0.0655338,0.0920718,0.0179879,0.018354099999999998,0.0462007
PLW,,0.0,0.0,0.0,0.0,0.0,0.0,0.0,0.0,0.0,0.0,0.0,0.0,0.0,0.0,0.0,0.0,0.0,0.0,0.0,0.0,0.0,0.0,0.0,0.0,0.0,0.0,0.0,0.0,0.0
PNG,0.7117851000000001,0.7117851000000001,0.7117851000000001,0.7117851000000001,0.7117851000000001,0.7117851000000001,0.3904939,13.064819600000002,0.4842836,0.4213071,0.28839760000000003,0.0151862,0.230018,0.07132720000000001,0.4384017,0.043879600000000005,0.1299506,0.0269262,0.0362473,0.0417433,0.048548,0.027304099999999998,0.023824400000000003,0.0520691,0.046864800000000005,0.9653505,0.034895600000000006,0.037592799999999996,0.11094280000000001,0.052468400000000005
POL,0.0015408,0.0015408,0.0015408,0.0015408,0.0015408,0.0015408,0.0006723,0.0006378,0.0016813000000000002,0.0006498000000000001,0.0005110000000000001,0.0011087,0.001971,0.0123157,0.0002464,0.0014777,0.0001231,0.0,0.0002462,0.0003695,0.0007387,0.0,0.0018471,0.0011078,0.0,0.0004927,0.0,0.0027093,0.0003697,0.0
PRI,0.0009678,0.0009678,0.0009678,0.0009678,0.0009678,0.0009678,0.00035,0.0010688,0.0010862,0.0029718,0.0002273,0.0,0.0,0.0,0.0,0.0,0.0,0.0,0.0,0.0,0.0,0.0,0.00010240000000000001,0.0,0.0,0.0,0.0,0.0,0.0,0.0
PRK,0.10967980000000001,0.10967980000000001,0.10967980000000001,0.10967980000000001,0.10967980000000001,0.10967980000000001,0.1045437,0.3566801,0.1413132,0.08527710000000001,0.09230150000000001,0.0889084,0.0208736,0.0270156,0.3913499,0.1240309,0.043476799999999996,0.0106846,0.0589621,0.2578083,0.0186634,0.1204419,0.0069998,0.0243182,0.35472800000000004,0.13151290000000002,0.0049116,0.0259232,0.0881642,0.0534255
PRT,0.0668557,0.0668557,0.0668557,0.0668557,0.0668557,0.0668557,0.1605611,0.0910411,0.1377976,0.1050435,0.0759529,0.0040534,0.017567799999999998,0.1130698,0.0054044,0.111413,0.0189176,0.0023341,0.0003684,0.0057738,0.021253900000000003,0.0068793,0.014863,0.0243239,0.0019656,0.0190427,0.1266457,0.4927475,0.0270045,0.020510999999999998
PRY,0.7400715,0.7400715,0.7400715,0.7400715,0.7400715,0.7400715,1.3463901,1.7803176,1.4883175000000002,3.8275104,0.7356346,0.4366943,1.1975053,0.6465291,0.3489567,0.6891783,0.3823286,1.5459026,0.187394,0.1506981,0.2637495,0.2730129,0.1675038,0.2937027,0.0839442,0.055930900000000006,0.131585,0.5598265,0.14866900000000002,1.020434
PSE,0.0,0.0,0.0,0.0,0.0,0.0,0.0,0.0,0.0,0.0,0.0,0.0,0.0,0.0,0.0,0.0,0.0,0.0,0.0,0.0,0.0,0.0,0.0,0.0,0.0,0.0,0.0,0.0,0.0,0.0
PYF,0.0024597000000000004,0.0024597000000000004,0.0024597000000000004,0.0024597000000000004,0.0024597000000000004,0.0024597000000000004,0.0019002,0.0019002,0.0042473,0.0020957,0.0003872,0.0,0.0,0.0,0.0,0.0,0.0,0.0,0.0,0.0,0.0,0.0041961,0.0,0.0,0.0,0.0,0.0,0.0,0.0,0.0
QAT,0.0,0.0,0.0,0.0,0.0,0.0,0.0,0.0,0.0,0.0,0.0,0.0,0.0,0.0,0.0,0.0,0.0,0.0,0.0,0.0,0.0,0.0,0.0,0.0,0.0,0.0,0.0,0.0,0.0,0.0
ROU,0.0118224,0.0118224,0.0118224,0.0118224,0.0118224,0.0118224,0.0337717,0.028031300000000002,0.029132,0.028515000000000002,0.022458,0.0003689,0.0034434,0.001968,0.0035659000000000003,0.0063948,0.0124207,0.0088549,0.0020904,0.0098403,0.0065173,0.0202908,0.0092248,0.0062745,0.0019679,0.0,0.0,0.012420400000000002,0.0030743000000000003,0.0094676
RUS,,,6.768638200000001,6.768638200000001,6.768638200000001,6.768638200000001,18.787533200000002,7.025881,13.4027976,8.9641005,10.084374200000001,3.0801541,4.1539637,7.3445185,7.4863378,3.5731196,5.648762,2.8832447,10.748691500000001,4.4840547,5.6431882,5.973354400000001,7.3079168,2.8016549,6.654467400000001,2.8577453,6.792994800000001,3.8403369,6.7789748,6.1291497
RWA,0.0061633,0.0061633,0.0061633,0.0061633,0.0061633,0.0061633,0.0066643,0.015909100000000002,0.0241139,0.0063184,0.0050665,0.0,0.0168553,0.0,0.0,0.0003664,0.0,0.0,0.0003664,0.0006107,0.0026871,0.0001221,0.0,0.0040306,0.0003664,0.0,0.0028092000000000004,0.0,0.0,0.0
SAU,0.0,0.0,0.0,0.0,0.0,0.0,0.0,0.0,0.0,0.0,0.0,0.0,0.0,0.0,0.0,0.0,0.0,0.0,0.0,0.0,0.0,0.0,0.0,0.0,0.0,0.0,0.0,0.0,0.0,0.0
SDN,,,,,,,,,,,,,,,,,,,,,,,0.0024436,0.0017105,0.0030545,0.0032988,0.0041342,0.0031568,0.0067653999999999995,0.0036655000000000004
SEN,0.4792903,0.4792903,0.4792903,0.4792903,0.4792903,0.4792903,0.9045648000000001,1.1553464,2.0077443,2.8754336,1.8968514,0.007674800000000001,0.0072655,0.0091074,0.045148200000000006,0.0846284,0.1159816,0.1249469,0.122511,0.0995887,0.0736362,0.0495457,0.09848269999999999,0.0842161,0.049650599999999996,0.0407675,0.048237699999999994,0.0232462,0.0371205,0.0340308
SGP,4.27e-05,4.27e-05,4.27e-05,4.27e-05,4.27e-05,4.27e-05,4.74e-05,6.65e-05,5.23e-05,3.5000000000000004e-05,1.23e-05,0.0,0.0,0.0,0.0,0.0,0.0,0.0,0.0,0.0,0.0,0.0,0.0,0.0,0.0,0.0,0.0,0.0,0.0,0.0
SHN,0.0,0.0,0.0,0.0,0.0,0.0,0.0,0.0,0.0,0.0,0.0,0.0,0.0,0.0,0.0,0.0,0.0,0.0,0.0,0.0,0.0,0.0,0.0,0.0,0.0,0.0,0.0,0.0,0.0,0.0
SJM,0.0,0.0,0.0,0.0,0.0,0.0,0.0,0.0,0.0,0.0,0.0,0.0,0.0,0.0,0.0,0.0,0.0,0.0,0.0,0.0,0.0,0.0,0.0,0.0,0.0,0.0,0.0,0.0,0.0,0.0
SLB,1.7000000000000003e-05,1.7000000000000003e-05,1.7000000000000003e-05,1.7000000000000003e-05,1.7000000000000003e-05,1.7000000000000003e-05,0.0,0.0,0.0,0.0,0.0,0.0,0.0001023,0.0,0.0,0.0,0.0,0.0,0.0,0.0,0.0,0.0,0.0,0.0,0.0,0.0,0.0,0.0,0.0,0.0
SLE,0.0837748,0.0837748,0.0837748,0.0837748,0.0837748,0.0837748,0.0729457,0.1047512,0.23310720000000001,0.1654397,0.1524297,0.0014322,0.0016766,0.0811602,0.10117709999999999,0.0647659,0.1134795,0.06527089999999999,0.0254488,0.0452538,0.0230103,0.024017399999999998,0.035469099999999996,0.0298662,0.0862272,0.3950113,0.047178,0.0623664,0.02733,0.029648599999999997
SLV,0.0071567,0.0071567,0.0071567,0.0071567,0.0071567,0.0071567,0.0001388,0.0014721,0.004528900000000001,0.004377799999999999,0.0049215,0.0041556,0.00024440000000000003,0.0013445,0.0017597000000000001,0.0058727,0.0008188,0.0001023,0.00024440000000000003,0.0001023,0.0004491,0.00012220000000000002,0.0015889,0.0281497,0.0003468,0.0286041,0.0007135,0.026736899999999997,0.0082066,0.0171288
SOM,0.0006892000000000001,0.0006892000000000001,0.0006892000000000001,0.0006892000000000001,0.0006892000000000001,0.0006892000000000001,0.0009213,0.0008585000000000001,0.0008379,0.0008366000000000001,0.0005587999999999999,0.0001221,0.0,0.0,0.0,0.0,0.0,0.0,0.0,0.0,0.0,0.0,0.0,0.0,0.0,0.0,0.0,0.0,0.0,0.0
SPM,0.0,0.0,0.0,0.0,0.0,0.0,0.0,0.0,0.0,0.0,0.0,0.0,0.0,0.0,0.0,0.0,0.0,0.0,0.0,0.0,0.0,0.0,0.0,0.0,0.0,0.0,0.0,0.0,0.0,0.0
SRB,,,,,,,,,,,,,,,,,0.0006145,0.0237236,0.0002459,0.0034418,0.0004917000000000001,0.013401300000000001,0.0095865,0.0,0.0004918,0.0007376,0.0003688,0.0009834000000000002,0.0011065,0.014257400000000002
SSD,,,,,,,,,,,,,,,,,,,,,,,0.9609943,1.2271546000000002,1.1063996,0.7464754,1.1342267,0.8383886,0.8750738,0.4873002
STP,0.0,0.0,0.0,0.0,0.0,0.0,0.0,0.0,0.0,0.0,0.0,0.0,0.0,0.0,0.0,0.0,0.0,0.0,0.0,0.0,0.0,0.0,0.0,0.0,0.0,0.0,0.0,0.0,0.0,0.0
SVK,,,,0.000613,0.000613,0.000613,0.0004387,0.0003428,0.00034399999999999996,0.00034399999999999996,0.00034399999999999996,0.0002462,0.0,0.0002462,0.0,0.0004923,0.0,0.0018458,0.0,0.0003692,0.0,0.0,0.0001231,0.0,0.0011074,0.0,0.0,0.0004923,0.0018460000000000002,0.0
SVN,,,0.0011103,0.0011103,0.0011103,0.0011103,0.0004139,0.0003917,0.0004215,0.0004098,0.00026900000000000003,0.000246,0.0,0.0030746000000000002,0.000123,0.0,0.0015988,0.000246,0.0,0.000492,0.0,0.006641200000000001,0.0035669,0.000123,0.000369,0.0,0.000123,0.0,0.0011069,0.000369
SWE,0.0065205,0.0065205,0.0065205,0.0065205,0.0065205,0.0065205,0.0015426,0.0010938,0.0086228,0.0012089000000000002,0.0005814,0.0,0.0,0.0,0.0,0.0,0.0019084000000000002,0.0,0.0,0.0,0.0,0.0,0.0,0.0,0.0286489,0.0,0.0,0.0,0.008557200000000001,0.0
SWZ,0.0347703,0.0347703,0.0347703,0.0347703,0.0347703,0.0347703,0.08121460000000001,0.0560582,0.11216330000000001,0.074801,0.048108,0.0106541,0.0056331,0.021045,0.019103000000000002,0.0129802,0.003796,0.1304118,0.0808227,0.0073473,0.0257163,0.0270631,0.0198381,0.0204501,0.0182567,0.0099186,0.0142044,0.0071026,0.004041,0.023757200000000003
SYC,0.0,0.0,0.0,0.0,0.0,0.0,0.0,0.0,0.0,0.0,0.0,0.0,0.0,0.0,0.0,0.0,0.0,0.0,0.0,0.0,0.0,0.0,0.0,0.0,0.0,0.0,0.0,0.0,0.0,0.0
SYR,0.001082,0.001082,0.001082,0.001082,0.001082,0.001082,0.00011509999999999999,0.0001118,0.00011509999999999999,0.00017449999999999999,0.00019769999999999998,0.0,0.0,0.0,0.0001227,0.0,0.0,0.0011043000000000001,0.0,0.0,0.0,0.0,0.009079700000000001,0.0001227,0.0,0.0008589,0.0006134,0.0,0.0,0.0003681
TCA,0.00013780000000000002,0.00013780000000000002,0.00013780000000000002,0.00013780000000000002,0.00013780000000000002,0.00013780000000000002,0.00017219999999999998,0.0001291,0.0001291,0.0001291,0.0001291,0.0,0.0,0.0,0.0,0.0,0.0,0.0,0.0,0.0,0.0,0.0,0.0,0.0,0.0,0.0,0.0,0.0,0.0,0.0
TCD,1.7239108,1.7239108,1.7239108,1.7239108,1.7239108,1.7239108,1.8606294,2.8369826,6.1666867000000005,6.0063582,3.7419258,0.7586525000000001,0.9329985000000001,1.231013,1.2262578000000002,0.8586701000000001,1.3517666,1.7082757,1.1083680999999999,0.552929,1.2793526,1.2340019,1.5359634000000002,0.9305562000000001,0.8676903,0.9341563,1.5474052,1.0667486,0.9822874,0.6541836
TGO,0.0419317,0.0419317,0.0419317,0.0419317,0.0419317,0.0419317,0.0864385,0.10998680000000001,0.2060805,0.29283780000000004,0.0569004,0.017901399999999998,0.0191289,0.0176965,0.0169805,0.0421451,0.023936699999999998,0.010843,0.0023528,0.0056261,0.0040918000000000005,0.0045008,0.0018413,0.0016367,0.0013298000000000001,0.0056261,0.0114567,0.0139121,0.0080812,0.0065469000000000005
THA,2.3214975,2.3214975,2.3214975,2.3214975,2.3214975,2.3214975,1.512374,1.4864004,3.7475764,2.0723518,1.2530364999999999,0.5858846999999999,1.4050124000000002,1.3939765,5.352616,2.1519524000000003,1.2618314000000002,3.718432,1.5812913000000002,2.4566441,2.2590336000000004,0.9438464000000001,2.2021405,1.1466083,3.4118174,2.4520175,2.5493034,2.5497149,1.1576821,1.9406199
TJK,,,0.0006167000000000001,0.0006167000000000001,0.0006167000000000001,0.0006167000000000001,0.002337,0.0007467000000000001,0.0,0.0,0.0,0.0,0.0,0.0,0.0,0.0,0.0,0.0,0.0,0.0,0.0,0.0,0.0,0.0,0.0,0.0,0.0,0.0,0.0,0.0
TKL,0.0,0.0,0.0,0.0,0.0,0.0,0.0,0.0,0.0,0.0,0.0,0.0,0.0,0.0,0.0,0.0,0.0,0.0,0.0,0.0,0.0,0.0,0.0,0.0,0.0,0.0,0.0,0.0,0.0,0.0
TKM,,,0.00029549999999999997,0.00029549999999999997,0.00029549999999999997,0.00029549999999999997,0.0002229,0.0001938,0.0001923,0.000189,0.0006793,0.0,0.0,0.0,0.0,0.0,0.0,0.0,0.0,0.0,0.0,0.0,0.0,0.0,0.0,0.0,0.0,0.0,0.0,0.0
TLS,0.0053123,0.0053123,0.0053123,0.0053123,0.0053123,0.0053123,0.0006861,0.0118464,0.0005869,0.0038683000000000003,0.0004514,0.0022278,0.018688,0.0005512000000000001,0.0087802,0.0060865,0.0109992,0.0020033,0.0042737999999999995,0.0055382,0.0,0.0015544,0.0061859,0.0001023,0.0082687,0.005734,0.001023,0.0016567,0.0044356000000000005,0.0114506
TON,0.0,0.0,0.0,0.0,0.0,0.0,0.0,0.0,0.0,0.0,0.0,0.0,0.0,0.0,0.0,0.0,0.0,0.0,0.0,0.0,0.0,0.0,0.0,0.0,0.0,0.0,0.0,0.0,0.0,0.0
TTO,0.0021716,0.0021716,0.0021716,0.0021716,0.0021716,0.0021716,0.0040774,0.0029982000000000003,0.0063805,0.0036383,0.0065463,0.0,0.0,0.0014322999999999998,0.0,0.0001023,0.00030690000000000003,0.0010230999999999999,0.0001023,0.0002046,0.0058316,0.0,0.0,0.0,0.0001023,0.0002046,0.0025577,0.0018415,0.00030690000000000003,0.0014322999999999998
TUN,0.0029044,0.0029044,0.0029044,0.0029044,0.0029044,0.0029044,0.0002784,0.0002378,0.0003681,0.0003311,0.003935500000000001,0.0,0.00036820000000000006,0.0,0.0,0.0,0.0,0.000859,0.0,0.0,0.0004909000000000001,0.0009819,0.0012272000000000001,0.0024546999999999998,0.0051548,0.0012273000000000002,0.0,0.0243009,0.0,0.0013499000000000002
TUR,0.0053729,0.0053729,0.0053729,0.0053729,0.0053729,0.0053729,0.0116283,0.0076425,0.0134462,0.0120483,0.0058548,0.0003685,0.0001228,0.0029478,0.0008597,0.0013502000000000002,0.0030686,0.0020871,0.0062604,0.0006142,0.0002457,0.0056501,0.0031920000000000004,0.0027019,0.0012284,0.0028239000000000003,0.0011049,0.009329800000000001,0.0011051,0.0332686
TUV,0.0,0.0,0.0,0.0,0.0,0.0,0.0,0.0,0.0,0.0,0.0,0.0,0.0,0.0,0.0,0.0,0.0,0.0,0.0,0.0,0.0,0.0,0.0,0.0,0.0,0.0,0.0,0.0,0.0,0.0
TWN,0.0006731,0.0006731,0.0006731,0.0006731,0.0006731,0.0006731,0.0001923,0.0001502,0.0001502,0.0001502,0.0001502,0.0,0.0,0.00036730000000000004,0.0044072,0.0,0.0,0.0,0.0,0.0001224,0.0001224,0.0,0.0,0.0012242,0.0,0.00036730000000000004,0.0,0.0,0.0,0.0
TZA,5.8788374999999995,5.8788374999999995,5.8788374999999995,5.8788374999999995,5.8788374999999995,5.8788374999999995,1.2593499,1.2923406,1.8916685,1.0613427999999998,0.5536871999999999,3.7530766,4.6663819,8.256833199999999,7.3831178,9.9051802,7.1756899999999995,6.9290769,7.4490812,8.9127485,8.282108000000001,6.6860346,7.7757011,6.1594599,5.9590187,8.3851511,7.585844600000001,7.605578700000001,5.7533212,6.4103076
UGA,0.1802648,0.1802648,0.1802648,0.1802648,0.1802648,0.1802648,0.27119760000000004,0.6697349,0.822911,1.1020023,0.6546878,0.046551499999999996,0.055034,0.0607919,0.0477553,0.0639273,0.032628000000000004,0.0150733,0.0356202,0.0243613,0.043295,0.0337622,0.0738647,0.0353754,0.051874699999999996,0.046752800000000004,0.037858600000000006,0.0497076,0.018592300000000003,0.032995199999999995
UKR,,,0.07841450000000001,0.07841450000000001,0.07841450000000001,0.07841450000000001,0.035288200000000006,0.0347413,0.036076000000000004,0.0451948,0.0172899,0.014401500000000001,0.048018700000000004,0.0531779,0.0130481,0.1180591,0.0509582,0.029168600000000003,0.0236339,0.13798660000000001,0.1051165,0.056494100000000005,0.0824884,0.1237014,0.22145030000000002,0.266662,0.0176025,0.039137500000000006,0.1059838,0.2062688
URY,0.004785,0.004785,0.004785,0.004785,0.004785,0.004785,0.0118636,0.0107492,0.0158772,0.0130124,0.022253799999999997,0.0,0.00036780000000000005,0.00036780000000000005,0.0076021000000000005,0.0035562000000000002,0.000613,0.0002452,0.0036783000000000002,0.0006131,0.0008585000000000001,0.0076042,0.0001226,0.0001226,0.0001226,0.0008583,0.0002453,0.0011034,0.0014713,0.0067456
USA,1.6550666,1.6550666,1.6550666,1.6550666,1.6550666,1.6550666,2.9370981,1.3877765,2.7698356,3.1946612,3.2957172,0.5039137,1.3948806,1.1582108,1.151286,0.8785397,1.0264859,1.4722069,1.9543499,1.0370115000000002,0.8642663,1.2565002,1.1090299000000001,1.214697,1.2626658,2.1774517,1.3589508000000001,2.5166729,2.3222692,1.4346012000000001
UZB,,,0.0430198,0.0430198,0.0430198,0.0430198,0.0438292,0.0393831,0.0396238,0.037154400000000004,0.055108700000000004,0.0,0.0,0.0,0.0,0.0,0.0,0.0,0.0,0.0,0.0,0.0,0.0,0.0,0.0,0.0,0.0,0.0,0.0,0.0
VCT,0.0,0.0,0.0,0.0,0.0,0.0,0.0,0.0,0.0,0.0,0.0,0.0,0.0,0.0,0.0,0.0,0.0,0.0,0.0,0.0,0.0,0.0,0.0,0.0,0.0,0.0,0.0,0.0,0.0,0.0
VEN,0.5444525,0.5444525,0.5444525,0.5444525,0.5444525,0.5444525,0.752649,0.9852505,2.6857228,1.0414029,1.5126604,0.4358924,0.0676425,1.2771339000000002,0.112079,0.2394999,0.1423381,0.3877827,0.13242320000000002,0.074972,0.839289,0.0540549,0.0460907,0.2466915,0.1991,0.2572872,0.6101462000000001,0.0852394,0.1933318,0.6881793
VGB,3.41e-05,3.41e-05,3.41e-05,3.41e-05,3.41e-05,3.41e-05,0.0,0.0,0.0,0.0,0.0,0.0,0.0,0.0,0.0,0.00020480000000000002,0.0,0.0,0.0,0.0,0.0,0.0,0.0,0.0,0.0,0.0,0.0,0.0,0.0,0.0
VIR,0.0,0.0,0.0,0.0,0.0,0.0,0.0,0.0,0.0,0.0,0.0,0.0,0.0,0.0,0.0,0.0,0.0,0.0,0.0,0.0,0.0,0.0,0.0,0.0,0.0,0.0,0.0,0.0,0.0,0.0
VNM,1.2798672,1.2798672,1.2798672,1.2798672,1.2798672,1.2798672,0.8290553,0.6014171,1.9498477,1.150452,1.1235798,0.3084699,3.5124612,1.064913,1.5932851000000001,1.596328,0.6120538,1.5323387,0.4556128,0.6447346,1.2382951,0.5797049,0.7125507,2.5669361,1.3757123,0.6221453,0.9370404999999999,0.3669998,0.3829636,0.4329658
VUT,0.0013958,0.0013958,0.0013958,0.0013958,0.0013958,0.0013958,6.03e-05,0.000555,5.77e-05,7.910000000000001e-05,0.0,0.0,0.0,0.0004095,0.0,0.0025593,0.0,0.0,0.0,0.0,0.0,0.0,0.0,0.0,0.00010240000000000001,0.0037885,0.0,0.0063465,0.0,0.0
WLF,0.0,0.0,0.0,0.0,0.0,0.0,0.0,0.0,0.0,0.0,0.0,0.0,0.0,0.0,0.0,0.0,0.0,0.0,0.0,0.0,0.0,0.0,0.0,0.0,0.0,0.0,0.0,0.0,0.0,0.0
WSM,0.002428,0.002428,0.002428,0.002428,0.002428,0.002428,0.0018605000000000002,0.0018605000000000002,0.004207600000000001,0.0020561,0.0003872,0.0,0.0,0.0,0.0,0.0,0.0,0.0,0.0,0.0,0.0,0.0041961,0.0,0.0,0.0,0.0,0.0,0.0,0.0,0.0
YEM,0.0,0.0,0.0,0.0,0.0,0.0,0.0,0.0,0.0,0.0,0.0,0.0,0.0,0.0,0.0,0.0,0.0,0.0,0.0,0.0,0.0,0.0,0.0,0.0,0.0,0.0,0.0,0.0,0.0,0.0
ZAF,0.4503544,0.4503544,0.4503544,0.4503544,0.4503544,0.4503544,1.4170717,1.4147416000000002,2.4371428,1.6265081000000001,0.5384776000000001,0.0569018,0.0982539,0.2500501,0.0860556,0.3247876,0.07810790000000001,0.368887,0.21514650000000002,0.1100713,0.14922370000000001,0.10698919999999999,0.1358293,0.11911360000000001,0.1740855,0.09208100000000001,0.1330015,0.19862970000000002,0.4828504,0.18847730000000001
ZMB,13.902530800000001,13.902530800000001,13.902530800000001,13.902530800000001,13.902530800000001,13.902530800000001,7.0832377,6.8243333,6.3991622,6.4193302999999995,3.911374,9.001954,9.8100914,12.9363807,13.3372232,14.6034319,12.5030943,14.4670658,16.2538307,14.0528969,17.5468757,16.6377447,16.7446031,17.083052199999997,17.4936355,21.380141599999998,20.3846959,20.184961599999998,18.7195821,19.8820414
ZWE,0.1844448,0.1844448,0.1844448,0.1844448,0.1844448,0.1844448,0.1860207,0.3439763,0.3980209,0.257021,0.0165885,0.0251897,0.0432891,0.0634664,0.0829073,0.15555660000000002,0.10699710000000001,0.2166871,0.2410376,0.1589672,0.26792020000000005,0.15885059999999998,0.2450544,0.2249956,0.1573767,0.2712588,0.2196274,0.1238685,0.2093457,0.2526509
