### META ###
ID,Area|Land|Agriculture__Historic__FAO_2020
category,Agriculture
creator,AG
entity,Area|Land
modified,2021/05/06-02:56:15
pathway,Historic
scenario,Historic
source,FAO_2020
unit,Mha
variable,Area|Land|Agriculture
### DATA ###
region,1961,1962,1963,1964,1965,1966,1967,1968,1969,1970,1971,1972,1973,1974,1975,1976,1977,1978,1979,1980,1981,1982,1983,1984,1985,1986,1987,1988,1989,1990,1991,1992,1993,1994,1995,1996,1997,1998,1999,2000,2001,2002,2003,2004,2005,2006,2007,2008,2009,2010,2011,2012,2013,2014,2015,2016,2017,2018
ABW,0.002,0.002,0.002,0.002,0.002,0.002,0.002,0.002,0.002,0.002,0.002,0.002,0.002,0.002,0.002,0.002,0.002,0.002,0.002,0.002,0.002,0.002,0.002,0.002,0.002,0.002,0.002,0.002,0.002,0.002,0.002,0.002,0.002,0.002,0.002,0.002,0.002,0.002,0.002,0.002,0.002,0.002,0.002,0.002,0.002,0.002,0.002,0.002,0.002,0.002,0.002,0.002,0.002,0.002,0.002,0.002,0.002,0.002
AFG,37.7,37.76,37.81,37.873,37.875,37.913000000000004,37.979,37.980000000000004,37.996,38.006,38.036,38.046,38.048,38.048,38.048,38.048,38.050000000000004,38.050000000000004,38.049,38.049,38.053,38.054,38.054,38.054,38.054,38.054,38.045,38.04,38.04,38.04,38.03,38.03,37.934,37.813,37.753,37.752,37.79,37.867,37.753,37.753,37.753,37.753,37.910000000000004,37.911,37.910000000000004,37.910000000000004,37.910000000000004,37.910000000000004,37.910000000000004,37.911,37.910000000000004,37.910000000000004,37.910000000000004,37.910000000000004,37.910000000000004,37.910000000000004,37.910000000000004,37.919000000000004
AGO,57.17,57.2,57.22,57.25,57.27,57.300000000000004,57.33,57.36,57.4,57.4,57.4,57.4,57.4,57.4,57.4,57.4,57.4,57.4,57.4,57.4,57.4,57.4,57.4,57.4,57.4,57.4,57.4,57.4,57.4,57.404,45.562637,45.718053999999995,45.873471,46.028888,46.184305,46.339722,46.495139,46.650555999999995,46.805973,46.96139,47.516451,48.071512000000006,48.626573,49.181634,49.736695,50.291756,50.846817,51.401877999999996,51.956939,52.512,53.067062,53.62212400000001,54.177186000000006,54.732248,55.28731,55.84238,56.39743,56.95249
ALB,1.232,1.232,1.233,1.23,1.237,1.24,1.244,1.24,1.235,1.23,1.2,1.174,1.1460000000000001,1.122,1.08,1.075,1.109,1.114,1.117,1.118,1.116,1.114,1.11,1.113,1.112,1.111,1.111,1.117,1.11,1.121,1.127,1.127,1.1260000000000001,1.1260000000000001,1.127,1.131,1.135,1.139,1.145,1.1440000000000001,1.139,1.1400000000000001,1.121,1.122,1.077,1.12,1.119,1.181,1.2013,1.2013,1.201,1.2013,1.188309,1.175375,1.1755440000000001,1.1831,1.170761,1.176081
AND,0.026000000000000002,0.026000000000000002,0.026000000000000002,0.026000000000000002,0.026000000000000002,0.026000000000000002,0.026000000000000002,0.026000000000000002,0.026000000000000002,0.026000000000000002,0.025,0.025,0.024,0.024,0.024,0.023,0.023,0.023,0.023,0.023,0.023,0.023,0.023,0.023,0.023,0.023,0.023,0.023,0.023,0.023,0.023,0.023,0.023,0.023,0.023,0.023,0.023,0.023,0.023,0.023,0.02275,0.022850000000000002,0.02286,0.02281,0.0218,0.02178,0.02077,0.02076,0.02077,0.01977,0.01977,0.018760000000000002,0.01881,0.0188,0.01881,0.01882,0.01882,0.01883
ARE,0.20800000000000002,0.20800000000000002,0.20800000000000002,0.20800000000000002,0.209,0.21,0.21,0.21,0.21,0.212,0.212,0.212,0.213,0.214,0.215,0.216,0.217,0.218,0.219,0.223,0.227,0.227,0.232,0.232,0.23500000000000001,0.23800000000000002,0.23800000000000002,0.23900000000000002,0.23900000000000002,0.28500000000000003,0.31,0.339,0.355,0.372,0.383,0.387,0.395,0.398,0.516,0.547,0.562,0.5660000000000001,0.554,0.554,0.557,0.5386000000000001,0.5326000000000001,0.5396000000000001,0.38789999999999997,0.39230000000000004,0.3885,0.3767,0.37939999999999996,0.3825,0.38280000000000003,0.38380000000000003,0.38380000000000003,0.38175000000000003
ARG,137.829,136.434,134.875,133.297,131.78,130.948,129.703,129.235,129.302,129.28,129.154,129.028,128.90200000000002,128.776,128.65,128.524,128.398,128.272,128.14600000000002,128.02,127.894,128.769,128.644,128.517,128.391,128.26500000000001,127.93900000000001,127.38000000000001,127.47,127.565,127.66,127.75500000000001,127.85000000000001,127.94800000000001,128.04500000000002,128.142,128.235,128.33,128.412,128.51,128.606,128.71,130.8835,134.345,137.7975,141.104,144.03300000000002,144.261,143.792,147.481,148.281,149.254,149.199,148.70000000000002,148.70000000000002,148.70000000000002,148.70000000000002,148.768
ARM,,,,,,,,,,,,,,,,,,,,,,,,,,,,,,,,1.17,1.181,1.2,1.244,1.306,1.332,1.328,1.323,1.323,1.328,1.391,1.444,1.5050000000000001,1.605,1.7564000000000002,1.7519000000000002,1.7488,1.7463,1.735,1.6981,1.683,2.051,2.0494000000000003,2.0457,2.0455,2.0438,2.0445
ASM,0.003,0.003,0.003,0.003,0.003,0.003,0.003,0.003,0.003,0.003,0.003,0.003,0.003,0.003,0.003,0.003,0.003,0.003,0.003,0.003,0.003,0.003,0.003,0.003,0.003,0.003,0.003,0.003,0.003,0.003,0.003,0.0032,0.0032,0.0032,0.0035,0.004,0.004,0.0047,0.00479,0.0048,0.0045000000000000005,0.0045000000000000005,0.00504,0.005,0.005,0.005,0.0048,0.0048,0.004900000000000001,0.004900000000000001,0.004900000000000001,0.004900000000000001,0.004900000000000001,0.004900000000000001,0.004900000000000001,0.004900000000000001,0.004900000000000001,0.004900000000000001
ATG,0.01,0.009000000000000001,0.01,0.009000000000000001,0.011,0.011,0.01,0.01,0.011,0.011,0.011,0.007,0.007,0.007,0.007,0.007,0.007,0.007,0.007,0.007,0.007,0.007,0.007,0.008,0.009000000000000001,0.009000000000000001,0.009000000000000001,0.009000000000000001,0.009000000000000001,0.009000000000000001,0.009000000000000001,0.009000000000000001,0.009000000000000001,0.009000000000000001,0.009000000000000001,0.009000000000000001,0.009000000000000001,0.009000000000000001,0.009000000000000001,0.009000000000000001,0.009000000000000001,0.009000000000000001,0.009000000000000001,0.009000000000000001,0.009000000000000001,0.009000000000000001,0.009000000000000001,0.009000000000000001,0.009000000000000001,0.009000000000000001,0.009000000000000001,0.009000000000000001,0.009000000000000001,0.009000000000000001,0.009000000000000001,0.009000000000000001,0.009000000000000001,0.009000000000000001
AUS,474.4844445,476.5929315,479.3695782,481.9038096,486.259191,487.0285257,489.5805639,513.5695611,510.8880189,493.4324985,499.5361667,499.815,497.897,500.357,499.547,500.742,491.51,496.1,493.238,495.63800000000003,495.565,490.772,483.789,486.558,486.791,468.541,471.02,472.052,467.104,464.437,462.782,466.004,460.09700000000004,469.14300000000003,463.38800000000003,465.23,462.233,463.88100000000003,453.693,455.469,455.7,447.0,439.5,440.11,445.149,434.925,425.449,417.288,409.029,398.58,409.6726,405.474,396.6153,406.269,365.913,371.07800000000003,393.797,378.082
AUT,3.5554,3.531,3.4898000000000002,3.4765,3.4642,3.406,3.3737,3.3593,3.3511,3.3358000000000003,3.3209,3.3071,3.2222,3.2073,3.1895000000000002,3.1835,3.1776,3.1808,3.1429,3.141,3.1554,3.1427,3.0259,3.0332,3.0375,3.0268,3.028,3.0483000000000002,3.0505999999999998,3.0239000000000003,3.0369,3.013,2.999,2.9941,2.9811,2.9733,2.9646,2.9599,2.9552,2.9402,2.9161,2.9021999999999997,2.88523,2.8674,2.8568000000000002,2.8433,2.8301,2.8094,2.795,2.7792,2.7573000000000003,2.7352,2.7164,2.7142,2.71845,2.67017,2.65462,2.65283
AZE,,,,,,,,,,,,,,,,,,,,,,,,,,,,,,,,4.4462,4.456600000000001,4.486,4.4891000000000005,4.5262,4.5887,4.6821,4.6924,4.7404,4.7456000000000005,4.7448999999999995,4.754600000000001,4.7549,4.7586,4.756,4.7565,4.7566999999999995,4.7573,4.7668,4.7687,4.7683,4.7698,4.7697,4.7698,4.773,4.7775,4.7795000000000005
BDI,1.575,1.59,1.604,1.605,1.624,1.621,1.666,1.676,1.897,1.8800000000000001,1.899,1.9060000000000001,2.0,2.0300000000000002,2.06,2.095,2.1430000000000002,2.12,2.1,2.088,2.075,2.06,2.06,2.06,2.06,2.082,2.092,2.105,2.105,2.11,2.11,2.12,2.123,2.073,2.037,1.993,1.952,1.913,1.887,1.867,1.851,1.834,1.833,1.848,1.819,1.7830000000000001,1.733,1.7830000000000001,1.833,1.833,1.883,1.933,2.033,2.033,2.033,2.033,2.033,2.033
BEL,,,,,,,,,,,,,,,,,,,,,,,,,,,,,,,,,,,,,,,,1.3896,1.3868,1.3891,1.3922,1.3913,1.383,1.3800000000000001,1.3669000000000002,1.3653,1.3636,1.3557000000000001,1.3357,1.332,1.3365,1.3313,1.328,1.3508,1.327,1.354
BEN,1.442,1.462,1.482,1.502,1.522,1.552,1.592,1.622,1.707,1.727,1.7770000000000001,1.807,1.827,1.857,1.897,1.927,1.957,1.977,1.997,2.027,2.057,2.09,2.1,2.11,2.13,2.19,2.2,2.21,2.22,2.27,2.2800000000000002,2.295,2.32,2.4,2.52,2.71,2.89,3.0500000000000003,3.11,3.1950000000000003,3.265,3.365,3.467,3.467,3.484,3.34,3.35,3.5500000000000003,3.65,3.65,3.65,3.75,3.95,3.95,3.95,3.95,3.95,3.95
BFA,8.139,8.149000000000001,8.159,8.169,8.179,8.19,8.2,8.21,8.222,8.236,8.22,8.302,8.373,8.453,8.536,8.585,8.635,8.685,8.735,8.785,8.835,8.885,8.935,8.985,9.035,9.085,9.14,9.564,9.6,9.575000000000001,9.55,9.525,9.5,9.431000000000001,9.450000000000001,9.55,9.85,9.97,9.97,9.77,10.57,10.77,11.17,10.67,10.97,10.77,10.97,12.07,11.77,12.08,11.790000000000001,12.1,12.3,12.1,12.1,12.1,12.1,12.1
BGD,9.48,9.477,9.48,9.52,9.637,9.65,9.695,9.669,9.675,9.697000000000001,9.695,9.991,9.989,9.989,10.004,9.998,9.991,9.987,9.983,9.987,9.981,9.978,9.964,10.06,10.027000000000001,10.041,10.115,10.427,10.443,10.386000000000001,10.32,9.549,9.446,9.358,9.374,9.327,9.365,9.434000000000001,9.486,9.4,9.403,9.353,9.328,9.323,9.311,9.28,9.266,9.253,9.246,9.241,9.128,9.120000000000001,9.108,9.099,9.16224,9.19421,9.18733,9.2023
BGR,5.673,5.6850000000000005,5.6930000000000005,5.772,5.793,5.8020000000000005,5.863,5.881,6.022,6.01,6.009,6.022,5.982,6.038,5.955,6.198,6.206,6.211,6.206,6.181,6.179,6.182,6.1770000000000005,6.172,6.1690000000000005,6.166,6.166,6.162,6.168,6.159,6.1610000000000005,6.154,6.121,6.159,6.164,6.164,6.203,5.6450000000000005,5.679,5.582,5.498,5.325,5.3260000000000005,5.33,5.265,5.19,5.1160000000000005,5.101,5.03,5.0520000000000005,5.088,5.123,4.995,4.977,5.0119,5.021,5.029520000000001,5.03
BHR,0.007,0.007,0.007,0.007,0.007,0.007,0.007,0.007,0.007,0.007,0.007,0.007,0.007,0.007,0.008,0.01,0.01,0.01,0.01,0.01,0.009000000000000001,0.008,0.008,0.008,0.008,0.008,0.008,0.008,0.008,0.008,0.008,0.009000000000000001,0.009000000000000001,0.009000000000000001,0.009000000000000001,0.009000000000000001,0.009000000000000001,0.009000000000000001,0.01,0.0092,0.0092,0.0092,0.0089,0.0087,0.0087,0.00855,0.008400000000000001,0.008199999999999999,0.00836,0.0086,0.0086,0.0086,0.0086,0.0086,0.0086,0.0086,0.0086,0.0086
BHS,0.01,0.01,0.01,0.01,0.01,0.01,0.01,0.01,0.01,0.01,0.01,0.01,0.01,0.01,0.01,0.011,0.011,0.011,0.011,0.011,0.011,0.011,0.011,0.011,0.012,0.012,0.012,0.012,0.012,0.012,0.012,0.012,0.012,0.012,0.012,0.012,0.012,0.012,0.012,0.013000000000000001,0.013000000000000001,0.013000000000000001,0.013000000000000001,0.013000000000000001,0.013000000000000001,0.013000000000000001,0.013000000000000001,0.013000000000000001,0.015,0.015,0.014,0.014,0.014,0.014,0.014,0.014,0.014,0.014
BIH,,,,,,,,,,,,,,,,,,,,,,,,,,,,,,,,2.2,2.19,2.18,2.1750000000000003,2.17,2.165,2.16,2.105,2.13,2.126,2.123,2.169,2.1694,2.157,2.1590000000000003,2.149,2.13,2.128,2.144,2.1510000000000002,2.156,2.161,2.157,2.176,2.209,2.228,2.211
BLR,,,,,,,,,,,,,,,,,,,,,,,,,,,,,,,,9.391,9.354000000000001,9.346,9.339,9.333,9.306000000000001,9.307,9.281,9.252,9.128,9.025,8.986,8.957,8.949,8.958,8.916,8.917,8.927,8.898,8.875,8.796,8.7264,8.632299999999999,8.5819,8.5402,8.502,8.46
BLZ,0.079,0.079,0.08,0.08,0.08,0.081,0.081,0.081,0.082,0.082,0.083,0.083,0.084,0.084,0.085,0.085,0.08600000000000001,0.093,0.094,0.096,0.097,0.097,0.097,0.097,0.101,0.10300000000000001,0.112,0.115,0.12,0.126,0.13,0.136,0.14300000000000002,0.14300000000000002,0.146,0.147,0.148,0.148,0.15,0.149,0.149,0.152,0.152,0.152,0.152,0.152,0.152,0.152,0.155,0.157,0.157,0.16,0.16,0.16,0.17,0.17,0.17200000000000001,0.17200000000000001
BMU,0.0004,0.0003,0.0003,0.0004,0.0004,0.0004,0.0004,0.0003,0.0003,0.0003,0.0003,0.0003,0.0003,0.0003,0.0003,0.0003,0.0003,0.0003,0.0003,0.0003,0.0003,0.0003,0.0003,0.0003,0.0003,0.0003,0.0003,0.0003,0.0003,0.0003,0.0003,0.0003,0.0003,0.0003,0.0004,0.0004,0.0004,0.0004,0.0004,0.0004,0.0004,0.0004,0.0004,0.0004,0.0004,0.0004,0.0004,0.0003,0.0003,0.0003,0.0003,0.0003,0.0003,0.0003,0.0003,0.0003,0.0003,0.0003
BOL,30.042,29.942,29.807000000000002,29.878,29.915,29.951,29.988,30.024,30.261,30.297,30.734,31.27,31.308,31.843,32.38,32.416000000000004,32.953,32.989,33.525,33.562,34.099000000000004,34.136,34.173,34.717,34.687,35.203,35.227000000000004,35.25,35.47,35.455,35.796,35.831,36.213,36.351,36.6,36.684,36.874,36.982,37.069,37.143,37.156,37.311,36.647,36.617,36.962,37.112,37.39,37.485,37.673,37.516,37.557,37.651,37.738,37.702,37.661,37.685,37.488,37.727000000000004
BRA,156.959,160.666,164.373,168.08,171.787,175.494,179.201,182.90800000000002,186.615,190.328,193.834,197.34,200.846,204.352,207.859,212.78,217.701,222.622,227.543,232.517208,234.41379999999998,236.31060000000002,238.2074,240.10420000000002,241.998707,240.57920000000001,239.1594,237.73960000000002,236.3198,234.9,233.48020000000002,232.0604,230.6406,229.2208,227.805,227.9087,228.01239999999999,228.11610000000002,228.2198,228.3235,228.42720000000003,228.5309,228.6346,228.73829999999998,228.842,228.951,229.6718,230.39260000000002,231.1134,231.8342,232.555,233.2758,233.9966,234.7174,235.43820000000002,236.159,236.8786,236.878801
BRB,0.019,0.019,0.019,0.019,0.019,0.019,0.019,0.019,0.019,0.019,0.019,0.019,0.019,0.019,0.019,0.019,0.019,0.019,0.019,0.019,0.019,0.019,0.019,0.019,0.019,0.019,0.019,0.019,0.019,0.019,0.019,0.019,0.019,0.019,0.019,0.019,0.019,0.019,0.018000000000000002,0.018000000000000002,0.018000000000000002,0.017,0.017,0.016,0.016,0.016,0.016,0.016,0.016,0.015,0.014,0.013000000000000001,0.0125,0.012,0.011,0.01,0.01,0.01
BRN,0.021,0.021,0.021,0.024,0.024,0.023,0.023,0.024,0.024,0.024,0.019,0.018000000000000002,0.018000000000000002,0.018000000000000002,0.018000000000000002,0.017,0.015,0.015,0.015,0.014,0.014,0.013000000000000001,0.013000000000000001,0.012,0.012,0.012,0.012,0.012,0.012,0.011,0.011,0.011,0.011,0.011,0.01,0.01,0.01,0.01,0.01,0.01,0.011,0.011,0.011,0.011,0.011,0.0103,0.0114,0.0114,0.0134,0.0134,0.0134,0.0134,0.014400000000000001,0.014400000000000001,0.014400000000000001,0.014400000000000001,0.014400000000000001,0.014400000000000001
BTN,0.361,0.363,0.363,0.365,0.366,0.368,0.368,0.37,0.37,0.382,0.382,0.385,0.385,0.392,0.392,0.398,0.4,0.4,0.405,0.41300000000000003,0.41300000000000003,0.418,0.43,0.444,0.444,0.444,0.465,0.46,0.452,0.454,0.504,0.504,0.505,0.509,0.5650000000000001,0.5700000000000001,0.5720000000000001,0.5720000000000001,0.5720000000000001,0.53,0.535,0.535,0.537,0.584,0.593,0.577,0.5630000000000001,0.5213,0.52,0.52,0.5196000000000001,0.5196000000000001,0.5196000000000001,0.5256000000000001,0.5256000000000001,0.519,0.513,0.513
BWA,26.0,26.0,26.0,26.0,26.001,26.001,26.001,26.001,26.001,26.001,26.001,26.002,26.002,26.002,26.002,26.002,26.002,26.002,26.004,26.004,26.004,26.006,26.006,26.006,26.008,26.008,26.01,26.01,26.015,26.021,25.901,25.851,25.951,25.996000000000002,25.946,25.946,25.901,25.831,25.841,25.951,25.801000000000002,25.846,25.796,25.827,25.8415,25.803,25.784,25.881,25.918,25.861,25.926000000000002,25.887,25.882,26.004,25.8616,25.8616,25.8616,25.8616
CAF,4.738,4.748,4.756,4.7700000000000005,4.78,4.79,4.8,4.8100000000000005,4.82,4.83,4.84,4.8500000000000005,4.86,4.87,4.89,4.9,4.91,4.92,4.93,4.945,4.945,4.96,4.97,4.982,4.9830000000000005,5.0040000000000004,5.005,5.006,5.006,5.006,5.008,5.0200000000000005,5.0200000000000005,5.0200000000000005,5.01,5.022,5.123,5.149,5.149,5.149,5.149,5.149,5.195,5.215,5.215,5.21,5.21,5.21,5.23,5.08,5.08,5.08,5.08,5.08,5.08,5.08,5.08,5.08
CAN,61.843,62.28,62.717,63.154,63.591,63.701,63.566,63.431000000000004,63.296,63.161,63.023,63.050000000000004,63.077,63.104,63.131,63.158989999999996,62.785000000000004,62.410000000000004,62.035000000000004,61.660000000000004,61.29,61.212,61.134,61.056000000000004,60.978,60.898892000000004,61.025,61.151,61.277,61.403,61.5332464,61.465,61.397,61.329,61.261,61.192,61.215,61.239000000000004,61.263,61.287,61.308160799999996,62.091,61.946,61.801,61.656,60.584,60.008,59.432,58.856,58.28,57.6997,57.771,59.796,59.736000000000004,59.677,59.611000000000004,59.585,59.76
CHE,1.7363,1.7334,1.7192,1.7104000000000001,1.7016,1.6957,1.6888,1.6861,1.6874000000000002,1.6739000000000002,1.6654000000000002,1.6628,1.6537000000000002,1.6475,1.6438,1.6425999999999998,1.6414000000000002,1.6449,1.6587,1.6539000000000001,1.649,1.6441,1.6393,1.6345,1.6296,1.6248,1.62,1.6151,1.6104,1.6057000000000001,1.6009000000000002,1.5962,1.5915000000000001,1.5868,1.5820999999999998,1.5788,1.5757,1.5723,1.5691,1.566,1.5626,1.5595,1.5562,1.5532000000000001,1.55,1.5468,1.5435,1.5406,1.5375,1.5346,1.5315999999999999,1.5287000000000002,1.5516539,1.5486833999999998,1.5457187,1.5427598,1.5398066,1.5368592
CHL,13.386000000000001,13.556000000000001,13.726,13.898,14.069,14.238,14.458,14.678,14.848,15.1,15.35,15.6,15.838000000000001,16.25,16.55,17.2,17.1,17.0,16.9,16.85,16.75,16.6,16.55,16.5,16.472,16.436,16.163,16.154,16.169,15.899000000000001,15.789,15.556000000000001,15.477,15.450000000000001,15.33,15.232000000000001,15.222,15.219000000000001,15.06,15.11,15.15,15.565,15.425,15.935,15.885,15.8,15.732000000000001,15.784,15.782,15.743,15.789,15.755,15.781,15.7612,15.785,15.7418,15.757,15.693
CHN,343.248,346.00100000000003,348.854,351.706,355.509,359.112,362.71500000000003,366.313,370.928,375.51800000000003,380.165,384.781,390.38800000000003,397.029,401.637,407.5333333,413.4286667,419.396,423.9605,428.519,433.818,443.418,453.831,465.438,477.244,483.353,488.661,494.279,500.38800000000003,506.592,512.271,515.198,519.106,523.713,523.714,523.7520000000001,523.74425,523.7385,523.73475,523.731,524.3228444,524.9146889,525.5055333,526.0913778,526.6822222,527.2720667,527.8619111,528.4517556000001,529.0386,528.9168000000001,528.8851,528.7995,528.8015,528.695,528.6334,528.5529,528.5311,528.5287
CIV,15.68,15.88,15.88,15.98,16.080000000000002,16.080000000000002,16.15,16.15,16.2,16.2,16.3,16.31,16.44,16.625,16.715,16.84,17.080000000000002,17.21,17.225,17.255,17.37,17.490000000000002,17.584,17.901,18.18,18.28,18.400000000000002,18.72,18.82,18.93,18.95,19.2,19.502,19.7,19.8,19.8,19.7,19.7,19.6,19.6,19.6,19.6,19.6,20.0,20.2,20.3,20.6,20.6,20.6,20.6,20.6,20.7,21.2,21.2,21.2,21.2,21.2,21.2
CMR,7.51,7.57,7.62,7.68,7.74,7.8,7.87,7.92,7.97,7.978,8.028,8.095,8.16,8.28,8.395,8.51,8.644,8.671,8.912,8.93,8.96,9.01,9.06,9.11,9.16,9.23,9.21,9.21,9.19,9.17,9.15,9.16,9.16,9.16,9.16,9.16,9.16,9.16,9.16,9.16,9.16,9.16,9.16,9.21,9.213000000000001,9.213000000000001,9.213000000000001,9.263,9.313,9.700000000000001,9.75,9.75,9.75,9.75,9.75,9.75,9.75,9.75
COD,25.05,25.07,25.1,25.13,25.150000000000002,25.17,25.2,25.25,25.3,25.35,25.400000000000002,25.45,25.5,25.55,25.55,25.6,25.63,25.650000000000002,25.650000000000002,25.7,25.75,25.77,25.8,25.85,25.900000000000002,25.95,25.95,25.95,25.95,25.96,25.98,26.0,26.0,26.0,25.8,25.8,25.7,25.7,25.6,25.6,25.55,25.55,25.55,25.55,25.55,25.586000000000002,25.650000000000002,25.7,25.745,26.0,26.2,30.776,31.400000000000002,32.1,32.2,32.0,31.5,31.5
COG,10.540000000000001,10.540000000000001,10.542,10.543000000000001,10.543000000000001,10.543000000000001,10.543000000000001,10.543000000000001,10.544,10.548,10.548,10.55,10.554,10.558,10.562,10.568,10.565,10.52,10.522,10.525,10.528,10.554,10.558,10.562,10.568,10.565,10.540000000000001,10.542,10.544,10.521,10.523,10.525,10.53,10.518,10.52,10.522,10.536,10.538,10.544,10.540000000000001,10.540000000000001,10.540000000000001,10.540000000000001,10.545,10.547,10.55,10.55,10.55,10.563,10.576,10.596,10.602,10.627,10.627,10.627,10.627,10.628,10.628
COK,0.006,0.006,0.006,0.006,0.006,0.006,0.006,0.006,0.006,0.006,0.006,0.006,0.006,0.006,0.006,0.006,0.006,0.006,0.006,0.006,0.006,0.006,0.006,0.006,0.006,0.006,0.006,0.006,0.006,0.006,0.006,0.005,0.005,0.005,0.005,0.005,0.005,0.005,0.005,0.0048,0.004690000000000001,0.0035800000000000003,0.0033,0.00302,0.0027400000000000002,0.00246,0.00218,0.0019,0.0016200000000000001,0.00134,0.0010500000000000002,0.0015,0.0015,0.0015,0.0015,0.0015,0.0015,0.0015
COL,39.97,40.972,41.493,41.995,43.008,43.02,43.023,43.025,43.03,43.03,45.054,45.068,45.084,45.099000000000004,45.115,45.13,45.315,45.261,45.277,45.292,45.308,45.323,45.339,45.356,45.375,45.395,45.401,45.283,45.183,45.083,44.884,44.983000000000004,44.903,44.865,44.513,44.92,45.082,45.543,45.668,44.859,41.745,41.607,42.051,42.391,42.557,42.174,42.436,42.614000000000004,42.54,42.503,41.721000000000004,42.617599999999996,44.815599999999996,44.7847,44.7539,44.723,49.499,49.492000000000004
COM,0.095,0.095,0.095,0.095,0.095,0.095,0.095,0.095,0.095,0.095,0.095,0.095,0.095,0.095,0.095,0.095,0.095,0.1,0.1,0.1,0.1,0.1,0.1,0.11,0.11,0.11,0.113,0.114,0.114,0.114,0.114,0.115,0.115,0.12,0.122,0.124,0.126,0.13,0.132,0.133,0.135,0.135,0.135,0.135,0.133,0.133,0.133,0.133,0.133,0.133,0.133,0.133,0.133,0.133,0.133,0.132,0.131,0.131
CPV,0.065,0.065,0.065,0.065,0.065,0.065,0.065,0.065,0.065,0.065,0.065,0.065,0.065,0.065,0.065,0.065,0.065,0.065,0.065,0.065,0.065,0.065,0.065,0.065,0.065,0.065,0.065,0.067,0.067,0.068,0.068,0.069,0.069,0.069,0.07,0.07,0.07200000000000001,0.07200000000000001,0.07100000000000001,0.07100000000000001,0.073,0.074,0.074,0.075,0.075,0.076,0.076,0.078,0.078,0.078,0.078,0.084,0.084,0.079,0.079,0.079,0.079,0.079
CRI,1.395,1.41,1.42,1.485,1.555,1.635,1.6360000000000001,1.716,1.79,1.856,1.887,1.887,2.048,2.048,2.122,2.205,2.287,2.36,2.443,2.516,2.599,2.6790000000000003,2.682,2.748,2.681,2.612,2.539,2.463,2.378,2.1986,2.203618,2.16,2.113,2.095,2.048,1.995,1.953,1.915,1.8880000000000001,1.84,1.833,1.826,1.829,1.822,1.805,1.815,1.8,1.793,1.816,1.819,1.819,1.812,1.801,1.778,1.7775,1.7775,1.7795,1.7825
CUB,3.5500000000000003,3.805,4.038,4.755,4.548,4.51,4.621,4.727,4.745,5.022,5.073,5.581,5.851,5.631,5.8100000000000005,5.997,6.038,5.948,5.862,5.937,5.938,6.083,6.179,6.142,6.222,6.4510000000000005,6.726,6.788,6.772,6.7410000000000005,6.755,6.775,6.73,6.686,6.684,6.615,6.687,6.674,6.66,6.554,6.656000000000001,6.654,6.638,6.5280000000000005,6.6370000000000005,6.63,6.62,6.567,6.513800000000001,6.4612,6.4078,6.405600000000001,6.342300000000001,6.27888,6.2403,6.2267,6.3,6.3
CYM,0.0027,0.0027,0.0027,0.0027,0.0027,0.0027,0.0027,0.0027,0.0027,0.0027,0.0027,0.0027,0.0027,0.0027,0.0027,0.0027,0.0027,0.0027,0.0027,0.0027,0.0027,0.0027,0.0027,0.0027,0.0027,0.0027,0.0027,0.0027,0.0027,0.0027,0.0027,0.0027,0.0027,0.0027,0.0027,0.0027,0.0027,0.0027,0.0027,0.0027,0.0027,0.0027,0.0027,0.0027,0.0027,0.0027,0.0027,0.0027,0.0027,0.0027,0.0027,0.0027,0.0027,0.0027,0.0027,0.0027,0.0027,0.0027
CYP,0.404,0.402,0.405,0.403,0.402,0.4,0.401,0.401,0.399,0.398,0.396,0.394,0.3942,0.28700000000000003,0.18030000000000002,0.1779,0.1761,0.1743,0.17250000000000001,0.1715,0.1759,0.182,0.183,0.182,0.16280000000000003,0.16319999999999998,0.16240000000000002,0.16140000000000002,0.16140000000000002,0.1606,0.15919999999999998,0.1596,0.15869999999999998,0.1434,0.1431,0.1432,0.1422,0.1442,0.1442,0.14150000000000001,0.14,0.14,0.154,0.156,0.167,0.157,0.1472,0.1156,0.1276,0.1145,0.1163,0.1169,0.10923000000000001,0.10937999999999999,0.12718000000000002,0.10969,0.12176519999999999,0.13134700000000002
CZE,,,,,,,,,,,,,,,,,,,,,,,,,,,,,,,,,4.282,4.284,4.28,4.28,4.28,4.284,4.282,4.28,4.2780000000000005,4.272,4.269,4.265,4.26,4.2540000000000004,4.249,4.244,4.239,4.234,4.229,4.225,3.521,3.516,3.494,3.488,3.521,3.523
DEU,19.375,19.393,19.402,19.458000000000002,19.534,19.531,19.412,19.285,19.254,19.023,18.952,18.949,18.897000000000002,18.821,18.792,18.758,18.709,18.659,18.594,18.519000000000002,18.461000000000002,18.396,18.330000000000002,18.284,18.244,18.208000000000002,18.125,18.097,18.056,18.032,17.136,16.951,17.162,17.308,17.343,17.337,17.327,17.373,17.152,17.068,17.034,16.967,17.001,17.013,17.031,16.946,16.95,16.921,16.886,16.7,16.719,16.664,16.697,18.333000000000002,18.424,18.342,18.097,18.295
DJI,1.301,1.301,1.301,1.301,1.301,1.301,1.301,1.301,1.301,1.301,1.301,1.301,1.301,1.301,1.301,1.301,1.301,1.301,1.301,1.301,1.301,1.301,1.301,1.301,1.301,1.301,1.301,1.301,1.301,1.299,1.336,1.371,1.401,1.401,1.451,1.481,1.5010000000000001,1.5010000000000001,1.551,1.601,1.681,1.701,1.701,1.701,1.701,1.7013,1.7015,1.7012,1.7013,1.7016,1.702,1.702,1.702,1.702,1.702,1.702,1.702,1.702
DMA,0.017,0.018000000000000002,0.017,0.017,0.018000000000000002,0.019,0.019,0.019,0.019,0.019,0.019,0.019,0.019,0.019,0.019,0.019,0.019,0.019,0.019,0.019,0.019,0.019,0.019,0.019,0.019,0.019,0.019,0.018000000000000002,0.018000000000000002,0.018000000000000002,0.018000000000000002,0.018000000000000002,0.018000000000000002,0.018000000000000002,0.017,0.017,0.017,0.017,0.019,0.021,0.022,0.022,0.022,0.022,0.022,0.022,0.022,0.022,0.023,0.025,0.025,0.025,0.025,0.025,0.025,0.025,0.025,0.025
DNK,3.16,3.141,3.088,3.068,3.033,3.027,3.023,3.017,2.991,2.975,2.951,2.956,2.986,2.932,2.9370000000000003,2.9330000000000003,2.927,2.9210000000000003,2.92,2.9050000000000002,2.8970000000000002,2.887,2.846,2.855,2.834,2.819,2.798,2.787,2.774,2.7880000000000003,2.77,2.7560000000000002,2.739,2.691,2.726,2.716,2.688,2.672,2.644,2.6470000000000002,2.676,2.665,2.658,2.646,2.707,2.71,2.6630000000000003,2.668,2.634,2.626,2.69,2.624,2.628,2.652631,2.633899,2.62563,2.631289,2.632
DOM,2.19,2.205,2.22,2.235,2.25,2.265,2.2800000000000002,2.29,2.33,2.335,2.344,2.37,2.4050000000000002,2.4250000000000003,2.455,2.5100000000000002,2.54,2.565,2.59,2.62,2.625,2.63,2.63,2.63,2.63,2.637,2.637,2.637,2.641,2.5460000000000003,2.5460000000000003,2.5460000000000003,2.5460000000000003,2.5460000000000003,2.576,2.575,2.5,2.5100000000000002,2.467,2.515,2.515,2.515,2.435,2.4170000000000003,2.4170000000000003,2.4170000000000003,2.4170000000000003,2.3970000000000002,2.3970000000000002,2.3970000000000002,2.3970000000000002,2.352,2.352,2.352,2.4290000000000003,2.4290000000000003,2.4290000000000003,2.4290000000000003
DZA,45.471000000000004,44.9,44.51,44.164,44.167,44.167,44.251,44.203,44.203,44.216,45.433,45.396,44.304,44.336,43.753,44.021,43.832,43.843,43.82,43.83,39.171,39.107,39.282000000000004,39.61,39.051,38.688,38.779,38.817,38.76,38.676,38.622,38.865,38.862,39.64,39.649,39.636,39.69,39.826,39.731,40.021,40.109,39.855000000000004,39.905699999999996,41.145,41.211,41.181,41.252,41.309,41.38,41.374,41.388,41.39819000000001,41.431635,41.431,41.4564,41.3602,41.335140800000005,41.358847000000004
ECU,4.71,4.71,4.72,4.72,4.73,4.73,4.74,4.735,4.795,4.855,4.915,4.9750000000000005,5.035,5.168,5.385,5.555,5.835,6.005,6.19,6.478,6.759,6.96,7.095,7.255,7.42,7.58,7.721,7.726,7.753,7.846,7.914000000000001,7.953,7.9750000000000005,8.129,8.108,7.987,8.012,8.027000000000001,8.075,8.066,7.785,7.49,7.25,7.527,7.5,7.444,7.412,7.445,7.5344,7.4977,7.346100000000001,7.5069,7.513,5.4750000000000005,5.789,5.516,5.59,5.448
EGY,2.568,2.505,2.49,2.5060000000000002,2.672,2.7800000000000002,2.801,2.801,2.835,2.843,2.852,2.855,2.855,2.843,2.825,2.73,2.6350000000000002,2.54,2.447,2.445,2.468,2.4452399999999996,2.4347399999999997,2.45826,2.497,2.567,2.547,2.581,2.571,2.648,2.6430000000000002,2.99628,3.01518,3.01266,3.283,3.17646,3.24492,3.25962,3.483,3.291,3.338,3.424,3.4090000000000003,3.478,3.523,3.533,3.5380000000000003,3.5420000000000003,3.689,3.6710000000000003,3.62,3.696,3.7309699999999997,3.71519,3.7898771000000004,3.7337654000000002,3.8359688000000003,3.8359688000000003
ERI,,,,,,,,,,,,,,,,,,,,,,,,,,,,,,,,,7.4,7.406000000000001,7.407,7.338,7.36,7.4670000000000005,7.4670000000000005,7.53,7.532,7.532,7.567,7.5,7.522,7.572,7.572,7.572,7.5920000000000005,7.5920000000000005,7.5920000000000005,7.5920000000000005,7.5920000000000005,7.5920000000000005,7.5920000000000005,7.5920000000000005,7.5920000000000005,7.5920000000000005
ESP,33.230000000000004,33.232,33.137,32.753,32.694,32.156,32.382,32.159,32.527,32.119,32.684,32.568,32.28,32.078,31.921,31.516000000000002,31.59,31.478,31.355,31.238,31.206,31.191,30.791,30.628,30.712,30.61,30.601,30.578,30.701,30.472,30.371000000000002,30.279,30.033,30.183,29.719,30.139,30.059,29.958000000000002,29.778000000000002,29.766000000000002,29.52,29.419,29.153000000000002,29.071,29.164,28.613,28.004,28.142,27.97,27.545,27.014,26.942,26.7332,26.578,26.5765,26.265700000000002,26.29553,26.1833239
EST,,,,,,,,,,,,,,,,,,,,,,,,,,,,,,,,1.374,1.32,1.101,0.991,1.0050000000000001,1.0230000000000001,1.043,1.0010000000000001,0.986,0.89,0.6982,0.8287000000000001,0.7704,0.8819,0.8985,0.9146000000000001,0.9067999999999999,0.9318,0.9488,0.9460000000000001,0.9559,0.965,0.974,0.993,1.0030000000000001,1.002,1.004
ETH,,,,,,,,,,,,,,,,,,,,,,,,,,,,,,,,,30.54,30.472,30.5,30.5,30.492,30.508,30.676000000000002,30.662,30.605400000000003,30.498,31.607,33.101,33.591,34.219,35.077,34.513,34.985,35.683,36.325199999999995,36.488,36.699,36.910000000000004,37.121,37.332,37.5401,37.903
FIN,2.7657,2.7851,2.8065,2.8256,2.8415,2.8594,2.8734,2.8861,2.7655,2.7241999999999997,2.7037,2.6136999999999997,2.5821,2.6054,2.6138000000000003,2.6119000000000003,2.5976,2.5851,2.5675,2.536,2.5166999999999997,2.4877,2.4504,2.4257,2.4084000000000003,2.3934,2.408,2.3731999999999998,2.3858,2.3930000000000002,2.4248000000000003,2.4065,2.3836999999999997,2.4119,2.244,2.218,2.15,2.192,2.2014,2.218,2.222,2.236,2.246,2.253,2.2738,2.3008,2.2949,2.2964,2.2965,2.2919,2.2866,2.2851,2.2585,2.2671,2.2734,2.275,2.27,2.2720000000000002
FJI,0.227,0.227,0.228,0.228,0.223,0.223,0.221,0.219,0.221,0.221,0.221,0.23,0.23500000000000001,0.24,0.245,0.26,0.27,0.28,0.28500000000000003,0.29,0.3,0.31,0.32,0.33,0.34500000000000003,0.35000000000000003,0.365,0.38,0.395,0.41000000000000003,0.424,0.435,0.435,0.433,0.44,0.44,0.44,0.43,0.428,0.428,0.428,0.428,0.428,0.428,0.428,0.428,0.427,0.428,0.42760000000000004,0.425,0.425,0.425,0.425,0.425,0.425,0.425,0.425,0.425
FLK,1.2,1.2,1.2,1.2,1.2,1.2,1.2,1.2,1.2,1.2,1.2,1.2,1.2,1.2,1.2,1.2,1.2,1.2,1.2,1.2,1.2,1.2,1.2,1.2,1.2,1.2,1.19,1.19,1.19,1.19,1.19,1.209,1.201,1.21,1.212,1.1300000000000001,1.1303,1.1305999999999998,1.1309,1.1312,1.1315,1.1318,1.1320999999999999,1.1324,1.1335,1.1337000000000002,1.1359000000000001,1.1264,1.124,1.1095,1.1435,1.1276,1.1198,1.1145,1.1159000000000001,1.1234000000000002,1.1398,1.1416
FRA,34.539,34.44,34.354,34.109,34.001,33.846000000000004,33.629,33.178,33.173,32.495,32.623,32.515,32.46,32.442,32.357,32.021,31.91,31.961000000000002,31.834,31.722,31.687,31.646,31.565,31.508,31.442,31.395,31.353,30.830000000000002,30.740900000000003,30.5928,30.484900000000003,30.3843,30.2913,30.204900000000002,30.1502,30.0963,30.0396,29.98,29.9291,29.8074,29.7133,29.6107,29.534599999999998,29.4584,29.390400000000003,29.312700000000003,29.2061,29.1101,29.019900000000003,28.9263,28.8786,28.8448,28.7737,28.7665,28.7269,28.718021,28.697499,28.6601
FRO,0.003,0.003,0.003,0.003,0.003,0.003,0.003,0.003,0.003,0.003,0.003,0.003,0.003,0.003,0.003,0.003,0.003,0.003,0.003,0.003,0.003,0.003,0.003,0.003,0.003,0.003,0.003,0.003,0.003,0.003,0.003,0.003,0.003,0.003,0.003,0.003,0.003,0.003,0.003,0.003,0.003,0.003,0.003,0.003,0.003,0.003,0.003,0.003,0.003,0.003,0.003,0.003,0.003,0.003,0.003,0.003,0.003,0.003
FSM,0.1086,0.1066,0.11159999999999999,0.11159999999999999,0.11170000000000001,0.11170000000000001,0.1067,0.1067,0.1067,0.1047,0.1037,0.1037,0.1037,0.1027,0.1027,0.1027,0.1017,0.1017,0.10070000000000001,0.1017,0.1037,0.1037,0.1037,0.1037,0.1037,0.1037,0.1027,0.1027,0.1027,0.09466,0.1022,0.1022,0.10020000000000001,0.10020000000000001,0.10020000000000001,0.10020000000000001,0.10020000000000001,0.09620000000000001,0.09620000000000001,0.09620000000000001,0.09620000000000001,0.09620000000000001,0.09620000000000001,0.09720000000000001,0.09720000000000001,0.09720000000000001,0.09620000000000001,0.09620000000000001,0.0947,0.0947,0.0947,0.0937,0.0903,0.0903,0.0903,0.0903,0.0903,0.0903
GAB,5.195,5.21,5.2250000000000005,5.24,5.255,5.2700000000000005,5.235,5.25,5.215,5.18,5.2,5.165,5.135,5.15,5.1690000000000005,5.154,5.1770000000000005,5.199,5.15,5.152,5.152,5.152,5.152,5.152,5.152,5.152,5.152,5.152,5.152,2.00538,2.011542,2.017704,2.023866,2.030028,5.16,2.042352,2.048514,2.054676,2.0608380000000004,2.067,2.0720590000000003,2.077118,2.082177,2.087236,2.092295,2.0973539999999997,2.102413,2.1074720000000005,2.112531,2.1175900000000003,2.1294720000000003,2.1413539999999998,2.1532359999999997,2.165118,2.177,2.18888,2.2007600000000003,2.21264
GEO,,,,,,,,,,,,,,,,,,,,,,,,,,,,,,,,3.229,3.128,3.097,3.048,3.035,3.037,3.045,2.999,3.0,3.003,3.004,3.0060000000000002,2.492,2.52,2.5180000000000002,2.517,2.5140000000000002,2.498,2.46,2.4424,2.435,2.4861,2.46,2.4181,2.394,2.3848000000000003,2.3718000000000004
GHA,11.700000000000001,11.700000000000001,11.700000000000001,11.700000000000001,11.700000000000001,11.700000000000001,11.700000000000001,11.700000000000001,11.700000000000001,11.700000000000001,11.700000000000001,11.700000000000001,11.700000000000001,11.700000000000001,11.8,11.8,11.9,12.0,12.0,12.0,12.0,12.200000000000001,12.200000000000001,12.3,12.4,12.4,12.4,12.5,12.5,12.605,12.72,12.72,12.8,12.9,13.1,13.3,13.628,13.69026,13.797825000000001,13.90539,13.995958000000002,14.086526000000001,14.177094,14.267662000000001,14.35823,14.448798000000002,14.539366000000001,14.629934,14.720502000000002,14.81107,14.823568,14.836066,14.848564000000001,14.861062,14.87356,14.831760000000001,14.789959999999999,14.78274
GIN,14.620000000000001,14.619,14.595,14.571,14.548,14.524000000000001,14.5,14.476,14.452,14.429,14.405000000000001,14.381,14.357000000000001,14.334,14.32,14.296000000000001,14.272,14.248000000000001,14.245000000000001,14.221,14.197000000000001,14.173,14.159,14.136000000000001,14.122,14.098,14.074,14.081,14.057,14.141,14.049,14.055,14.052,14.048,14.024000000000001,13.917,13.8,13.715,13.540000000000001,13.489,13.540000000000001,13.74,13.845,13.93,14.121,14.13,14.18,14.24,14.25,14.3,14.3,14.4,14.5,14.5,14.5,14.5,14.5,14.5
GLP,0.058,0.058,0.057,0.06,0.06,0.062,0.061,0.061,0.061,0.063,0.063,0.063,0.061,0.055,0.059000000000000004,0.06,0.06,0.06,0.06,0.06,0.059000000000000004,0.056,0.054,0.058,0.058,0.06,0.058,0.056,0.056,0.053,0.053,0.053,0.053,0.052000000000000005,0.053,0.05,0.05,0.051000000000000004,0.05,0.049,0.048,0.047,0.046,0.045,0.044,0.044,0.0598,0.0599,0.0597,0.0589,0.0578,0.055799999999999995,0.0548,0.0529,0.052700000000000004,0.0521,0.052110000000000004,0.05158
GMB,0.524,0.525,0.526,0.527,0.528,0.529,0.531,0.531,0.533,0.534,0.537,0.542,0.547,0.5740000000000001,0.5680000000000001,0.5670000000000001,0.5740000000000001,0.581,0.5700000000000001,0.5630000000000001,0.585,0.606,0.587,0.5730000000000001,0.5730000000000001,0.582,0.589,0.604,0.586,0.586,0.592,0.558,0.557,0.557,0.557,0.557,0.557,0.552,0.552,0.552,0.54,0.517,0.507,0.515,0.527,0.495,0.495,0.552,0.603,0.615,0.615,0.605,0.605,0.605,0.605,0.605,0.605,0.605
GNB,1.358,1.358,1.358,1.358,1.358,1.358,1.368,1.368,1.368,1.368,1.368,1.368,1.373,1.3780000000000001,1.3780000000000001,1.3780000000000001,1.379,1.379,1.3800000000000001,1.383,1.3900000000000001,1.403,1.413,1.44,1.448,1.415,1.41,1.4000000000000001,1.437,1.447,1.447,1.447,1.467,0.61245,0.620895,0.62934,0.6377849999999999,0.6462300000000001,0.654675,0.66312,0.6715650000000001,0.68001,0.688455,0.6969,0.705345,0.7137899999999999,0.7222350000000001,0.73068,0.739125,0.7475700000000001,0.7560140000000001,0.764458,0.7729020000000001,0.781346,0.78979,0.79823,0.80667,0.81511
GNQ,0.314,0.319,0.324,0.325,0.325,0.329,0.329,0.329,0.329,0.329,0.334,0.334,0.334,0.334,0.334,0.334,0.334,0.334,0.334,0.334,0.334,0.334,0.334,0.334,0.334,0.334,0.334,0.334,0.334,0.334,0.334,0.334,0.334,0.334,0.334,0.334,0.334,0.334,0.334,0.334,0.334,0.324,0.324,0.22284800000000002,0.23120500000000002,0.23956200000000002,0.24791900000000003,0.256276,0.264633,0.27299,0.28134800000000004,0.28400000000000003,0.28400000000000003,0.28400000000000003,0.28400000000000003,0.28400000000000003,0.28400000000000003,0.28400000000000003
GRC,8.91,8.902000000000001,9.021,8.991,8.678,9.09,9.113,9.143,9.144,9.155,9.155,9.16,9.143,9.141,9.118,9.115,9.112,9.175,9.181000000000001,9.18,9.206,9.206,9.182,9.209,9.184000000000001,9.18,9.177,9.179,9.215,9.222,9.164,9.167,9.16,9.17,9.164,9.172,8.985,8.782,8.67,8.529,8.438,8.343,8.252,8.08,8.005,7.863,7.753,7.657,7.5600000000000005,7.489,7.396,7.283,7.159,6.207,6.205,6.142,6.1080000000000005,6.1096
GRD,0.022,0.022,0.022,0.022,0.022,0.022,0.022,0.022,0.022,0.022,0.022,0.02,0.02,0.02,0.02,0.02,0.02,0.019,0.019,0.016,0.016,0.016,0.016,0.016,0.014,0.014,0.013000000000000001,0.013000000000000001,0.013000000000000001,0.013000000000000001,0.012,0.012,0.012,0.012,0.011,0.011,0.011,0.011,0.012,0.012,0.013000000000000001,0.013000000000000001,0.012,0.012,0.007,0.007,0.007,0.007,0.008,0.008,0.008,0.008,0.008,0.008,0.008,0.008,0.008,0.008
GRL,0.23500000000000001,0.23500000000000001,0.23500000000000001,0.23500000000000001,0.23500000000000001,0.23500000000000001,0.23500000000000001,0.23500000000000001,0.23500000000000001,0.23500000000000001,0.23500000000000001,0.23500000000000001,0.23500000000000001,0.23500000000000001,0.23500000000000001,0.23500000000000001,0.23500000000000001,0.23500000000000001,0.23500000000000001,0.23500000000000001,0.23500000000000001,0.23500000000000001,0.23500000000000001,0.23500000000000001,0.2353,0.2356,0.2359,0.2362,0.23650000000000002,0.2368,0.2371,0.2374,0.2377,0.23800000000000002,0.2383,0.2386,0.2389,0.2392,0.23950000000000002,0.2398,0.2401,0.2404,0.2407,0.241,0.24130000000000001,0.2416,0.2419,0.2422,0.2425,0.24280000000000002,0.2431,0.2434,0.24307,0.24308000000000002,0.2431,0.24311000000000002,0.24311000000000002,0.24311000000000002
GTM,2.646,2.658,2.67,2.682,2.694,2.706,2.728,2.74,2.742,2.755,2.767,2.8000000000000003,2.843,2.875,2.888,2.93,2.993,3.005,3.016,3.0500000000000003,3.067,3.104,3.119,3.785,3.785,3.785,3.785,4.285,4.285,4.285,4.285,4.285,4.482,4.5120000000000005,4.5120000000000005,4.5120000000000005,4.522,4.43,4.44,4.465,4.495,4.525,5.064,4.8,4.562,4.3,4.414,4.138,4.04354,3.96208,3.89062,3.80916,3.7207,3.7938,3.856,3.856,3.856,3.856
GUM,0.016,0.016,0.017,0.017,0.017,0.017,0.017,0.017,0.017,0.017,0.017,0.017,0.017,0.017,0.017,0.017,0.017,0.017,0.018000000000000002,0.018000000000000002,0.02,0.02,0.02,0.02,0.02,0.02,0.02,0.02,0.02,0.02,0.02,0.02,0.02,0.02,0.02,0.02,0.02,0.02,0.02,0.02,0.02,0.02,0.02,0.02,0.02,0.02,0.019,0.019,0.018000000000000002,0.018000000000000002,0.018000000000000002,0.018000000000000002,0.018000000000000002,0.018000000000000002,0.018000000000000002,0.018000000000000002,0.018000000000000002,0.018000000000000002
GUY,1.359,1.359,1.359,1.359,1.359,1.364,1.364,1.366,1.366,1.371,1.371,1.374,1.3760000000000001,1.3760000000000001,1.3780000000000001,1.458,1.542,1.6260000000000001,1.715,1.715,1.715,1.715,1.725,1.728,1.728,1.73,1.73,1.73,1.732,1.0828499999999999,1.086643,1.090436,1.0942290000000001,1.098022,1.101815,1.105608,1.109401,1.113194,1.1169870000000002,1.1207799999999999,1.125221,1.1296620000000002,1.134103,1.1385440000000002,1.142985,1.147426,1.151867,1.1563080000000001,1.160749,1.1651900000000002,1.1768800000000001,1.18857,1.20026,1.21195,1.22364,1.23284,1.2420499999999999,1.25125
HKG,0.014,0.014,0.014,0.013000000000000001,0.013000000000000001,0.013000000000000001,0.013000000000000001,0.013000000000000001,0.013000000000000001,0.013000000000000001,0.012,0.012,0.012,0.012,0.01,0.01,0.009000000000000001,0.008,0.008,0.008,0.009000000000000001,0.009000000000000001,0.009000000000000001,0.009000000000000001,0.009000000000000001,0.009000000000000001,0.009000000000000001,0.009000000000000001,0.008,0.008,0.008,0.008,0.008,0.008,0.008,0.008,0.007,0.007,0.007,0.007,0.007,0.007,0.007,0.007,0.007,0.006,0.006,0.006,0.006,0.0055,0.0055,0.0050999999999999995,0.0050999999999999995,0.0050999999999999995,0.0050999999999999995,0.005,0.0050999999999999995,0.005
HND,2.98,2.99,2.995,3.0,3.005,3.015,3.025,3.0300000000000002,3.0300000000000002,3.04,3.045,3.08,3.09,3.096,3.1350000000000002,3.17,3.245,3.257,3.257,3.257,3.2640000000000002,3.269,3.27,3.277,3.278,3.285,3.285,3.285,3.371,3.3200000000000003,3.342,3.355,3.548,3.52,3.48,3.48,3.395,3.395,3.337,2.935,2.936,3.028,3.153,3.14,3.15,3.16,3.16,3.184,3.198,3.2600000000000002,3.29,3.3200000000000003,3.3200000000000003,3.3200000000000003,3.3200000000000003,3.3200000000000003,3.35,3.356
HRV,,,,,,,,,,,,,,,,,,,,,,,,,,,,,,,,2.404,2.2720000000000002,2.312,2.332,1.935,1.941,2.048,2.032,1.169,1.178,1.181,1.196,1.176,1.211,1.23,1.202,1.2891,1.2995999999999999,1.3337999999999999,1.3260999999999998,1.331,1.5673,1.688,1.688,1.688,1.688,1.688
HTI,1.6600000000000001,1.665,1.67,1.675,1.68,1.685,1.69,1.695,1.7,1.705,1.71,1.584,1.583,1.583,1.583,1.585,1.585,1.595,1.595,1.6,1.6,1.6,1.6,1.6,1.6,1.6,1.6,1.599,1.598,1.597,1.596,1.575,1.575,1.595,1.59,1.59,1.69,1.69,1.69,1.69,1.67,1.67,1.67,1.67,1.67,1.67,1.82,1.77,1.79633,1.87,1.83,1.77,1.84,1.84,1.84,1.84,1.84,1.84
HUN,7.083,7.0120000000000005,6.984,6.979,6.953,6.9270000000000005,6.914,6.9030000000000005,6.888,6.875,6.855,6.846,6.835,6.782,6.7700000000000005,6.757000000000001,6.729,6.698,6.651,6.627,6.601,6.582,6.571,6.554,6.539,6.523000000000001,6.511,6.497,6.484,6.474,6.46,6.136,6.13,6.122,6.179,6.184,6.195,6.1930000000000005,6.186,5.854,5.865,5.849,5.865,5.864,5.863,5.809,5.807,5.79,5.783,5.343,5.337,5.338,5.591,5.565,5.582,5.5600000000000005,5.564,5.585
IDN,38.6,38.6,38.550000000000004,38.550000000000004,38.5,38.45,38.45,38.45,38.4,38.4,38.35,38.35,38.300000000000004,38.300000000000004,38.256,38.046,38.046,38.046,38.0,38.0,37.95,37.95,37.9,37.052,39.679,41.292,43.485,44.137,44.435,45.083,41.524,41.351,42.016,41.971000000000004,42.978,42.968,43.527,43.877,45.877,47.177,47.7,48.181000000000004,51.006,53.366,51.846000000000004,51.5,53.0,54.0,55.6,55.6,56.5,56.5,57.0,57.0,57.300000000000004,60.2,62.300000000000004,62.300000000000004
IMN,0.0325,0.0325,0.032200000000000006,0.0318,0.032,0.031,0.031100000000000003,0.0312,0.0316,0.0316,0.0316,0.032,0.0324,0.032799999999999996,0.0332,0.0337,0.034100000000000005,0.0345,0.0349,0.0354,0.0358,0.0363,0.0366,0.037,0.0374,0.037899999999999996,0.0383,0.038700000000000005,0.0391,0.0396,0.04,0.0404,0.040799999999999996,0.041299999999999996,0.0417,0.042100000000000005,0.0425,0.043000000000000003,0.0434,0.0438,0.0442,0.0454,0.045770000000000005,0.0458,0.04611,0.04236,0.04212,0.04428,0.04342,0.04338,0.04261,0.0384,0.0388,0.0389,0.0404,0.040600000000000004,0.0391,0.040299999999999996
IND,174.952,176.482,176.154,176.71200000000002,177.177,177.53,177.80700000000002,178.364,177.792,178.052,177.817,177.946,178.751,179.282,179.69400000000002,179.649,179.591,180.592,180.58,180.272,180.401,180.77100000000002,180.46200000000002,181.452,181.34,181.192,181.543,181.091,181.501,181.413,181.586,181.305,181.382,181.291,180.945,180.589,180.981,180.874,181.02100000000002,180.975,180.487,180.56,180.249,180.375,180.126,179.906,179.62,179.757,180.068,179.573,179.67000000000002,179.642,179.698,179.721,179.674,179.674,179.674,179.674
IRL,5.64,5.647,5.671,5.666,5.662,5.635,5.654,5.674,5.691,5.667,5.672,5.682,5.682,5.692,5.715,5.7170000000000005,5.722,5.727,5.722,5.727,5.732,5.727,5.704,5.696,5.705,5.694,5.6690000000000005,5.663,5.655,5.649,4.442,4.413,4.404,4.39,4.389,4.341,4.431,4.416,4.418,4.412,4.41,4.373,4.37,4.305,4.3020000000000005,4.26,4.276,4.6290000000000004,4.59392,4.5680000000000005,4.555,4.533,4.477,4.466,4.43,4.461,4.489,4.516
IRN,59.271,59.29,59.35,59.410000000000004,59.47,59.480000000000004,59.550000000000004,59.6,59.67,59.7,60.154,60.800000000000004,61.481,60.96,60.44,59.95,59.693,58.867000000000004,59.908,57.713,58.28,58.867000000000004,59.21,59.54,60.370000000000005,60.7,61.03,61.871,61.7,61.5,62.997,63.787,64.152,64.157,64.208,64.427,63.832,64.787,63.687000000000005,62.884,63.823,64.044,64.265,64.486,47.631,47.852000000000004,48.073,46.685,46.6862,46.5394,46.3926,46.2458,45.954,45.954,45.954,45.954,45.954,45.954
IRQ,8.8,8.855,8.91,8.865,8.92,8.925,8.98,8.985,8.99,8.993,8.999,9.16,9.17,9.28,9.285,9.285,9.285,9.389,9.439,9.439,9.439,9.450000000000001,9.450000000000001,9.450000000000001,9.465,9.48,9.48,9.53,9.23,9.23,9.63,9.55,9.870000000000001,9.35,9.1,9.1,8.66,8.9,8.75,8.3,8.49,8.84,8.69,8.69,9.39,8.99,9.14,8.19,7.8500000000000005,8.22,8.55,8.5685,8.86375,9.269,9.25,9.25,9.25,9.25
ISL,2.12,2.12,2.12,2.12,2.12,2.12,2.12,2.12,2.12,2.001,1.991,1.981,1.971,1.96,1.95,1.94,1.931,1.921,1.911,1.9000000000000001,1.9000000000000001,1.9000000000000001,1.9000000000000001,1.9000000000000001,1.9000000000000001,1.9000000000000001,1.9000000000000001,1.9000000000000001,1.9000000000000001,1.901,1.901,1.901,1.9000000000000001,1.9000000000000001,1.899,1.897,1.895,1.891,1.889,1.889,1.889,1.887,1.885,1.8840000000000001,1.8820000000000001,1.881,1.8760000000000001,1.8760000000000001,1.875,1.874,1.8732,1.8722,1.8722,1.8722,1.872,1.872,1.872,1.872
ISR,0.511,0.505,0.522,0.525,0.514,0.525,0.525,0.521,0.523,0.525,0.527,0.527,0.537,0.545,0.54,0.53,0.531,0.533,0.533,0.533,0.538,0.54,0.553,0.5640000000000001,0.5750000000000001,0.579,0.577,0.5760000000000001,0.5750000000000001,0.579,0.578,0.577,0.577,0.579,0.5730000000000001,0.5640000000000001,0.5630000000000001,0.562,0.559,0.5660000000000001,0.561,0.5630000000000001,0.551,0.5135,0.5145,0.5088,0.5181,0.5156000000000001,0.5226000000000001,0.5045000000000001,0.517,0.5262,0.5203,0.5377000000000001,0.5339,0.532,0.623,0.6233
ITA,20.683,20.652,20.51,20.462,20.44,20.405,20.379,20.355,20.227,20.18,17.649,17.508,17.482,17.502,17.517,17.529,17.501,17.589,17.608,17.562,17.551000000000002,17.536,17.26,17.244,17.095,17.042,17.012,16.839,16.85,16.84,16.054000000000002,15.978,15.91,15.702,15.333,15.349,15.345,15.484,15.799,15.637,15.502,15.273,14.907,14.883000000000001,14.736,14.203000000000001,14.162,14.4572,13.9824,14.3278,13.8526,13.729000000000001,13.63,13.162,12.945,12.812,12.82657,12.451
JAM,0.533,0.535,0.535,0.533,0.507,0.517,0.517,0.517,0.517,0.507,0.507,0.507,0.507,0.507,0.507,0.507,0.507,0.507,0.497,0.497,0.497,0.487,0.47700000000000004,0.47700000000000004,0.47700000000000004,0.47700000000000004,0.47700000000000004,0.47700000000000004,0.47700000000000004,0.47600000000000003,0.47600000000000003,0.47600000000000003,0.503,0.5,0.497,0.494,0.489,0.484,0.482,0.47900000000000004,0.47900000000000004,0.47400000000000003,0.47400000000000003,0.47200000000000003,0.467,0.467,0.464,0.449,0.449,0.444,0.444,0.444,0.444,0.444,0.444,0.444,0.444,0.444
JOR,1.084,1.086,1.087,1.091,1.092,1.094,1.097,1.099,1.1,1.104,1.105,1.109,1.11,1.114,1.115,1.117,1.118,1.122,1.125,1.127,1.1176,1.1240999999999999,1.1380000000000001,1.0501,1.1178,1.1258,1.156,1.165,1.1498,1.0402,1.0104,1.1207,1.09,1.072,1.114,1.051,1.061,1.066,1.067,1.069,1.022,1.025,1.0050000000000001,1.037,1.0130000000000001,1.018,0.9632999999999999,0.9725,1.025,1.0023,1.0026,1.0449000000000002,1.0566,1.064,1.0563,1.06596,1.0070000000000001,1.0218
JPN,7.11,7.12,7.0200000000000005,7.03,7.0040000000000004,6.896,6.838,6.797,6.652,6.696,6.541,6.484,6.447,6.415,6.273,6.236,6.215,6.194,6.174,6.061,6.042,6.026,6.011,5.996,5.8790000000000004,5.8580000000000005,5.84,5.817,5.729,5.6930000000000005,5.654,5.615,5.574,5.533,5.4430000000000005,5.399,5.354,5.3100000000000005,5.271,5.258,4.793,4.763,4.736,4.714,4.692,4.671,4.65,4.628,4.609,4.593,4.561,4.549,4.538,4.518,4.496,4.471,4.444,4.42
KAZ,,,,,,,,,,,,,,,,,,,,,,,,,,,,,,,,221.463,221.747,221.651,217.1865,215.4736,215.6918,215.3298,215.0753,215.39329999999998,214.4856,213.4689,213.0014,212.6705,212.286,211.8765,211.43560000000002,210.8514,210.7833,217.1618,216.98850000000002,217.0121,216.9941,216.7994,216.2597,216.24210000000002,216.2138,216.03650000000002
KEN,25.2,25.205000000000002,25.21,25.215,25.22,25.225,25.23,25.235,25.240000000000002,25.245,25.25,25.255,25.26,25.265,25.572,25.578,25.580000000000002,25.580000000000002,25.580000000000002,25.580000000000002,25.580000000000002,25.580000000000002,25.580000000000002,25.505,26.354,26.373,26.435000000000002,26.662,27.053,26.77,26.877,27.072,26.84,27.232,27.218,26.451,26.594,26.458000000000002,26.876,26.671,26.839000000000002,26.818,26.874000000000002,26.992,27.002,27.054000000000002,27.07,27.085,27.285,27.32,27.63,27.73,27.63,27.63,27.63,27.63,27.63,27.63
KGZ,,,,,,,,,,,,,,,,,,,,,,,,,,,,,,,,10.088000000000001,10.120000000000001,10.373,10.439,10.641,10.661,10.69,10.726,10.714,10.776,10.776,10.84,10.77,10.745000000000001,10.731100000000001,10.7286,10.727200000000002,10.6173,10.6119,10.6085,10.5913,10.556700000000001,10.5571,10.5562,10.5411,10.5401,10.5413
KHM,3.5180000000000002,3.533,3.5420000000000003,3.595,3.6270000000000002,3.6270000000000002,3.629,3.577,3.477,3.419,2.45,2.45,2.45,2.5,2.5,2.5500000000000003,2.5500000000000003,2.6,2.6,2.65,2.65,2.68,2.69,2.691,2.99,3.29,3.7,4.15,4.4350000000000005,4.455,4.51,4.515,4.531,4.57,4.57,4.58,4.58,4.63,4.64,4.7700000000000005,4.89,5.0,5.1000000000000005,5.23,5.356,5.355,5.355,5.355,5.355,5.455,5.455,5.455,5.455,5.455,5.566,5.566,5.566,5.566
KIR,0.039,0.039,0.043000000000000003,0.043000000000000003,0.043000000000000003,0.043000000000000003,0.038,0.038,0.038,0.038,0.038,0.038,0.038,0.038,0.038,0.038,0.038,0.038,0.038,0.038,0.038,0.038,0.038,0.039,0.039,0.039,0.039,0.039,0.039,0.039,0.039,0.039,0.037,0.037,0.037,0.037,0.037,0.034,0.034,0.034,0.034,0.034,0.034,0.034,0.034,0.034,0.034,0.034,0.034,0.034,0.034,0.034,0.034,0.034,0.034,0.034,0.034,0.034
KNA,0.02,0.02,0.02,0.02,0.02,0.02,0.02,0.02,0.018000000000000002,0.015,0.015,0.015,0.015,0.015,0.015,0.015,0.015,0.015,0.015,0.015,0.015,0.014,0.014,0.013000000000000001,0.013000000000000001,0.012,0.012,0.012,0.012,0.012,0.012,0.012,0.012,0.01,0.01,0.009000000000000001,0.009000000000000001,0.009000000000000001,0.01,0.0095,0.009300000000000001,0.0081,0.0081,0.008029999999999999,0.005,0.00501,0.00509,0.0050999999999999995,0.0055,0.0057,0.006,0.006,0.006,0.006,0.006,0.006,0.006,0.006
KOR,2.113,2.081,2.1,2.191,2.278,2.315,2.336,2.343,2.337,2.324,2.299,2.27,2.271,2.2680000000000002,2.2720000000000002,2.27,2.267,2.263,2.2520000000000002,2.247,2.245,2.243,2.236,2.229,2.22,2.217,2.219,2.214,2.197,2.179,2.161,2.136,2.118,2.096,2.048,2.008,1.983,1.969,1.954,1.973,1.945,1.919,1.9020000000000001,1.893,1.881,1.858,1.84,1.817,1.795,1.7730000000000001,1.7561,1.788,1.7687000000000002,1.7483,1.736,1.7008,1.6767,1.6520000000000001
KWT,0.135,0.135,0.135,0.135,0.135,0.135,0.135,0.135,0.135,0.135,0.135,0.135,0.135,0.135,0.135,0.135,0.135,0.135,0.135,0.135,0.136,0.136,0.136,0.137,0.137,0.138,0.138,0.14100000000000001,0.14100000000000001,0.14100000000000001,0.14100000000000001,0.14100000000000001,0.14200000000000002,0.14200000000000002,0.14200000000000002,0.14300000000000002,0.14300000000000002,0.14300000000000002,0.14400000000000002,0.148,0.151,0.151,0.151,0.15,0.15,0.15,0.151,0.151,0.1515,0.152,0.1525,0.152,0.1536,0.15209999999999999,0.1494,0.15,0.1514,0.15
LAO,1.55,1.55,1.5,1.45,1.45,1.46,1.46,1.47,1.472,1.477,1.482,1.512,1.532,1.555,1.568,1.58,1.59,1.598,1.605,1.606,1.609,1.617,1.62,1.6300000000000001,1.635,1.6380000000000001,1.6400000000000001,1.6500000000000001,1.6520000000000001,1.6600000000000001,1.6620000000000001,1.6640000000000001,1.665,1.69,1.7,1.7,1.756,1.7650000000000001,1.7730000000000001,1.806,1.841,1.8760000000000001,1.911,1.946,1.985,2.025,2.063,2.104,2.168,2.22,2.2765,2.299,2.335,2.44,2.494,2.494,2.444,2.394
LBN,0.562,0.5700000000000001,0.5700000000000001,0.58,0.596,0.596,0.606,0.616,0.62,0.625,0.63,0.635,0.645,0.64,0.635,0.63,0.625,0.619,0.613,0.601,0.598,0.598,0.598,0.598,0.599,0.6,0.604,0.604,0.604,0.605,0.606,0.606,0.606,0.607,0.609,0.618,0.622,0.626,0.5825,0.595,0.598,0.616,0.627,0.6383,0.653,0.679,0.6771,0.663,0.663,0.64,0.651,0.658,0.658,0.658,0.658,0.658,0.658,0.658
LBR,2.583,2.581,2.581,2.578,2.578,2.575,2.575,2.573,2.573,2.571,2.571,2.571,2.571,2.571,2.571,2.571,2.576,2.576,2.576,2.576,2.576,2.58,2.585,2.586,2.588,2.597,2.603,2.6,2.6,2.493,1.13702,1.16728,1.19754,1.2278,1.25806,1.28832,1.3185799999999999,1.34884,1.3791,1.40936,1.43962,1.46988,1.50014,1.5304000000000002,1.5606600000000002,1.5909200000000001,1.62118,1.65144,1.6817,1.7119600000000001,1.74222,1.77248,1.80274,1.833,1.8632600000000001,1.89352,1.92378,1.95404
LBY,11.17,11.383000000000001,11.585,11.793000000000001,11.995000000000001,12.203,12.405000000000001,12.615,12.82,13.025,13.235,13.438,13.645,13.848,14.055,14.258000000000001,14.465,14.673,14.875,15.08,15.185,15.292,15.405000000000001,15.415000000000001,15.427,15.435,15.44,15.44,15.445,15.455,15.46,15.465,15.465,15.475,15.515,15.666,15.666,15.450000000000001,15.450000000000001,15.450000000000001,15.450000000000001,15.450000000000001,15.450000000000001,15.385,15.385,15.385,15.385,15.385,15.385,15.351,15.351,15.355,15.355,15.35,15.35,15.35,15.35,15.35
LCA,0.017,0.017,0.018000000000000002,0.018000000000000002,0.018000000000000002,0.018000000000000002,0.019,0.019,0.019,0.019,0.02,0.02,0.02,0.019899999999999998,0.02,0.02,0.02,0.02,0.0202,0.0205,0.020800000000000003,0.021,0.0212,0.021500000000000002,0.0218,0.0212,0.021,0.021,0.021,0.0209,0.0198,0.0197,0.0197,0.0195,0.018000000000000002,0.0174,0.017,0.0155,0.0154,0.014199999999999999,0.013900000000000001,0.0131,0.012400000000000001,0.0111,0.0109,0.0101,0.0099,0.0101,0.0106,0.0106,0.0106,0.0106,0.0106,0.0106,0.0106,0.0106,0.0106,0.0106
LIE,0.009000000000000001,0.009000000000000001,0.009000000000000001,0.009000000000000001,0.009000000000000001,0.009000000000000001,0.009000000000000001,0.009000000000000001,0.009000000000000001,0.009000000000000001,0.009000000000000001,0.009000000000000001,0.009000000000000001,0.009000000000000001,0.009000000000000001,0.009000000000000001,0.009000000000000001,0.009000000000000001,0.009000000000000001,0.009000000000000001,0.009000000000000001,0.009000000000000001,0.009000000000000001,0.009000000000000001,0.009000000000000001,0.008,0.008,0.008,0.008,0.007,0.007,0.007,0.007,0.007,0.007,0.007,0.007,0.007,0.007,0.007,0.006900000000000001,0.006900000000000001,0.006900000000000001,0.006900000000000001,0.006900000000000001,0.0068,0.0068,0.0068,0.006500000000000001,0.0063,0.006,0.006,0.0056,0.00532,0.0051600000000000005,0.0051600000000000005,0.0051600000000000005,0.0051600000000000005
LKA,1.723,1.707,2.06,2.103,2.156,2.205,2.255,2.321,2.328,2.333,2.339,2.345,2.351,2.357,2.359,2.396,2.433,2.469,2.359,2.349,2.349,2.2960000000000003,2.308,2.311,2.315,2.326,2.334,2.337,2.34,2.339,2.342,2.344,2.32,2.323,2.326,2.327,2.328,2.329,2.345,2.35,2.351,2.356,2.37,2.31,2.5100000000000002,2.44,2.39,2.595,2.5100000000000002,2.62,2.73,2.69,2.74,2.74,2.74,2.75,2.7601999999999998,2.8116
LSO,2.581,2.576,2.576,2.578,2.578,2.583,2.583,2.533,2.478,2.427,2.364,2.359,2.359,2.359,2.376,2.359,2.2920000000000003,2.293,2.309,2.2960000000000003,2.302,2.2920000000000003,2.287,2.301,2.308,2.291,2.33,2.343,2.305,2.321,2.323,2.336,2.334,2.329,2.324,2.326,2.329,2.329,2.329,2.334,2.334,2.3040000000000003,2.3040000000000003,2.314,2.327,2.307,2.329,2.362,2.339,2.326,2.312,2.2853000000000003,2.2521,2.2763000000000004,2.223,2.356,2.418,2.4333
LTU,,,,,,,,,,,,,,,,,,,,,,,,,,,,,,,,3.3890000000000002,3.333,3.126,3.41,3.411,3.4170000000000003,3.4250000000000003,3.496,3.418,2.896,2.8850000000000002,2.541,2.6043000000000003,2.837,2.7906999999999997,2.6959,2.6721,2.689,2.7723000000000004,2.8059000000000003,2.8422,2.8914,2.9524000000000004,3.0059,2.9539,2.9353000000000002,2.947
LUX,,,,,,,,,,,,,,,,,,,,,,,,,,,,,,,,,,,,,,,,0.128,0.128,0.128,0.128,0.128,0.129,0.129,0.131,0.131,0.13069999999999998,0.13104,0.13127000000000003,0.13141999999999998,0.13088,0.13099000000000002,0.13127000000000003,0.13065100000000002,0.131158,0.131559
LVA,,,,,,,,,,,,,,,,,,,,,,,,,,,,,,,,2.5300000000000002,2.5140000000000002,2.54,1.832,1.874,1.772,1.749,1.617,1.588,1.581,1.595,1.582,1.6420000000000001,1.734,1.855,1.839,1.825,1.833,1.805,1.816,1.841,1.877,1.872,1.8845,1.931,1.933,1.938
MAR,23.37,23.580000000000002,23.85,24.11,24.42,24.738,24.938,25.238,25.429000000000002,25.705000000000002,26.812,26.17,26.425,26.63,26.917,27.150000000000002,27.5,27.918,28.004,28.93,29.09,29.177,29.273,29.384,29.398,29.497,29.666,29.744,30.064,30.343,30.355,30.616,30.711000000000002,30.964000000000002,30.749000000000002,30.966,30.895,30.976,30.693,30.652,30.37,30.283,30.876,30.041,29.989,29.946,29.96,29.981,30.002599999999997,29.9883,30.1038,30.403000000000002,30.585,30.0825,30.047,30.1,30.069,30.069
MDA,,,,,,,,,,,,,,,,,,,,,,,,,,,,,,,,2.56,2.557,2.557,2.556,2.556,2.556,2.556,2.557,2.544,2.539,2.5340000000000003,2.528,2.5220000000000002,2.499,2.483,2.485,2.481,2.472,2.465,2.462,2.46,2.461,2.333,2.336,2.3359,2.3353,2.2765999999999997
MDG,35.145,35.17,35.195,35.22,35.245,35.27,35.295,35.32,35.35,35.37,35.39,35.42,35.44,35.475,35.759,35.764,35.929,36.0,36.02,36.04,36.075,36.1,36.135,36.160000000000004,36.195,36.22,36.24,36.27,36.295,36.325,36.35,36.37,36.49,36.480000000000004,36.480000000000004,36.596000000000004,37.49,38.49,39.5,40.5,40.843,40.843,40.843,40.843,40.893,40.893,40.893,40.895,40.895,40.895,40.895,40.895,40.895,40.895,40.895,40.895,40.895,40.895
MDV,0.005,0.005,0.005,0.005,0.005,0.005,0.005,0.005,0.005,0.005,0.006,0.006,0.007,0.007,0.007,0.007,0.007,0.007,0.007,0.007,0.007,0.008,0.008,0.008,0.008,0.008,0.008,0.008,0.008,0.008,0.008,0.008,0.008,0.008,0.008,0.008,0.008,0.008,0.008,0.009000000000000001,0.01,0.012,0.012,0.011,0.009000000000000001,0.008,0.008,0.008,0.008,0.0079,0.0079,0.0079,0.0079,0.0079,0.0079,0.0079,0.0079,0.0079
MEX,98.316,98.179,98.10900000000001,98.049,97.979,97.914,97.839,97.769,97.709,97.635,96.938,97.15,97.4,97.551,97.551,97.551,97.601,98.19800000000001,97.998,98.18,98.21000000000001,98.315,101.02,101.031,101.435,101.441,102.55,103.051,104.05,105.151,106.154,106.177,106.18,106.19,106.19500000000001,106.31,106.31,106.325,106.32600000000001,106.33,106.55,106.55,106.55,106.57000000000001,106.57000000000001,106.57000000000001,106.7,103.808,103.367,102.84400000000001,103.07300000000001,102.138,101.586,101.423,103.263,104.992,106.964,106.891
MHL,,,,,,,,,,,,,,,,,,,,,,,,,,,,,,,0.012,0.012,0.012,0.012,0.012,0.012,0.012,0.012,0.012,0.012,0.012,0.012,0.012,0.013000000000000001,0.013000000000000001,0.013000000000000001,0.013000000000000001,0.013000000000000001,0.013000000000000001,0.013000000000000001,0.013000000000000001,0.012,0.0086,0.0086,0.0086,0.0086,0.0086,0.0086
MKD,,,,,,,,,,,,,,,,,,,,,,,,,,,,,,,,1.307,1.297,1.296,1.287,1.29,1.283,1.291,1.282,1.235,1.242,1.334,1.301,1.262,1.228,1.224,1.076,1.063,1.0130000000000001,1.119,1.118,1.2670000000000001,1.26,1.2610000000000001,1.262,1.2650000000000001,1.266,1.264
MLI,31.698,31.703,31.708000000000002,31.713,31.718,31.722,31.728,31.728,31.728,31.778000000000002,31.778000000000002,31.778000000000002,31.778000000000002,31.828,31.878,32.077,32.075,32.075,32.08,32.08,32.083,32.083,32.083,32.083,32.103,32.106,32.106,32.123,32.123,32.128,32.138,32.24,33.14,35.25,35.419000000000004,36.65,37.65,37.65,37.65,38.6,39.274,39.684,40.726,39.791000000000004,40.392,40.466,40.597,40.551,41.0454,41.051,41.651,41.651,41.201,41.201,41.201,41.201,41.201,41.201
MLT,0.018000000000000002,0.017,0.016,0.015,0.014,0.014,0.014,0.014,0.014,0.014,0.014,0.014,0.014,0.014,0.013000000000000001,0.013000000000000001,0.014,0.014,0.014,0.013000000000000001,0.013000000000000001,0.013000000000000001,0.013000000000000001,0.013000000000000001,0.013000000000000001,0.013000000000000001,0.013000000000000001,0.013000000000000001,0.013000000000000001,0.013000000000000001,0.013000000000000001,0.013000000000000001,0.013000000000000001,0.013000000000000001,0.011,0.011,0.01,0.009000000000000001,0.009000000000000001,0.009000000000000001,0.01,0.01,0.010400000000000001,0.01,0.009300000000000001,0.0092,0.009300000000000001,0.009300000000000001,0.009300000000000001,0.01033,0.01033,0.0103,0.010230000000000001,0.010230000000000001,0.010230000000000001,0.01038,0.01038,0.01038
MMR,10.43,10.47,10.507,10.620000000000001,10.583,10.74,10.767,10.768,10.767,10.801,10.805,10.805,10.322000000000001,10.333,10.347,10.362,10.356,10.367,10.377,10.385,10.421,10.441,10.438,10.422,10.429,10.435,10.422,10.373,10.395,10.428,10.416,10.398,10.446,10.421,10.450000000000001,10.504,10.519,10.513,10.609,10.812,10.939,10.925,10.982000000000001,11.082,11.263,11.597,11.984,12.277000000000001,12.441,12.526,12.558,12.549,12.587,12.632,12.748999900000001,12.76,12.870700000000001,12.889000000000001
MNE,,,,,,,,,,,,,,,,,,,,,,,,,,,,,,,,,,,,,,,,,,,,,,0.515,0.514,0.513,0.514,0.512,0.513,0.513,0.22313,0.23032,0.23140000000000002,0.2557,0.25630000000000003,0.25680000000000003
MNG,140.683,140.683,140.683,140.681,140.683,140.683,140.683,140.683,140.65200000000002,140.684,140.683,140.683,140.683,140.683,140.683,125.552,125.97500000000001,125.917,124.71300000000001,124.587,124.519,124.525,124.976,124.607,124.587,124.531,124.889,125.23400000000001,125.532,125.656,126.13000000000001,123.59,119.12400000000001,118.46900000000001,118.46900000000001,118.46900000000001,128.891,129.132,130.282,130.47,130.1295,130.118,114.27143219999999,114.1527,113.9278,114.7273,114.68,114.507,114.27005620000001,114.21003,114.18780000000001,114.06790330000001,114.10169,113.75880000000001,113.73876,113.67141000000001,113.58375000000001,113.54939999999999
MOZ,46.649,46.660000000000004,46.67,46.678000000000004,46.688,46.694,46.72,46.82,46.924,47.009,47.009,47.028,47.08,47.08,47.1,47.1,47.1,47.1,47.1,47.1,47.15,47.230000000000004,47.230000000000004,47.33,47.38,47.43,47.53,47.58,47.63,35.26,35.479,35.698,35.917,36.136,36.355000000000004,36.574,36.793,37.012,37.231,37.45,37.671586000000005,37.893172,38.114758,38.336344,38.55793,38.779516,39.001102,39.222688000000005,39.444274,39.66586,39.872288000000005,40.078716,40.285144,40.491572,40.698,41.00971,41.2314,41.413832000000006
MRT,39.522,39.522,39.523,39.523,39.523,39.523,39.523,39.523,39.533,39.533,39.493,39.493,39.480000000000004,39.45,39.446,39.449,39.45,39.446,39.449,39.464,39.484,39.504,39.524,39.535000000000004,39.555,39.575,39.595,39.615,39.635,39.656,39.666000000000004,39.678000000000004,39.69,39.730000000000004,39.76,39.75,39.75,39.75,39.75,39.75,39.712,39.662,39.662,39.661,39.661,39.661,39.661,39.661,39.651,39.711,39.661,39.661,39.661,39.661,39.661,39.661,39.661,39.661
MSR,0.005,0.005,0.005,0.004,0.003,0.003,0.003,0.003,0.003,0.003,0.003,0.003,0.002,0.002,0.002,0.002,0.002,0.002,0.002,0.002,0.002,0.003,0.003,0.003,0.003,0.003,0.003,0.003,0.003,0.003,0.003,0.003,0.003,0.003,0.003,0.003,0.003,0.003,0.003,0.003,0.003,0.003,0.003,0.003,0.003,0.003,0.003,0.003,0.003,0.003,0.003,0.003,0.003,0.003,0.003,0.003,0.003,0.003
MTQ,0.034,0.034,0.034,0.034,0.034,0.035,0.038,0.038,0.038,0.038,0.038,0.038,0.036000000000000004,0.036000000000000004,0.036000000000000004,0.036000000000000004,0.034,0.034,0.039,0.039,0.038,0.038,0.04,0.04,0.042,0.039,0.041,0.04,0.038,0.039,0.036000000000000004,0.035,0.031,0.034,0.032,0.033,0.033,0.034,0.034,0.033,0.033,0.033,0.032,0.03,0.028,0.028,0.0378,0.037700000000000004,0.0374,0.0374,0.0368,0.0368,0.0368,0.0316,0.0315,0.0309,0.02995,0.03133
MUS,0.099,0.1,0.1,0.1,0.101,0.099,0.105,0.111,0.111,0.112,0.112,0.113,0.113,0.113,0.113,0.114,0.114,0.114,0.114,0.114,0.114,0.114,0.114,0.114,0.114,0.114,0.114,0.113,0.112,0.111,0.11,0.109,0.107,0.105,0.10400000000000001,0.10300000000000001,0.10200000000000001,0.10200000000000001,0.1,0.101,0.10200000000000001,0.1,0.099,0.098,0.096,0.094,0.092,0.091,0.091,0.091,0.089,0.08700000000000001,0.08600000000000001,0.08600000000000001,0.08600000000000001,0.08600000000000001,0.08600000000000001,0.08600000000000001
MWI,3.2,3.3000000000000003,3.35,3.4,3.603,3.653,3.605,3.7070000000000003,3.757,3.7070000000000003,3.857,3.907,3.9570000000000003,3.96,3.91,3.912,3.915,3.968,3.97,3.83,3.93,4.03,3.94,3.99,4.005,4.105,4.11,4.115,4.165,4.218,4.32,4.2700000000000005,4.2700000000000005,4.07,4.28,4.38,4.43,4.58,4.68,4.73,4.83,4.83,4.98,4.98,5.18,5.285,4.985,5.4350000000000005,5.485,5.6850000000000005,5.585,5.585,5.6000000000000005,5.65,5.65,5.65,5.65,5.65
MYS,3.08474,3.15095,3.27587,3.33802,3.4973400000000003,3.50813,3.5716799999999997,3.7003000000000004,3.7559400000000003,3.8850100000000003,3.9587800000000004,4.080030000000001,4.16089,4.22147,4.35414,4.43962,4.57074,4.59361,4.83911,4.88614,5.04479,5.1077900000000005,5.205439999999999,5.21612,5.41575,5.7199,6.0733999999999995,6.3838,6.7217,6.756600000000001,6.7945,6.8065,6.8914,6.9909,6.966,6.9611,6.9587,6.9447,6.947100000000001,6.9387,6.947,7.0375000000000005,7.11624,7.1317,7.13441,7.0752,7.1072,7.150399999999999,7.22,7.3893,7.530600000000001,7.8292,8.0593,8.089,8.56997,8.571,8.571,8.571
MYT,0.01502,0.01502,0.01502,0.01502,0.01602,0.01602,0.01602,0.01602,0.01602,0.01602,0.01602,0.01602,0.01602,0.01602,0.01602,0.01602,0.01602,0.01702,0.01702,0.01702,0.01702,0.01702,0.01702,0.01702,0.01702,0.01702,0.01702,0.01702,0.01802,0.01802,0.01852,0.01852,0.01852,0.01852,0.01852,0.01852,0.01852,0.02002,0.02002,0.02002,0.02002,0.02002,0.02002,0.02002,0.02002,0.02002,0.02002,0.02002,0.02002,0.02002,0.02002,0.02002,0.02002,0.02002,0.02002,0.02002,0.02,0.02
NAM,38.642,38.642,38.642,38.646,38.646,38.646,38.649,38.649,38.649,38.651,38.653,38.653,38.653,38.653,38.653,38.655,38.655,38.656,38.656,38.657000000000004,38.657000000000004,38.657000000000004,38.662,38.662,38.662,38.662,38.662,38.662,38.662,38.662,38.662,38.662,38.7,38.75,38.82,38.82,38.82,38.82,38.82,38.82,38.82,38.82,38.82,38.82,38.82,38.82,38.808,38.808,38.808,38.809,38.809,38.809,38.809,38.809,38.809,38.81,38.81,38.81
NCL,0.261,0.261,0.261,0.262,0.262,0.262,0.262,0.263,0.263,0.263,0.263,0.264,0.264,0.264,0.264,0.265,0.265,0.265,0.265,0.265,0.265,0.272,0.28,0.29,0.278,0.267,0.256,0.246,0.23600000000000002,0.232,0.229,0.23,0.23,0.231,0.233,0.23500000000000001,0.23800000000000002,0.24,0.243,0.245,0.248,0.25,0.2436,0.2366,0.2301,0.2246,0.2181,0.2106,0.2056,0.1986,0.19030000000000002,0.184034,0.18373,0.18373,0.18403,0.18403,0.18403,0.18403
NER,31.5,31.5,31.5,31.5,31.5,31.5,31.5,32.177,32.176,31.2,31.23,31.177,30.814,29.78,29.78,29.78,29.78,29.78,29.958000000000002,30.72,30.28,30.36,31.01,30.78,30.78,31.28,31.012,31.3,31.405,33.047000000000004,34.105000000000004,35.0,35.0,35.0,36.0,36.0,36.0,36.0,37.0,37.0,38.0,38.0,38.412,38.472,42.965,42.989000000000004,43.782000000000004,43.782000000000004,43.782000000000004,43.982,44.482,44.782000000000004,45.682,45.682,45.697,46.397,46.6,46.6
NFK,0.001,0.001,0.001,0.001,0.001,0.001,0.001,0.001,0.001,0.001,0.001,0.001,0.001,0.001,0.001,0.001,0.001,0.001,0.001,0.001,0.001,0.001,0.001,0.001,0.001,0.001,0.001,0.001,0.001,0.001,0.001,0.001,0.001,0.001,0.001,0.001,0.001,0.001,0.001,0.001,0.001,0.001,0.001,0.001,0.001,0.001,0.001,0.001,0.001,0.001,0.001,0.001,0.001,0.001,0.001,0.001,0.001,0.001
NGA,53.17651,53.9,56.01691,56.97107,59.07013,56.50599,58.21287,58.171949999999995,63.81403,61.03047,59.47756,55.15,60.300000000000004,56.15,55.15,55.15,50.493,48.955,48.234,50.438,47.219,48.403,48.693,52.606,54.924,60.001000000000005,60.341,60.788000000000004,61.182,61.586,63.929,64.447,65.040825,65.20412999999999,65.367435,65.53074,65.694045,65.85735000000001,66.020655,66.18396000000001,66.347266,66.510572,66.673878,66.837184,67.00049000000001,67.163796,67.327102,67.490408,67.65371400000001,67.81702,67.980326,68.143632,68.306938,68.47024400000001,68.63355,68.79685210000001,68.96015,69.12345
NIC,3.43,3.43,3.468,3.488,3.5180000000000002,3.58,3.58,3.58,3.585,3.585,3.605,3.61,3.62,3.63,3.63,3.63,3.73,3.735,3.74,3.745,3.827,3.829,3.83,3.883,3.855,3.857,3.8890000000000002,3.94,3.993,4.025,4.0600000000000005,4.12,4.19,4.22,4.553,4.654,4.808,4.913,5.018,5.141,5.175,5.2780000000000005,5.336,5.237,5.306,5.2,5.1850000000000005,5.12,5.105,5.026,5.0709,5.103,5.065,5.065,5.065,5.065,5.065,5.065
NIU,0.003,0.003,0.003,0.003,0.003,0.003,0.003,0.003,0.004,0.004,0.004,0.004,0.004,0.005,0.005,0.005,0.005,0.0048,0.0048,0.0048,0.0048,0.0048,0.0048,0.0048,0.0048,0.0048,0.0048,0.0048,0.0048,0.0048,0.0048,0.0048,0.0048,0.0048,0.0048,0.0048,0.0048,0.0048,0.0048,0.0048,0.0048,0.0048,0.0048,0.0048,0.0048,0.0048,0.005,0.005,0.005,0.005,0.005,0.005,0.005,0.005,0.005,0.005,0.005,0.005
NLD,2.314,2.303,2.289,2.2680000000000002,2.255,2.245,2.239,2.227,2.21,2.193,2.128,2.114,2.101,2.094,2.082,2.073,2.06,2.0460000000000003,2.0340000000000003,2.02,2.011,2.005,2.009,2.016,2.019,2.015,2.0140000000000002,2.012,2.004,2.0060000000000002,1.991,1.986,1.988,1.971,1.964,1.981,1.966,1.973,1.967,1.956,1.931,1.949,1.923,1.9494,1.9377,1.9196,1.9144,1.9293,1.9174000000000002,1.8723,1.8584,1.8417000000000001,1.8476,1.8391,1.846,1.815,1.819,1.822
NOR,1.034,1.031,1.028,1.0190000000000001,1.0110000000000001,1.0050000000000001,1.0,0.994,0.986,0.9540000000000001,0.931,0.91,0.904,0.901,0.898,0.896,0.899,0.9,0.9540000000000001,0.936,0.936,0.9420000000000001,0.9450000000000001,0.9540000000000001,0.9570000000000001,0.969,0.97,0.976,0.991,0.976,1.01,1.0030000000000001,1.0130000000000001,1.03,1.127,1.1320000000000001,1.038,1.047,1.038,1.042,1.047,1.046,1.04,1.04,1.036,1.035,1.032,1.0248,1.01426,1.0059,0.999,0.9928,0.9871428,0.98676,0.98603,0.9836699999999999,0.98511,0.9862970000000001
NPL,3.553,3.553,3.563,3.553,3.553,3.553,3.567,3.567,3.567,3.702,3.702,3.822,3.9530000000000003,3.994,4.009,4.025,4.04,4.055,4.07,4.085,4.103,4.1066,4.1102,4.1138,4.1164,4.132,4.134600000000001,4.1382,4.1408000000000005,4.1444,4.147,4.1582,4.1693999999999996,4.1806,4.191800000000001,4.203,4.2142,4.2254,4.2366,4.2491,4.259,4.241,4.227,4.218,4.202,4.1850000000000005,4.166,4.152,4.14,4.126,4.126600000000001,4.121,4.121,4.121,4.121,4.121,4.121,4.121
NRU,0.0003,0.0003,0.0003,0.0003,0.0004,0.0004,0.0004,0.0004,0.0004,0.0004,0.0004,0.0004,0.0004,0.0004,0.0004,0.0004,0.0004,0.0004,0.0004,0.0004,0.0004,0.0004,0.0004,0.0004,0.0004,0.0004,0.0004,0.0004,0.0004,0.0004,0.0004,0.0004,0.0004,0.0004,0.0004,0.0004,0.0004,0.0004,0.0004,0.0004,0.0004,0.0004,0.0004,0.0004,0.0004,0.0004,0.0004,0.0004,0.0004,0.0004,0.0004,0.0004,0.0004,0.0004,0.0004,0.0004,0.0004,0.0004
NZL,15.777000000000001,15.857000000000001,15.893,15.916,15.852,15.828000000000001,15.844000000000001,15.84,15.683,15.677,15.67,16.061,16.022000000000002,15.999,16.379,16.715,16.611,16.797,16.684,16.807,17.332,16.729,16.73,16.579,16.446,16.509,16.47,16.335,16.256,16.182,16.119,15.96,15.919,15.116,14.975,14.904,14.903,14.903,14.903,15.413,15.418000000000001,12.099,11.858,11.89,11.712,11.375,11.487,11.374,11.49,11.408,11.371,11.2094,11.106,11.116,10.712,10.614,10.644,10.467
OMN,1.035,1.035,1.035,1.036,1.036,1.036,1.038,1.04,1.04,1.042,1.042,1.044,1.045,1.046,1.047,1.048,1.049,1.051,1.051,1.051,1.051,1.051,1.055,1.059,1.061,1.067,1.07,1.073,1.077,1.08,1.08,1.083,1.072,1.072,1.071,1.071,1.07,1.071,1.071,1.173,1.1736,1.2734,1.373,1.472,1.465,1.463,1.465,1.4572,1.4544000000000001,1.4432,1.4368,1.4238,1.4195,1.4198,1.434,1.436,1.45192,1.45889
PAK,35.730000000000004,35.84,35.88,36.355000000000004,37.235,37.415,37.47,37.17,35.7,35.865,35.485,35.505,36.4,35.74,36.035000000000004,35.712,35.913000000000004,36.417,36.337,37.416000000000004,36.504,38.509,36.409,37.5,37.118,35.571,36.671,35.347,35.86,35.206,35.27,35.38,35.75,35.79,36.026,36.172000000000004,36.669000000000004,36.76,36.756,36.698,36.972,36.884,36.842,36.045,35.965,36.135,36.013,35.313,35.277,35.242,35.936,36.063,36.28,36.252,36.202,36.794000000000004,37.003,36.300000000000004
PAN,1.624,1.6340000000000001,1.6440000000000001,1.6480000000000001,1.6580000000000001,1.668,1.669,1.679,1.687,1.684,1.713,1.743,1.7630000000000001,1.7850000000000001,1.806,1.827,1.849,1.85,1.852,1.855,1.8820000000000001,1.9140000000000001,1.941,1.966,1.995,2.02,2.045,2.07,2.1,2.124,2.134,2.15,2.15,2.1350000000000002,2.132,2.132,2.14,2.149,2.157,2.23,2.2404,2.2378,2.2352,2.2326,2.23,2.2244,2.2318000000000002,2.2292,2.2316,2.26639,2.263,2.259,2.259,2.259,2.259,2.259,2.259,2.259
PER,16.956,17.099,17.43,17.668,17.75,17.675,17.684,17.78,17.819,17.913,17.922,18.272000000000002,18.319,18.319,18.329,18.419,18.542,18.594,18.63,18.679000000000002,18.704,18.754,18.802,18.853,18.865000000000002,18.894000000000002,18.919,18.929000000000002,18.939,21.836000000000002,21.896,21.956,21.966,21.637900000000002,21.889,22.122,22.335,22.603,22.826,23.124,23.107,22.755,22.888,22.906,23.236,23.412,23.568,23.715,23.946,24.023,24.104,24.3321,24.604,23.779,23.334,23.687,23.667,23.608700000000002
PHL,7.713,7.792,7.872,8.152000000000001,8.132,8.13,8.305,8.281,8.253,8.31,8.279,8.43,8.596,8.862,9.192,9.674,10.09,10.14,10.394,10.625,10.67,10.74,10.78,10.82,10.91,10.98,11.02,11.06,11.1,11.14,11.157,11.115,11.065,11.015,11.015,11.105,11.335,11.285,11.235,11.234,11.184000000000001,11.135,11.24,11.47,11.355,11.58,11.790000000000001,12.01,12.1,12.1,12.26,12.43,12.44,12.44,12.44,12.44,12.44,12.44
PLW,,,,,,,,,,,,,,,,,,,,,,,,,,,,,,,0.0043,0.0043,0.0043,0.0043,0.0043,0.0043,0.0043,0.0043,0.0043,0.0043,0.0043,0.0043,0.0043,0.0043,0.0043,0.0043,0.0043,0.0043,0.0043,0.0043,0.0043,0.0043,0.0043,0.0043,0.0043,0.0043,0.0043,0.0043
PNG,0.495,0.495,0.495,0.505,0.505,0.511,0.556,0.585,0.616,0.641,0.669,0.679,0.6890000000000001,0.6980000000000001,0.714,0.724,0.735,0.756,0.768,0.772,0.778,0.77,0.767,0.775,0.808,0.8300000000000001,0.846,0.863,0.87,0.877,0.882,0.887,0.893,0.898,0.934,0.9550000000000001,0.962,0.974,0.993,1.0050000000000001,1.01,1.0,1.0050000000000001,1.02,1.03,1.04,1.04,1.19,1.19,1.19,1.19,1.19,1.19,1.19,1.19,1.19,1.19,1.19
POL,20.322,20.262,20.184,20.13,19.946,19.947,19.819,19.777,19.557000000000002,19.543,19.508,19.371,19.326,19.257,19.224,19.199,19.159,19.111,19.048000000000002,19.007,18.91,18.891000000000002,18.879,18.939,18.914,18.879,18.869,18.82,18.807000000000002,18.793,18.753,18.743000000000002,18.715,18.707,18.622,18.474,18.457,18.443,18.435,18.413,17.788,16.899,16.169,16.327,15.906,15.957,15.469000000000001,15.601,15.619,14.449,14.779,14.529,14.609,14.558,14.545,14.543000000000001,14.620000000000001,14.669
PRI,0.616,0.601,0.605,0.585,0.609,0.581,0.5680000000000001,0.5660000000000001,0.562,0.552,0.53,0.515,0.492,0.494,0.493,0.493,0.491,0.495,0.486,0.47500000000000003,0.467,0.467,0.466,0.464,0.461,0.463,0.462,0.462,0.45,0.435,0.42,0.41000000000000003,0.311,0.309,0.309,0.309,0.291,0.2725,0.25989999999999996,0.2472,0.2347,0.222,0.21559999999999999,0.209,0.2024,0.1958,0.189,0.19069999999999998,0.19230000000000003,0.19390000000000002,0.1955,0.1968,0.19219999999999998,0.1876,0.183,0.1784,0.1738,0.16890000000000002
PRK,2.38,2.38,2.38,2.38,2.38,2.38,2.38,2.38,2.38,2.38,2.38,2.38,2.43,2.43,2.43,2.43,2.43,2.43,2.43,2.515,2.515,2.515,2.515,2.515,2.515,2.515,2.515,2.515,2.515,2.5180000000000002,2.5300000000000002,2.5300000000000002,2.5500000000000003,2.65,2.65,2.5500000000000003,2.5500000000000003,2.5500000000000003,2.5500000000000003,2.5500000000000003,2.5500000000000003,2.5500000000000003,2.5500000000000003,2.5500000000000003,2.6,2.6,2.6,2.65,2.67,2.68,2.63,2.63,2.63,2.63,2.63,2.63,2.63,2.63
PRT,3.875,3.8810000000000002,3.887,3.8930000000000002,3.899,3.9050000000000002,3.911,3.9130000000000003,3.923,3.9290000000000003,3.935,3.9410000000000003,3.946,3.951,3.956,3.9610000000000003,3.966,3.971,3.976,3.979,3.982,3.985,3.988,3.991,3.994,3.997,4.001,4.005,4.005,3.963,3.92,3.878,3.959,3.952,3.924,3.73,3.5820000000000003,3.7225,3.863,3.9563800000000002,3.8538200000000002,3.87772,3.8136799999999997,3.86961,3.82389,3.75766,3.66092,3.7258600000000004,3.69558,3.65417,3.64936,3.6644099999999997,3.71643,3.69969,3.6950300000000005,3.63646,3.60268,3.5914200000000003
PRY,10.411,10.522,10.64,10.772,10.895,11.02,11.121,11.217,11.317,11.417,11.518,11.618,11.766,12.033,12.254,12.474,12.684000000000001,12.405000000000001,12.615,13.035,13.457,13.893,14.43,14.967,15.499,16.551000000000002,17.048000000000002,17.085,17.122,14.18414,14.439561,14.694982,14.950403000000001,16.032,16.458000000000002,19.021,19.171,19.602,20.083000000000002,16.73835,17.080493999999998,19.581,19.346,18.106926,18.44907,18.791214,19.133358,19.475502000000002,19.817646,20.15979,20.574044,20.988298,21.402552,21.748,21.953,21.749,21.738,21.819
PSE,0.47900000000000004,0.47900000000000004,0.47900000000000004,0.47900000000000004,0.47900000000000004,0.48,0.482,0.482,0.482,0.484,0.484,0.484,0.485,0.486,0.486,0.489,0.491,0.493,0.493,0.494,0.498,0.5,0.502,0.503,0.502,0.502,0.502,0.502,0.503,0.501,0.499,0.497,0.497,0.497,0.503,0.499,0.497,0.47600000000000003,0.491,0.499,0.496,0.497,0.494,0.494,0.4908,0.4847,0.4805,0.4772,0.4263,0.3749,0.3865,0.39897000000000005,0.40782,0.425,0.42392,0.428,0.463,0.463
PYF,0.1453,0.1474,0.1484,0.1484,0.1544,0.1554,0.1554,0.1564,0.15940000000000001,0.1589,0.15940000000000001,0.16040000000000001,0.16140000000000002,0.16340000000000002,0.16440000000000002,0.16740000000000002,0.16940000000000002,0.1692,0.1717,0.1732,0.1762,0.1762,0.1758,0.1762,0.1763,0.1777,0.17500000000000002,0.1753,0.1515,0.15130000000000002,0.1514,0.1486,0.1486,0.1476,0.1489,0.1494,0.1474,0.1481,0.14799,0.14400000000000002,0.14329,0.14318,0.14144,0.13912,0.13784000000000002,0.13676,0.13488,0.1331,0.13132,0.13763999999999998,0.14485,0.15280000000000002,0.15930000000000002,0.1668,0.17592,0.176,0.176,0.176
QAT,0.051000000000000004,0.051000000000000004,0.051000000000000004,0.051000000000000004,0.051000000000000004,0.051000000000000004,0.051000000000000004,0.051000000000000004,0.051000000000000004,0.051000000000000004,0.051000000000000004,0.051000000000000004,0.051000000000000004,0.052000000000000005,0.052000000000000005,0.052000000000000005,0.052000000000000005,0.052000000000000005,0.053,0.055,0.056,0.057,0.058,0.059000000000000004,0.059000000000000004,0.06,0.061,0.061,0.06,0.061,0.061,0.064,0.065,0.065,0.065,0.066,0.066,0.066,0.066,0.066,0.0663,0.0645,0.06459999999999999,0.06459999999999999,0.06420000000000001,0.06559999999999999,0.06559999999999999,0.06706000000000001,0.06509999999999999,0.0665,0.06503,0.06652,0.0685,0.0676,0.0678,0.067,0.067,0.067
ROU,14.601,14.688,14.724,14.742,14.791,14.835,14.838000000000001,14.972,14.968,14.93,14.935,14.943,14.904,14.929,14.946,14.955,14.96,14.965,14.967,14.964,14.948,14.963000000000001,14.981,14.992,15.02,15.038,15.093,15.109,14.758000000000001,14.769,14.798,14.790000000000001,14.793000000000001,14.798,14.797,14.782,14.798,14.747,14.781,14.857000000000001,14.798,14.818,14.8,14.13,14.18,14.039,13.63,13.634,13.621,14.156,13.982000000000001,13.733,13.905000000000001,13.83,13.858,13.521,13.378,13.414
RUS,,,,,,,,,,,,,,,,,,,,,,,,,,,,,,,,221.631,218.79500000000002,217.711,216.4,216.11100000000002,217.989,217.287,216.79,217.162,216.86100000000002,216.651,216.27700000000002,215.98000000000002,215.68,215.488,215.463,215.494,215.494,215.494,215.494,215.494,215.494,215.494,215.494,215.494,215.494,215.494
RWA,1.315,1.325,1.335,1.345,1.355,1.365,1.375,1.383,1.397,1.4040000000000001,1.448,1.508,1.5050000000000001,1.584,1.612,1.639,1.665,1.68,1.697,1.715,1.76,1.7750000000000001,1.79,1.808,1.819,1.83,1.842,1.853,1.855,1.879,1.877,1.837,1.73,1.485,1.485,1.545,1.595,1.615,1.661,1.67,1.749,1.831,1.804,1.8158800000000002,1.7829000000000002,1.80295,1.80488,1.8074400000000002,1.80887,1.8039200000000002,1.81644,1.81573,1.8425,1.8095,1.8117,1.8117,1.8117,1.8117
SAU,86.17,86.19,86.212,86.241,86.262,86.284,86.304,86.34,86.375,86.42,86.467,86.517,86.57000000000001,86.64,86.684,86.75,86.804,86.85600000000001,86.909,86.962,87.013,87.068,87.27,92.423,97.625,102.78,107.98,113.13,118.29,123.48100000000001,123.672,123.74600000000001,130.785,137.785,144.785,151.785,158.785,166.785,173.785,173.785,173.791,173.793,173.798,173.709,173.717,173.674,173.675,173.572,173.435,173.406,173.388,173.345,173.29500000000002,173.5753,173.6354,173.619,173.62920000000003,173.629
SDN,,,,,,,,,,,,,,,,,,,,,,,,,,,,,,,,,,,,,,,,,,,,,,,,,,,68.21136,68.20716,68.19456,68.18616,68.18616,68.18616,68.18616,68.18616
SEN,8.647,8.647,8.747,8.747,8.847,8.847,8.947000000000001,9.117,8.903,8.864,8.946,8.946,8.996,9.046,9.046,9.045,8.844,8.843,8.842,8.841,8.84,8.839,8.838000000000001,8.837,8.836,8.834,8.832,8.83,8.827,8.869,8.709,8.78,8.818,8.915000000000001,8.815,8.907,8.628,8.39,9.112,9.027000000000001,8.799,8.75,8.632,8.687,8.776,8.488,8.503,9.275,9.488,9.458,8.965,8.965,8.868,8.872,8.873,8.878,8.878,8.878
SGP,0.014,0.014,0.013000000000000001,0.013000000000000001,0.013000000000000001,0.013000000000000001,0.013000000000000001,0.012,0.012,0.012,0.01,0.011,0.011,0.009000000000000001,0.008,0.008,0.008,0.008,0.008,0.008,0.007,0.006,0.006,0.006,0.005,0.004,0.003,0.003,0.002,0.002,0.0012,0.0012,0.0012,0.0012,0.0012,0.0012,0.0012,0.0012,0.0012,0.0012,0.0012,0.0012,0.0008,0.0008,0.00076,0.00075,0.0008,0.0007,0.0007,0.00074,0.00073,0.00073,0.00067,0.00066,0.00066,0.00066,0.00066,0.00066
SHN,0.01,0.01,0.01,0.01,0.01,0.01,0.01,0.01,0.01,0.01,0.01,0.01,0.01,0.01,0.01,0.01,0.01,0.01,0.01,0.01,0.01,0.01,0.01,0.01,0.01,0.01,0.01,0.01,0.01,0.01,0.01,0.01,0.01,0.011,0.012,0.012,0.012,0.012,0.012,0.012,0.012,0.012,0.012,0.012,0.012,0.012,0.012,0.012,0.012,0.012,0.012,0.012,0.012,0.012,0.012,0.012,0.012,0.012
SLB,0.055,0.055,0.055,0.055,0.055,0.055,0.055,0.055,0.055,0.055,0.055,0.055,0.055,0.055,0.055,0.055,0.056,0.057,0.059000000000000004,0.059000000000000004,0.059000000000000004,0.062,0.062,0.064,0.064,0.066,0.065,0.067,0.068,0.068,0.069,0.07100000000000001,0.07100000000000001,0.07200000000000001,0.073,0.073,0.073,0.074,0.076,0.076,0.077,0.079,0.083,0.083,0.089,0.094,0.094,0.097,0.101,0.107,0.11,0.111,0.111,0.1115,0.113,0.114,0.117,0.117
SLE,2.612,2.617,2.624,2.629,2.634,2.6390000000000002,2.644,2.654,2.6590000000000003,2.664,2.669,2.674,2.6790000000000003,2.684,2.689,2.694,2.699,2.709,2.719,2.724,2.729,2.744,2.749,2.7640000000000002,2.814,2.819,2.824,2.825,2.825,2.825,2.825,2.815,2.811,2.81,2.81,2.81,2.809,2.809,2.8040000000000003,2.81,3.00152,3.23008,3.5666700000000002,3.77273,3.81202,4.02988,3.62372,3.71223,3.80097,3.93038,4.0176300000000005,3.83665,3.94865,3.9490000000000003,3.9490000000000003,3.9490000000000003,3.9490000000000003,3.9490000000000003
SLV,1.252,1.252,1.258,1.258,1.26,1.25,1.241,1.239,1.237,1.235,1.278,1.281,1.288,1.298,1.308,1.3,1.309,1.35,1.4000000000000001,1.41,1.37,1.341,1.337,1.347,1.367,1.387,1.387,1.407,1.407,1.3531199999999999,1.3576199999999998,1.36212,1.36662,1.37112,1.3756199999999998,1.3880000000000001,1.38462,1.38912,1.481,1.39812,1.40262,1.40712,1.4116199999999999,1.4161199999999998,1.42062,1.42512,1.42962,1.4341199999999998,1.43862,1.44312,1.44762,1.4521199999999999,1.45662,1.46112,1.46562,1.4701199999999999,1.4746199999999998,1.47912
SMR,0.001,0.001,0.001,0.001,0.001,0.001,0.001,0.001,0.001,0.001,0.001,0.001,0.001,0.001,0.001,0.001,0.001,0.001,0.001,0.001,0.001,0.001,0.001,0.001,0.001,0.001,0.001,0.001,0.001,0.001,0.001,0.001,0.001,0.001,0.001,0.001,0.001,0.001,0.001,0.001,0.001,0.001,0.001,0.001,0.001,0.001,0.001,0.001,0.001,0.001,0.001,0.001,0.001,0.001,0.0023,0.0023,0.0023,0.0023
SOM,43.905,43.910000000000004,43.915,43.92,43.925000000000004,43.93,43.935,43.94,43.945,43.95,43.955,43.96,43.965,43.97,43.975,43.980000000000004,43.985,43.99,43.995,44.0,44.005,44.01,44.015,44.02,44.025,44.03,44.035000000000004,44.039,44.04,44.042,44.042,44.043,44.044000000000004,44.050000000000004,44.056,44.061,44.066,44.067,44.067,44.067,44.071,44.226,44.276,44.377,44.377,44.168,44.028,44.128,44.128,44.128,44.028,44.025,44.125,44.125,44.125,44.125,44.125,44.125
SPM,0.003,0.003,0.003,0.003,0.003,0.003,0.003,0.003,0.003,0.003,0.003,0.003,0.003,0.003,0.003,0.003,0.003,0.003,0.003,0.003,0.003,0.003,0.003,0.003,0.003,0.003,0.003,0.003,0.003,0.003,0.003,0.003,0.003,0.003,0.003,0.003,0.003,0.003,0.003,0.003,0.003,0.003,0.003,0.003,0.003,0.003,0.003,0.003,0.003,0.003,0.002,0.002,0.002,0.002,0.002,0.002,0.002,0.002
SRB,,,,,,,,,,,,,,,,,,,,,,,,,,,,,,,,,,,,,,,,,,,,,,3.537,3.5729,3.6036,3.5180000000000002,3.5216,3.5282,3.4626,3.4912,3.5064,3.481,3.456,3.419,3.464
SSD,,,,,,,,,,,,,,,,,,,,,,,,,,,,,,,,,,,,,,,,,,,,,,,,,,,28.5332,28.5332,28.5332,28.5332,28.5332,28.5332,28.5332,28.5332
STP,0.035,0.035,0.035,0.035,0.036000000000000004,0.036000000000000004,0.036000000000000004,0.036000000000000004,0.036000000000000004,0.036000000000000004,0.037,0.037,0.037,0.037,0.037,0.037,0.037,0.037,0.037,0.037,0.037,0.037,0.037,0.037,0.038,0.038,0.038,0.038,0.042,0.042,0.042,0.042,0.042,0.044,0.045,0.045,0.046,0.046,0.047,0.049,0.051000000000000004,0.051000000000000004,0.053,0.049,0.048,0.048,0.048,0.047,0.047,0.046,0.044,0.044,0.044,0.044,0.044,0.044,0.044,0.044
SVK,,,,,,,,,,,,,,,,,,,,,,,,,,,,,,,,,2.446,2.446,2.446,2.444,2.445,2.443,2.443,2.44,2.255,2.237,2.236,1.934,1.941,1.939,1.93,1.937,1.93,1.9447,1.9297000000000002,1.9274000000000002,1.925,1.921,1.922,1.919,1.911,1.92
SVN,,,,,,,,,,,,,,,,,,,,,,,,,,,,,,,,0.5640000000000001,0.56,0.549,0.538,0.525,0.495,0.49,0.5,0.518,0.51,0.505,0.51,0.492,0.509,0.491,0.498,0.61856,0.62512,0.6238600000000001,0.62061,0.61179,0.61021,0.61875,0.62066,0.62163,0.61922,0.61618
SWE,4.237,4.172,3.981,3.943,3.849,3.797,3.785,3.721,3.745,3.753,3.758,3.734,3.718,3.735,3.726,3.735,3.722,3.728,3.7110000000000003,3.704,3.6750000000000003,3.66,3.636,3.611,3.494,3.476,3.455,3.4370000000000003,3.418,3.4130000000000003,3.358,3.344,3.356,3.356,3.267,3.297,3.259,3.231,3.194,3.153,3.154,3.17,3.1630000000000003,3.184,3.216,3.1630000000000003,3.137,3.093,3.079,3.085,3.0660000000000003,3.0486,3.0479000000000003,3.0326999999999997,3.0398,3.0315,3.021,3.009
SWZ,1.468,1.478,1.474,1.477,1.484,1.493,1.497,1.498,1.494,1.494,1.494,1.5130000000000001,1.5130000000000001,1.482,1.313,1.371,1.393,1.393,1.34,1.291,1.284,1.286,1.288,1.2690000000000001,1.284,1.329,1.307,1.285,1.264,1.238,1.227,1.223,1.222,1.222,1.222,1.222,1.223,1.223,1.223,1.223,1.224,1.224,1.224,1.224,1.224,1.224,1.224,1.224,1.222,1.222,1.222,1.222,1.222,1.222,1.222,1.222,1.222,1.222
SYC,0.005,0.005,0.005,0.005,0.005,0.005,0.005,0.005,0.005,0.005,0.005,0.005,0.005,0.005,0.005,0.005,0.005,0.005,0.005,0.005,0.005,0.006,0.006,0.006,0.006,0.006,0.006,0.005,0.005,0.004,0.004,0.004,0.004,0.004,0.004,0.004,0.004,0.004,0.004,0.004,0.004,0.004,0.004,0.004,0.004,0.004,0.003,0.003,0.0029,0.0024,0.0015,0.0015,0.0015500000000000002,0.0015500000000000002,0.0015500000000000002,0.0015500000000000002,0.0015500000000000002,0.0015500000000000002
SYR,14.941,14.97,15.041,14.854000000000001,14.299,13.63,13.63,13.421000000000001,13.445,13.459,13.458,14.161,14.478,14.517,14.107000000000001,14.213000000000001,14.040000000000001,14.009,13.96,14.062000000000001,14.115,14.113,13.991,13.973,13.951,13.92,13.907,13.733,13.492,13.495000000000001,13.512,13.613,13.642,13.786,13.789,13.790000000000001,13.804,13.754,13.767,13.711,13.723,13.759,13.813,13.905000000000001,13.828,13.877,13.897,13.898,13.908,13.908,13.915000000000001,13.921000000000001,13.921000000000001,13.921000000000001,13.921000000000001,13.921000000000001,13.921000000000001,13.921000000000001
TCA,0.001,0.001,0.001,0.001,0.001,0.001,0.001,0.001,0.001,0.001,0.001,0.001,0.001,0.001,0.001,0.001,0.001,0.001,0.001,0.001,0.001,0.001,0.001,0.001,0.001,0.001,0.001,0.001,0.001,0.001,0.001,0.001,0.001,0.001,0.001,0.001,0.001,0.001,0.001,0.001,0.001,0.001,0.001,0.001,0.001,0.001,0.001,0.001,0.001,0.001,0.001,0.001,0.001,0.001,0.001,0.001,0.001,0.001
TCD,47.9,47.9,47.9,47.9,47.9,47.9,47.9,47.9,47.9,47.9,47.9,47.9,47.910000000000004,47.92,48.0,48.1,48.1,48.15,48.15,48.15,48.15,48.15,48.15,48.15,48.155,48.205,48.205,48.230000000000004,48.25,48.300000000000004,48.35,48.370000000000005,48.4,48.42,48.45,48.43,48.63,48.63,48.63,48.63,48.93,48.730000000000004,48.83,48.83,48.93,48.93,48.931000000000004,48.931000000000004,49.035000000000004,49.235,49.335,49.685,50.036,50.236000000000004,50.237,50.238,50.238,50.238
TGO,3.0700000000000003,3.0700000000000003,3.0700000000000003,3.0700000000000003,3.075,3.075,3.075,3.075,3.075,3.075,2.88,2.88,2.88,2.88,2.88,2.88,2.88,2.98,3.0300000000000002,3.035,3.035,3.035,3.035,3.085,3.09,3.09,3.11,3.14,3.14,3.19,3.1950000000000003,3.1950000000000003,3.3000000000000003,3.3000000000000003,3.3000000000000003,3.4,3.45,3.5300000000000002,3.63,3.63,3.48,3.505,3.48,3.455,3.25,3.2800000000000002,3.495,3.545,3.605,3.665,3.665,3.85,3.8200000000000003,3.8200000000000003,3.8200000000000003,3.8200000000000003,3.8200000000000003,3.8200000000000003
THA,11.653,11.98,12.46,12.69,12.94,13.21,13.46,13.700000000000001,13.92,14.248000000000001,14.399000000000001,15.23,16.080000000000002,16.883,17.22,17.548000000000002,17.965,18.376,18.702,18.938,19.341,19.779,19.898,20.051000000000002,20.577,20.775000000000002,21.240000000000002,21.330000000000002,21.337,21.383,21.516000000000002,21.374,21.245,21.12,21.21,20.863,20.442,20.052,20.017,19.834,19.828,19.689,19.554000000000002,19.555,19.61,19.7,19.8,20.05,20.879,21.06,21.06,21.86,22.11,22.11,22.11,22.11,22.11,22.11
TJK,,,,,,,,,,,,,,,,,,,,,,,,,,,,,,,,4.489,4.543,4.47,4.582,4.585,4.562,4.547,4.5680000000000005,4.573,4.573,4.571,4.596,4.65,4.672,4.735,4.729,4.727,4.759399999999999,4.7557,4.752800000000001,4.749,4.7462,4.7417,4.738300000000001,4.7335,4.740100000000001,4.7277
TKL,0.0003,0.0004,0.0004,0.0004,0.0004,0.0004,0.0004,0.0004,0.0004,0.0004,0.0004,0.0004,0.0004,0.0004,0.0004,0.0004,0.0004,0.0004,0.0004,0.0004,0.0004,0.0004,0.0004,0.0004,0.0005,0.0005,0.0005,0.0005,0.0005,0.0005,0.0006,0.0006,0.0006,0.0006,0.0006,0.0006,0.0006,0.0006,0.0006,0.0006,0.0006,0.0006,0.0006,0.0006,0.0006,0.0006,0.0006,0.0006,0.0006,0.0006,0.0006,0.0006,0.0006,0.0006,0.0006,0.0006,0.0006,0.0006
TKM,,,,,,,,,,,,,,,,,,,,,,,,,,,,,,,,35.35,35.45,35.45,35.5,35.5,35.5,35.5,35.54,35.5,35.5,35.35,35.19,35.050000000000004,34.88,34.7,34.550000000000004,34.35,34.205,34.0,33.838,33.838,33.838,33.838,33.838,33.838,33.838,33.838
TLS,0.23,0.23,0.23,0.23,0.23,0.23,0.232,0.232,0.233,0.243,0.243,0.245,0.25,0.25,0.255,0.258,0.262,0.271,0.276,0.279,0.28200000000000003,0.28400000000000003,0.28600000000000003,0.289,0.292,0.295,0.299,0.303,0.305,0.318,0.33,0.33,0.335,0.34,0.34,0.342,0.343,0.341,0.337,0.337,0.362,0.362,0.365,0.385,0.385,0.385,0.375,0.38,0.382,0.372,0.373,0.384,0.38,0.38,0.38,0.38,0.38,0.38
TON,0.027,0.028,0.029,0.029,0.03,0.031,0.031,0.031,0.033,0.032,0.032,0.033,0.033,0.034,0.034,0.033,0.033,0.033,0.033,0.034,0.034,0.034,0.033,0.033,0.033,0.033,0.033,0.033,0.032,0.032,0.032,0.032,0.032,0.032,0.033,0.033,0.031,0.031,0.031,0.03,0.03,0.03,0.03,0.03,0.03,0.031,0.031,0.031,0.032,0.032,0.032,0.033,0.033,0.034,0.035,0.035,0.035,0.035
TTO,0.097,0.097,0.098,0.098,0.098,0.098,0.098,0.098,0.098,0.098,0.101,0.101,0.11,0.111,0.106,0.106,0.106,0.106,0.106,0.101,0.095,0.088,0.074,0.074,0.07100000000000001,0.07100000000000001,0.07100000000000001,0.07200000000000001,0.07200000000000001,0.077,0.081,0.081,0.081,0.081,0.076,0.076,0.07100000000000001,0.066,0.067,0.067,0.06,0.06,0.06,0.055,0.054,0.054,0.054,0.054,0.054,0.054,0.054,0.054,0.054,0.054,0.054,0.054,0.054,0.054
TUN,8.648,8.627,8.606,8.669,8.648,8.627,8.606,8.585,8.716,8.882,8.868,8.947000000000001,9.016,9.045,9.094,9.143,9.169,9.034,8.951,8.700000000000001,8.75,8.816,8.899000000000001,8.898,8.822000000000001,8.706,8.696,8.492,8.67,8.644,9.21,9.355,9.422,9.283,9.348,9.324,9.347,9.42,9.526,9.551,9.499,9.763,9.784,9.83,9.824,9.806000000000001,9.805,9.881,9.789,10.038,10.072000000000001,9.922,9.943,9.761000000000001,9.834,9.703,9.743,9.743
TUR,36.517,36.648,37.37,37.292,37.296,37.484,37.300000000000004,37.601,38.643,38.178,38.314,38.826,38.787,38.328,37.962,37.903,38.029,38.045,38.892,38.579,38.613,37.191,36.718,37.613,38.13,38.483000000000004,39.427,39.263,39.897,39.677,40.067,39.904,39.913000000000004,40.149,39.493,39.364000000000004,39.242,39.919000000000004,40.302,40.479,40.968,41.196,40.644,41.21,41.223,40.493,39.505,39.122,38.911,39.012,38.247,38.407000000000004,38.423,38.554,38.551,38.328,37.963,37.802
TUV,0.002,0.002,0.002,0.002,0.002,0.002,0.002,0.002,0.002,0.002,0.002,0.002,0.002,0.002,0.002,0.002,0.002,0.002,0.002,0.002,0.002,0.002,0.002,0.002,0.002,0.002,0.002,0.002,0.002,0.002,0.002,0.002,0.002,0.002,0.002,0.002,0.002,0.002,0.002,0.002,0.0017,0.0017,0.0017,0.0017,0.0017,0.0017,0.0018000000000000002,0.0018000000000000002,0.0018000000000000002,0.0018000000000000002,0.0018000000000000002,0.0018000000000000002,0.0018000000000000002,0.0018000000000000002,0.0018000000000000002,0.0018000000000000002,0.0018000000000000002,0.0018000000000000002
TWN,0.884,0.887,0.89,0.893,0.896,0.899,0.902,0.9,0.915,0.905,0.903,0.899,0.896,0.917,0.917,0.92,0.923,0.918,0.915,0.907,0.9,0.891,0.894,0.892,0.888,0.888,0.886,0.895,0.895,0.89,0.884,0.876,0.875,0.872,0.873,0.872,0.865,0.859,0.855,0.851,0.849,0.847,0.844,0.836,0.833,0.8300000000000001,0.8260000000000001,0.8220000000000001,0.8150000000000001,0.8130000000000001,0.808,0.803,0.8,0.7996000000000001,0.7966000000000001,0.794,0.793,0.7907000000000001
TZA,26.0,26.0,27.0,27.0,27.0,27.0,27.0,27.0,27.0,28.0,29.0,29.0,29.0,29.0,29.0,29.0,29.0,30.0,30.0,30.0,31.0,31.0,31.0,31.0,32.0,32.0,32.0,32.0,32.0,31.18999,31.56199,31.93399,32.30599,32.67799,33.04999,33.42199,33.703,33.8,33.9,34.0,34.1,34.2,34.27,35.160000000000004,35.36,35.36,35.65,36.9744,37.300000000000004,37.45,38.300000000000004,39.373993999999996,39.65,39.65,39.65,39.65,39.65,39.65
UGA,9.018,9.114,9.258000000000001,9.873,9.871,9.885,9.888,9.925,9.950000000000001,9.98,10.03,10.1,10.18,10.264,10.407,10.538,10.538,10.61,10.61,10.68,10.76,10.84,11.3,11.5,11.6,11.817,11.817,11.817,11.862,11.962,12.032,12.052,12.082,12.102,12.122,12.172,12.172,12.242,12.262,12.512,12.612,12.812,13.112,13.262,13.262,13.46275,13.6635,13.914250000000001,14.115,14.265,14.365,14.415000000000001,14.415000000000001,14.415000000000001,14.415000000000001,14.415000000000001,14.415000000000001,14.415000000000001
UKR,,,,,,,,,,,,,,,,,,,,,,,,,,,,,,,,41.929,41.89,41.861000000000004,41.853,41.84,41.854,41.611000000000004,41.453,41.406,41.385,41.396,41.355000000000004,41.354,41.304,41.284,41.266,41.292,41.276,41.267,41.281,41.297000000000004,42.114000000000004,42.099000000000004,42.095,42.102000000000004,42.075,41.913000000000004
URY,16.354,16.249,16.141000000000002,16.084,15.973,15.915000000000001,15.842,15.722,15.648,15.481,15.441,15.4,15.36,15.321,15.281,15.24,15.201,15.161,15.121,15.081,15.053,15.021,14.992,14.962,14.933,14.895,14.858,14.839,14.822000000000001,14.917,14.921000000000001,14.925,14.93,14.934000000000001,14.938,14.941,14.945,14.950000000000001,14.954,14.958,14.962,14.923,14.927,14.829,14.832,14.695,14.55,14.674,14.814,14.433,14.526,14.23,14.3397,14.2948,14.293600000000001,14.0908,14.044500000000001,14.0159
USA,447.509,443.991,441.443,439.012,435.873,435.55,435.307,435.795,435.447,434.40000000000003,433.3,432.3,431.2,430.158,430.158,430.158,430.331,428.163,428.163,428.163,428.163,431.399,431.399,431.399,431.399,431.399,426.94800000000004,426.94800000000004,426.94800000000004,426.94800000000004,426.94800000000004,425.42900000000003,422.94800000000004,421.139,420.139,416.306,414.885,414.588,413.887,414.399,414.944,413.064,413.0223,412.9809,412.9396,412.8988,412.8576,410.9023,408.947,406.99170000000004,405.0364,403.0810538,403.627,404.1729,404.7187,405.2646,405.8103538,405.8103538
UZB,,,,,,,,,,,,,,,,,,,,,,,,,,,,,,,,27.724,27.647000000000002,27.64,27.643,27.64,27.637,27.334,27.331,27.328,27.325,27.046,26.865000000000002,26.684,26.503,26.322,26.141000000000002,25.96,25.779,25.598,25.417,25.236,25.060000000000002,25.542,26.2225,26.2197,26.201,26.197
VCT,0.01,0.01,0.011,0.011,0.011,0.011,0.011,0.011,0.011,0.011,0.011,0.011,0.01,0.01,0.01,0.01,0.011,0.011,0.012,0.012,0.012,0.011,0.012,0.012,0.012,0.013000000000000001,0.01166,0.011300000000000001,0.01094,0.01058,0.010220000000000002,0.009859999999999999,0.0095,0.00914,0.00878,0.00842,0.008060000000000001,0.0077,0.00734,0.007,0.007,0.007,0.007,0.007,0.007,0.007,0.007,0.007,0.007,0.007,0.007,0.007,0.007,0.007,0.007,0.007,0.007,0.007
VEN,19.232,19.302,19.372,19.444,19.514,19.584,19.666,19.758,19.84,19.933,20.026,20.065,20.179000000000002,20.244,20.298000000000002,20.47,20.684,20.740000000000002,20.900000000000002,21.02,21.04,21.16,21.28,21.39,21.64,21.85,21.96,22.01,21.81,21.86,21.857,21.607,21.603,21.61,21.62,21.632,21.636,21.642,21.633,21.635,21.638,21.54,21.54,21.59,21.595,21.555,21.559,21.6,21.5,21.5,21.5,21.5,21.5,21.5,21.5,21.5,21.5,21.5
VGB,0.006,0.006,0.006,0.006,0.006,0.008,0.008,0.008,0.008,0.008,0.008,0.008,0.008,0.008,0.008,0.008,0.008,0.008,0.008,0.008,0.008,0.009000000000000001,0.009000000000000001,0.009000000000000001,0.009000000000000001,0.009000000000000001,0.009000000000000001,0.009000000000000001,0.009000000000000001,0.008,0.008,0.008,0.008,0.008,0.008,0.008,0.008,0.008,0.007,0.007,0.007,0.007,0.007,0.007,0.007,0.007,0.007,0.007,0.007,0.007,0.007,0.007,0.007,0.007,0.007,0.007,0.007,0.007
VIR,0.012,0.012,0.014,0.016,0.016,0.016,0.015,0.015,0.015,0.015,0.015,0.015,0.015,0.015,0.015,0.015,0.015,0.015,0.015,0.016,0.016,0.015,0.014,0.014,0.012,0.012,0.012,0.011,0.011,0.01,0.01,0.01,0.01,0.009000000000000001,0.008,0.008,0.008,0.008,0.007,0.007,0.007,0.006,0.006,0.006,0.006,0.004,0.004,0.004,0.004,0.004,0.004,0.004,0.004,0.004,0.004,0.004,0.004,0.004
VNM,6.292,6.297,6.3020000000000005,6.307,6.312,6.317,6.3420000000000005,6.367,6.382000000000001,6.417,6.422,6.447,6.482,6.507000000000001,6.5120000000000005,6.722,6.812,6.836,6.8500000000000005,6.8580000000000005,6.876,6.884,6.902,6.91,6.75,6.7250000000000005,6.71,6.71,6.715,6.726,6.751,7.025,7.087,7.140000000000001,7.079,7.682,7.844,8.055,8.413,8.78,9.483,9.455,9.537,9.7956,10.0541,10.078,10.0626,10.2408,10.292,10.760100000000001,10.768600000000001,10.7933,10.8528,10.873700000000001,12.1478,12.1722,12.1688,12.1688
VUT,0.105,0.105,0.105,0.105,0.113,0.113,0.113,0.113,0.113,0.12,0.12,0.12,0.12,0.12,0.126,0.126,0.127,0.127,0.128,0.128,0.131,0.132,0.135,0.135,0.137,0.14100000000000001,0.14300000000000002,0.147,0.149,0.152,0.154,0.157,0.159,0.16,0.165,0.167,0.168,0.17200000000000001,0.17300000000000001,0.17500000000000002,0.177,0.178,0.18,0.181,0.183,0.185,0.187,0.187,0.187,0.187,0.187,0.187,0.187,0.187,0.187,0.187,0.187,0.187
WLF,0.004,0.004,0.004,0.004,0.004,0.004,0.004,0.004,0.004,0.004,0.004,0.004,0.005,0.005,0.005,0.005,0.005,0.005,0.005,0.005,0.005,0.005,0.005,0.005,0.005,0.006,0.006,0.006,0.006,0.006,0.006,0.006,0.006,0.006,0.006,0.006,0.006,0.006,0.006,0.006,0.006,0.006,0.006,0.006,0.006,0.006,0.006,0.006,0.006,0.006,0.006,0.006,0.006,0.006,0.006,0.006,0.006,0.006
WSM,0.056,0.057,0.057,0.057,0.062,0.062,0.062,0.063,0.063,0.0635,0.064,0.064,0.064,0.064,0.065,0.069,0.07100000000000001,0.07100000000000001,0.0735,0.074,0.077,0.077,0.0776,0.078,0.078,0.07840000000000001,0.0767,0.077,0.054200000000000005,0.054,0.054,0.052000000000000005,0.052000000000000005,0.051000000000000004,0.051000000000000004,0.051000000000000004,0.051000000000000004,0.051000000000000004,0.0508,0.048,0.048,0.047,0.045,0.043000000000000003,0.042,0.04020000000000001,0.0385,0.037,0.0349,0.0415,0.048,0.0545,0.061,0.0675,0.07562,0.0757,0.0757,0.0757
YEM,23.337,23.348,23.36,23.37,23.38,23.391000000000002,23.398,23.403000000000002,23.413,23.418,23.426000000000002,23.437,23.442,23.447,23.46,23.46,23.46,23.462,23.463,23.463,23.465,23.465,23.465,23.465,23.47,23.47,23.479,23.479,23.481,23.626,23.631,23.481,23.725,23.73,23.736,23.755,23.72,23.68,23.668,23.669,23.595,23.656,23.495,23.557000000000002,23.523,23.627,23.627,23.517,23.452,23.579,23.452,23.501,23.499,23.4516,23.4326,23.3858,23.387700000000002,23.387700000000002
ZAF,101.33500000000001,100.135,98.995,97.75,96.61,96.44500000000001,96.18,95.99000000000001,95.79,95.59,95.39,95.19500000000001,94.99,94.805,94.58500000000001,94.382,94.32000000000001,94.28,94.21000000000001,94.16,94.10000000000001,94.033,94.033,94.033,94.033,94.4,94.65,94.9,95.3,95.60000000000001,96.005,96.473,96.936,97.265,97.52,97.89,97.94500000000001,97.988,98.058,98.125,98.013,98.028,97.928,97.608,97.483,96.888,96.89,97.108,96.988,96.891,96.374,96.34100000000001,96.34100000000001,96.34100000000001,96.34100000000001,96.34100000000001,96.34100000000001,96.34100000000001
ZMB,19.307000000000002,19.36,19.404,19.459,19.513,19.607,19.661,19.735,19.804000000000002,19.874,20.053,20.251,20.144000000000002,20.202,20.237000000000002,20.41,20.274,20.155,19.78,19.846,19.836000000000002,19.808,19.961000000000002,19.982,20.125,20.225,20.366,20.529,20.897000000000002,20.811,20.826,21.065,21.202,21.473,21.458000000000002,21.865000000000002,21.971,22.025000000000002,22.405,22.498,22.555,22.616,22.909,22.897000000000002,22.762,23.048000000000002,22.984,23.087,23.586000000000002,23.436,23.636,23.836000000000002,23.736,23.836000000000002,23.836000000000002,23.836000000000002,23.836000000000002,23.836000000000002
ZWE,10.985,11.07,11.155,11.24,11.305,11.41,11.495000000000001,11.58,11.665000000000001,11.75,11.835,11.9,11.935,12.02,12.055,12.09,12.115,12.165000000000001,12.215,12.275,12.35,12.435,12.51,12.565,12.64,12.715,12.790000000000001,12.88,12.955,13.01,13.18,13.35,13.52,13.72,13.86,14.235,14.419,14.52,14.84,15.06,15.24,15.47,15.65,16.0,16.1,16.3,16.2,16.45,16.3,16.2,16.4,16.2,16.2,16.2,16.2,16.2,16.2,16.2
