### META ###
ID,Emissions|CO2|Agriculture|Total_and_related_land_use__Historic__FAO_2020
category,Agriculture|Total_and_related_land_use
creator,AG
entity,Emissions|CO2
modified,2021/05/06-02:56:15
pathway,Historic
scenario,Historic
source,FAO_2020
unit,Mt CO2
variable,Emissions|CO2|Agriculture|Total_and_related_land_use
### DATA ###
region,1990,1991,1992,1993,1994,1995,1996,1997,1998,1999,2000,2001,2002,2003,2004,2005,2006,2007,2008,2009,2010,2011,2012,2013,2014,2015,2016,2017
ABW,0.0,0.0,0.0,0.0,0.0,0.0,0.0,0.0,0.0,0.0,0.0,0.0,0.0,0.0,0.0,0.0,0.0,0.0,0.0,0.0,0.0,0.0,0.0,0.0,0.0,0.0,0.0,0.0
AFG,0.0,0.0,0.0,0.0,0.0,0.0,0.0,0.0,0.0,0.0,0.0,0.0,0.0,0.0,0.0,0.0,0.0,0.0,0.0,0.0,0.0,0.0,0.0,0.0,0.0,0.0,0.0,0.0
AGO,86.6305024,86.6301997,86.62989590000001,86.62959070000001,86.6292843,86.6289767,82.0745531,79.2518306,83.8676507,79.31117110000001,82.4902211,70.67660409999999,86.80996610000001,92.4547218,99.3227732,98.2594539,79.40728109999999,95.6606434,79.01366349999999,80.8568383,82.70575070000001,106.2893536,80.5344979,90.9441145,77.11652790000001,92.1107772,73.6504435,73.6504435
AIA,0.0,0.0,0.0,0.0,0.0,0.0,0.0,0.0,0.0,0.0,0.0,0.0,0.0,0.0,0.0,0.0,0.0,0.0,0.0,0.0,0.0,0.0,0.0,0.0,0.0,0.0,0.0,0.0
ALB,0.5614916,0.5626817,0.5638778,0.5650799,0.5662879000000001,0.5675019,0.5705143,0.5717362,0.573179,0.5742118,0.5760395,0.1263404,0.1166896,0.11922289999999999,0.1166195,0.1166195,0.39361680000000004,0.44362290000000004,0.39557950000000003,0.3957936,0.3973136,0.3899851,0.3388044,0.3396549,0.340569,0.3512197,0.3414241,0.3414241
ARE,0.0,0.0,0.0,0.0,0.0,0.0,0.0,0.0,0.0,0.0,0.0,0.0,0.0,0.0,0.0,0.0,0.0,0.0,0.0,0.0,0.0,0.0,0.0,0.0,0.0,0.0,0.0,0.0
ARG,131.6428016,132.1084782,132.5820727,133.06378880000003,133.5538372,134.0524361,131.45081539999998,131.4060705,133.2972873,133.1591043,132.9622139,144.5719549,150.7752691,149.9112628,158.7346304,154.6400758,146.1485676,139.2880988,142.5432002,146.4239306,134.17985050000001,128.80406440000002,136.4171661,128.7383186,128.0084267,126.22393,128.5312338,128.5312338
ARM,,,0.0525523,0.052468600000000004,0.052384900000000005,0.052301,0.0522171,0.052133000000000006,0.0520489,0.0519646,0.0518803,0.034530500000000006,0.034480800000000006,0.0344309,0.034381100000000005,0.0343311,0.4113735,0.4107197,0.41006509999999996,0.40940980000000005,0.4087536,0.0,0.0,0.0,0.0,0.0,0.0,0.0
ASM,0.013587199999999999,0.013587199999999999,0.013587199999999999,0.013587199999999999,0.013587199999999999,0.013587199999999999,0.013587199999999999,0.013587199999999999,0.013587199999999999,0.013587300000000002,0.013587300000000002,0.013587300000000002,0.013587300000000002,0.013587300000000002,0.013587300000000002,0.013587300000000002,0.013587300000000002,0.013587300000000002,0.013587400000000001,0.013587400000000001,0.013587400000000001,0.013587400000000001,0.0135978,0.0136083,0.0136188,0.0136294,0.0136294,0.0136294
ATG,0.0100458,0.010127700000000002,0.01021,0.0102928,0.0103762,0.01046,0.0105443,0.010629099999999999,0.010714399999999999,0.010800200000000001,0.0108865,0.014631100000000001,0.014705000000000001,0.014779500000000001,0.014854599999999999,0.0149303,0.0,0.0,0.0,0.0,0.0,0.0,0.0,0.0,0.0,0.0,0.0,0.0
AUS,3.7327007,3.7327007,3.7327007,3.7327007,3.7327007,3.7327007,3.1488161,2.98468,3.1669275,2.9063199,3.2508276,81.6316684,80.31063300000001,81.6708669,78.0814053,78.18877880000001,219.8222944,220.55670980000002,220.8174202,223.98060320000002,223.88913680000002,2.6146644,2.8064327,4.4795926,2.7053687,2.5623095,3.1348744,3.1348744
AUT,1.9690286000000001,1.9845419,2.0000044,2.0154163,2.0307778,2.0460892,2.0615131,2.0767044,2.0918732,2.1069849,2.1220435,0.7299111,0.7305701,0.7329013,0.7525784,0.7383628999999999,0.3814487,0.3822278,0.3887967,0.3838364,0.38471980000000006,0.385496,0.386334,0.3872605,0.3882757,0.3892005,0.38932110000000003,0.38932110000000003
AZE,,,0.0,0.0,0.0,0.0,0.0,0.0,0.0,0.0,0.0,0.0,0.0,0.0,0.0,0.0,0.0,0.0,0.0,0.0,0.0,0.0,0.0,0.0,0.0,0.0,0.0,0.0
BDI,8.680228,8.658580200000001,8.635524799999999,8.6109199,8.584603800000002,8.5563917,8.0647686,8.1411722,8.2948456,8.061178,8.1704742,6.1939508,6.9724158,7.1718386,6.5368838,6.0227174,4.777447100000001,4.3778068,4.8388965,5.0058552,4.8974646,4.7354696,4.5416456,4.747161500000001,4.4774635,4.4515161,4.9327613,4.9327613
BEL,,,,,,,,,,,1.4111004,0.9174751,0.9244070000000001,0.9319481,0.9401412,0.9502910000000001,0.163025,0.16092990000000001,0.16085149999999998,0.16085560000000002,0.1608201,0.4935897,0.4287033,0.43157270000000003,0.4348453,0.43722469999999997,0.43722469999999997,0.43722469999999997
BEN,14.8365029,14.8364605,14.836416999999999,14.8363725,14.836326800000002,14.8362799,14.836231900000001,14.8361826,14.8361319,14.836079900000001,14.836026500000001,10.636315399999999,10.6365289,10.636746800000001,10.6369691,10.637196,10.7218516,10.7220117,10.7221752,10.7223422,10.7225128,10.7226871,10.722865400000002,10.7230476,10.7232339,10.7234245,10.7234245,10.7234245
BFA,10.9814477,10.9764641,10.9713926,10.9662308,10.9609763,10.9556264,10.9501787,10.9446304,10.9389786,10.9332206,10.9273532,11.030469499999999,11.0436051,11.0569971,11.0706531,11.0845808,12.679504699999999,12.6684485,12.6571648,12.645646300000001,12.6338857,12.5939686,12.610764600000001,12.6279239,12.645458399999999,12.663380499999999,12.663380499999999,12.663380499999999
BGD,23.9009441,23.8996536,23.8983586,23.8970591,23.8957551,23.8944464,23.5251132,23.488136100000002,23.574488300000002,23.5945688,23.4760972,22.9697149,22.924067899999997,22.9701248,23.802992300000003,22.7653845,24.2217379,24.143254600000002,24.770230400000003,23.926634300000003,25.4877947,25.4462692,24.4668162,24.568101900000002,24.6926892,24.993376,24.484943100000002,24.484943100000002
BGR,2.6001171,2.635927,2.6716338,2.7072378,2.7427395000000003,2.7781394,2.7883980000000004,2.8206311,2.8649746,2.8972258,2.9492741000000002,3.4948581,3.2952622000000003,3.3369209,3.390542,3.3513623,3.3566561999999998,3.3755502,3.3844828000000002,3.3634784,3.3785639,1.252912,1.2522888,1.2144165,1.1836,1.1937255,1.2025315,1.2025315
BHR,0.0,0.0,0.0,0.0,0.0,0.0,0.0,0.0,0.0,0.0,0.0,0.0,0.0,0.0,0.0,0.0,0.0,0.0,0.0,0.0,0.0,0.0,0.0,0.0,0.0,0.0,0.0,0.0
BHS,0.0,0.0,0.0,0.0,0.0,0.0,0.0,0.0,0.0,0.0,0.0,0.0,0.0,0.0,0.0,0.0,0.0,0.0,0.0,0.0,0.0,0.0,0.0,0.0,0.0,0.0,0.0,0.0
BIH,,,0.8781035,0.8965739,0.9150862,0.9336405999999999,0.9771814000000001,0.9532085,0.9893192000000001,1.1001199,1.0784261,0.0974001,0.0517998,0.3343321,0.0522858,0.0522858,0.0522858,0.1637532,0.07593040000000001,0.051642600000000004,0.051642600000000004,0.1715545,0.11413190000000001,0.051156,0.0499136,0.093825,0.0735582,0.0735582
BLR,,,23.9104135,23.9104135,23.9104135,23.9104135,23.1306873,23.0877879,23.1065533,23.2238119,23.1653841,23.237307400000002,28.660279,24.7648341,22.907354899999998,23.1484695,23.998614699999997,22.8635153,22.6758039,22.9114876,22.658128100000003,22.5732359,24.1190797,22.7488375,23.9107692,24.212757699999997,22.453169300000003,22.453169300000003
BLZ,8.7448321,8.7727132,8.801140499999999,8.830129999999999,8.859698700000001,8.889864,7.711452599999999,7.5775676,7.793901,7.7820269,7.7763753,4.8300283,6.528174600000001,6.5419077,4.6634987,6.251850999999999,3.92715,5.3535509,4.3595141,3.3619944,4.9267175,4.8134015,2.7374999,5.5402322999999996,2.8506639000000003,3.8756283,3.6304456000000003,3.6304456000000003
BMU,0.0,0.0,0.0,0.0,0.0,0.0,0.0,0.0,0.0,0.0,0.0,0.0,0.0,0.0,0.0,0.0,0.0,0.0,0.0,0.0,0.0,0.0,0.0,0.0,0.0,0.0,0.0,0.0
BOL,77.00423500000001,77.0026743,77.0011002,76.9995123,76.99791060000001,76.9962949,76.994665,76.99302060000001,76.9913617,76.9896879,76.9879992,77.2710079,77.2722374,77.2734782,77.2747303,77.2759939,143.79152900000003,144.2817496,144.7805477,145.28815020000002,145.80479250000002,84.08945419999999,84.08945419999999,84.08945419999999,84.08945419999999,84.08945419999999,84.08945419999999,84.08945419999999
BRA,1103.6370304,1104.6481841,1105.6687888,1106.6989778,1107.7388867,1108.7886536,1109.0657515,1110.1806208,1111.7360015,1112.2872321,1113.3864601,1303.4082877,1304.4140112,1307.0478095,1307.1948209,1307.4569815,841.0172670000001,842.1130716,842.5558863,844.1459162,844.316541,498.8019199,499.1180953,499.4374519,500.3756877,501.99250770000003,508.33176230000004,508.33176230000004
BRB,0.0,0.0,0.0,0.0,0.0,0.0,0.0,0.0,0.0,0.0,0.0,0.0,0.0,0.0,0.0,0.0,0.0014705999999999999,0.0014333,0.0013959,0.0013585000000000001,0.0013211,0.0013886,0.0013857,0.0013829,0.00138,0.0013772,0.0013772,0.0013772
BRN,1.6151899,1.6138646,1.612529,1.611183,1.6098264,1.6084591000000001,1.7059912,1.8340687,4.766454800000001,1.6415504,1.6516998,1.6660965,1.6185204000000002,1.7166066000000002,1.5960509,1.6121478,1.7229192,1.7156958,1.7100988,1.7246966000000001,1.7130034,0.3439284,0.3438653,0.3378923,0.4019824,0.3791971,0.4204911,0.4204911
BTN,0.0,0.0,0.0,0.0,0.0,0.0,0.0,0.0,0.0,0.0,0.0,0.0,0.0,0.0,0.0,0.0,0.0,0.0,0.0,0.0,0.0,0.0,0.0,0.0,0.0,0.0,0.0,0.0
BWA,51.7107478,51.8412925,51.9741085,52.1092553,52.246795,52.386791599999995,62.4178978,70.9838326,78.2844152,66.8598566,58.1354857,46.3870878,115.3133191,78.0770829,33.800410400000004,69.0085399,39.0094502,72.02343739999999,36.3429944,31.5909386,27.8862506,28.7023449,28.9972362,53.8773218,30.348278999999998,103.7924444,57.9689544,57.9689544
CAF,7.5343428999999995,7.5298588,7.5253685,7.5208719,7.516369200000001,7.5118601,7.4721936,7.4673547000000005,7.4628268,7.4582927,7.4555316000000005,7.4446708,7.4401177,7.435558200000001,7.441315800000001,7.4264202,7.4309229,7.4215005000000005,7.4824951,7.41389,7.4099029000000005,7.4085629,7.415148100000001,7.4020085,7.3999744000000005,7.4087605000000005,7.932675100000001,7.932675100000001
CAN,142.6634291,142.6637108,142.6639926,142.6642745,142.6645564,142.6648384,125.07782110000001,113.2206813,182.394747,135.24861040000002,112.5073606,105.67448900000001,152.4329063,155.6610142,130.3842707,128.6036239,136.9044431,124.3902064,130.8832703,102.1581825,147.88963850000002,103.8124569,128.509112,166.9710562,139.427562,166.71373190000003,118.86771850000001,118.86771850000001
CHE,0.36991460000000004,0.36991460000000004,0.36991460000000004,0.36991460000000004,0.36991460000000004,0.36991460000000004,0.3699226,0.3699205,0.3699239,0.3699219,0.36991460000000004,0.3311225,0.310178,0.3031682,0.297593,0.29761730000000003,0.29741680000000004,0.2972985,0.2976147,0.298108,0.297967,0.3005019,0.3005019,0.30052229999999996,0.30135500000000004,0.3006312,0.3006312,0.3006312
CHL,0.39674400000000004,0.39674400000000004,0.39674400000000004,0.39674400000000004,0.39674400000000004,0.39674400000000004,0.3965115,0.3968399,0.39691919999999997,0.3970887,0.3943313,0.3939264,0.39291879999999996,0.3925382,0.3926654,0.3928173,8.4675557,8.4611198,8.4542472,8.446638000000002,8.4403285,0.4205309,0.3911367,0.3931447,0.39071490000000003,0.39312759999999997,0.3955403,0.3955403
CHN,1.8952263,1.8952263,1.8952263,1.8952263,1.8952263,1.8952263,1.9644248,1.8248663,1.8811058,1.8134937,1.8746515,1.8554156000000002,1.8557117,1.9583439,2.1187471,1.7937016000000001,1.6683086,1.8422660000000002,1.8216349,1.8934294,1.7534353,1.7580206,1.7883997999999999,1.8151462,3.095346,1.9131165,1.7538777,1.7538777
CIV,3.0346094,3.0346173,3.0346253,3.0346332000000005,3.0346412000000003,3.0346491,2.9857314,2.9847823,3.0244465000000003,3.0003467,3.0006196000000003,2.9252683999999998,2.9352974,3.079796,2.936328,2.9825428,12.1887768,12.193847,12.1826034,12.1299597,12.0732164,6.0865014,6.1374891,6.167796,6.1464053000000005,6.1796752,6.1022492,6.1022492
CMR,115.1802423,115.1764452,115.1725787,115.16864100000001,115.16463,115.16054369999999,111.6434614,111.6279839,111.60641869999999,111.6663968,111.9099257,113.1065658,112.2113913,116.3274053,114.6599407,118.60708629999999,113.7234323,116.2127089,117.43644760000001,115.8593703,114.0537995,114.3672591,113.73782580000001,119.2993668,115.3006496,117.9416568,117.4319335,117.4319335
COD,146.5954464,146.5952879,146.5951288,146.5949691,146.5948088,146.59464780000002,147.095812,146.8931298,147.050693,147.1791666,146.7804935,146.1489636,146.188239,146.43175440000002,146.4746896,147.0017569,147.008948,146.29995000000002,146.5881072,146.3755712,146.48012160000002,147.5904628,146.5948164,147.90776350000002,146.41272270000002,146.2923481,146.7039973,146.7039973
COG,25.340341499999997,25.3403646,25.3403877,25.3404109,25.3404341,25.340457299999997,14.3549518,14.5089245,14.3835741,14.449202300000001,14.0667498,18.6132389,15.3925766,23.151220600000002,24.284162100000003,30.1970052,28.6192196,24.5611685,20.9330512,20.3205017,26.797784,30.843474699999998,29.449102500000002,30.321056000000002,18.3862144,28.1035998,28.8236649,28.8236649
COK,0.0,0.0,0.0,0.0,0.0,0.0,0.0,0.0,0.0,0.0,0.0,0.0,0.0,0.0,0.0,0.0,0.0,0.0,0.0,0.0,0.0,0.0,0.0,0.0,0.0,0.0,0.0,0.0
COL,148.2396525,148.2396525,148.2396525,148.2396525,148.2396525,148.2396525,146.3144914,146.3141647,146.3144735,146.3142859,146.3142947,182.732361,182.96272700000003,188.02843410000003,186.45817350000002,183.0822284,174.46491450000002,175.00020120000002,174.5648301,174.6586903,174.82309659999999,18.3861141,18.3863608,18.4294617,20.533124500000003,19.2429329,36.2896326,36.2896326
COM,0.0538866,0.053877600000000005,0.0538683,0.0538589,0.053849400000000006,0.053839700000000004,0.0538298,0.0538197,0.0538095,0.0537991,0.0537885,0.08066670000000001,0.08066670000000001,0.08066670000000001,0.08066670000000001,0.08066670000000001,0.08066670000000001,0.08077290000000001,0.08088240000000001,0.08099500000000001,0.08111109999999999,0.10830769999999999,0.10806220000000001,0.10781149999999999,0.1075556,0.1072941,0.1072941,0.1072941
CPV,0.0,0.0,0.0,0.0,0.0,0.0,0.0,0.0,0.0,0.0,0.0,0.0,0.0,0.0,0.0,0.0,0.0,0.0,0.0,0.0,0.0,0.0265272,0.026548,0.0265683,0.0265882,0.0266077,0.0266077,0.0266077
CRI,6.5258448,6.5272155000000005,6.5286065,6.5300181,6.5314509,6.5329054,6.4918450000000005,6.4843257,6.4920432,6.5021587,6.502034,0.1826969,0.1785171,0.9356968000000001,0.1750616,0.21305090000000002,0.21305090000000002,0.1746997,0.1743378,0.1743378,0.2775729,13.536172200000001,13.5836006,13.6019964,13.596225,13.6021667,13.6666886,13.6666886
CUB,0.17768899999999999,0.1828879,0.1878998,0.1927346,0.1974015,0.201909,0.2062653,0.2104778,0.2145535,0.2184989,0.2223202,0.0,0.0,0.0,0.0,0.0,0.0,0.0,0.0,0.0,0.0,0.0,0.0,0.0,0.0,0.0,0.0,0.0
CYM,0.0,0.0,0.0,0.0,0.0,0.0,0.0,0.0,0.0,0.0,0.0,0.0,0.0,0.0,0.0,0.0,0.0,0.0,0.0,0.0,0.0,0.0,0.0,0.0,0.0,0.0,0.0,0.0
CYP,0.0,0.0,0.0,0.0,0.0,0.0,0.0,0.0,0.0,0.0,0.0,0.007416000000000001,0.0074893,0.0075624,0.0076353,0.0077079,0.012252599999999999,0.012701599999999999,0.013150600000000002,0.013599600000000002,0.0140487,0.0066979,0.0068617999999999995,0.0070256,0.007189600000000001,0.007353500000000001,0.007353500000000001,0.007353500000000001
CZE,,,,0.1265407,0.1265407,0.1265407,0.1264485,0.1264417,0.1264478,0.1264457,0.1263679,0.1252916,0.1237166,0.1209965,0.1200681,0.12030750000000001,0.1197448,0.11968859999999999,0.11951640000000001,0.11966660000000001,0.119457,0.1194632,0.1192629,0.11924290000000001,0.1217948,0.11914100000000001,0.11914100000000001,0.11914100000000001
DEU,10.1188766,10.1188766,10.1188766,10.1188766,10.1188766,10.1188766,10.126350700000001,10.126028,10.1263111,10.1263041,10.125997600000002,19.3858828,19.397457,19.3958489,19.377650900000003,19.4526951,9.873266,9.872416300000001,9.9328017,9.863135,9.863092,9.8630636,9.859793400000001,9.8565938,9.8337181,9.8416754,9.8322658,9.8322658
DJI,0.0,0.0,0.0,0.0,0.0,0.0,0.0,0.0,0.0,0.0,0.0,0.0,0.0,0.0,0.0,0.0,0.0,0.0,0.0,0.0,0.0,0.0,0.0,0.0,0.0,0.0,0.0,0.0
DMA,0.0927769,0.0935121,0.0942552,0.0950064,0.0957657,0.0965332,0.0973093,0.09809380000000001,0.0988871,0.0996892,0.1005003,0.0980286,0.0985203,0.0990176,0.0995207,0.10002960000000001,0.0997941,0.09731690000000001,0.0948108,0.0922751,0.08970940000000001,0.0871132,0.08693859999999999,0.0867619,0.086583,0.086402,0.086402,0.086402
DNK,1.1543089,1.1543089,1.1543089,1.1543089,1.1543089,1.1543089,1.1549927,1.1548878,1.1549319,1.1549120000000002,1.1548413000000002,2.4458922,2.4567699,2.468804,2.4866156999999998,2.4913905,1.2779059,1.2824474000000001,1.2824126000000002,1.27452,1.2756887,1.1522184,1.1521096,1.1520859,1.1506939,1.1517981,1.1505918,1.1505918
DOM,0.0,0.0,0.0,0.0,0.0,0.0,0.0,0.0,0.0,0.0,0.0,0.0,0.0,0.0,0.0,0.0,0.0,0.0,0.0,0.0,0.0,0.0,0.0,0.0,0.0,0.0,0.0,0.0
DZA,0.9176513000000001,0.9172165999999999,0.9167772,0.9163332000000001,0.9158844,0.9154308,0.9149723000000001,0.9145087,0.9140401,0.9135662999999999,0.9130873,1.2411400000000001,1.2434912999999999,1.2458684,1.248272,1.2507021999999999,0.0,0.0,0.0,0.0,0.0,0.36551960000000006,0.364991,0.3644665,0.3639461,0.3634298,0.3634298,0.3634298
ECU,40.588550600000005,40.5704517,40.5521284,40.5335763,40.514791100000004,40.4957685,40.47602,40.4565088,40.4367462,40.416727200000004,40.396485999999996,34.2778605,34.2808054,34.2837845,34.360085,34.363134200000005,34.366219400000006,34.3693413,34.3725005,34.3756976,34.386676099999995,34.3822086,34.3855239,34.3888801,34.3922778,34.3957179,34.3957179,34.3957179
EGY,0.0,0.0,0.0,0.0,0.0,0.0,0.0,0.0,0.0,0.0,0.0,0.0,0.0,0.0,0.0,0.0,0.0,0.0,0.0,0.0,0.0,0.0,0.0,0.0,0.0,0.0,0.0,0.0
ERI,,,,1.4137263,1.413395,1.4130619,1.4059483000000002,1.4055778,1.4052390000000001,1.4048983000000002,1.4045557,1.4361705999999999,1.4379251,1.4396895,1.4414638,1.4432481000000001,1.3998945,1.4146739,1.4036552,1.5087868000000002,1.4074591,1.4093773,1.411019,1.4126701000000002,1.4143307999999999,1.4160011,1.4160011,1.4160011
ESP,0.4842558,0.4842558,0.4842558,0.4842558,0.4842558,0.4842558,0.4788936,0.4928675,0.5555397000000001,0.4627272,0.5343977999999999,0.48174320000000004,0.4754764,0.5852168000000001,0.5379358,0.5543532,0.5659453,0.4713664,0.4696775,0.4729379,0.4805915,0.7275155,0.4621173,0.4589771,0.5084771,0.467461,0.4578102,0.4578102
EST,,,2.379611,2.379611,2.379611,2.379611,2.3978815,2.3906252,2.3906387000000002,2.3903783,2.3877399,2.3991363999999997,2.6720265,2.474784,2.4839922000000003,2.4621047,3.5202418,3.4091205,3.4324757,3.441381,3.4811023,2.6438128,2.6584054999999998,2.6760988,2.6515533000000002,2.6572725,2.6501551,2.6501551
ETH,,,,27.9085294,27.8796543,27.8502199,22.962358000000002,21.261718400000003,23.93027,23.3550453,20.410220000000002,25.924008,32.7805536,31.1154257,30.4305746,23.0273616,29.3005052,21.228420800000002,27.5440317,26.252928500000003,25.8550681,18.635559,24.880018800000002,28.2154792,19.196782,19.4453507,23.8605908,23.8605908
EU28,91.3365017,91.60071219999999,102.3113942,102.8099539,103.086864,103.3634917,103.4301014,103.5886838,104.03799000000001,104.140049,104.489879,147.8441161,149.1358319,151.1311049,149.8025145,150.94406709999998,148.9409192,150.62417100000002,149.88889650000002,149.9573163,150.86764920000002,114.8579522,115.4070717,113.4281117,113.7363079,113.85026420000001,113.5220414,113.5220414
FIN,5.9054741,5.9054741,5.9054741,5.9054741,5.9054741,5.9054741,5.9478637,5.9161061,5.9159696,5.9159501,5.9182235,35.2073106,35.5681728,36.049365,36.4159078,36.778386,26.0950049,26.218292700000003,26.4426428,26.646917300000002,26.846905800000002,6.527801800000001,6.5006294,6.515275300000001,6.5491591,6.5434085,6.5534212,6.5534212
FJI,0.7867009,0.7867644,0.7868276,0.7868904,0.7869528,0.7870149000000001,0.7870766,0.787138,0.7871991,0.7872598000000001,0.7873201000000001,0.9039839,0.9040298,0.9044800000000001,0.9045252,0.9048699,1.7462652,1.7458903000000001,1.7452316,1.744048,1.7441984,0.1043328,0.1043328,0.1043328,0.1057419,0.1053373,0.1053373,0.1053373
FLK,0.2549564,0.2549564,0.2549564,0.2549564,0.2549564,0.2549564,0.26542340000000003,0.2693817,0.2675553,0.26882310000000004,0.2554645,0.4118058,0.3216919,0.25075810000000004,0.29320979999999996,0.2497878,0.24942760000000003,0.24939840000000002,0.25085630000000003,0.24932830000000003,0.2495753,0.2495753,0.3711762,0.2496062,0.2496062,0.2496062,0.2496062,0.2496062
FRA,5.4801465,5.4801465,5.4801465,5.4801465,5.4801465,5.4801465,5.479621900000001,5.4788784999999995,5.4794008000000005,5.479239499999999,5.4787783,7.840142200000001,7.8161954,7.81224,7.7764642,7.7862216,11.6978778,11.7280937,11.7770613,11.807732900000001,11.8528137,11.8990074,11.9723621,12.0464173,12.113980900000001,12.1905158,12.188585600000001,12.188585600000001
FRO,0.016593800000000002,0.016593800000000002,0.016593800000000002,0.016593800000000002,0.016593800000000002,0.016593800000000002,0.016593800000000002,0.016593800000000002,0.016593800000000002,0.016593800000000002,0.016593800000000002,0.016593800000000002,0.016593800000000002,0.016593800000000002,0.016593800000000002,0.016593800000000002,0.016593800000000002,0.016593800000000002,0.016593800000000002,0.016593800000000002,0.016593800000000002,0.016593800000000002,0.016593800000000002,0.016593800000000002,0.016593800000000002,0.016593800000000002,0.016593800000000002,0.016593800000000002
FSM,0.33243540000000005,0.4127925,0.4127811,0.41276979999999996,0.41275850000000003,0.4127471,0.4127358,0.4127245,0.4127132,0.412702,0.4126907,0.4127591,0.41274849999999996,0.41273790000000005,0.4127272,0.4127167,0.4127061,0.4126932,0.4126803,0.4126673,0.41265440000000003,0.0605881,0.0605862,0.060584200000000005,0.0605823,0.060580300000000004,0.060580300000000004,0.060580300000000004
GAB,0.8508066,0.8508066,0.8508066,0.8508066,0.8508066,0.8508066,0.7236399,0.7236811000000001,0.7239809,0.7234406,0.7223816000000001,0.7454171,0.7443828,0.7941613,0.8005000999999999,0.9429836,0.8072836,1.0124625,1.1341408,0.7850927000000001,0.9427831999999999,1.0152163,0.7807337,1.0054293,0.9416237,1.1558351,0.9042013,0.9042013
GBR,2.6654884,2.6654884,2.6654884,2.6654884,2.6654884,2.6654884,2.7172289999999997,2.7073732,2.7053629000000003,2.7094359,2.7053872,2.7491137,2.6522835000000002,3.5670894,2.6382869,2.7460323,2.7114890999999997,3.1181453,2.6299418,2.6705655000000004,2.7417648,2.7458068,2.9851917,2.6330889,2.6324804,2.7256194000000002,2.6324892,2.6324892
GEO,,,0.0,0.0,0.0,0.0,0.0,0.0,0.0,0.0,0.0,0.0,0.0,0.0,0.0,0.0,0.0,0.0,0.0,0.0,0.0,0.0,0.0,0.0,0.0,0.0,0.0,0.0
GHA,0.1221505,0.1221505,0.1221505,0.1221505,0.1221505,0.1221505,0.1133192,0.1133192,0.11331959999999999,0.11332080000000001,0.1133192,0.1151421,0.11526,0.1185411,0.11378310000000001,0.11378310000000001,0.1135081,0.1129777,0.1077377,0.10403749999999999,0.10353570000000001,0.1028395,0.1006475,0.2279269,0.0994222,0.0942606,0.0942606,0.0942606
GIB,0.0,0.0,0.0,0.0,0.0,0.0,0.0,0.0,0.0,0.0,0.0,0.0,0.0,0.0,0.0,0.0,0.0,0.0,0.0,0.0,0.0,0.0,0.0,0.0,0.0,0.0,0.0,0.0
GIN,15.7701651,15.7702536,15.7703429,15.7704332,15.770524400000001,15.770616500000001,14.3779917,14.224093100000001,14.278588599999999,14.441152400000002,14.3406711,14.618651900000001,14.866808800000001,16.400731,17.4388481,16.7108625,17.0554207,17.7548175,15.2868686,16.2220382,15.885795,16.3480944,15.294799800000002,15.7358349,16.1155065,15.310392,16.172402599999998,16.172402599999998
GLP,0.0109428,0.0109052,0.0108677,0.0108301,0.0107925,0.0107549,0.0107173,0.0106797,0.010642,0.0106044,0.010566700000000002,0.021058,0.0210031,0.0209481,0.0208931,0.020838000000000002,0.1511481,0.1511272,0.1511062,0.15108500000000002,0.15106370000000002,0.0251737,0.0251871,0.0252005,0.025214,0.0252274,0.0252274,0.0252274
GMB,0.0,0.0,0.0,0.0,0.0,0.0,0.0,0.0,0.0,0.0,0.0,0.0,0.0,0.0,0.0,0.0,0.0,0.0,0.0,0.0,0.0,0.0,0.0,0.0,0.0,0.0,0.0,0.0
GNB,1.6713913,1.6722606000000002,1.6731374,1.674022,1.6749142,1.6758144,1.6760773,1.6769935,1.6779178,1.6788505,1.6797916000000002,1.6839729,1.6815853,1.6791759,1.6767444,1.6742904,1.7489257,1.7424851000000001,1.7437998000000001,1.7451274,1.7490489,1.747822,1.7491893,1.7505704000000002,1.7519653000000002,1.7533743,1.7533743,1.7533743
GNQ,5.3547275,5.3549278000000005,5.3551305000000005,5.3553358,5.3555438,5.3557544,5.3559966,5.3562127,5.3564318,5.3566537,5.3568498,5.3056276,5.3053042999999995,5.3049766,5.3046445,5.3043078,5.3954047,5.3951803,5.3949528,5.394722,5.394487900000001,5.3028317,5.3024649,5.3020927,5.301715199999999,5.301332,5.301332,5.301332
GRC,1.483367,1.483367,1.483367,1.483367,1.483367,1.483367,1.4343532,1.4323859,1.4732027,1.432745,1.4389332,1.5984308,1.4172529,1.4199970000000002,1.5213074,1.4917453,1.4625842,1.4586677,1.6652107,1.4345371,1.414706,1.4866997,1.4526130000000002,1.5169174,1.4239063,1.4102797,1.4149366,1.4149366
GRD,0.0,0.0,0.0,0.0,0.0,0.0,0.0,0.0,0.0,0.0,0.0,0.0,0.0,0.0,0.0,0.0,0.0,0.0,0.0,0.0,0.0,0.0,0.0,0.0,0.0,0.0,0.0,0.0
GRL,0.0,0.0,0.0,0.0,0.0,0.0,0.0,0.0,0.0,0.0,0.0,0.0,0.0,0.0,0.0,0.0,0.0,0.0,0.0,0.0,0.0,0.0,0.0,0.0,0.0,0.0,0.0,0.0
GTM,16.414290700000002,16.4140017,16.413705999999998,16.4134034,16.4130938,16.4127767,16.412452000000002,16.4121193,16.4117785,16.411429100000003,16.4110709,15.6775792,15.6782006,15.6788384,15.679493200000001,15.6801657,13.9322719,13.8849666,13.836600200000001,13.7871365,13.7365378,13.019917600000001,13.053118399999999,13.0869816,13.121527200000001,13.156775900000001,13.156775900000001,13.156775900000001
GUF,2.8471453,2.8472016,2.847258,2.8473144,2.8473708,2.8474273,2.7697428,2.7625576,2.7718491,2.7592271999999998,2.7295789,2.2116156,2.341127,2.3863184,2.6827599,2.2388145,4.562597,4.5936355,4.8130777,4.715073,4.6919135,1.2448470999999999,1.2578429000000002,1.2447158999999999,1.2448074,1.2939354,1.3429719,1.3429719
GUM,0.0,0.0,0.0,0.0,0.0,0.0,0.0,0.0,0.0,0.0,0.0,0.0,0.0,0.0,0.0,0.0,0.0,0.0,0.0,0.0,0.0,0.0,0.0,0.0,0.0,0.0,0.0,0.0
GUY,16.6075975,16.6076023,16.6076072,16.607612,16.6076168,16.6076217,9.7529744,9.5937186,12.1857205,8.7170196,8.543488300000002,11.361083800000001,12.5570228,33.457273300000004,11.069040300000001,18.2133511,13.6658015,13.0739324,14.876309,16.3366917,25.2701679,18.612278200000002,22.020140200000004,20.171973,26.3142574,34.6353806,27.839935,27.839935
HKG,0.0,0.0,0.0,0.0,0.0,0.0,0.0,0.0,0.0,0.0,0.0,0.0,0.0,0.0,0.0,0.0,0.0,0.0,0.0,0.0,0.0,0.0,0.0,0.0,0.0,0.0,0.0,0.0
HND,40.6284174,40.634742700000004,40.6413451,40.648243300000004,40.6554575,40.66301,40.6709251,40.67922970000001,40.6879531,40.6971279,40.7067901,28.016270300000002,28.005102,27.993498,27.981432400000003,27.9688769,27.955801100000002,27.957686900000002,27.959654200000003,27.9617084,27.9638554,27.9661017,27.9684543,27.970920800000002,27.9735099,27.9762309,27.9762309,27.9762309
HRV,,,0.43712439999999997,0.4432141,0.4492809,0.455325,0.4574747,0.4634119,0.4713429,0.4759897,0.4930274,0.4441739,0.44886329999999997,0.4541765,0.4568922,0.4621653,0.5588403,0.6396161,0.5703413,0.5753603,0.5803614,0.2985313,0.2996722,0.3008126,0.3019524,0.3030919,0.3030919,0.3030919
HTI,0.2982819,0.2982328,0.298183,0.2981326,0.2980817,0.29802999999999996,0.2979778,0.2979249,0.2978713,0.297817,0.2977621,0.3175535,0.31762419999999997,0.31769580000000003,0.3177686,0.3178425,0.3179175,0.31788099999999997,0.317844,0.3178064,0.3177682,0.3177294,0.31806470000000003,0.3184054,0.3187516,0.3191035,0.3191035,0.3191035
HUN,5.8656022000000005,5.8656022000000005,5.8656022000000005,5.8656022000000005,5.8656022000000005,5.8656022000000005,5.8176685,5.8161968,5.8205795,5.8168978,5.8289671,5.949947,5.7962714,5.8016389,5.7175716,5.6731722,5.7323141,5.8020323,5.7466475,5.6724456000000005,5.6693992,5.749296999999999,5.8214222,5.6712312,5.7863564,5.6768194,5.6687368,5.6687368
IDN,1489.2149187,1498.4029592,1507.8925007,1517.6986309000001,1527.8374618,1538.3262171000001,1385.7234608,2084.4282442000003,1513.7844754000002,1448.1349683,1405.6023921,627.1689498,1012.8435409,722.1970575,991.4375733,783.8994231,1176.8898463,714.3441104,706.2556859,1004.2254496,698.8720784999999,838.4981530000001,846.3947354000001,819.6840634,1093.931397,1114.7253464,711.7941953000001,711.7941953000001
IMN,0.00158,0.00158,0.00158,0.00158,0.00158,0.00158,0.00158,0.00158,0.00158,0.00158,0.0015876,0.0015784,0.0015768,0.0015768,0.0015677000000000002,0.0015684,0.0015684,0.0015684,0.0015684,0.0015684,0.0015684,0.0015684,0.0015684,0.0016420999999999999,0.0016420999999999999,0.0016420999999999999,0.0016420999999999999,0.0016420999999999999
IND,6.3260158,6.3260158,6.3260158,6.3260158,6.3260158,6.3260158,6.3009070000000005,6.303180500000001,6.3166022,6.3270665,6.3046363,6.2935637,6.2872588,6.3055575,6.2827542,6.2774318000000005,6.285754700000001,6.2801074,6.278384,6.2942733,6.2986769,6.3019403,6.2952529,6.3129025,6.342236700000001,6.3350488,6.531195800000001,6.531195800000001
IRL,1.1119672,1.1119672,1.1119672,1.1119672,1.1119672,1.1119672,1.1519117,1.142768,1.1425654,1.1425654,1.1425654,1.1088077,1.1075061000000002,1.1296368,1.1012739999999999,1.1406406999999998,1.5511827,1.6591187,1.5740184,1.5953625,1.9612351000000001,1.2614879,1.1043039000000001,1.0990627,1.0981667,1.2373699,1.1005704,1.1005704
IRN,0.0,0.0,0.0,0.0,0.0,0.0,0.0,0.0,0.0,0.0,0.0,0.0,0.0,0.0,0.0,0.0,0.0,0.0,0.0,0.0,0.0,0.0,0.0,0.0,0.0,0.0,0.0,0.0
IRQ,0.0,0.0,0.0,0.0,0.0,0.0,0.0,0.0,0.0,0.0,0.0,0.0,0.0,0.0,0.0,0.0,0.0,0.0,0.0,0.0,0.0,0.0,0.0,0.0,0.0,0.0,0.0,0.0
ISL,0.037012300000000005,0.037012300000000005,0.037012300000000005,0.037012300000000005,0.037012300000000005,0.037012300000000005,0.0394322,0.038875700000000006,0.038875700000000006,0.038875700000000006,0.038875700000000006,0.037012300000000005,0.037012300000000005,0.037012300000000005,0.037012300000000005,0.037012300000000005,0.193356,0.037012300000000005,0.037012300000000005,0.037012300000000005,0.037012300000000005,0.037012300000000005,0.037012300000000005,0.037012300000000005,0.037012300000000005,0.037012300000000005,0.037012300000000005,0.037012300000000005
ISR,0.0127868,0.0125,0.0122222,0.011953,0.011692000000000001,0.011438700000000001,0.011193,0.0109544,0.0107226,0.0104973,0.0102783,0.0,0.0,0.0,0.0,0.0,0.0203441,0.0203704,0.0203967,0.020423100000000003,0.020449600000000002,0.0,0.0,0.0,0.0,0.0,0.0,0.0
ITA,0.864775,0.864775,0.864775,0.864775,0.864775,0.864775,0.7990066,0.7989362,0.7990511,0.7987299000000001,0.7953273000000001,0.8839324000000001,0.9074327,1.0442334000000002,0.8053750000000001,0.7971237999999999,1.0207822,0.7953867,0.8388155,0.9126445,0.7953867,0.8735586,0.7975582000000001,0.7953867,0.8453298,0.7953867,0.9452161,0.9452161
JAM,0.49811930000000004,0.49818599999999996,0.4982529,0.49832,0.49838720000000003,0.4984546,0.46981,0.4642657,0.4642309,0.4646878,0.4743992,0.5090139,0.4574035,0.444691,0.4395363,0.43954340000000003,0.6754903000000001,0.6279410000000001,0.48351780000000005,0.6132672,0.48654800000000004,0.4665224,0.5342697,0.5394884,0.47550560000000003,0.4755627,0.5529890000000001,0.5529890000000001
JOR,0.0,0.0,0.0,0.0,0.0,0.0,0.0,0.0,0.0,0.0,0.0,0.0,0.0,0.0,0.0,0.0,0.0,0.0,0.0,0.0,0.0,0.0,0.0,0.0,0.0,0.0,0.0,0.0
JPN,7.0714664,7.110548700000001,7.1496542000000005,7.1887829000000005,7.2279349,7.2671101,7.300744300000001,7.3356708,7.3749175,7.4141582,7.4534026,5.3367972,5.3256841,5.3580217,5.31869,5.2741439,6.2992693,6.151837,6.0873379000000005,6.02795,5.9167168000000006,5.383556400000001,5.315368,5.280623899999999,5.214595,5.1731186,5.1253472,5.1253472
KAZ,,,1.1649441,1.1662023,1.1674648,1.1687314,1.1702594,1.2103979999999999,1.1728452,1.1739678,1.1747302,4.3763917,4.3848422000000005,4.395251,4.4020692,4.4108461,0.8417005000000001,0.8431154000000001,0.8469477000000001,0.8459595000000001,0.8473887,0.0,0.0016889000000000001,0.0,0.0004825,0.0,0.0,0.0
KEN,58.7324921,58.7377727,58.7433208,58.749157200000006,58.7553051,58.7617901,58.6837169,58.8506348,58.8174829,58.939078800000004,58.6382062,0.1141793,0.2191326,0.3439908,0.1901799,0.31503820000000005,1.0768545,0.3313241,1.2704753000000002,0.7886704999999999,0.1082835,0.9336749999999999,2.3901134,0.2273799,0.1568078,0.6010059999999999,0.3196664,0.3196664
KGZ,,,0.0,0.0,0.0,0.0,0.0,0.0,0.0,0.0,0.0,0.0,0.0,0.0,0.0,0.0,6.0022317,5.6113346,5.1824912,4.7098944000000005,4.1864881,0.0,0.0,0.0,0.0,0.0,0.0,0.0
KHM,24.348843600000002,24.3242429,24.299105,24.2734121,24.2471456,24.2202862,24.1928134,24.1647061,24.135942,24.106497800000003,24.0763491,27.797245800000002,27.7542476,27.71,27.6644479,27.6175326,21.547945199999997,21.533703000000003,21.5191144,21.504166700000003,21.488846300000002,21.473139200000002,21.457030500000002,21.4405046,21.4235452,21.406135,21.406135,21.406135
KIR,0.0,0.0,0.0,0.0,0.0,0.0,0.0,0.0,0.0,0.0,0.0,0.0,0.0,0.0,0.0,0.0,0.0,0.0,0.0,0.0,0.0,0.0,0.0,0.0,0.0,0.0,0.0,0.0
KNA,0.0,0.0,0.0,0.0,0.0,0.0,0.0,0.0,0.0,0.0,0.0,0.0,0.0,0.0,0.0,0.0,0.0,0.0,0.0,0.0,0.0,0.0,0.0,0.0,0.0,0.0,0.0,0.0
KOR,0.6439288000000001,0.6891261,0.7344399,0.7798707,0.8254189000000001,0.8710850000000001,0.9168694000000001,0.9627726,1.0087951000000002,1.0549373,1.1011997,2.1272265000000004,2.2341601,2.3413187,2.448703,2.5563136,2.6290967000000003,2.7480635,2.8672819,2.9867526,3.1064766,3.4845709,3.5920636,3.6998196,3.8078397,3.9161251000000004,3.9161251000000004,3.9161251000000004
KWT,0.0,0.0,0.0,0.0,0.0,0.0,0.0,0.0,0.0,0.0,0.0,0.0,0.0,0.0,0.0,0.0,0.0,0.0,0.0,0.0,0.0,0.0,0.0,0.0,0.0,0.0,0.0,0.0
LAO,27.0793086,27.1966988,27.3155873,27.436003,27.5579755,27.6815352,27.806713199999997,27.9335416,28.0620533,28.1922818,28.324262,0.0,0.0,0.0,0.0,0.0,0.0,0.0,0.0,0.0,0.0,0.0,0.0,0.0,0.0,0.0,0.0,0.0
LBN,0.0,0.0,0.0,0.0,0.0,0.0,0.0,0.0,0.0,0.0,0.0,0.0,0.0,0.0,0.0,0.0,0.0,0.0,0.0,0.0,0.0,0.0,0.0,0.0,0.0,0.0,0.0,0.0
LBR,15.0168963,15.0168893,15.0168822,15.016874900000001,15.0168676,15.0168602,15.0066906,15.006683,15.006675300000001,15.0066675,15.0066597,15.0159926,15.017085300000002,15.0231981,15.0218971,15.0218886,15.0218801,15.0218715,15.0218627,15.0998144,15.0218293,15.0314037,15.1785036,15.2185494,15.3137863,15.4172526,15.4120908,15.4120908
LBY,0.0,0.0,0.0,0.0,0.0,0.0,0.0,0.0,0.0,0.0,0.0,0.0,0.0,0.0,0.0,0.0,0.0,0.0,0.0,0.0,0.0,0.0,0.0,0.0,0.0,0.0,0.0,0.0
LCA,0.0200913,0.0202553,0.020420300000000002,0.0205861,0.0207529,0.0209206,0.021089200000000002,0.0212588,0.021429300000000002,0.0216008,0.0217733,0.0219467,0.0220581,0.0221701,0.0222827,0.022396000000000003,0.0225099,0.021944500000000002,0.021375699999999997,0.0208037,0.0202283,0.0196496,0.0196097,0.019569600000000003,0.0195292,0.0194887,0.0194887,0.0194887
LKA,2.7145622,2.7109648,2.7073382,2.7036822000000003,2.6999963,2.6962802999999997,2.6922797999999997,2.6884799,2.688071,2.6808932,2.6787913,3.4244573999999997,3.4153004,3.4055436,3.3958437,3.3799369,2.0903836,2.0704607999999998,2.0633478,2.0562145999999997,2.0513105,2.5089731000000004,2.5047237,2.4858013999999997,2.4702111,2.4624296,2.4624296,2.4624296
LSO,0.0038675000000000003,0.0038683000000000003,0.0038692,0.00387,0.0038708,0.0038716,0.0038724,0.0038731,0.0038739,0.0038747,0.0038754,0.0038762,0.0038752,0.0038742,0.0038732000000000003,0.0038723,0.0038713000000000003,0.0038704,0.0038694000000000003,0.0038685,0.0038676,0.0657333,0.06576860000000001,0.06580230000000001,0.0658346,0.0658656,0.0658656,0.0658656
LTU,,,4.8742984,4.8742984,4.8742984,4.8742984,4.8780806000000005,4.8789417,4.8776185,4.8876032,4.8779745000000005,4.8632608,4.8918056,4.9428651,4.8357807,4.8203934,4.8242288,4.816961500000001,4.8504923,4.856002999999999,4.794227,6.4329626,6.417013700000001,6.4316006,6.4226275,6.4528827,6.4344257,6.4344257
LUX,,,,,,,,,,,0.0021101,0.0021101,0.0020208,0.0019338,0.0019338,0.0019338,0.002175,0.0019338,0.0019338,0.0019338,0.0019338,0.0019338,0.0019338,0.0019338,0.0019772,0.0019772,0.0019772,0.0019772
LVA,,,2.6153701000000003,2.6216968,2.6279966,2.6342697,2.6557269000000003,2.6521546,2.657763,2.6646592,2.6740102,3.2604583,3.4737574,3.4591703000000003,3.3185938000000004,3.2864809,5.7393655,5.7690318,5.8364756,5.8992607,5.9756805,3.3262481,3.3490599000000003,3.3936037000000003,3.4003876,3.3795174,3.3646796,3.3646796
MAC,0.0,0.0,0.0,0.0,0.0,0.0,0.0,0.0,0.0,0.0,0.0,0.0,0.0,0.0,0.0,0.0,0.0,0.0,0.0,0.0,0.0,0.0,0.0,0.0,0.0,0.0,0.0,0.0
MAR,0.0891538,0.0901494,0.0911434,0.0921359,0.09312690000000001,0.09411620000000001,0.09510410000000001,0.0960903,0.09707510000000001,0.0980583,0.0990399,0.0,0.0,0.0,0.0,0.0,0.0,0.0,0.0,0.0,0.0,3.6771392,3.6884958,3.6998845,3.7113055,3.7227589,3.7227589,3.7227589
MDA,,,0.13214510000000002,0.13214510000000002,0.13214510000000002,0.13214510000000002,0.118272,0.118272,0.118272,0.118272,0.118272,0.1188289,0.1188289,0.1522771,0.11244580000000001,0.11244580000000001,0.1245093,0.1824144,0.11244580000000001,0.1148585,0.11153189999999999,0.1159091,0.1183218,0.13521080000000002,0.1110837,0.1762269,0.1110837,0.1110837
MDG,42.6636108,42.6576965,42.6517241,42.6456928,42.6396017,42.6334498,41.936020600000006,41.349666899999995,42.1117421,41.6424064,40.6316493,29.942078600000002,25.2440409,26.1134308,27.534711,28.2073734,46.572843500000005,47.9537391,45.614105300000006,50.4611699,49.1936782,20.1684368,17.370356800000003,21.5471119,19.571465,17.902600900000003,18.4128053,18.4128053
MDV,0.0,0.0,0.0,0.0,0.0,0.0,0.0,0.0,0.0,0.0,0.0,0.0,0.0,0.0,0.0,0.0,0.0,0.0,0.0,0.0,0.0,0.0,0.0,0.0,0.0,0.0,0.0,0.0
MEX,21.2471671,21.2573318,21.2675521,21.277828500000002,21.288161499999998,21.298551500000002,21.308999,21.319504400000003,21.330068400000002,21.340691200000002,21.3513736,17.1691386,17.1678947,17.166645199999998,17.165389899999997,17.1641288,13.3243812,13.3278181,13.331267,13.334728,13.338201100000001,10.7351981,10.7392721,10.7433574,10.7474541,10.751562,10.751562,10.751562
MHL,,0.0,0.0,0.0,0.0,0.0,0.0,0.0,0.0,0.0,0.0,0.0,0.0,0.0,0.0,0.0,0.0,0.0,0.0,0.0,0.0,0.0,0.0,0.0,0.0,0.0,0.0,0.0
MKD,,,0.0,0.0,0.0,0.0,3.6e-06,3.6e-06,3.6e-06,3.6e-06,3.18e-05,0.0,0.0,0.0,0.0,0.0,0.0,0.0,0.0,0.0,0.0,0.0,0.0,0.0,0.0,0.0,0.0,0.0
MLI,6.9495884,6.9495665,6.9495441,6.9495211,6.9494976,6.9494735,6.9494488,6.9494234,6.9493974,6.9493707,6.9493434,9.0175638,9.017595,9.0176271,9.01766,9.017693900000001,11.9133297,11.9133771,11.9134258,11.9134761,11.9135278,6.5359229999999995,6.5358381,6.5357504,6.5356599,6.5355663999999996,6.5355663999999996,6.5355663999999996
MLT,0.0,0.0,0.0,0.0,0.0,0.0,0.0,0.0,0.0,0.0,0.0,0.0,0.0,0.0,0.0,0.0,0.0,0.0,0.0,0.0,0.0,0.0,0.0,0.0,0.0,0.0,0.0,0.0
MMR,108.9876521,108.98882950000001,108.9900333,108.9912644,108.9925238,108.9938124,107.4199801,107.06978310000001,107.7497129,107.7725484,107.7802642,84.19570909999999,83.6382274,84.76487089999999,86.7752034,84.0313502,85.4168651,84.9521478,83.3457165,84.8873933,86.31146679999999,123.230499,124.1113588,126.0269995,126.2102646,128.4402394,127.343374,127.343374
MNE,,,,,,,,,,,,,,,,,0.0289926,0.039126,0.0289926,0.0289926,0.0289926,0.0813485,0.0323704,0.0289926,0.0289926,0.0289926,0.0289926,0.0289926
MNG,20.8027533,20.799984000000002,20.797178199999998,20.7943353,20.7914545,20.788535,20.7332329,24.4046899,20.4148212,20.2850612,22.4171011,19.8340218,21.9672687,19.0331167,19.8470826,19.2993831,8.7603025,8.1095734,7.5383823,3.6516918,3.0875502999999997,20.014423400000002,20.1175305,19.697025000000004,19.3407627,22.0217994,19.386889800000002,19.386889800000002
MOZ,34.7671354,34.76495,34.7627424,34.7605123,34.7582594,34.7559832,34.7536835,34.751359799999996,34.7490118,34.7466391,34.7442413,35.186005599999994,35.181959400000004,35.1778692,35.1737342,35.1695536,35.1019087,35.1298784,35.1581605,35.1867603,35.215683299999995,34.8628759,34.8372113,34.811271999999995,34.785053500000004,34.7585513,34.7585513,34.7585513
MRT,1.1711237,1.1706827000000002,1.1702204999999999,1.1697353000000001,1.1692254,1.168689,1.1681239,1.1675275999999999,1.1668976,1.1662309,1.1655243,1.1867508,1.1867101,1.1866667,1.1866202000000001,1.1865704000000001,0.6372034999999999,0.638,0.6388275,0.6396878,0.640583,0.5253787999999999,0.5633215,0.6023943,0.6426487,0.6841389,0.6841389,0.6841389
MSR,0.0335631,0.033758899999999994,0.0339662,0.034186,0.0344196,0.034668199999999996,0.034933399999999996,0.035217,0.035520699999999995,0.035847000000000004,0.0361984,0.0,0.0,0.0,0.0,0.0,0.0,0.0,0.0,0.0,0.0,0.0,0.0,0.0,0.0,0.0,0.0,0.0
MTQ,0.0,0.0,0.0,0.0,0.0,0.0,0.0,0.0,0.0,0.0,0.0,0.0,0.0,0.0,0.0,0.0,0.0,0.0,0.0,0.0,0.0,0.0,0.0,0.0,0.0,0.0,0.0,0.0
MUS,0.0,0.0,0.0,0.0,0.0,0.0,0.0,0.0,0.0,0.0,0.0,0.18261580000000002,0.1826029,0.1825895,0.1825756,0.1825612,0.0,0.0,0.0,0.0,0.0,0.0,0.0,0.0,0.0,0.0,0.0,0.0
MWI,7.7884202,7.7906598,7.7929376,7.7952545,7.7976115,7.8000098,8.2497686,8.259350399999999,8.2644828,8.0859163,8.529184800000001,10.5548947,9.6810869,9.7169075,9.5167454,9.5831327,9.13116,9.280974899999999,9.261512100000001,9.4617194,9.569857599999999,5.9324200000000005,5.921359000000001,5.958361,5.986178600000001,6.0042696,5.8326416,5.8326416
MYS,73.3236302,73.16596510000001,73.00718979999999,72.84729270000001,72.6862617,72.5240848,68.785696,69.915037,88.5695475,67.7351335,67.54109960000001,91.5807838,97.0516327,96.67812119999999,104.0624506,106.1031926,36.311576699999996,42.2789814,40.2373646,55.658224800000006,48.9805592,70.8485956,68.7073646,70.41489720000001,85.1662116,73.2186859,74.0574697,74.0574697
MYT,0.0524589,0.0524488,0.0524384,0.0524275,0.0524162,0.0524045,0.0523923,0.052379600000000005,0.052366300000000005,0.0523525,0.0523382,0.0627678,0.0628386,0.0629126,0.0629902,0.06307159999999999,0.0486595,0.048718899999999996,0.048781399999999996,0.048847299999999996,0.0489168,0.0489904,0.0490415,0.0490957,0.049153300000000004,0.0492147,0.0492147,0.0492147
NAM,7.7925262,7.7925243,7.7925223,7.7925203000000005,7.792518200000001,7.792516200000001,8.5259571,8.4556807,8.6830332,8.634159100000002,9.047449199999999,7.8961114,7.9063169,7.8868402,7.9293018,7.8917544,7.8823402,7.928378800000001,7.9356963,7.9481671,7.8922362999999995,7.938600800000001,7.9574968,7.9363799,7.908801,7.9483143,7.9199247999999995,7.9199247999999995
NCL,0.0,0.0,0.0,0.0,0.0,0.0,0.0,0.0,0.0,0.0,0.0,0.0,0.0,0.0,0.0,0.0,0.0,0.0,0.0,0.0,0.0,0.0,0.0,0.0,0.0,0.0,0.0,0.0
NER,7.261304600000001,7.261696700000001,7.262114400000001,7.262560400000001,7.2630377,7.2635496,7.2641002,7.2646939,7.265336100000001,7.2660328000000005,7.2667914,2.2414157,2.2404682,2.2395028000000003,2.2385187,2.2375156,2.2590837,2.2580302000000003,2.2569556,2.2558594,2.2547408,1.4423034000000001,1.4415576,1.4407960000000002,1.4400183,1.4392238,1.4392238,1.4392238
NFK,0.0,0.0,0.0,0.0,0.0,0.0,0.0,0.0,0.0,0.0,0.0,0.0,0.0,0.0,0.0,0.0,0.0,0.0,0.0,0.0,0.0,0.0,0.0,0.0,0.0,0.0,0.0,0.0
NGA,178.70437270000002,178.5163282,178.31912530000002,178.1120783,177.8944311,177.6653483,177.4239044,177.169071,176.8997028,176.6145195,176.3120863,175.9907894,176.90641920000002,177.8829434,178.9266455,180.0447046,178.37121470000002,178.6871722,179.0283329,179.39783780000002,179.79937220000002,188.33388639999998,188.1803647,188.0115465,187.82502580000002,187.617864,187.617864,187.617864
NIC,28.8680883,28.868154,28.8682218,28.868291700000004,28.868364000000003,28.8684386,28.8753805,28.8726557,28.8836069,28.8738749,28.873194,28.8657178,28.8652441,28.864752199999998,28.864241300000003,28.863710200000003,36.342778,36.3431773,36.343593399999996,36.3440273,36.3403016,3.6739243999999998,3.6708039,3.6707791000000003,3.6583728,3.6583481000000004,3.7099656,3.7099656
NIU,0.0451819,0.0452935,0.0454062,0.0455201,0.045635,0.0457511,0.0458683,0.0459867,0.046106299999999996,0.0462271,0.046349100000000004,0.046472400000000004,0.046535200000000006,0.0465987,0.0466629,0.0467278,0.07486920000000001,0.075365,0.075866,0.0763723,0.07688400000000001,0.0483758,0.0483758,0.0483757,0.0483757,0.0483756,0.0483756,0.0483756
NLD,2.0083968,2.0083968,2.0083968,2.0083968,2.0083968,2.0083968,2.0090111,2.0088738,2.0088737,2.0088681999999998,2.0088706,1.9828221000000001,1.9496118,1.9265355,1.9084306,1.9070553000000001,1.9083724,1.9134615,1.9107246,1.9107246,1.9104812,1.9112390000000001,1.9112151,1.9112151,1.9075766,1.9071674,1.9071674,1.9071674
NOR,3.6601164,3.6951927,3.7302799,3.7653781,3.8004873,3.8356075,3.8757260000000002,3.9108150999999998,3.9445591,3.980394,4.0143945,3.3314754,3.3708807000000003,3.4155355,3.4575626,3.5056848,2.5006781,2.5111350000000003,2.5754502,2.565817,2.6064928,2.7285091,2.757092,2.7795292,2.8144270000000002,2.8366493999999998,2.8366493999999998,2.8366493999999998
NPL,45.7508137,45.9746106,46.2070936,46.4487784,46.7002223,46.9620286,46.596567300000004,46.8496437,47.2358442,47.864417800000005,47.930642,29.344424200000002,29.0040056,30.0594667,29.3709607,29.8750536,3.1286107000000003,3.0571062,3.7264659000000004,4.543661,3.7708383,3.3379499999999998,4.3007864,3.9614319,4.3978720000000004,3.1347785,6.5413531,6.5413531
NRU,0.0,0.0,0.0,0.0,0.0,0.0,0.0,0.0,0.0,0.0,0.0,0.0,0.0,0.0,0.0,0.0,0.0,0.0,0.0,0.0,0.0,0.0,0.0,0.0,0.0,0.0,0.0,0.0
NZL,2.3344029,2.3348793000000003,2.3353511,2.3358181,2.3362806000000003,2.3367386000000003,2.3376613,2.3380599,2.3384115000000003,2.3389455,2.3390149,2.1966958,2.1972563000000003,2.1993456,2.2007168000000004,2.2032015,4.2255741,4.2622221,4.284248,4.2749223,4.2738505,1.5326369,1.5408681,1.5317855,1.5324901,1.5331748,1.5331748,1.5331748
OMN,0.0,0.0,0.0,0.0,0.0,0.0,0.0,0.0,0.0,0.0,0.0,0.0,0.0,0.0,0.0,0.0,0.0,0.0,0.0,0.0,0.0,0.0,0.0,0.0,0.0,0.0,0.0,0.0
PAK,22.6845748,22.6485952,22.611425800000003,22.5730067,22.533273700000002,22.4921584,22.449587200000003,22.4054815,22.3597568,22.3123222,22.2630801,22.1649653,22.1550711,22.144759699999998,22.1340042,22.1227753,22.2047319,22.157396400000003,22.1078194,22.0558376,22.0012717,21.9439241,21.6932847,21.4291818,21.1505006,20.856,20.856,20.856
PAN,10.135211300000002,10.135679,10.13615,10.1366242,10.1371016,10.1375824,10.0765236,10.0752827,10.0757897,10.072812599999999,10.0768331,10.1954457,10.335771500000002,10.1947711,10.208611300000001,10.1785651,10.0263773,9.989838599999999,9.887296000000001,9.8945785,9.895280399999999,8.4153825,8.524051600000002,8.5320687,8.416206,8.6436009,8.4164844,8.4164844
PCN,0.0,0.0,0.0,0.0,0.0,0.0,0.0,0.0,0.0,0.0,0.0,0.0,0.0,0.0,0.0,0.0,0.0,0.0,0.0,0.0,0.0,0.0,0.0,0.0,0.0,0.0,0.0,0.0
PER,93.02383040000001,93.1106277,93.1978211,93.2854133,93.37340700000001,93.4618052,93.1372541,93.6999835,93.7993446,93.5403011,93.5663325,55.367303500000006,55.3483674,55.487799700000004,55.4342868,57.6750609,80.78386710000001,82.4723332,80.73651480000001,80.4304166,81.5989874,84.4144131,84.5589421,84.82049649999999,84.4540122,84.727585,84.5778942,84.5778942
PHL,0.0,0.0,0.0,0.0,0.0,0.0,0.0,0.0,0.0,0.0,0.0,18.701909800000003,18.5883304,18.4750541,18.3620796,18.2494058,15.3770483,15.283125,15.1879422,15.0914746,14.9936958,0.0,0.0,0.0,0.0,0.0,0.0,0.0
PLW,,0.0,0.0,0.0,0.0,0.0,0.0,0.0,0.0,0.0,0.0,0.0,0.0,0.0,0.0,0.0,0.0,0.0,0.0,0.0,0.0,0.0,0.0,0.0,0.0,0.0,0.0,0.0
PNG,48.0219127,48.021939599999996,48.0219666,48.0219935,48.022020499999996,48.0220475,38.3567468,114.6326694,40.0096821,40.0442264,40.0209208,37.1206597,53.33864620000001,44.7193252,72.24149430000001,42.210410700000004,50.9809445,39.6529152,44.0509937,40.115729800000004,46.4498368,38.7312108,39.4292308,40.7667756,47.2245943,88.53153089999999,39.171809,39.171809
POL,13.3082662,13.3082662,13.3082662,13.3082662,13.3082662,13.3082662,13.283237999999999,13.2884528,13.2830895,13.290754100000001,13.289252200000002,13.2449911,13.3036104,13.3932506,13.0608589,13.0714522,13.0484149,13.0423992,13.056035900000001,13.0310726,13.032547600000001,13.0718446,13.072088,13.019417299999999,12.981693600000002,12.998037700000001,12.9775299,12.9775299
PRI,0.1255738,0.1255738,0.1255738,0.1255738,0.1255738,0.1255738,0.12315949999999999,0.1246408,0.1231079,0.1281834,0.1231079,0.11760580000000001,0.1162975,0.1061265,0.1030601,0.1007416,0.09842279999999999,0.09580520000000001,0.0917294,0.0917294,0.09042120000000001,0.0894114,0.111994,0.088103,0.1123944,0.09303789999999999,0.09303789999999999,0.09303789999999999
PRK,13.6219707,13.6440402,13.6668029,13.690292,13.7145427,13.7395928,13.741586600000002,13.7660009,13.7963054,13.824815300000001,13.848936,13.894207,13.9185039,13.957550900000001,14.201542100000001,14.044345600000002,14.0794913,14.0708527,14.18089,14.0979732,14.0754409,14.2002003,14.1311975,14.134380100000001,14.172671200000002,14.144093400000001,14.144093400000001,14.144093400000001
PRT,1.4321581,1.4321892,1.4322205,1.4322519,1.4322836,1.4323153,1.4327992999999999,1.4302273,1.4352351,1.4330646999999999,1.4271819000000001,2.3157766000000004,2.3005822,2.3973644,2.2605587999999996,2.2759575,2.1912838999999997,2.2011795000000003,2.2072404999999997,2.2152528000000005,2.2343865999999997,2.2342888,2.2365207000000003,2.233504,2.2307278000000004,2.2301448,2.2344632,2.2344632
PRY,79.1145686,79.1817227,79.2500222,79.3194966,79.39017650000001,79.46209350000001,79.5352805,79.60977129999999,79.68560120000001,79.76280650000001,79.841425,79.8327929,79.894379,79.95712239999999,80.0210558,80.0862135,136.9719404,137.10634570000002,137.24534020000002,137.38916310000002,137.5380705,149.42035769999998,149.5010479,149.5849599,149.67229070000002,149.7632534,149.7632534,149.7632534
PSE,0.0,0.0,0.0,0.0,0.0,0.0,0.0,0.0,0.0,0.0,0.0,0.0,0.0,0.0,0.0,0.0,0.0,0.0,0.0,0.0,0.0,0.0,0.0,0.0,0.0,0.0,0.0,0.0
PYF,0.0641752,0.06428589999999999,0.0643977,0.0645106,0.0646246,0.0647397,0.064856,0.0649735,0.0650922,0.06521210000000001,0.06533320000000001,0.0658152,0.06587810000000001,0.06594159999999999,0.06600579999999999,0.06607070000000001,0.0942122,0.094706,0.095205,0.0957093,0.0962191,0.0669907,0.0669817,0.06697280000000001,0.066964,0.0669552,0.0669552,0.0669552
QAT,0.0,0.0,0.0,0.0,0.0,0.0,0.0,0.0,0.0,0.0,0.0,0.0,0.0,0.0,0.0,0.0,0.0,0.0,0.0,0.0,0.0,0.0,0.0,0.0,0.0,0.0,0.0,0.0
ROU,1.1425878,1.1425884000000002,1.1425889,1.1425895000000001,1.1425900999999998,1.1425907,0.9687838000000001,0.9111289,0.934652,0.9169063,0.9266549000000001,0.6831608,1.2236079,0.9908316,0.6663477000000001,0.7966341,0.692504,1.8407521999999998,0.8645712999999999,0.6582666,0.6351009000000001,1.8423004,2.5135761000000003,0.8309521,0.7542105,0.8121155,0.6311623,0.6311623
RUS,,,152.3533938,152.3144114,152.27543210000002,152.2364559,129.7599623,87.3057292,138.0579815,100.8941194,106.6210932,170.1941599,174.4241442,233.44810819999998,145.8288351,177.6864152,100.40904180000001,77.6789089,228.8235666,108.5986111,110.5874263,108.80011560000001,165.1956989,122.7709423,117.8822166,76.8184981,131.73331159999998,131.73331159999998
RWA,3.242443,3.2233743,3.2046148,3.1861572000000002,3.1679942000000003,3.1501187,2.6630528,2.7386972000000003,2.7084537,2.6115779000000003,2.4860864,2.4892793,2.4251984,3.834971,2.8718204999999997,3.3561716,3.0111088,2.2122371,3.2148065000000003,2.5206720999999996,2.7309416,2.6153220999999998,2.3840727000000004,3.1094274,2.2378663000000003,3.6037935,3.4415856,3.4415856
SAU,0.0,0.0,0.0,0.0,0.0,0.0,0.0,0.0,0.0,0.0,0.0,0.0,0.0,0.0,0.0,0.0,0.0,0.0,0.0,0.0,0.0,0.0,0.0,0.0,0.0,0.0,0.0,0.0
SDN,,,,,,,,,,,,,,,,,,,,,,,78.47503040000001,78.675657,78.8798618,79.0877414,79.0877414,79.0877414
SEN,8.1282228,8.1262873,8.124333,8.1223598,8.1203672,8.1183551,8.1163232,8.1142711,8.1121986,8.1101053,8.107991,9.5916835,9.591831,9.59198,9.5921305,9.5922826,7.5621354,7.5622441,7.562353900000001,7.5624646,7.5625765000000005,8.7397616,8.7502241,8.7607864,8.771449800000001,8.7822158,8.7822158,8.7822158
SGP,0.0,0.0,0.0,0.0,0.0,0.0,0.0,0.0,0.0,0.0,0.0,0.0,0.0,0.0,0.0,0.0,0.0,0.0,0.0,0.0,0.0,0.0,0.0,0.0,0.0,0.0,0.0,0.0
SHN,0.0,0.0,0.0,0.0,0.0,0.0,0.0,0.0,0.0,0.0,0.0,0.0,0.0,0.0,0.0,0.0,0.0,0.0,0.0,0.0,0.0,0.0,0.0,0.0,0.0,0.0,0.0,0.0
SLB,1.6883206,1.6883228,1.6883249,1.6883270000000001,1.6883291999999999,1.6883314,1.6883335,1.6883357,1.6883379,1.6883401,1.6883424,1.6280742000000001,1.6279325,1.6277901,1.6276471,1.6275033,1.6876029000000001,1.6877870000000001,1.687972,1.688158,1.6883449000000001,1.6885328,1.6877914,1.6870462,1.6862972999999999,1.6855445,1.6855445,1.6855445
SLE,5.7309532,5.7309643,5.7309754,5.7309868,5.7309982,5.7310098,5.7310216,5.7310335,5.731045600000001,5.7310579,5.731070300000001,5.8880192,5.8880067,5.887994,5.8879811,5.8879681,5.8879548999999995,5.8879945,5.8880346,5.888075300000001,5.8881166,0.0,0.0,0.0,0.0,0.0,0.0,0.0
SLV,0.8209852,0.8197865000000001,0.8185589,0.8173013,0.8160125,0.8146914000000001,0.8133368000000001,0.8119473,0.8105217,0.8090584000000001,0.807556,0.8229458,0.8215143,0.8200419000000001,0.8185270000000001,0.8169676,0.7784524,0.7769974,0.7754998000000001,0.7739576,0.7723688,0.7707313,0.7707155,0.7706991000000001,0.7706822,0.7706648,0.7706648,0.7706648
SOM,16.3618469,16.3673589,16.372974,16.378695,16.384525000000004,16.390467100000002,16.3965247,16.402701,16.4089997,16.415424299999998,16.4219788,16.4500865,16.438213500000003,16.4260929,16.4137166,16.4010766,16.3881644,16.398922600000002,16.4099177,16.421157599999997,16.4326504,16.444404900000002,16.4817607,16.5199867,16.5591136,16.5991739,16.5991739,16.5991739
SPM,0.0032413,0.0032541000000000002,0.003267,0.0032802,0.0032934,0.0033069,0.0033205,0.0033342999999999997,0.0033482,0.0033623,0.0033766,0.0067821,0.0067977,0.0068136,0.006829900000000001,0.006846700000000001,0.003432,0.0034398000000000002,0.0034476,0.0034556,0.0034636999999999997,0.0034719000000000004,0.0034763000000000003,0.0034806,0.0034851,0.0034896,0.0034896,0.0034896
SRB,,,,,,,,,,,,,,,,,0.004640399999999999,0.0031450000000000002,0.0028555000000000004,0.0055087,0.0027832,1.7851759999999999,1.7839907000000002,1.7857461000000001,1.7875479,1.7893478,1.7893478,1.7893478
SSD,,,,,,,,,,,,,,,,,,,,,,,189.52730480000002,124.87303179999999,62.3934071,107.5438381,110.8228016,110.8228016
STP,0.0,0.0,0.0,0.0,0.0,0.0,0.0,0.0,0.0,0.0,0.0,0.0,0.0,0.0,0.0,0.0,0.2514286,0.2510663,0.2506977,0.2503226,0.2499408,0.0,0.0,0.0,0.0,0.0,0.0,0.0
SVK,,,,0.09586270000000001,0.0969002,0.09793779999999999,0.09904900000000001,0.1000698,0.1011269,0.1021543,0.10368580000000001,0.0316726,0.031316,0.0311438,0.0309174,0.0309174,0.2614626,0.26330169999999997,0.2651348,0.26708740000000003,0.2689152,0.1909272,0.1924074,0.19296700000000003,0.1939972,0.19503890000000002,0.19503890000000002,0.19503890000000002
SVN,,,0.14030350000000003,0.14030350000000003,0.14030350000000003,0.14030350000000003,0.14030350000000003,0.14030350000000003,0.14030350000000003,0.14030350000000003,0.14030350000000003,0.1418535,0.1418535,0.1418535,0.14060570000000003,0.14060570000000003,0.49806560000000005,0.5042028000000001,0.5109877,0.5213184,0.5284909,0.2279639,0.2246199,0.22561840000000002,0.22928980000000002,0.2302877,0.2302877,0.2302877
SWE,32.5255691,32.7161553,32.9066057,33.0969205,33.28709980000001,33.4771437,33.6720792,33.8604743,34.084671199999995,34.240034800000004,34.4268632,35.5485453,36.0205132,36.5127965,37.0482483,37.6085744,49.6744849,49.7651452,49.9564554,50.187420700000004,50.4652288,38.131284099999995,38.229008,38.3058337,38.582340300000006,38.4957514,38.491866900000005,38.491866900000005
SWZ,0.17769100000000002,0.17572780000000002,0.17380250000000003,0.17191399999999998,0.1700613,0.1682433,0.20252340000000002,0.19926370000000002,0.20079380000000002,0.1874699,0.18566390000000002,0.1580678,0.1561806,0.1551911,0.1529272,0.15134229999999999,0.1497843,0.1483071,0.14707050000000002,0.1454228,0.1442319,0.14328020000000002,0.14143160000000002,0.14004,0.1386707,0.1371058,0.1371058,0.1371058
SYC,0.0,0.0,0.0,0.0,0.0,0.0,0.0,0.0,0.0,0.0,0.0,0.0,0.0,0.0,0.0,0.0,0.0,0.0,0.0,0.0,0.0,0.0,0.0,0.0,0.0,0.0,0.0,0.0
SYR,0.0,0.0,0.0,0.0,0.0,0.0,0.0,0.0,0.0,0.0,0.0,0.030591899999999998,0.030725000000000002,0.030854700000000002,0.0309811,0.0311042,0.0,0.0,0.0,0.0,0.0,0.0,0.0,0.0,0.0,0.0,0.0,0.0
TCA,0.0,0.0,0.0,0.0,0.0,0.0,0.0,0.0,0.0,0.0,0.0,0.0,0.0,0.0,0.0,0.0,0.0,0.0,0.0,0.0,0.0,0.0,0.0,0.0,0.0,0.0,0.0,0.0
TCD,7.7315122,7.7292568,7.726975700000001,7.7246686,7.722335,7.7199744,7.7175863,7.715170199999999,7.7127257,7.7102523000000005,7.7077494,7.5035093,7.5042773,7.505054400000001,7.5058407,7.5066365,25.6302448,25.627771100000004,25.625191100000002,25.6224976,25.6196831,25.5885004,25.602708800000002,25.6176019,25.633230400000002,25.64965,25.64965,25.64965
TGO,6.8730012,6.8696048,6.8660052,6.8621835,6.8581185,6.8537863,6.8491596,6.8442074,6.8388939,6.8331783,6.827013,6.7877096,6.7857839,6.7836855,6.78139,6.7788684,6.7109308,6.7106243999999995,6.7102829,6.7099,6.7094677,6.7089758,6.700649,6.6909894,6.6796491,6.666147700000001,6.666147700000001,6.666147700000001
THA,1.3660886,1.3660886,1.3660886,1.3660886,1.3660886,1.3660886,1.2238773,1.2388223,1.372163,1.2278753,1.223658,48.4877446,49.2921461,49.4401954,51.427770900000006,50.4480553,16.9697552,16.9615055,16.951691900000004,16.9301557,17.270847399999997,1.2937333000000002,1.2937333000000002,1.2937333000000002,1.7492207000000002,1.2949863000000001,1.3156333,1.3156333
TJK,,,0.0,0.0,0.0,0.0,0.0,0.0,0.0,0.0,0.0,0.0,0.0,0.0,0.0,0.0,0.0,0.0,0.0,0.0,0.0,0.0,0.0,0.0,0.0,0.0,0.0,0.0
TKL,0.0,0.0,0.0,0.0,0.0,0.0,0.0,0.0,0.0,0.0,0.0,0.0,0.0,0.0,0.0,0.0,0.0,0.0,0.0,0.0,0.0,0.0,0.0,0.0,0.0,0.0,0.0,0.0
TKM,,,0.0,0.0,0.0,0.0,0.0,0.0,0.0,0.0,0.0,0.0,0.0,0.0,0.0,0.0,0.0,0.0,0.0,0.0,0.0,0.0,0.0,0.0,0.0,0.0,0.0,0.0
TLS,5.0497439,5.0616814,5.073899000000001,5.0864066,5.099214700000001,5.1123342,5.1257767,5.1395542,5.1536794,5.1681656,5.1830269,4.6206915,4.5924805,4.5635097,4.533747900000001,4.5031622,4.4717179,4.4296277,4.3863218,4.3417469,4.2958463,4.2485601,4.2202048,4.1909668,4.1608044,4.129672800000001,4.129672800000001,4.129672800000001
TON,0.0,0.0,0.0,0.0,0.0,0.0,0.0,0.0,0.0,0.0,0.0,0.0,0.0,0.0,0.0,0.0,0.0,0.0,0.0,0.0,0.0,0.0,0.0,0.0,0.0,0.0,0.0,0.0
TTO,0.2536698,0.2534433,0.2532154,0.2529862,0.25275559999999997,0.2525237,0.2522903,0.2520556,0.2518194,0.25158179999999997,0.25134280000000003,0.28520260000000003,0.2857078,0.2862161,0.2867275,0.2872421,0.28776,0.28733949999999997,0.28691629999999996,0.2864905,0.28606200000000004,0.4195046,0.4195046,0.4195046,0.4195046,0.4195046,0.4195046,0.4195046
TUN,0.105743,0.10583719999999999,0.1059259,0.10600960000000001,0.1060886,0.10616339999999999,0.1062342,0.10630150000000001,0.10636530000000001,0.10642610000000001,0.106484,0.0,0.0,0.0,0.0,0.0,0.0131439,0.0131527,0.0131612,0.0131694,0.0131774,0.0,0.0,0.0,0.0,0.0,0.0,0.0
TUR,0.0006969,0.0006969,0.0006969,0.0006969,0.0006969,0.0006969,0.0010135,0.0007957999999999999,0.0008112000000000001,0.0007858,0.0008639,0.0007572,0.0006366000000000001,0.0005159,0.0005159,0.0007572,4.7464908,4.8086873,4.8685752,4.9272764,4.9854288,1.6028384000000002,1.6274676,1.6510537,1.6748148,1.6979176,1.6979176,1.6979176
TUV,0.0,0.0,0.0,0.0,0.0,0.0,0.0,0.0,0.0,0.0,0.0,0.0,0.0,0.0,0.0,0.0,0.0,0.0,0.0,0.0,0.0,0.0,0.0,0.0,0.0,0.0,0.0,0.0
TWN,0.0,0.0,0.0,0.0,0.0,0.0,0.0,0.0,0.0,0.0,0.0,0.0,0.0,0.0,0.0,0.0,0.0,0.0,0.0,0.0,0.0,0.0,0.0,0.0,0.0,0.0,0.0,0.0
TZA,227.0542768,227.0542798,227.05428279999998,227.05428580000003,227.05428899999998,227.0542921,232.51069750000002,221.65978130000002,231.84262090000001,228.0577288,211.07305970000002,233.5721103,224.8347493,238.1052763,239.8029171,246.7466145,223.7679926,230.6361206,232.8337266,225.32283180000002,223.1331218,216.58699570000002,208.4901524,204.88179190000002,204.5907321,209.1562726,204.3328797,204.3328797
UGA,21.0921063,21.0934496,21.0948438,21.096291700000002,21.0977965,21.099361700000003,21.0988365,20.7308944,21.3968596,20.9439237,21.032250100000002,19.6258374,21.4573845,22.3848351,22.9227239,23.2317776,28.6474277,26.2227445,27.4666844,27.8743191,27.3860146,27.335413000000003,27.2314786,27.5394325,27.494318200000002,28.093623500000003,27.0139384,27.0139384
UKR,,,13.6089158,13.6089158,13.6089158,13.6089158,11.8395086,11.7882896,11.799567999999999,11.728537000000001,11.4394954,12.0661345,16.0841143,12.7004479,12.5680732,12.1535556,15.4138328,16.1702339,16.663476600000003,16.4590263,15.13464,12.6693475,14.5716325,10.890066800000001,15.7303768,17.7404007,11.4914874,11.4914874
URY,0.1510602,0.1510602,0.1510602,0.1510602,0.1510602,0.1510602,0.1466493,0.1464458,0.15287309999999998,0.146273,0.14684250000000001,0.2199748,0.21934289999999998,0.2266475,0.2181527,0.3153347,0.1386022,0.1389554,0.14849289999999998,0.14884630000000001,0.1402916,0.1739854,0.14082060000000002,0.1392439,0.13798169999999998,0.1428071,0.1384642,0.1384642
USA,196.11073180000002,196.63009820000002,197.1490919,197.6677131,198.18596230000003,198.7038398,151.8191883,141.54872390000003,147.7289064,165.3755198,147.8298718,131.7052764,161.63479999999998,141.1676421,191.4149865,164.0819619,137.7576284,225.2265921,112.0118652,130.4070373,130.0594289,165.16644140000002,123.6288652,110.8149552,126.8462216,124.38831200000001,95.246447,95.246447
UZB,,,0.09478700000000001,0.1012145,0.10757259999999999,0.1138625,0.1200852,0.1262419,0.1323335,0.1383611,0.1443257,0.15022829999999998,0.1569287,0.1635605,0.1701249,0.17662270000000002,0.2356348,0.2407671,0.2459116,0.2510683,0.2562373,0.9596872,1.1864819,1.4148271,1.6447386,1.8762327,1.8762327,1.8762327
VCT,0.0,0.0,0.0,0.0,0.0,0.0,0.0,0.0,0.0,0.0,0.0,0.0,0.0,0.0,0.0,0.0,0.0,0.0,0.0,0.0,0.0,0.0,0.0,0.0,0.0,0.0,0.0,0.0
VEN,138.1399278,138.2508198,138.3629442,138.4763217,138.5909734,138.7069209,132.1315588,131.9434632,133.1467188,132.3242651,131.8975106,150.9540689,131.1538926,145.9634732,132.1430425,135.3684389,30.7438158,34.078460899999996,27.1382901,23.7430517,42.642263899999996,75.3332204,75.75512690000001,93.63007060000001,82.1944799,87.53514340000001,96.0423595,96.0423595
VGB,0.0013392,0.0013504,0.0013614999999999999,0.0013727000000000001,0.0013839,0.0013952,0.0014064000000000001,0.0014177,0.0014290000000000001,0.0014403999999999999,0.0014517,0.0007316,0.0007352999999999999,0.0007391,0.0007428000000000001,0.0007466,0.0015007,0.0014627,0.0014246,0.0013865000000000001,0.0013483,0.0013100000000000002,0.0013073,0.0013046,0.0013019000000000001,0.0012992,0.0012992,0.0012992
VIR,0.0122557,0.0122557,0.0122557,0.0122557,0.0122557,0.0122557,0.0122557,0.0122557,0.0122557,0.0122557,0.0122557,0.013713699999999999,0.015346,0.017035699999999997,0.018786,0.020600100000000003,0.0073647,0.0079486,0.0085398,0.009138400000000001,0.009744300000000001,0.0101762,0.010740000000000001,0.011310700000000002,0.0118887,0.012474,0.012474,0.012474
VNM,5.4538609,5.4538609,5.4538609,5.4538609,5.4538609,5.4538609,5.3187796,5.2433747,5.410799600000001,5.3670605,5.2874836,5.1237300999999995,7.6312343,5.1329446,5.4717446,5.5749797,8.5264805,8.5395191,8.4462966,8.420389100000001,8.6166025,13.3404712,13.2996004,15.0551978,13.8377972,13.270946,13.4567692,13.4567692
VUT,0.0,0.0,0.0,0.0,0.0,0.0,0.0,0.0,0.0,0.0,0.0,0.0,0.0,0.0,0.0,0.0,0.0,0.0,0.0,0.0,0.0,0.0,0.0,0.0,0.0,0.0,0.0,0.0
WLF,0.0054061000000000005,0.0054052,0.0054042000000000005,0.0054033,0.0054024,0.0054014,0.0054005,0.005399600000000001,0.0053987,0.0053977,0.0053968,0.0057556000000000005,0.0057556000000000005,0.0057556000000000005,0.0057556000000000005,0.0057556000000000005,0.0057556000000000005,0.005753599999999999,0.0057516,0.0057497,0.0057477000000000006,0.0050275,0.0050081,0.004988800000000001,0.0049694000000000006,0.0049501,0.0049501,0.0049501
WSM,0.0,0.0,0.0,0.0,0.0,0.0,0.0,0.0,0.0,0.0,0.0,0.0,0.0,0.0,0.0,0.0,0.0,0.0,0.0,0.0,0.0,0.0,0.0,0.0,0.0,0.0,0.0,0.0
YEM,0.0,0.0,0.0,0.0,0.0,0.0,0.0,0.0,0.0,0.0,0.0,0.0,0.0,0.0,0.0,0.0,0.0,0.0,0.0,0.0,0.0,0.0,0.0,0.0,0.0,0.0,0.0,0.0
ZAF,5.125053100000001,5.125053100000001,5.125053100000001,5.125053100000001,5.125053100000001,5.125053100000001,4.1289019,4.0739337,4.330475000000001,4.1495633,4.1572939,2.8514337999999997,3.6081545999999998,3.5993779,3.6351948000000003,4.1147933000000005,2.8833587000000005,2.8077501000000002,2.8006363000000003,3.4499787000000004,3.1549123,2.0805663,2.4154935,1.7924584000000001,2.6471388,2.4032855,0.6571692,0.6571692
ZMB,336.6248309,336.62482539999996,336.6248198,336.62481410000004,336.6248084,336.62480270000003,310.830526,283.11989140000003,288.60629930000005,261.4240975,296.6108484,284.30499729999997,325.0554337,339.9471788,349.8363556,405.98994760000005,346.4359041,323.5189685,337.00988040000004,294.8298199,327.68078210000004,325.1431258,338.8623206,347.63580570000005,326.9975086,349.55749810000003,365.6918688,365.6918688
ZWE,37.7183617,37.7178655,37.7173543,37.716827599999995,37.716284699999996,37.7157247,37.7151469,37.714550300000006,37.713934200000004,37.7132974,37.712639,37.7119578,37.7115109,37.7110479,37.710568099999996,37.7100704,37.7095539,37.7111417,37.7127922,37.7145089,37.716296,36.034105600000004,36.0339174,36.033721299999996,36.0335168,36.0333035,36.0333035,36.0333035
