### META ###
ID,Emissions|CH4|Agriculture|Rice_cultivation__Historic__FAO_2020
category,Agriculture|Rice_cultivation
creator,AG
entity,Emissions|CH4
modified,2021/05/06-02:56:14
pathway,Historic
scenario,Historic
source,FAO_2020
unit,Mt CH4
variable,Emissions|CH4|Agriculture|Rice_cultivation
### DATA ###
region
