### META ###
ID,Emissions|F-gases|Industrial_processes__Historic__FAO_2020
category,Industrial_processes
creator,AG
entity,Emissions|F-gases
pathway,Historic
scenario,Historic
source,FAO_2020
unit,Gg N2O
variable,Emissions|F-gases|Industrial_processes
### DATA ###
region,1990,1991,1992,1993,1994,1995,1996,1997,1998,1999,2000,2001,2002,2003,2004,2005,2006,2007,2008,2009,2010,2011,2012,2013,2014,2015,2016,2017
AGO,0.0,0.0,0.0,0.0,0.0,0.0,0.0,0.0,0.0,0.0001,0.0001,0.0004,0.0008,0.0013,0.0022,0.0042,0.0042,0.0049,0.0057,0.0062,0.0067,0.0068,0.0074,0.0079,0.0085,0.009,0.0096,0.0101
ALB,0.0,0.0,0.0,0.0001,0.0002,0.0006,0.001,0.001,0.0016,0.0024,0.0033,0.0046,0.0058,0.0078,0.0103,0.0133,0.0147,0.0168,0.0187,0.0206,0.0224,0.023,0.0247,0.0264,0.0281,0.0297,0.0314,0.0331
ARE,0.1655,0.1854,0.1728,0.1474,0.1235,0.113,0.1227,0.1399,0.1343,0.1534,0.1652,0.168,0.1706,0.1766,0.1927,0.2001,0.2207,0.2319,0.2413,0.2488,0.2619,0.2656,0.275,0.2843,0.2937,0.303,0.3124,0.3217
ARG,0.4358,0.4209,0.0829,0.0726,0.0642,0.0494,0.0483,0.0466,0.0466,0.0479,0.0415,0.0367,0.0484,0.0752,0.1046,0.0737,0.052,0.1418,0.1083,0.119,0.1291,0.139,0.1319,0.1405,0.1422,0.1624,0.1702,0.1783
ARM,,,0.0001,0.0002,0.0006,0.0014,0.0025,0.0033,0.0048,0.0065,0.0089,0.0132,0.0208,0.0324,0.0473,0.0715,0.0765,0.0889,0.1014,0.1113,0.1212,0.1227,0.1321,0.1416,0.151,0.1603,0.1698,0.1792
ATG,0.0,0.0,0.0,0.0,0.0,0.0001,0.0002,0.0002,0.0003,0.0005,0.0006,0.0007,0.0008,0.0009,0.0011,0.0013,0.0015,0.0016,0.0018,0.002,0.0021,0.0022,0.0024,0.0025,0.0026,0.0028,0.0029,0.0031
AUS,0.9989,0.9203,0.8174,0.7258,0.5967,0.5817,0.5481,0.5817,0.6622,0.7482,0.8212,0.8848,0.9559,1.0718,1.1859,1.2982,1.4422,1.56,1.6741,1.7845,1.8481,1.9641,1.9454,2.0576,2.2447,2.4317,2.5065,2.544
AUT,0.2937,0.2263,0.1648,0.1444,0.1867,0.2319,0.2918,0.2843,0.2469,0.2731,0.3012,0.3386,0.376,0.4153,0.4583,0.4789,0.5406,0.5799,0.6229,2.4317,3.6476,3.6476,2.8245,2.7871,2.9555,2.8432,2.8994,2.7123
AZE,,,0.0281,0.0195,0.0106,0.0054,0.0018,0.0076,0.0079,0.0083,0.0089,0.0097,0.0107,0.0314,0.0494,0.0572,0.0574,0.0692,0.0726,0.0597,0.0647,0.0769,0.0823,0.0881,0.096,0.1016,0.1072,0.1128
BEL,,,,,,,,,,,0.2319,0.2656,0.3049,0.3404,0.3816,0.4171,0.4658,0.5069,0.5481,0.5649,0.5836,0.6154,0.6453,0.6547,0.6715,0.6697,0.679,0.6435
BGR,0.0012,0.0014,0.0016,0.0023,0.0037,0.0075,0.0101,0.0122,0.0165,0.0217,0.0275,0.0348,0.0438,0.0542,0.0681,0.0838,0.093,0.1044,0.116,0.1324,0.148,0.1659,0.1801,0.2114,0.2394,0.2637,0.3012,0.3891
BHR,0.563,0.0862,0.0945,0.1083,0.0726,0.0677,0.0649,0.0642,0.0606,0.0557,0.0513,0.0473,0.0417,0.0428,0.0428,0.0604,0.0701,0.0696,0.0696,0.0677,0.0696,0.0655,0.0662,0.0672,0.0679,0.0688,0.0698,0.0705
BIH,,,0.0748,0.0365,0.0238,0.0213,0.0206,0.0286,0.0434,0.084,0.0902,0.0726,0.06,0.0769,0.1006,0.1231,0.136,0.148,0.1635,0.171,0.1908,0.1908,0.202,0.2132,0.2263,0.2376,0.2488,0.26
BLR,,,0.0009,0.0016,0.0025,0.0048,0.0079,0.0118,0.0171,0.0224,0.0284,0.0357,0.0445,0.0567,0.0773,0.1004,0.1089,0.1235,0.138,0.1461,0.1612,0.1661,0.1779,0.1889,0.202,0.2132,0.2245,0.2376
BOL,0.002,0.0021,0.0024,0.0028,0.0034,0.9147,2.9181,4.9196,5.8361,5.5181,4.826,3.2922,2.1324,2.7497,4.6016,5.3498,5.7052,6.0606,6.416,6.7714,7.1081,7.4635,7.8189,8.1743,8.5297,8.8851,9.2406,9.596
BRA,1.5937,1.676,1.734,1.6872,1.6255,1.56,1.2757,1.2926,1.3019,1.0026,0.9484,0.881,1.0456,1.2944,1.4347,1.6199,1.7621,1.8706,1.9454,1.908,1.9828,1.7134,1.8257,1.7658,1.5975,1.5432,1.9828,2.0202
BRN,0.0,0.0,0.0001,0.0002,0.0005,0.001,0.0031,0.0053,0.0077,0.0114,0.0211,0.0269,0.0335,0.0406,0.0479,0.055,0.0629,0.07,0.0771,0.0844,0.0917,0.096,0.1027,0.1094,0.116,0.1227,0.1294,0.136
CAN,2.3943,2.5627,2.413,2.6001,2.544,2.544,2.7497,2.8058,3.0116,3.2548,3.4044,3.4792,3.685,3.9656,4.1152,4.3958,4.6951,4.9196,5.1066,5.4246,6.0045,6.098,6.4534,6.5282,6.5282,7.0333,7.4261,7.6506
CHE,0.1684,0.1485,0.1218,0.1053,0.1012,0.1089,0.115,0.1377,0.1721,0.2076,0.2488,0.2825,0.3217,0.3517,0.3816,0.4134,0.4639,0.4994,0.5368,0.5612,0.578,0.6098,0.6603,0.6678,0.6828,0.6977,0.664,0.6734
CHL,0.0052,0.0084,0.0077,0.0078,0.007,0.008,0.0074,0.0075,0.0087,0.0101,0.0076,0.0105,0.0191,0.0309,0.0445,0.0632,0.0849,0.1096,0.1364,0.1652,0.1945,0.2394,0.2993,0.361,0.4209,0.4845,0.5518,0.5144
CHN,2.7578,2.3376,2.5559,3.8973,5.8101,4.3496,5.0413,7.3483,5.7862,15.4697,12.6708,15.5374,20.9796,24.6893,32.8025,39.7314,44.9813,40.751,42.5067,41.9867,42.465,52.1725,55.4248,58.6789,61.9517,65.2058,68.4599,71.714
CMR,0.2039,0.1964,0.1861,0.1908,0.1764,0.1448,0.1543,0.1579,0.1302,0.1298,0.1119,0.093,0.0672,0.0773,0.0862,0.0902,0.0881,0.0872,0.0913,0.0731,0.0761,0.0587,0.0533,0.0481,0.0428,0.0376,0.0324,0.0269
COG,0.0,0.0,0.0,0.0,0.0,0.0,0.0,0.0001,0.0001,0.0001,0.0002,0.0003,0.0004,0.0005,0.0007,0.001,0.0011,0.0013,0.0014,0.0016,0.0017,0.0018,0.0019,0.002,0.0022,0.0023,0.0024,0.0025
COL,0.0037,0.0044,0.0056,0.0066,0.0076,0.0084,0.0077,0.0069,0.0066,0.0062,0.0042,0.0172,0.0256,0.0333,0.043,0.0619,0.0748,0.0894,0.115,0.1399,0.1796,0.202,0.245,0.3124,0.4022,0.3273,0.3517,0.3779
COM,0.0,0.0,0.0,0.0,0.0,0.0,0.0,0.0,0.0,0.0,0.0,0.0,0.0,0.0,0.0,0.0,0.0001,0.0001,0.0001,0.0001,0.0001,0.0001,0.0001,0.0001,0.0001,0.0001,0.0001,0.0001
CRI,0.0,0.0,0.0,0.0001,0.0003,0.0006,0.001,0.0015,0.0024,0.0037,0.0053,0.0064,0.0077,0.0095,0.0111,0.0132,0.0148,0.0164,0.018,0.0196,0.0211,0.0223,0.0238,0.0253,0.0267,0.0282,0.0297,0.0314
CUB,0.0,0.0,0.0001,0.0002,0.0005,0.0011,0.0021,0.0028,0.0038,0.0054,0.0072,0.0106,0.0142,0.0186,0.023,0.0275,0.0318,0.0361,0.0402,0.0443,0.0486,0.0496,0.0531,0.0567,0.0602,0.0638,0.0673,0.0709
CYP,0.0,0.0001,0.0001,0.0006,0.0014,0.0031,0.0051,0.0069,0.0096,0.0129,0.0166,0.021,0.0253,0.0297,0.035,0.0406,0.0456,0.0507,0.0556,0.0606,0.0655,0.0585,0.0593,0.0572,0.0569,0.0668,0.0655,0.0666
CZE,,,,0.0041,0.0085,0.0189,0.0327,0.0426,0.0552,0.073,0.0937,0.1184,0.1403,0.168,0.1983,0.2413,0.2675,0.2974,0.3273,0.5499,0.7912,0.8679,0.9072,0.9559,1.0213,1.0905,1.1373,1.1972
DEU,2.3008,2.413,2.1137,2.0763,2.2821,2.5065,2.8432,3.0303,3.1425,3.1238,3.6476,3.2922,3.4605,3.6289,3.9656,4.3397,4.8073,5.0692,5.4994,5.3311,5.5181,5.7239,5.7613,5.7987,5.8361,6.0045,6.0419,6.0045
DNK,0.0301,0.0322,0.0395,0.0447,0.0585,0.0722,0.0788,0.0976,0.1182,0.1438,0.1725,0.1945,0.2245,0.2507,0.2806,0.3124,0.3479,0.376,0.4059,0.419,0.419,0.3891,0.4265,0.4134,0.3928,0.3068,0.3161,0.2563
DZA,0.0582,0.041,0.0357,0.0294,0.0243,0.02,0.0275,0.0333,0.0441,0.0557,0.0683,0.072,0.0763,0.0814,0.0874,0.0932,0.1014,0.1098,0.1184,0.13,0.1382,0.1437,0.1513,0.159,0.1667,0.1745,0.1822,0.1908
ECU,0.0,0.0,0.0,0.0002,0.0004,0.0008,0.0014,0.002,0.0028,0.0031,0.0042,0.0055,0.007,0.0085,0.0111,0.0134,0.015,0.0169,0.0187,0.0206,0.0223,0.0228,0.0245,0.026,0.0277,0.0292,0.0309,0.0324
EGY,0.3217,0.3273,0.3236,0.3199,0.3348,0.3068,0.3966,0.3255,0.3573,0.3666,0.3161,0.3273,0.3461,0.3554,0.3928,0.4489,0.4676,0.4863,0.4994,0.5163,0.5275,0.5331,0.5518,0.5686,0.5874,0.6042,0.6229,0.6397
ESP,1.2757,1.3113,1.3318,1.3206,1.3019,1.3524,1.4198,1.4048,1.5488,1.2608,1.2832,1.3936,1.4459,1.6199,1.7265,1.8668,2.0202,2.2073,2.3756,2.413,2.5253,2.4317,2.3195,2.3382,2.3195,1.4908,1.4534,1.3056
EST,,,0.0005,0.0005,0.0006,0.0009,0.0012,0.0016,0.002,0.0024,0.0028,0.0034,0.0043,0.0053,0.0067,0.0085,0.0092,0.0104,0.0115,0.0124,0.0137,0.0144,0.0151,0.0162,0.017,0.0174,0.0184,0.0184
ETH,,,,0.0,0.0,0.0,0.0001,0.0002,0.0003,0.0004,0.0008,0.001,0.0012,0.0012,0.0017,0.0022,0.0023,0.0026,0.0029,0.0031,0.0033,0.0036,0.0038,0.0041,0.0043,0.0045,0.0048,0.0051
EU28,10.857,11.5358,11.1229,11.7241,12.3195,12.148,13.5361,13.9385,15.2633,15.6498,19.2285,18.1904,19.2614,19.9923,20.7435,22.1051,23.7635,25.4836,27.3029,30.7469,34.7799,35.5879,35.7246,36.6368,37.8916,39.9119,40.5023,40.6907
FIN,0.0096,0.0102,0.0124,0.0145,0.02,0.0284,0.0372,0.0483,0.0619,0.0829,0.0975,0.1113,0.1283,0.1427,0.1582,0.174,0.1964,0.2132,0.2301,0.2319,0.2768,0.2843,0.2918,0.2993,0.2993,0.2955,0.2974,0.2843
FRA,1.8687,2.0202,2.3569,2.9929,2.413,1.547,1.6966,1.8556,2.1886,2.3569,2.6375,2.731,2.8994,2.9929,3.0864,3.0677,3.3296,3.6476,3.9656,4.2088,4.5642,4.7886,4.8822,4.8634,4.8447,4.9009,4.957,4.8073
GAB,0.0,0.0,0.0,0.0,0.0001,0.0001,0.0002,0.0003,0.0004,0.0005,0.0006,0.0008,0.001,0.0013,0.0015,0.0018,0.0021,0.0023,0.0025,0.0028,0.003,0.0031,0.0033,0.0035,0.0038,0.004,0.0042,0.0044
GBR,1.2907,1.5432,1.5376,1.3318,1.908,2.0015,1.9828,1.9454,2.1324,2.2073,1.9641,2.0202,2.226,2.3382,2.2821,2.4878,2.6749,2.9555,3.1238,3.2361,3.4605,3.1051,3.1612,3.1799,3.1799,3.1612,3.049,2.8994
GEO,,,0.0,0.0,0.0,0.0001,0.0001,0.0002,0.0003,0.0004,0.0005,0.0007,0.0009,0.0014,0.0018,0.0025,0.0028,0.0032,0.0036,0.0039,0.0043,0.0074,0.0111,0.0065,0.0081,0.0087,0.0093,0.0099
GHA,0.1298,0.1235,0.1193,0.1089,0.0819,0.0707,0.0638,0.0619,0.0198,0.0305,0.0322,0.0256,0.0143,0.0025,0.0013,0.0032,0.0028,0.0022,0.0024,0.0027,0.0029,0.0029,0.0032,0.0034,0.0036,0.0038,0.004,0.0042
GRC,0.5032,0.3891,0.361,0.4227,0.4751,0.6004,0.6379,0.6528,0.7108,0.8081,0.6322,0.1493,0.5537,0.5107,0.5069,0.4733,0.2151,0.2338,0.2507,0.26,0.2881,0.3012,0.3311,0.3704,0.3685,0.376,0.3928,0.3872
GRD,0.0003,0.0003,0.0003,0.0003,0.0004,0.0004,0.0004,0.0004,0.0004,0.0004,0.0004,0.0004,0.0004,0.0004,0.0004,0.0004,0.0005,0.0005,0.0005,0.0005,0.0005,0.0005,0.0005,0.0005,0.0005,0.0005,0.0005,0.0006
GTM,0.0,0.0001,0.0002,0.0009,0.0023,0.005,0.0086,0.0123,0.0179,0.0247,0.0333,0.044,0.0561,0.069,0.0847,0.1029,0.1158,0.13,0.144,0.1579,0.1715,0.177,0.1889,0.202,0.2132,0.2263,0.2394,0.2507
HKG,0.0677,0.0638,0.0576,0.0466,0.037,0.0286,0.0282,0.0269,0.0249,0.0264,0.0277,0.0267,0.0256,0.0241,0.0228,0.0213,0.0224,0.0234,0.0245,0.0208,0.0202,0.0195,0.0189,0.0182,0.0175,0.0169,0.0162,0.0156
HRV,,,0.0746,0.0653,0.0636,0.0679,0.0739,0.06,0.0273,0.0219,0.0196,0.0173,0.0104,0.0119,0.0134,0.0152,0.0166,0.018,0.0193,0.0193,0.0187,0.0195,0.0196,0.0219,0.0223,0.0223,0.0226,0.0228
HUN,0.151,0.1308,0.063,0.0705,0.0791,0.0969,0.1003,0.1193,0.1373,0.1603,0.1927,0.2189,0.2488,0.2768,0.3143,0.3461,0.3872,0.3591,0.3947,0.419,0.4246,0.4583,0.4209,0.4433,0.5724,0.7426,0.5705,0.6173
IDN,0.2058,0.1927,0.2132,0.1927,0.1908,0.176,0.1592,0.1386,0.0935,0.0808,0.0397,0.0352,0.0264,0.032,0.0314,0.0329,0.0318,0.0311,0.0312,0.0322,0.0324,0.0088,0.0088,0.0094,0.0074,0.0094,0.0091,0.0075
IND,1.199,1.3131,1.2608,1.3206,1.2813,1.3449,1.2851,1.4216,2.0015,2.0576,2.3569,2.3569,2.3382,3.0303,3.7972,2.5814,2.544,3.9843,3.5541,3.8721,4.1713,4.321,4.5267,4.7325,4.9383,5.144,5.3498,5.5556
IRL,0.0042,0.0076,0.0115,0.0182,0.0273,0.0453,0.0649,0.0853,0.0752,0.1397,0.1983,0.2039,0.1964,0.2207,0.2263,0.245,0.2544,0.2656,0.2768,0.2394,0.2694,0.2787,0.275,0.2843,0.3012,0.303,0.3273,0.3386
IRN,0.1861,0.2189,0.2114,0.1945,0.1828,0.1678,0.1386,0.1289,0.1367,0.1498,0.049,0.0565,0.0834,0.0918,0.0522,0.0537,0.0453,0.0466,0.0475,0.0483,0.0475,0.0204,0.016,0.0149,0.0138,0.0126,0.0115,0.0104
IRQ,0.0451,0.0468,0.047,0.0425,0.0382,0.0337,0.0331,0.0307,0.0275,0.0279,0.0279,0.026,0.0239,0.0213,0.0186,0.0154,0.0163,0.0172,0.0181,0.0128,0.0113,0.0098,0.0082,0.0067,0.0052,0.0036,0.0021,0.0006
ISL,0.2301,0.2282,0.0294,0.0236,0.017,0.0166,0.0169,0.0191,0.0249,0.0294,0.0277,0.0281,0.0282,0.0294,0.0311,0.0322,0.0374,0.0447,0.0773,0.043,0.0447,0.0587,0.073,0.0705,0.0765,0.0821,0.0741,0.0627
ISR,0.1255,0.1235,0.1218,0.1182,0.116,0.1246,0.1395,0.1526,0.2095,0.2413,0.2825,0.333,0.3292,0.3292,0.333,0.3629,0.4022,0.4302,0.4602,0.4901,0.52,0.5387,0.563,0.5892,0.6135,0.6397,0.6659,0.6902
ITA,0.8043,0.7838,0.7202,0.7688,0.8885,0.939,1.4141,1.3917,1.6405,1.8893,1.8051,2.0576,2.1324,2.0763,2.1137,2.1698,2.4317,2.6188,2.8058,3.049,3.2922,3.5166,3.6663,3.8159,3.9282,4.0778,4.1339,4.19
JAM,0.0,0.0,0.0,0.0002,0.0003,0.0007,0.0012,0.0016,0.0022,0.0029,0.0038,0.0049,0.0062,0.0077,0.0092,0.0108,0.0123,0.0138,0.0152,0.0167,0.0181,0.0187,0.02,0.0213,0.0224,0.0238,0.0251,0.0264
JOR,0.0,0.0,0.0,0.0,0.0,0.0,0.0003,0.0007,0.0013,0.002,0.0042,0.0066,0.0096,0.0127,0.0178,0.0238,0.0264,0.0303,0.0342,0.0378,0.0413,0.0423,0.0455,0.0486,0.0518,0.0552,0.0584,0.0615
JPN,5.2937,6.416,7.0333,9.3902,8.9974,13.2435,11.8406,11.9155,11.691,11.2608,10.6622,10.8866,10.1758,10.737,10.7744,11.6349,12.5514,13.3558,14.0853,14.7774,15.563,16.9847,18.6869,20.202,22.2596,24.1302,26.0007,27.3101
KAZ,,,0.0002,0.0008,0.0014,0.0024,0.0038,0.0051,0.0063,0.0085,0.0123,0.0191,0.0275,0.0383,0.0531,0.0728,0.0804,0.098,0.1545,0.1749,0.2319,0.2469,0.245,0.2469,0.2263,0.2376,0.2413,0.2544
KEN,0.0004,0.0004,0.0005,0.0006,0.0007,0.0011,0.0013,0.0019,0.0022,0.0027,0.0032,0.0039,0.0048,0.0058,0.0068,0.008,0.0093,0.0108,0.0123,0.0141,0.0159,0.0151,0.0161,0.0172,0.0182,0.0193,0.0202,0.0213
KGZ,,,0.0,0.0001,0.0001,0.0002,0.0004,0.0007,0.0009,0.0012,0.0017,0.0023,0.0027,0.0036,0.0047,0.0052,0.006,0.0068,0.0075,0.0083,0.0091,0.0093,0.01,0.0106,0.0113,0.0119,0.0126,0.0132
KNA,0.0,0.0,0.0,0.0,0.0,0.0,0.0,0.0001,0.0001,0.0001,0.0002,0.0002,0.0003,0.0004,0.0005,0.0007,0.0008,0.0009,0.001,0.0011,0.0012,0.0012,0.0013,0.0014,0.0015,0.0016,0.0016,0.0017
KOR,0.9091,0.9933,1.0456,1.1354,1.2084,1.3618,2.0202,2.3008,2.2634,3.3483,2.8245,2.095,2.9742,2.544,2.2634,2.3943,2.0389,2.0389,2.1137,1.6274,1.5282,1.2626,1.2589,1.3056,1.401,1.2421,1.2495,1.257
KWT,0.047,0.0627,0.0761,0.0817,0.0859,0.0879,0.0892,0.0853,0.0816,0.0868,0.0937,0.1048,0.1199,0.1416,0.1631,0.185,0.2058,0.2282,0.2507,0.2563,0.2731,0.275,0.2899,0.3049,0.3199,0.3348,0.3498,0.3629
LBR,0.0,0.0,0.0,0.0,0.0,0.0,0.0,0.0001,0.0001,0.0002,0.0003,0.0006,0.001,0.0016,0.0022,0.0029,0.0034,0.0039,0.0045,0.005,0.0055,0.0055,0.0059,0.0064,0.0068,0.0072,0.0077,0.0081
LBY,0.0503,0.0473,0.0426,0.0344,0.0273,0.0208,0.0234,0.0245,0.0249,0.0282,0.0318,0.035,0.0383,0.0417,0.0458,0.0499,0.0533,0.0561,0.0591,0.0597,0.0625,0.0653,0.0681,0.0709,0.0737,0.0765,0.0793,0.0821
LCA,0.0032,0.0034,0.0039,0.0045,0.0052,0.006,0.0068,0.0077,0.0085,0.0093,0.0092,0.009,0.0088,0.0086,0.0085,0.0085,0.0085,0.0085,0.0085,0.0085,0.0085,0.0087,0.0088,0.0088,0.0088,0.0089,0.0089,0.0089
LTU,,,0.0007,0.0016,0.0029,0.0067,0.0114,0.0162,0.0236,0.029,0.0368,0.049,0.0643,0.0875,0.1115,0.1405,0.1577,0.1788,0.2001,0.2301,0.2806,0.2899,0.3348,0.3872,0.4377,0.5387,0.694,0.6753
LUX,,,,,,,,,,,0.0114,0.0136,0.0159,0.018,0.0204,0.0226,0.0254,0.0277,0.0299,0.0316,0.0327,0.0344,0.0359,0.038,0.041,0.0412,0.0402,0.0436
LVA,,,0.0005,0.0014,0.0032,0.0067,0.0111,0.0162,0.0224,0.0299,0.0417,0.0584,0.0786,0.1049,0.142,0.1908,0.2095,0.2394,0.2694,0.2712,0.2918,0.3012,0.3105,0.3367,0.3629,0.3872,0.4246,0.4134
MDA,,,0.0,0.0001,0.0001,0.0001,0.0002,0.0002,0.0003,0.0003,0.0004,0.0006,0.0008,0.001,0.0013,0.0017,0.002,0.0022,0.0025,0.0028,0.003,0.0034,0.0037,0.0039,0.0042,0.0049,0.0052,0.0053
MDG,0.0,0.0,0.0,0.0,0.0,0.0001,0.0002,0.0002,0.0003,0.0005,0.0006,0.0009,0.0007,0.001,0.0012,0.0015,0.0016,0.0017,0.0019,0.002,0.0022,0.0023,0.0025,0.0026,0.0028,0.0029,0.0031,0.0032
MEX,0.535,0.5668,0.3666,0.5294,0.4545,0.4452,0.9951,1.0382,0.8829,1.1635,0.9428,0.7707,1.0438,1.5264,1.9828,3.0116,4.0217,4.2275,4.6764,5.2376,8.4362,2.3569,2.1698,2.2634,2.544,2.2821,4.0217,4.1339
MKD,,,0.0001,0.0004,0.0009,0.002,0.0033,0.0043,0.006,0.0083,0.0109,0.0121,0.0144,0.0174,0.0213,0.0256,0.0281,0.0311,0.0342,0.037,0.0398,0.0282,0.0165,0.0271,0.0301,0.0354,0.0365,0.0378
MLT,0.0,0.0,0.0003,0.0006,0.0011,0.0021,0.0034,0.0047,0.0065,0.0085,0.0108,0.0136,0.0166,0.0189,0.0213,0.0249,0.0279,0.0307,0.0335,0.0363,0.0376,0.0443,0.0516,0.0561,0.0593,0.0632,0.0658,0.0801
MNE,,,,,,,,,,,,,,,,,0.0834,0.0924,0.101,0.1105,0.1207,0.1257,0.1324,0.1405,0.1493,0.1577,0.1661,0.1745
MNG,0.0,0.0,0.0,0.0,0.0,0.0,0.0,0.0,0.0,0.0,0.0,0.0,0.0,0.0,0.0,0.0,0.0,0.0007,0.0022,0.0044,0.008,0.0129,0.0195,0.0211,0.0217,0.0193,0.021,0.0226
MOZ,0.0,0.0,0.0,0.0001,0.0001,0.0003,0.0006,0.001,0.0018,0.0029,0.0094,0.0301,0.0301,0.0432,0.0572,0.061,0.0638,0.0662,0.0664,0.0696,0.073,0.0883,0.0945,0.1008,0.107,0.1132,0.1195,0.1257
MRT,0.0,0.0,0.0,0.0,0.0,0.0,0.0,0.0,0.0,0.0001,0.0001,0.0001,0.0002,0.0004,0.0005,0.0007,0.0008,0.001,0.0011,0.0013,0.0014,0.0014,0.0015,0.0017,0.0018,0.0019,0.002,0.0021
MUS,0.0,0.0,0.0,0.0,0.0001,0.0001,0.0002,0.0003,0.0005,0.0007,0.0009,0.0013,0.0017,0.0021,0.0027,0.0033,0.0038,0.0042,0.0048,0.0052,0.0057,0.0061,0.0065,0.0069,0.0075,0.008,0.0084,0.0089
MYS,0.0357,0.0419,0.0466,0.0464,0.0455,0.0434,0.0395,0.0342,0.0288,0.0413,0.0247,0.0571,0.0718,0.0868,0.0864,0.0937,0.1149,0.1278,0.1405,0.101,0.1046,0.139,0.1483,0.1577,0.167,0.1766,0.1859,0.1945
NGA,0.0432,0.0286,0.0228,0.0167,0.0114,0.0067,0.0126,0.0185,0.0288,0.0423,0.0513,0.0615,0.072,0.09,0.1089,0.1313,0.1431,0.1581,0.1745,0.1908,0.2076,0.2132,0.2282,0.2413,0.2563,0.2712,0.2843,0.2993
NLD,1.4927,1.5301,1.532,1.6349,1.7284,1.6442,1.792,1.7471,1.908,1.7602,1.8893,1.1074,0.8923,1.0138,0.9446,0.9989,1.0905,1.1485,1.2233,1.2701,1.3337,1.1934,1.2514,1.012,0.8792,0.9596,0.9764,0.9241
NOR,1.7228,1.5376,1.0905,1.1092,1.0681,1.0101,1.0157,1.07,1.098,1.156,1.199,1.2196,0.9035,0.9877,1.098,1.1523,1.1186,1.1541,1.1691,0.6566,0.4489,0.5294,0.4489,0.4265,0.4227,0.4059,0.4639,0.3853
NZL,0.1927,0.1818,0.1618,0.1745,0.1321,0.159,0.1652,0.1478,0.1601,0.159,0.1545,0.148,0.1485,0.1661,0.1831,0.1983,0.2151,0.2338,0.2469,0.2675,0.3012,0.3105,0.3367,0.3554,0.3984,0.4209,0.4078,0.4171
OMN,0.0,0.0,0.0001,0.0003,0.0006,0.0013,0.0018,0.0021,0.0025,0.0028,0.0018,0.0066,0.0125,0.0193,0.0277,0.0374,0.0432,0.0503,0.0585,0.0711,0.0782,0.0739,0.0797,0.0855,0.0913,0.0971,0.1029,0.1087
PAK,0.06,0.0552,0.0481,0.0372,0.0281,0.02,0.0202,0.0195,0.0182,0.0195,0.0206,0.0254,0.0307,0.0361,0.0423,0.0488,0.0514,0.0539,0.001,0.001,0.001,0.0247,0.0245,0.0245,0.0243,0.0241,0.0239,0.0238
PER,0.0,0.0001,0.0002,0.0007,0.0019,0.0043,0.0072,0.0105,0.0134,0.0172,0.0219,0.0269,0.0354,0.0441,0.0557,0.0705,0.078,0.0879,0.0978,0.1068,0.116,0.119,0.1272,0.1354,0.1438,0.1521,0.1603,0.1687
PHL,0.0288,0.0421,0.0541,0.0593,0.0627,0.063,0.058,0.0509,0.0432,0.0417,0.0395,0.044,0.0488,0.0537,0.0593,0.0651,0.0686,0.072,0.0752,0.066,0.0672,0.0683,0.0696,0.0707,0.0718,0.0731,0.0743,0.0756
PNG,0.0,0.0,0.0001,0.0004,0.001,0.0018,0.0026,0.0025,0.0023,0.0027,0.0001,0.0016,0.0034,0.0057,0.0085,0.012,0.0137,0.0161,0.0185,0.0206,0.0228,0.0217,0.0234,0.0251,0.0266,0.0282,0.0299,0.0314
POL,0.1483,0.1566,0.1779,0.1839,0.2095,0.2525,0.2675,0.2974,0.3292,0.3404,3.1987,3.0677,3.049,2.8807,2.8058,2.9929,3.1051,3.2174,3.3296,3.1612,3.0864,3.4044,3.6289,4.0591,4.4893,6.2477,6.2103,6.5095
PRK,0.0001,0.0005,0.001,0.0037,0.0086,0.0153,0.0496,0.0859,0.139,0.2039,0.3741,0.4134,0.4695,0.5163,0.5612,0.6004,0.6659,0.7146,0.8062,0.8586,0.9128,0.9895,1.0513,1.113,1.1747,1.2364,1.3,1.3618
PRT,0.0112,0.011,0.0128,0.0135,0.0173,0.0251,0.0354,0.0447,0.0587,0.0748,0.0924,0.1025,0.1182,0.1289,0.1429,0.1525,0.1725,0.1865,0.202,1.214,2.226,2.5253,2.8245,3.1425,3.4605,3.8159,4.19,4.6016
ROU,0.4471,0.4078,0.2825,0.275,0.2862,0.3049,0.275,0.275,0.2525,0.2132,0.176,0.1388,0.1023,0.1149,0.1418,0.1626,0.1779,0.1983,0.2132,0.1403,0.2189,0.2095,0.2039,0.2132,0.2245,0.2637,0.2955,0.3367
RUS,,,7.5945,8.2305,7.9686,8.4549,8.4923,9.0161,9.5211,10.0636,10.8492,10.9615,10.4938,10.6061,12.1025,12.8694,13.15,14.0666,14.1601,12.4392,13.5241,13.8234,27.6842,29.9289,23.382,22.2596,23.0079,30.116
RWA,0.0,0.0,0.0,0.0,0.0,0.0001,0.0001,0.0001,0.0002,0.0003,0.0004,0.0009,0.0022,0.0039,0.0067,0.0102,0.0111,0.013,0.015,0.0166,0.0182,0.0182,0.0196,0.0211,0.0224,0.0239,0.0254,0.0269
SAU,0.1452,0.1446,0.1322,0.1107,0.0911,0.0761,0.0791,0.0786,0.0786,0.0874,0.0202,0.0258,0.0359,0.0436,0.0408,0.0484,0.0516,0.0572,0.0627,0.0679,0.073,0.0701,0.0748,0.0795,0.0842,0.0889,0.0937,0.0984
SGP,0.0542,0.0602,0.0604,0.0713,0.0797,0.1038,0.1283,0.1502,0.1766,0.2357,0.2656,0.376,0.4227,0.4714,0.4826,0.5163,0.5892,0.6379,0.6846,0.6379,0.6771,0.6603,0.6453,0.7894,0.8249,0.8623,0.8979,0.9334
SLE,0.0,0.0,0.0,0.0,0.0,0.0,0.0,0.0,0.0,0.0,0.0,0.0001,0.0002,0.0004,0.0006,0.001,0.0011,0.0013,0.0015,0.0017,0.0018,0.0018,0.002,0.0021,0.0022,0.0024,0.0025,0.0027
SLV,0.0,0.0,0.0,0.0,0.0,0.0,0.0005,0.0013,0.0025,0.0042,0.0088,0.0104,0.012,0.0135,0.0149,0.0164,0.0185,0.02,0.0217,0.0234,0.0251,0.0273,0.0292,0.0311,0.0327,0.0346,0.0365,0.0382
SOM,0.0,0.0,0.0,0.0,0.0,0.0,0.0,0.0,0.0,0.0001,0.0001,0.0001,0.0002,0.0002,0.0002,0.0003,0.0003,0.0003,0.0003,0.0004,0.0004,0.0004,0.0005,0.0005,0.0005,0.0005,0.0006,0.0006
SRB,,,,,,,,,,,,,,,,,1.0101,1.1205,1.2252,1.3412,1.4553,1.5021,1.5993,1.6966,1.7976,1.908,2.0015,2.1137
SVK,,,,0.0054,0.006,0.0105,0.0264,0.0284,0.0325,0.0359,0.0425,0.0475,0.0556,0.0651,0.0771,0.0879,0.0982,0.1085,0.118,0.2768,0.3348,0.3255,0.3404,0.3404,0.3423,0.3835,0.3479,0.3835
SVN,,,0.1255,0.1171,0.1042,0.0739,0.072,0.067,0.0735,0.0715,0.0701,0.0632,0.0625,0.0748,0.0875,0.1016,0.1076,0.116,0.1253,0.1195,0.1296,0.1311,0.1403,0.1474,0.1551,0.165,0.1719,0.173
SWE,0.2058,0.5406,0.1756,0.1818,0.1983,0.2319,0.2544,0.2806,0.2862,0.3105,0.3348,0.3573,0.3853,0.4022,0.4265,0.462,0.4882,0.5181,0.5294,0.4171,0.5013,0.462,0.4153,0.3928,0.4134,0.4134,0.4227,0.4097
THA,0.2544,0.2563,0.2507,0.2189,0.1927,0.164,0.1465,0.1238,0.1006,0.0917,0.0808,0.1008,0.1221,0.1444,0.17,0.1964,0.2076,0.217,0.2282,0.1964,0.202,0.2076,0.2114,0.217,0.2226,0.2282,0.2338,0.2394
TJK,,,0.8492,0.5125,0.4639,0.4078,0.303,0.2712,0.2151,0.2001,0.177,0.1268,0.0677,0.0705,0.0795,0.0847,0.0924,0.0939,0.0771,0.0817,0.0799,0.0164,0.0049,0.0052,0.0056,0.0059,0.0062,0.0066
TKM,,,0.0,0.0001,0.0002,0.0004,0.0006,0.0006,0.0008,0.0014,0.0023,0.0042,0.0068,0.0101,0.0128,0.0157,0.0186,0.0213,0.0241,0.0271,0.0299,0.0299,0.0324,0.0346,0.0368,0.0391,0.0413,0.0438
TUN,0.0,0.0,0.0,0.0,0.0,0.0,0.0,0.0,0.0,0.0,0.0,0.0,0.0,0.0,0.0,0.0,0.0,0.0,0.0,0.0,0.0,0.0,0.0,0.0,0.0,0.0,0.0,0.0
TUR,0.2376,0.2376,0.2525,0.2376,0.2319,0.2263,0.2319,0.245,0.2637,0.2843,0.3311,0.3423,0.4227,0.5013,0.6135,0.7426,0.8006,0.8979,0.9858,1.2795,1.6835,1.835,1.9267,1.8706,1.9641,1.7695,2.226,2.7684
TWN,0.1461,0.1601,0.1601,0.1657,0.1801,0.2432,0.3554,0.5874,0.5799,0.8156,1.1766,1.07,1.3131,1.4703,1.5413,1.3636,1.5619,1.633,1.7041,1.3749,1.4796,1.835,1.908,1.9828,2.0763,2.1511,2.226,2.3008
UKR,,,0.0599,0.0567,0.0591,0.0593,0.0681,0.0758,0.0853,0.0939,0.0947,0.0971,0.0995,0.1115,0.1298,0.1422,0.1586,0.173,0.1871,0.1848,0.1983,0.1945,0.217,0.2319,0.26,0.2712,0.3217,0.3666
URY,0.0001,0.0001,0.0002,0.0002,0.0004,0.0006,0.0013,0.002,0.0031,0.0041,0.0063,0.0071,0.0067,0.0078,0.0106,0.0133,0.014,0.0154,0.0168,0.0178,0.0187,0.0094,0.0,0.0365,0.0872,0.0393,0.0419,0.0447
USA,16.2738,16.3487,16.0868,15.9933,17.2278,18.8926,21.3244,23.0079,26.749,30.303,32.9218,33.8571,37.5982,39.8429,43.771,47.5122,51.8144,55.9297,59.2967,64.5342,72.2035,73.1388,71.0812,70.333,72.2035,72.7647,72.9517,73.887
UZB,,,0.0004,0.0015,0.0034,0.0071,0.0115,0.0165,0.0232,0.0318,0.0406,0.0524,0.0653,0.0797,0.1031,0.1298,0.1427,0.1607,0.1786,0.1945,0.2114,0.7052,0.896,0.5481,0.5911,0.6341,0.6771,0.7202
VCT,0.0,0.0,0.0,0.0,0.0,0.0,0.0,0.0,0.0,0.0001,0.0001,0.0002,0.0002,0.0003,0.0003,0.0004,0.0005,0.0005,0.0006,0.0006,0.0007,0.0007,0.0007,0.0008,0.0008,0.0009,0.0009,0.001
VEN,0.7052,0.7108,0.6472,0.5948,0.4845,0.4826,0.462,0.4545,0.3666,0.2357,0.2432,0.2619,0.2039,0.1983,0.3049,0.2694,0.3292,0.3629,0.4097,0.4377,0.4751,0.3648,0.3704,0.3853,0.3984,0.4134,0.4284,0.4415
ZAF,0.1575,0.1336,0.1242,0.1119,0.0997,0.1051,0.1801,0.2001,0.2039,0.2095,0.1871,0.1889,0.2001,0.2488,0.2787,0.2899,0.3124,0.3236,0.3217,0.3348,0.2694,0.2825,0.7239,0.6566,0.5294,0.5537,0.5799,0.6061
ZMB,0.0,0.0,0.0,0.0,0.0,0.0,0.0,0.0,0.0,0.0,0.0,0.0,0.0,0.0,0.0001,0.0001,0.0001,0.0001,0.0001,0.0001,0.0001,0.0001,0.0001,0.0002,0.0002,0.0002,0.0002,0.0002
