### META ###
ID,Production|Pig__Historic__FAO_2020
category,Pig
creator,AG
entity,Production
pathway,Historic
scenario,Historic
source,FAO_2020
unit,tonnes
variable,Production|Pig
### DATA ###
region,1961,1962,1963,1964,1965,1966,1967,1968,1969,1970,1971,1972,1973,1974,1975,1976,1977,1978,1979,1980,1981,1982,1983,1984,1985,1986,1987,1988,1989,1990,1991,1992,1993,1994,1995,1996,1997,1998,1999,2000,2001,2002,2003,2004,2005,2006,2007,2008,2009,2010,2011,2012,2013,2014,2015,2016,2017
AGO,8000.0,8000.0,8000.0,8000.0,9000.0,9000.0,9000.0,9000.0,9000.0,9000.0,9500.0,9800.0,10350.0,11000.0,11500.0,12250.0,13000.0,13750.0,15750.0,16500.0,17000.0,17750.0,18500.0,19250.0,20000.0,20600.0,21000.0,21150.0,22000.0,23992.0,23000.0,24000.0,24500.0,25000.0,26000.0,28000.0,29000.0,29058.0,28600.0,29000.0,29900.0,34100.0,35750.0,39300.0,39900.0,44600.0,49800.0,55600.0,61900.0,69550.0,76700.0,84500.0,93600.0,103107.0,112307.0,113755.0,121023.0
ALB,3580.0,3640.0,3200.0,3200.0,3640.0,4300.0,4880.0,5570.0,6100.0,6280.0,6440.0,6560.0,6160.0,6400.0,6400.0,6600.0,6800.0,6800.0,7000.0,7000.0,8800.0,8800.0,9200.0,9600.0,10400.0,11200.0,11200.0,12000.0,12000.0,13300.0,9000.0,10600.0,12500.0,13550.0,13600.0,6360.0,6600.0,6500.0,6200.0,7800.0,7800.0,8600.0,8600.0,10100.0,11300.0,11250.0,12500.0,12500.0,12500.0,12500.0,13100.0,13260.0,13494.0,11900.0,11424.0,11424.0,11561.0
ARG,186932.0,159260.0,157408.0,153787.0,212536.0,233100.0,217260.0,182605.0,204665.0,210172.0,248026.0,216041.0,257707.0,240450.0,255064.0,257764.0,241489.0,214079.0,258241.0,263280.0,253663.0,230316.0,207204.0,210884.0,192968.0,206486.0,204687.0,192526.0,172051.0,140548.0,141585.0,157230.0,230140.0,230340.0,211433.0,179589.0,160971.0,184041.0,214583.0,213965.0,197504.0,165292.0,149755.0,160000.0,185000.0,230000.0,240000.0,274355.0,288851.0,279102.0,300663.0,331000.0,416442.0,442025.0,483437.0,522428.0,566276.0
ARM,,,,,,,,,,,,,,,,,,,,,,,,,,,,,,,,16800.0,4500.0,6100.0,4800.0,5600.0,5400.0,7200.0,8300.0,9100.0,8509.0,10310.0,11508.0,8505.0,9400.0,14100.0,13300.0,7500.0,7200.0,7900.0,9400.0,9500.0,12600.0,16200.0,17500.0,18000.0,16600.0
ASM,354.0,300.0,400.0,500.0,640.0,636.0,385.0,340.0,287.0,287.0,288.0,290.0,291.0,294.0,297.0,300.0,303.0,306.0,309.0,310.0,310.0,310.0,312.0,312.0,313.0,315.0,315.0,315.0,315.0,315.0,315.0,315.0,315.0,315.0,315.0,315.0,315.0,315.0,315.0,315.0,315.0,315.0,315.0,315.0,314.0,315.0,315.0,314.0,312.0,311.0,311.0,311.0,310.0,310.0,310.0,309.0,309.0
ATG,47.0,48.0,48.0,50.0,53.0,54.0,60.0,70.0,75.0,80.0,94.0,82.0,84.0,43.0,30.0,33.0,55.0,62.0,73.0,91.0,56.0,56.0,62.0,75.0,80.0,80.0,83.0,88.0,72.0,78.0,78.0,80.0,80.0,80.0,83.0,102.0,117.0,135.0,151.0,169.0,178.0,181.0,188.0,194.0,194.0,180.0,150.0,130.0,100.0,55.0,75.0,67.0,70.0,61.0,50.0,50.0,50.0
AUS,110000.0,122427.0,116223.0,113069.0,122156.0,135135.0,142247.0,149359.0,162568.0,174761.0,181873.0,194065.0,236173.0,211036.0,175071.0,173825.0,185083.0,199080.0,198600.0,219565.0,233000.0,228431.0,239100.0,253279.0,260321.0,270914.0,282831.0,296772.0,308143.0,317117.0,312116.0,335785.0,328317.0,344260.0,351299.0,333967.0,344200.0,369000.0,362200.0,364400.0,378531.0,407274.0,418875.0,394823.0,390336.0,382682.0,384586.0,345076.0,323670.0,338734.0,344266.0,351737.0,359903.0,362192.0,371163.0,377643.0,397139.0
AUT,288655.0,297920.0,297100.0,311000.0,317880.0,296240.0,303903.0,317110.0,325110.0,332597.0,355320.0,351700.0,347550.0,359140.0,368710.0,394980.0,408390.0,408320.0,435850.0,426230.0,452850.0,463300.0,455850.0,467350.0,476200.0,462150.0,469850.0,521830.0,517992.0,517047.0,462406.0,462801.0,475606.0,472562.0,457420.0,472194.0,474681.0,499553.0,519568.0,505385.0,488675.0,512129.0,517569.0,514653.0,510085.0,513971.0,535904.0,532946.0,540299.0,545818.0,544166.0,530263.0,529284.0,527442.0,529118.0,514892.0,508494.0
AZE,,,,,,,,,,,,,,,,,,,,,,,,,,,,,,,,6593.0,3347.0,2533.0,2801.0,2181.0,2261.0,1834.0,2119.0,1413.0,1550.0,1664.0,2072.0,2191.0,2056.0,1915.0,1402.0,1187.0,802.0,800.0,729.0,741.0,743.0,674.0,709.0,472.0,471.0
BDI,194.0,207.0,206.0,133.0,192.0,384.0,300.0,852.0,1060.0,848.0,1120.0,1348.0,1420.0,1532.0,1768.0,2632.0,1568.0,1680.0,1792.0,3076.0,2680.0,3160.0,4260.0,4400.0,3368.0,4440.0,4660.0,6900.0,5280.0,1160.0,1000.0,1200.0,1080.0,960.0,1000.0,960.0,980.0,1240.0,1600.0,1567.0,1526.0,1164.0,1426.0,995.0,2303.0,3440.0,2978.0,1208.0,3773.0,3692.0,3735.0,5117.0,5351.0,7387.0,8956.0,9024.0,8850.0
BEL,,,,,,,,,,,,,,,,,,,,,,,,,,,,,,,,,,,,,,,,1042320.0,1062400.0,1040710.0,1026472.0,1054010.0,1012934.0,1000928.0,1061045.0,1056169.0,1082036.0,1123769.0,1108255.0,1109610.0,1130572.0,1118330.0,1124310.0,1060541.0,1044561.0
BEN,2688.0,3080.0,3388.0,3721.0,3945.0,3358.0,3881.0,3434.0,3651.0,3983.0,4022.0,3894.0,3948.0,3948.0,3947.0,4311.0,4494.0,4704.0,4900.0,5068.0,5320.0,5572.0,5824.0,5852.0,6496.0,6608.0,6916.0,5180.0,5124.0,5180.0,6180.0,6360.0,6600.0,7470.0,7350.0,8100.0,6396.0,3570.0,2625.0,4020.0,3735.0,3855.0,4020.0,4170.0,4085.0,4245.0,4414.0,4604.0,4748.0,4944.0,5130.0,5400.0,5460.0,5786.0,6051.0,6218.0,6373.0
BFA,1093.0,1003.0,1039.0,1282.0,1395.0,1635.0,1515.0,1518.0,1611.0,1763.0,1998.0,1763.0,1410.0,1410.0,1716.0,1763.0,1845.0,1904.0,1974.0,2045.0,2938.0,3525.0,4113.0,4700.0,4982.0,5170.0,5335.0,5640.0,5875.0,7694.0,10806.0,11888.0,13078.0,14388.0,15828.0,17413.0,19157.0,21075.0,23186.0,25508.0,28062.0,30872.0,33963.0,37364.0,41106.0,45216.0,42538.0,37497.0,38246.0,39000.0,39780.0,39900.0,40800.0,41004.0,41252.0,40549.0,40825.0
BGR,140634.0,137300.0,117169.0,131418.0,164625.0,158451.0,168486.0,184680.0,164075.0,147115.0,169222.0,201380.0,185370.0,176244.0,269406.0,316524.0,275499.0,275523.0,307100.0,313081.0,326020.0,323884.0,333560.0,334823.0,334260.0,371749.0,371855.0,393657.0,411514.0,405780.0,361523.0,311430.0,276761.0,207096.0,256430.0,252420.0,226700.0,248050.0,267132.0,242865.0,50211.0,61784.0,70644.0,78320.0,74532.0,77009.0,76303.0,73757.0,73659.0,70471.0,72506.0,73159.0,72905.0,67442.0,69259.0,72737.0,75133.0
BHS,205.0,210.0,213.0,215.0,215.0,220.0,220.0,300.0,300.0,285.0,275.0,260.0,245.0,225.0,215.0,210.0,200.0,200.0,200.0,200.0,190.0,190.0,185.0,185.0,180.0,175.0,175.0,170.0,165.0,168.0,165.0,160.0,155.0,155.0,179.0,163.0,163.0,163.0,190.0,310.0,315.0,313.0,320.0,325.0,325.0,325.0,330.0,330.0,330.0,330.0,330.0,334.0,340.0,343.0,335.0,335.0,336.0
BIH,,,,,,,,,,,,,,,,,,,,,,,,,,,,,,,,10000.0,9500.0,10500.0,11000.0,8000.0,5000.0,7600.0,7000.0,6300.0,4300.0,6400.0,7400.0,8207.0,8850.0,9784.0,9011.0,8507.0,9717.0,13290.0,16570.0,15695.0,13013.0,9663.0,8534.0,8523.0,8771.0
BLR,,,,,,,,,,,,,,,,,,,,,,,,,,,,,,,,323000.0,283900.0,251800.0,262800.0,273000.0,297400.0,319700.0,310500.0,301500.0,303400.0,300700.0,300700.0,298900.0,321000.0,345900.0,371900.0,376000.0,388200.0,398400.0,419300.0,442900.0,468900.0,360300.0,361600.0,384400.0,399500.0
BLZ,735.0,735.0,700.0,665.0,700.0,700.0,665.0,665.0,665.0,735.0,840.0,840.0,840.0,805.0,875.0,840.0,840.0,840.0,840.0,840.0,840.0,875.0,1015.0,1120.0,1225.0,1260.0,1260.0,1295.0,475.0,649.0,459.0,570.0,361.0,671.0,674.0,656.0,665.0,652.0,849.0,841.0,1090.0,975.0,1034.0,780.0,1067.0,1161.0,1118.0,1067.0,1195.0,1220.0,1181.0,1409.0,1342.0,1373.0,1635.0,1687.0,1778.0
BMU,49.0,52.0,55.0,75.0,72.0,86.0,73.0,95.0,85.0,80.0,76.0,50.0,40.0,25.0,28.0,63.0,85.0,100.0,100.0,120.0,125.0,140.0,155.0,140.0,125.0,125.0,110.0,100.0,95.0,92.0,95.0,90.0,89.0,85.0,86.0,50.0,51.0,56.0,50.0,50.0,59.0,61.0,62.0,64.0,60.0,60.0,70.0,74.0,75.0,70.0,70.0,72.0,72.0,70.0,70.0,74.0,75.0
BOL,18570.0,18930.0,19273.0,19616.0,21116.0,21300.0,21570.0,23300.0,25110.0,27525.0,28813.0,30200.0,31715.0,33296.0,35243.0,36956.0,39343.0,41118.0,42973.0,47704.0,49224.0,51003.0,62355.0,53119.0,55137.0,53651.0,57068.0,60573.0,53863.0,65290.0,65316.0,66767.0,57663.0,59619.0,62277.0,65754.0,68659.0,72170.0,74060.0,76422.0,96950.0,100550.0,104150.0,107750.0,108000.0,110000.0,111966.0,114488.0,80464.0,83881.0,86302.0,89606.0,90599.0,92168.0,93628.0,100000.0,106000.0
BRA,534119.0,588408.0,574880.0,577989.0,595849.0,665106.0,667993.0,717524.0,719313.0,766523.0,802186.0,772000.0,700560.0,723000.0,760000.0,784500.0,834000.0,850000.0,900000.0,980000.0,980000.0,870000.0,885000.0,757000.0,780000.0,825000.0,1000000.0,1100000.0,1020000.0,1050000.0,1200000.0,1260000.0,1500000.0,1700000.0,1800000.0,1900000.0,2050000.0,2400000.0,2400000.0,2600000.0,2637000.0,2798000.0,3059000.0,3110000.0,2800000.0,2830000.0,2990000.0,3015000.0,3130000.0,3195000.0,3227000.0,3149726.0,3117087.0,3192918.0,3430734.0,3711235.0,3824682.0
BRB,2005.0,2157.0,2337.0,2366.0,2404.0,2499.0,2537.0,2622.0,2784.0,3278.0,3943.0,3990.0,3990.0,4845.0,4465.0,4750.0,4940.0,5700.0,4845.0,5605.0,5700.0,5700.0,5225.0,4560.0,4560.0,3990.0,3990.0,3895.0,3800.0,3724.0,3658.0,3525.0,3458.0,1688.0,1928.0,3059.0,2926.0,2793.0,2356.0,1922.0,1799.0,1410.0,1756.0,2064.0,2308.0,2637.0,2502.0,2637.0,2747.0,2745.0,2657.0,2541.0,2498.0,2704.0,2847.0,2664.0,2801.0
BRN,368.0,385.0,420.0,368.0,473.0,469.0,373.0,403.0,410.0,406.0,424.0,375.0,345.0,385.0,352.0,394.0,329.0,448.0,420.0,484.0,398.0,442.0,455.0,760.0,599.0,546.0,690.0,830.0,966.0,368.0,350.0,175.0,123.0,88.0,39.0,32.0,49.0,46.0,46.0,49.0,49.0,46.0,49.0,42.0,42.0,53.0,53.0,53.0,50.0,48.0,46.0,44.0,50.0,53.0,54.0,53.0,53.0
BTN,569.0,580.0,587.0,598.0,606.0,613.0,620.0,624.0,661.0,668.0,672.0,679.0,734.0,807.0,818.0,826.0,837.0,844.0,862.0,1100.0,881.0,899.0,954.0,989.0,991.0,1101.0,1101.0,1101.0,1101.0,1138.0,1156.0,1182.0,1204.0,1222.0,1285.0,1578.0,1395.0,1468.0,1468.0,1285.0,1285.0,1285.0,1101.0,1101.0,750.0,936.0,936.0,954.0,958.0,962.0,761.0,991.0,594.0,570.0,631.0,625.0,780.0
BWA,143.0,180.0,205.0,215.0,245.0,260.0,280.0,290.0,375.0,300.0,550.0,535.0,560.0,595.0,550.0,500.0,450.0,350.0,250.0,245.0,200.0,200.0,165.0,360.0,360.0,385.0,390.0,450.0,570.0,660.0,525.0,365.0,175.0,150.0,180.0,505.0,188.0,668.0,430.0,893.0,265.0,300.0,165.0,300.0,400.0,450.0,500.0,447.0,443.0,455.0,460.0,500.0,500.0,1423.0,600.0,575.0,577.0
CAF,450.0,540.0,600.0,750.0,900.0,1239.0,1320.0,1371.0,1404.0,1485.0,1551.0,1602.0,1650.0,1692.0,3000.0,3900.0,3900.0,4500.0,4500.0,4500.0,5700.0,5700.0,5900.0,6100.0,6200.0,6500.0,6870.0,7080.0,7290.0,7950.0,8000.0,8100.0,8700.0,9300.0,9900.0,11319.0,11800.0,11900.0,12000.0,12000.0,12500.0,12500.0,12900.0,13500.0,13360.0,13243.0,13200.0,16950.0,17650.0,18730.0,18185.0,16350.0,17000.0,17854.0,17130.0,18410.0,18223.0
CAN,534150.0,539120.0,537200.0,580390.0,551130.0,555940.0,654440.0,644260.0,614520.0,745720.0,813150.0,787080.0,763364.0,767201.0,654655.0,643187.0,647734.0,741444.0,889285.0,1033616.0,1015170.0,1005920.0,1029610.0,1043770.0,1088420.0,1093920.0,1121800.0,1181600.0,1177154.0,1123849.0,1096230.0,1207700.0,1194320.0,1229380.0,1275760.0,1227760.0,1256700.0,1393610.0,1563870.0,1639980.0,1731130.0,1857180.0,1880740.0,1934740.0,1918460.0,1899660.0,1906720.0,1952610.0,1950140.0,1938220.0,1975340.0,2004420.0,1981460.0,1962760.0,2063622.0,2085896.0,2141807.0
CHE,136459.0,130282.0,136534.0,147287.0,161317.0,158251.0,167509.0,188610.0,197000.0,196220.0,208894.0,223716.0,236595.0,237713.0,235403.0,246489.0,262163.0,258427.0,263466.0,278807.0,275364.0,289480.0,290900.0,276340.0,284600.0,285720.0,277620.0,278670.0,280262.0,269598.0,265473.0,264120.0,260555.0,246212.0,250806.0,220002.0,214487.0,231609.0,226448.0,225067.0,234476.0,235810.0,229719.0,227252.0,236452.0,243633.0,242064.0,231065.0,237912.0,249541.0,249067.0,242780.0,235554.0,242094.0,241394.0,238682.0,238602.0
CHL,29000.0,25000.0,25000.0,27000.0,32516.0,34430.0,36625.0,41639.0,42184.0,44387.0,45161.0,51346.0,49176.0,49902.0,29960.0,24880.0,28891.0,33815.0,42541.0,49743.0,55839.0,57703.0,59228.0,59133.0,66046.0,75495.0,88255.0,100113.0,113225.0,123171.0,128835.0,137571.0,147282.0,160814.0,172410.0,184698.0,208703.0,235014.0,243693.0,261477.0,303006.0,350721.0,365343.0,372845.0,410664.0,467866.0,498706.0,522423.0,513741.0,498489.0,527857.0,583671.0,550033.0,520074.0,523831.0,507740.0,489003.0
CHN,1606569.0,2042428.0,3606120.0,4825433.0,5595767.0,6089111.0,6418969.0,6332979.0,6153643.0,6138780.0,7091292.0,7874478.0,7941115.0,7849644.0,7995669.0,7983648.0,8018553.0,8772206.0,10868606.0,12125430.0,12674096.0,13527814.0,14008882.0,15366156.0,17566976.0,18239358.0,19490155.0,21092872.0,22133653.0,23559489.0,25824122.0,27647176.0,29836491.0,33426476.0,37885022.0,33014694.0,37156348.0,39900430.0,41049331.0,40751526.0,41654251.0,42322776.0,43433462.0,44478789.0,46622207.0,47590463.0,43933237.0,47190352.0,49897955.0,51693862.0,51593351.0,54435720.0,55917319.0,57660830.0,57418546.0,55195010.0,55449461.0
CIV,2063.0,2069.0,2462.0,2783.0,2930.0,3150.0,3155.0,4439.0,4541.0,4646.0,4725.0,4970.0,5320.0,5705.0,6195.0,6755.0,7630.0,8295.0,8680.0,8820.0,8960.0,9030.0,9100.0,9170.0,9240.0,9310.0,9380.0,9590.0,9800.0,10080.0,10360.0,10640.0,10990.0,11340.0,12950.0,7700.0,7525.0,5841.0,6086.0,6347.0,6624.0,6764.0,6907.0,7054.0,7203.0,7357.0,6920.0,6902.0,7082.0,6894.0,7195.0,7215.0,7323.0,7592.0,7756.0,8034.0,8000.0
CMR,3048.0,3000.0,3120.0,3120.0,3108.0,3348.0,3000.0,4164.0,4560.0,5160.0,5760.0,6360.0,6360.0,6600.0,6600.0,9744.0,10908.0,12144.0,13344.0,14400.0,13254.0,10800.0,9120.0,9600.0,13500.0,17411.0,14137.0,14844.0,15600.0,16380.0,14400.0,13200.0,12000.0,12000.0,12000.0,12000.0,12000.0,14400.0,12000.0,16140.0,16200.0,16200.0,16200.0,29100.0,29850.0,30300.0,31350.0,32600.0,31100.0,37800.0,39000.0,28500.0,29400.0,30551.0,31518.0,31150.0,31017.0
COD,18000.0,18500.0,19000.0,19500.0,20000.0,20750.0,22000.0,22750.0,23200.0,24500.0,25500.0,25800.0,26600.0,27000.0,27400.0,27500.0,27400.0,26800.0,27300.0,26700.0,27000.0,27300.0,27500.0,27800.0,28900.0,28900.0,29000.0,28000.0,29000.0,31000.0,27376.0,28752.0,28342.0,28652.0,27730.0,28583.0,28640.0,28697.0,27368.0,26090.0,24872.0,23710.0,23760.0,23810.0,23860.0,23910.0,23960.0,24010.0,24060.0,24100.0,24160.0,24622.0,24673.0,24458.0,24417.0,24231.0,24268.0
COG,1165.0,1210.0,1254.0,1120.0,1030.0,941.0,806.0,1120.0,1344.0,1658.0,1658.0,1658.0,1613.0,1613.0,1775.0,2005.0,2055.0,2178.0,1568.0,1182.0,986.0,1081.0,1114.0,1378.0,1557.0,1982.0,2122.0,2234.0,1988.0,2016.0,2061.0,2072.0,2128.0,2184.0,2240.0,2296.0,2324.0,2380.0,1350.0,1395.0,1410.0,1440.0,1450.0,1500.0,1520.0,1560.0,1600.0,1716.0,1831.0,1850.0,1890.0,1925.0,2000.0,1878.0,1721.0,1844.0,1836.0
COK,165.0,168.0,173.0,165.0,219.0,72.0,145.0,145.0,145.0,145.0,145.0,90.0,120.0,210.0,240.0,425.0,465.0,465.0,465.0,468.0,471.0,480.0,479.0,480.0,480.0,480.0,450.0,420.0,390.0,360.0,330.0,270.0,360.0,420.0,480.0,600.0,689.0,735.0,613.0,587.0,520.0,511.0,520.0,550.0,550.0,550.0,555.0,555.0,555.0,555.0,555.0,555.0,555.0,555.0,551.0,576.0,565.0
COL,75115.0,72250.0,71720.0,65755.0,64350.0,65050.0,72830.0,69030.0,66690.0,69030.0,71140.0,72070.0,83450.0,83000.0,98245.0,99646.0,99934.0,104677.0,95130.0,93955.0,105400.0,100800.0,111000.0,113859.0,118160.0,122960.0,122000.0,131000.0,125900.0,133490.0,133430.0,134710.0,134000.0,133200.0,133185.0,128700.0,103000.0,75409.0,107000.0,105000.0,98431.0,109189.0,123886.0,129866.0,127679.0,148239.0,177196.0,169821.0,171254.0,196614.0,216235.0,330798.0,244307.0,263151.0,305105.0,349125.0,355000.0
CPV,310.0,330.0,370.0,450.0,550.0,700.0,700.0,725.0,750.0,750.0,800.0,850.0,990.0,775.0,725.0,625.0,750.0,825.0,925.0,1050.0,1150.0,1837.0,1470.0,1379.0,2374.0,2513.0,3000.0,3185.0,3413.0,3711.0,3911.0,7327.0,7000.0,4696.0,8350.0,3060.0,5000.0,6480.0,7000.0,6500.0,7000.0,7000.0,7000.0,7200.0,7200.0,7350.0,7700.0,7850.0,8110.0,8300.0,2900.0,2930.0,2960.0,2985.0,3012.0,3036.0,2332.0
CRI,5174.0,5046.0,5366.0,5446.0,6334.0,6420.0,4950.0,5340.0,5770.0,7560.0,8190.0,8220.0,8330.0,8450.0,7690.0,8520.0,9989.0,9750.0,9880.0,9800.0,10000.0,13840.0,13730.0,10874.0,12363.0,10187.0,9613.0,15707.0,14136.0,14282.0,17314.0,19246.0,19108.0,23079.0,23616.0,20106.0,21219.0,24775.0,28951.0,30782.0,35673.0,36021.0,35786.0,37935.0,39062.0,40706.0,48012.0,50192.0,49601.0,46528.0,51791.0,54315.0,53694.0,55024.0,57504.0,60361.0,60640.0
CUB,27200.0,28000.0,29600.0,31200.0,32800.0,35000.0,33000.0,31000.0,32000.0,32800.0,38400.0,37600.0,40800.0,38000.0,34640.0,41920.0,78320.0,49270.0,48390.0,46080.0,54260.0,56480.0,60560.0,68480.0,75840.0,80160.0,84800.0,83680.0,88300.0,101120.0,91200.0,80669.0,107986.0,116709.0,107465.0,116253.0,64614.0,80718.0,99342.0,94322.0,75856.0,89787.0,93984.0,98274.0,96690.0,99858.0,177012.0,192720.0,178860.0,172260.0,176220.0,166320.0,193314.0,196944.0,204402.0,223674.0,235717.0
CYP,1829.0,2032.0,2540.0,2743.0,3150.0,6706.0,7620.0,8128.0,11176.0,12192.0,12700.0,13716.0,15951.0,14732.0,12192.0,13614.0,14224.0,15240.0,15646.0,15321.0,17526.0,19609.0,21000.0,23250.0,23600.0,23200.0,25300.0,27400.0,29300.0,31400.0,31900.0,33500.0,39200.0,42500.0,42800.0,45600.0,46100.0,47200.0,49150.0,52250.0,50700.0,51800.0,54313.0,55215.0,54684.0,52512.0,54978.0,59173.0,58102.0,57058.0,55213.0,51722.0,48664.0,42618.0,43774.0,43899.0,42289.0
CZE,,,,,,,,,,,,,,,,,,,,,,,,,,,,,,,,,614933.0,470554.0,502244.0,502354.0,463556.0,475700.0,451631.0,416600.0,414643.0,415634.0,411194.0,425502.0,380290.0,358505.0,360318.0,336485.0,300136.0,291469.0,274617.0,249869.0,242833.0,245610.0,237438.0,229089.0,220000.0
DEU,2671400.0,2642400.0,2722600.0,2931500.0,3049000.0,3030000.0,3137000.0,3399000.0,3401900.0,3398600.0,3592800.0,3655100.0,3622100.0,3818200.0,3939364.0,3957322.0,4021700.0,4204500.0,4311400.0,4418200.0,4450100.0,4294622.0,4408548.0,4494916.0,4619740.0,4703207.0,4734480.0,4663142.0,4477995.0,4456982.0,3812600.0,3584900.0,3645800.0,3604000.0,3602400.0,3635000.0,3563800.0,3834100.0,4102600.0,3981900.0,4074324.0,4110155.0,4239310.0,4323400.0,4499991.0,4662498.0,4985177.0,5121607.0,5264505.0,5488369.0,5616074.0,5474021.0,5506772.0,5527769.0,5570490.0,5589639.0,5505572.0
DMA,276.0,282.0,285.0,288.0,291.0,294.0,300.0,306.0,312.0,318.0,324.0,336.0,342.0,348.0,354.0,360.0,366.0,372.0,378.0,390.0,402.0,432.0,432.0,370.0,381.0,400.0,420.0,366.0,336.0,366.0,366.0,390.0,408.0,420.0,420.0,420.0,420.0,420.0,420.0,420.0,420.0,420.0,420.0,420.0,420.0,420.0,420.0,420.0,420.0,420.0,420.0,420.0,419.0,418.0,418.0,425.0,424.0
DNK,614300.0,632100.0,645400.0,688000.0,744000.0,730900.0,735000.0,715100.0,684400.0,717300.0,764300.0,765300.0,773900.0,743900.0,733941.0,716480.0,744264.0,812380.0,899074.0,972200.0,987000.0,985500.0,1043000.0,1034574.0,1083264.0,1143976.0,1148754.0,1167446.0,1163419.0,1208480.0,1271896.0,1369700.0,1503700.0,1521000.0,1494000.0,1493700.0,1520600.0,1629300.0,1641800.0,1624500.0,1716000.0,1759000.0,1762000.0,1809500.0,1792829.0,1748576.0,1802195.0,1707200.0,1585000.0,1668200.0,1720200.0,1669000.0,1589400.0,1593900.0,1600591.0,1579405.0,1532387.0
DOM,9200.0,9700.0,9200.0,9000.0,8700.0,9900.0,9600.0,10800.0,10350.0,11000.0,14000.0,16000.0,17100.0,18000.0,19000.0,21000.0,22500.0,22700.0,23000.0,11500.0,500.0,348.0,1935.0,6771.0,13000.0,14000.0,16500.0,17500.0,20000.0,20700.0,13200.0,15694.0,15876.0,17962.0,57380.0,59966.0,61780.0,64000.0,57656.0,61173.0,98817.0,109898.0,90915.0,70353.0,87060.0,101228.0,96345.0,85322.0,84793.0,67639.0,104345.0,78211.0,79082.0,73072.0,74152.0,75621.0,76859.0
DZA,40.0,40.0,40.0,80.0,92.0,36.0,40.0,50.0,75.0,80.0,80.0,80.0,82.0,80.0,80.0,80.0,80.0,82.0,82.0,84.0,88.0,88.0,88.0,92.0,96.0,100.0,100.0,104.0,108.0,112.0,116.0,120.0,120.0,128.0,128.0,128.0,128.0,128.0,128.0,128.0,128.0,128.0,128.0,128.0,128.0,120.0,124.0,128.0,128.0,124.0,116.0,120.0,120.0,117.0,116.0,114.0,112.0
ECU,30150.0,31725.0,25134.0,26595.0,28038.0,28350.0,28575.0,29115.0,29250.0,29925.0,30600.0,31613.0,33984.0,36450.0,39263.0,42206.0,45158.0,51390.0,56700.0,62550.0,53304.0,56549.0,58500.0,61929.0,64845.0,67860.0,67500.0,65250.0,64312.0,70672.0,76275.0,81801.0,81124.0,82294.0,88784.0,103185.0,106740.0,99922.0,110252.0,113511.0,139500.0,144934.0,153991.0,161336.0,162086.0,163100.0,189149.0,212545.0,180000.0,187000.0,200000.0,205000.0,218800.0,360055.0,316237.0,215874.0,218110.0
EGY,1300.0,1300.0,1400.0,1100.0,900.0,1000.0,1100.0,1000.0,1300.0,1300.0,1200.0,1300.0,1600.0,1700.0,1800.0,2426.0,2285.0,2248.0,2400.0,2500.0,2800.0,2600.0,2600.0,2700.0,3000.0,3050.0,2490.0,2480.0,2200.0,2450.0,2500.0,2900.0,2888.0,2750.0,2800.0,2850.0,2935.0,3000.0,3045.0,3100.0,3000.0,2700.0,2600.0,3000.0,2000.0,3000.0,2500.0,2200.0,538.0,500.0,473.0,485.0,491.0,486.0,350.0,400.0,362.0
ESP,239268.0,245321.0,311014.0,316908.0,266294.0,366574.0,416965.0,419016.0,436248.0,491749.0,475065.0,461242.0,588516.0,710131.0,601919.0,648812.0,734516.0,803024.0,939418.0,1182308.0,1224499.0,1336365.0,1342031.0,1428660.0,1387749.0,1398642.0,1489268.0,1722334.0,1703492.0,1788848.0,1877366.0,1917770.0,2088821.0,2124085.0,2174820.0,2356150.0,2401140.0,2744362.0,2893000.0,2904615.0,2989146.0,3070116.0,3189508.0,3076120.0,3168039.0,3235241.0,3439442.0,3484363.0,3290571.0,3368921.0,3469345.0,3466323.0,3431214.0,3555606.0,3854658.0,4181091.0,4298893.0
EST,,,,,,,,,,,,,,,,,,,,,,,,,,,,,,,,50135.0,34713.0,30438.0,35386.0,31650.0,29547.0,32380.0,31293.0,30286.0,33632.0,39940.0,39540.0,40853.0,39521.0,41593.0,42863.0,46200.0,46118.0,45783.0,50226.0,48800.0,49500.0,41400.0,50100.0,42700.0,41600.0
ETH,,,,,,,,,,,,,,,,,,,,,,,,,,,,,,,,,1150.0,1150.0,1210.0,1265.0,1320.0,1380.0,1440.0,1440.0,1495.0,1495.0,1615.0,1615.0,1665.0,1665.0,1665.0,1665.0,1725.0,1780.0,1840.0,1875.0,1875.0,1940.0,1992.0,2008.0,2028.0
EU28,9396356.0,9633550.0,9506446.0,10026320.0,10775292.0,10814647.0,11119003.0,11747664.0,11646586.0,12129778.0,12982926.0,13658621.0,14009621.0,14788076.0,14741234.0,14736339.0,15292361.0,16144253.0,16980711.0,17354566.0,17162893.0,17235776.0,17633954.0,17944436.0,18191458.0,18631438.0,19110180.0,19698159.0,19472683.0,19581652.0,19155562.0,19537701.0,20841067.0,20442245.0,20648764.0,21091170.0,20674570.0,22153467.0,22554399.0,21739287.0,21335198.0,21771322.0,22076003.0,21697776.0,21796218.0,21874596.0,22769927.0,22787382.0,22322080.0,22976339.0,23262086.0,22836883.0,22530762.0,22608582.0,23479140.0,23896700.0,23686260.0
FIN,61300.0,67300.0,66700.0,66800.0,68700.0,73300.0,90500.0,85890.0,88800.0,105500.0,131300.0,127530.0,125070.0,125160.0,127000.0,136000.0,140200.0,154350.0,163920.0,168900.0,180000.0,184400.0,185270.0,170480.0,172390.0,174050.0,181260.0,174280.0,179530.0,186970.0,177030.0,176040.0,169180.0,170660.0,167550.0,171820.0,179670.0,184520.0,181860.0,172790.0,173700.0,184240.0,193220.0,198490.0,203610.0,208270.0,213320.0,217070.0,205810.0,203210.0,201880.0,192940.0,194600.0,186130.0,191990.0,190160.0,181580.0
FJI,563.0,585.0,599.0,675.0,720.0,788.0,900.0,1013.0,1103.0,1215.0,1350.0,1440.0,1553.0,1688.0,1755.0,1890.0,1958.0,2093.0,2205.0,2295.0,2385.0,2475.0,2565.0,2655.0,2745.0,2790.0,2880.0,2970.0,3105.0,3173.0,3263.0,3186.0,3398.0,3524.0,3222.0,3366.0,3855.0,3460.0,4050.0,3825.0,3870.0,3915.0,3938.0,3938.0,3938.0,3960.0,3983.0,3951.0,3987.0,4005.0,4059.0,4005.0,4050.0,4002.0,3997.0,4127.0,4105.0
FRA,1188000.0,1275000.0,1215000.0,1230000.0,1320000.0,1301000.0,1374000.0,1401000.0,1297000.0,1375000.0,1491000.0,1533000.0,1527000.0,1546000.0,1587000.0,1614000.0,1648000.0,1727000.0,1803000.0,1803000.0,1720000.0,1675000.0,1676000.0,1684000.0,1662000.0,1677000.0,1729000.0,1852000.0,1844000.0,1726800.0,1772700.0,1903000.0,2033900.0,2116400.0,2144000.0,2161000.0,2219000.0,2328000.0,2353000.0,2312000.0,2315200.0,2346000.0,2339000.0,2292572.0,2274000.0,2010769.0,2031200.0,2274108.0,2261593.0,2254688.0,2217368.0,2161653.0,2130578.0,2120315.0,2148452.0,2185430.0,2136276.0
FSM,1098.0,1039.0,1144.0,1176.0,1243.0,1172.0,1201.0,1227.0,1263.0,1312.0,1269.0,1329.0,1352.0,1425.0,1531.0,1529.0,1832.0,1760.0,1822.0,1883.0,1923.0,1956.0,1959.0,1971.0,1902.0,1777.0,1906.0,1939.0,1660.0,1630.0,1661.0,1666.0,1667.0,1674.0,1684.0,1704.0,1710.0,1710.0,1734.0,1818.0,1850.0,1937.0,1937.0,1949.0,1965.0,1972.0,1992.0,1868.0,2003.0,2011.0,2069.0,2093.0,2122.0,2160.0,2181.0,2196.0,2207.0
GAB,1120.0,1148.0,1204.0,1204.0,1260.0,1316.0,1316.0,1344.0,1400.0,1456.0,1512.0,1568.0,1624.0,1680.0,1736.0,1792.0,1820.0,1848.0,1876.0,1764.0,1680.0,1540.0,1540.0,1624.0,1764.0,1904.0,1960.0,2142.0,2212.0,2338.0,2730.0,2970.0,3150.0,2940.0,2400.0,2730.0,3420.0,3600.0,3450.0,3300.0,3300.0,3300.0,3300.0,3300.0,3300.0,3300.0,3330.0,3390.0,3390.0,3390.0,3390.0,3450.0,3600.0,3547.0,3485.0,3522.0,3509.0
GBR,695022.0,774291.0,791499.0,829967.0,916469.0,874521.0,800180.0,835222.0,897294.0,920905.0,983922.0,980526.0,980310.0,977709.0,816361.0,851600.0,905000.0,877800.0,935000.0,926000.0,925000.0,955000.0,1007000.0,947000.0,970700.0,983328.0,1007081.0,1016593.0,939285.0,946080.0,978980.0,1002000.0,1023000.0,1061000.0,1017000.0,1004000.0,1091000.0,1135000.0,1042000.0,899000.0,777000.0,774000.0,716000.0,708000.0,706000.0,696549.0,739000.0,740000.0,720253.0,758000.0,806000.0,825000.0,833000.0,863000.0,900000.0,919000.0,901000.0
GEO,,,,,,,,,,,,,,,,,,,,,,,,,,,,,,,,56500.0,44800.0,47300.0,44300.0,45500.0,46700.0,42251.0,40770.0,36876.0,34725.0,36064.0,36699.0,34737.0,33340.0,31100.0,21400.0,11400.0,8200.0,12800.0,11600.0,11800.0,14900.0,17300.0,18700.0,16100.0,15500.0
GHA,3248.0,3332.0,3360.0,3892.0,3388.0,4032.0,4088.0,4676.0,5600.0,5992.0,5992.0,6272.0,6720.0,7476.0,8568.0,8624.0,8288.0,8316.0,8288.0,8484.0,8680.0,8400.0,8400.0,9100.0,9240.0,10500.0,8960.0,10696.0,12460.0,12886.0,12342.0,11240.0,11084.0,11390.0,10640.0,9690.0,10830.0,10830.0,10108.0,10878.0,10500.0,10416.0,10164.0,10080.0,10248.0,15456.0,16506.0,16968.0,17506.0,18010.0,19072.0,20224.0,21432.0,22932.0,24513.0,24513.0,24942.0
GIN,488.0,588.0,713.0,789.0,691.0,713.0,784.0,855.0,926.0,962.0,926.0,926.0,1021.0,1069.0,1164.0,1211.0,1235.0,1283.0,1330.0,1378.0,1425.0,1496.0,1568.0,1425.0,570.0,356.0,539.0,618.0,708.0,651.0,755.0,879.0,1017.0,1183.0,1349.0,1400.0,1454.0,1509.0,1567.0,1626.0,1688.0,1779.0,1867.0,1959.0,2056.0,1373.0,1466.0,1512.0,2330.0,1438.0,1509.0,1583.0,1662.0,1700.0,1750.0,1790.0,1810.0
GLP,372.0,387.0,400.0,351.0,390.0,450.0,430.0,480.0,560.0,510.0,600.0,600.0,850.0,900.0,1440.0,1452.0,1409.0,1998.0,2275.0,2429.0,2138.0,2485.0,2854.0,3020.0,2976.0,2921.0,2930.0,2824.0,2474.0,1927.0,974.0,1072.0,1067.0,1033.0,1175.0,1017.0,1060.0,1050.0,1034.0,1022.0,928.0,989.0,1131.0,1167.0,1192.0,1180.0,1531.0,1745.0,1600.0,1500.0,1463.0,1727.0,1826.0,1884.0,1868.0,1778.0,1816.0
GMB,90.0,90.0,60.0,105.0,150.0,192.0,192.0,204.0,216.0,224.0,232.0,240.0,252.0,260.0,280.0,288.0,280.0,288.0,300.0,320.0,336.0,352.0,368.0,352.0,352.0,352.0,352.0,352.0,360.0,360.0,360.0,360.0,360.0,420.0,420.0,420.0,420.0,420.0,360.0,360.0,360.0,420.0,420.0,420.0,420.0,420.0,636.0,650.0,702.0,740.0,400.0,420.0,200.0,299.0,431.0,440.0,500.0
GNB,5120.0,5120.0,5120.0,5120.0,5120.0,5120.0,5120.0,5120.0,5120.0,5120.0,5280.0,5480.0,5680.0,5920.0,6080.0,6440.0,6800.0,7200.0,7560.0,7840.0,8080.0,8240.0,8400.0,8480.0,8640.0,8764.0,8920.0,8920.0,8920.0,8920.0,8920.0,9200.0,9520.0,9840.0,10000.0,10160.0,10320.0,10480.0,10640.0,10640.0,10800.0,10800.0,11240.0,11240.0,11540.0,11856.0,12184.0,12520.0,12792.0,13600.0,15000.0,15200.0,16238.0,17788.0,17420.0,17225.0,17513.0
GNQ,65.0,76.0,86.0,101.0,108.0,90.0,90.0,90.0,90.0,90.0,90.0,95.0,95.0,95.0,99.0,99.0,99.0,99.0,99.0,99.0,104.0,104.0,104.0,108.0,108.0,108.0,110.0,113.0,115.0,117.0,119.0,122.0,124.0,126.0,128.0,131.0,133.0,135.0,137.0,140.0,142.0,142.0,142.0,144.0,144.0,144.0,146.0,146.0,148.0,151.0,153.0,154.0,167.0,164.0,163.0,162.0,164.0
GRC,37765.0,40072.0,38951.0,38957.0,46748.0,51363.0,46132.0,39839.0,45324.0,52056.0,63219.0,73785.0,90530.0,105646.0,103279.0,111217.0,120338.0,129069.0,141961.0,144409.0,144712.0,146115.0,146897.0,148174.0,138267.0,142344.0,150693.0,139903.0,138868.0,139839.0,140216.0,144650.0,136167.0,136690.0,136886.0,135510.0,133498.0,134357.0,130226.0,126985.0,115286.0,109604.0,111087.0,107521.0,109409.0,108470.0,101857.0,103653.0,98658.0,95226.0,95857.0,93590.0,91193.0,82850.0,88085.0,93500.0,81200.0
GRD,76.0,64.0,56.0,52.0,60.0,59.0,70.0,76.0,82.0,85.0,99.0,80.0,75.0,71.0,68.0,63.0,65.0,50.0,59.0,57.0,55.0,55.0,66.0,70.0,75.0,76.0,78.0,84.0,95.0,105.0,118.0,130.0,175.0,160.0,170.0,170.0,170.0,170.0,190.0,190.0,190.0,192.0,193.0,193.0,193.0,200.0,200.0,230.0,240.0,250.0,250.0,250.0,244.0,247.0,244.0,239.0,243.0
GTM,12171.0,11750.0,11414.0,10414.0,10582.0,11357.0,11815.0,12282.0,12182.0,13685.0,13530.0,13177.0,14475.0,13460.0,13704.0,11507.0,10389.0,12731.0,17592.0,16385.0,16633.0,16545.0,16264.0,15792.0,15946.0,15557.0,14332.0,14217.0,14715.0,22000.0,22900.0,23600.0,24500.0,25300.0,26200.0,27000.0,27897.0,28467.0,29500.0,30600.0,38500.0,48600.0,57700.0,58400.0,66700.0,58000.0,58200.0,58300.0,57500.0,58700.0,60000.0,61500.0,61500.0,62081.0,62430.0,62276.0,62045.0
GUF,250.0,250.0,255.0,260.0,265.0,270.0,260.0,265.0,276.0,275.0,286.0,279.0,280.0,240.0,245.0,220.0,320.0,380.0,400.0,460.0,530.0,907.0,1050.0,1105.0,1196.0,1016.0,807.0,833.0,671.0,900.0,833.0,774.0,929.0,774.0,1130.0,1140.0,1140.0,1245.0,1245.0,1169.0,1094.0,390.0,376.0,381.0,421.0,453.0,449.0,408.0,441.0,402.0,337.0,381.0,416.0,454.0,444.0,454.0,446.0
GUM,210.0,157.0,261.0,138.0,186.0,200.0,210.0,220.0,240.0,264.0,201.0,252.0,258.0,314.0,450.0,360.0,558.0,480.0,510.0,540.0,540.0,540.0,540.0,558.0,456.0,300.0,420.0,420.0,141.0,90.0,90.0,90.0,90.0,90.0,90.0,90.0,96.0,96.0,120.0,132.0,144.0,147.0,147.0,147.0,147.0,150.0,156.0,156.0,156.0,156.0,162.0,168.0,168.0,168.0,172.0,178.0,178.0
GUY,296.0,357.0,410.0,435.0,462.0,636.0,772.0,975.0,1184.0,1200.0,1507.0,1542.0,1416.0,1118.0,1459.0,2223.0,2313.0,1678.0,1814.0,1416.0,1361.0,1134.0,909.0,1072.0,1078.0,1088.0,1118.0,1100.0,1016.0,900.0,900.0,600.0,1137.0,500.0,500.0,450.0,400.0,380.0,365.0,350.0,350.0,360.0,400.0,420.0,420.0,400.0,400.0,350.0,266.0,305.0,203.0,199.0,572.0,418.0,281.0,252.0,470.0
HKG,52000.0,78000.0,93000.0,98500.0,101000.0,113000.0,101000.0,108000.0,108000.0,112000.0,139000.0,154000.0,149000.0,146000.0,143000.0,152000.0,157340.0,157315.0,168102.0,178730.0,186770.0,187110.0,184040.0,179820.0,182420.0,197040.0,197050.0,200000.0,193700.0,187760.0,168090.0,159970.0,149130.0,165580.0,159200.0,156040.0,153000.0,161000.0,161000.0,161000.0,165000.0,147000.0,145000.0,161000.0,148000.0,146000.0,132000.0,116000.0,126000.0,129000.0,116700.0,122800.0,123700.0,123654.0,125147.0,106763.0,115500.0
HND,7606.0,8009.0,8465.0,8616.0,8918.0,8765.0,9054.0,9178.0,9818.0,10240.0,10383.0,10549.0,9353.0,8562.0,8445.0,9246.0,8232.0,9061.0,9517.0,9794.0,11985.0,10611.0,8634.0,11300.0,10300.0,10700.0,11000.0,11500.0,12600.0,12960.0,13141.0,13246.0,13352.0,7886.0,8492.0,8884.0,9091.0,9126.0,9285.0,9513.0,9748.0,9329.0,8300.0,8772.0,9013.0,11073.0,11353.0,11640.0,12070.0,11933.0,12085.0,13363.0,13400.0,12691.0,12282.0,11242.0,10824.0
HRV,,,,,,,,,,,,,,,,,,,,,,,,,,,,,,,,65000.0,59600.0,60400.0,55600.0,56374.0,54510.0,60120.0,64240.0,63700.0,63900.0,65100.0,61750.0,80000.0,112200.0,112300.0,127900.0,121000.0,131000.0,121000.0,120100.0,126900.0,106500.0,95700.0,94000.0,98018.0,97151.0
HTI,16800.0,17200.0,17600.0,18000.0,18400.0,18880.0,21300.0,22000.0,22800.0,24000.0,25000.0,25900.0,26400.0,27800.0,29200.0,30100.0,28000.0,31300.0,29000.0,21800.0,15300.0,16800.0,16400.0,16400.0,16400.0,18000.0,16400.0,15200.0,13600.0,12800.0,15000.0,18150.0,19057.0,21000.0,22990.0,24140.0,25410.0,26860.0,26880.0,28000.0,31200.0,33000.0,33060.0,33000.0,33060.0,33000.0,33000.0,33000.0,33000.0,33000.0,33000.0,33000.0,33000.0,32755.0,31989.0,33233.0,33042.0
HUN,502300.0,503600.0,510300.0,516300.0,545500.0,536900.0,523300.0,616500.0,542200.0,569800.0,683400.0,774900.0,696400.0,809500.0,843400.0,765200.0,864500.0,853000.0,884500.0,904900.0,906100.0,946800.0,1049300.0,1123500.0,1011100.0,985500.0,1036700.0,1021900.0,1014300.0,1017700.0,930500.0,764300.0,672400.0,608300.0,578300.0,670700.0,580720.0,569900.0,625890.0,613420.0,556100.0,580000.0,510318.0,486541.0,453892.0,489127.0,499437.0,461175.0,453484.0,452073.0,434707.0,393712.0,368153.0,412292.0,455088.0,457808.0,469829.0
IDN,93500.0,104500.0,115500.0,115500.0,115500.0,115500.0,104500.0,137500.0,121000.0,126500.0,148500.0,159500.0,137500.0,143000.0,132000.0,148500.0,148500.0,143000.0,176000.0,176000.0,203500.0,214500.0,280500.0,335500.0,368500.0,412500.0,418000.0,462000.0,495000.0,544500.0,572000.0,583000.0,621500.0,660000.0,572000.0,599500.0,632500.0,621500.0,550000.0,412500.0,418000.0,467500.0,495000.0,194683.0,173669.0,195983.0,228905.0,209777.0,200118.0,211993.0,224800.0,232143.0,298440.0,302287.0,330213.0,339609.0,344247.0
IND,154000.0,152775.0,151375.0,150500.0,148750.0,148050.0,157850.0,166250.0,165550.0,174300.0,194425.0,205100.0,205275.0,211225.0,214200.0,217525.0,224875.0,235200.0,249900.0,261450.0,278950.0,296100.0,299950.0,304325.0,360500.0,364000.0,367500.0,381500.0,395500.0,413000.0,427000.0,444500.0,448000.0,451500.0,455000.0,458500.0,461650.0,463400.0,464730.0,465850.0,467180.0,468580.0,469910.0,444500.0,425250.0,404915.0,385000.0,381500.0,378000.0,371000.0,364000.0,357000.0,353500.0,350000.0,343753.0,316083.0,305467.0
IRL,106697.0,112162.0,115046.0,120295.0,139013.0,125529.0,109166.0,122623.0,143835.0,144081.0,154160.0,160294.0,143000.0,131000.0,99000.0,123000.0,130000.0,135000.0,151700.0,153400.0,149900.0,153300.0,160900.0,144000.0,135499.0,137079.0,140584.0,147500.0,143900.0,157000.0,179600.0,202300.0,212000.0,214800.0,211200.0,210700.0,219900.0,241600.0,249700.0,230400.0,239800.0,229700.0,218800.0,204300.0,205800.0,209000.0,205300.0,202400.0,195600.0,214300.0,233800.0,241400.0,239300.0,254100.0,276400.0,282700.0,294200.0
IRN,1200.0,1200.0,1200.0,1200.0,1200.0,1200.0,1200.0,1200.0,1200.0,1350.0,1350.0,1350.0,1350.0,1500.0,1400.0,1500.0,1500.0,1500.0,1250.0,,,,,,,,,,,,,,,,,,,,,,,,,,,,,,,,,,,,,,
ISL,250.0,280.0,290.0,320.0,330.0,440.0,440.0,481.0,405.0,408.0,400.0,430.0,560.0,600.0,600.0,680.0,720.0,780.0,900.0,1050.0,1110.0,982.0,1267.0,1435.0,1630.0,1868.0,2007.0,2474.0,2686.0,2533.0,2594.0,2643.0,2861.0,3212.0,3330.0,3740.0,3938.0,3886.0,4706.0,4783.0,5284.0,6011.0,6205.0,5597.0,5300.0,5744.0,6088.0,6645.0,6375.0,6158.0,6044.0,5855.0,6404.0,6472.0,6806.0,6089.0,6265.0
ISR,3775.0,4100.0,3700.0,2600.0,3200.0,3300.0,3880.0,4675.0,4550.0,4900.0,5175.0,6220.0,6840.0,7520.0,8515.0,8435.0,10030.0,9150.0,8955.0,9300.0,9250.0,9670.0,8790.0,8350.0,8750.0,8350.0,8900.0,9375.0,8575.0,9205.0,9375.0,9375.0,8745.0,8930.0,10640.0,10830.0,12310.0,12120.0,8700.0,14863.0,15722.0,16479.0,17430.0,18030.0,18665.0,17539.0,18311.0,18244.0,19649.0,18868.0,19246.0,19396.0,16267.0,15739.0,15825.0,16099.0,14797.0
ITA,391800.0,395700.0,374700.0,471900.0,478100.0,435500.0,460900.0,541900.0,533401.0,593200.0,644000.0,665700.0,689200.0,738000.0,786700.0,815880.0,904100.0,966559.0,1033388.0,1085494.0,1105835.0,1108064.0,1165920.0,1218073.0,1186896.0,1172231.0,1230604.0,1269069.0,1295287.0,1333050.0,1332803.0,1341586.0,1371346.0,1369250.0,1345560.0,1410300.0,1395816.0,1412189.0,1471702.0,1478500.0,1509640.0,1535900.0,1589890.0,1589889.0,1514747.0,1559243.0,1603280.0,1606013.0,1628028.0,1673000.0,1601877.0,1650837.0,1652424.0,1327822.0,1491414.0,1544132.0,1466949.0
JAM,3372.0,3444.0,3297.0,3414.0,3350.0,2973.0,3851.0,4580.0,5590.0,6513.0,4670.0,6577.0,8224.0,4365.0,5000.0,6886.0,7906.0,7598.0,6260.0,7357.0,7525.0,7267.0,6604.0,7149.0,7262.0,6078.0,6459.0,7331.0,7504.0,7394.0,4741.0,5926.0,7047.0,7247.0,6690.0,6553.0,6512.0,6826.0,6867.0,6621.0,6367.0,5490.0,6324.0,7468.0,9449.0,7638.0,7239.0,9138.0,8958.0,7973.0,7110.0,9490.0,9640.0,8185.0,7049.0,8213.0,8304.0
JPN,206288.0,324188.0,279354.0,342356.0,407238.0,564556.0,603458.0,589577.0,587658.0,734294.0,843244.0,885306.0,970520.0,1097924.0,1039642.0,1056229.0,1169465.0,1284473.0,1429927.0,1475005.0,1395843.0,1427630.0,1428824.0,1424204.0,1531914.0,1551651.0,1582014.0,1578938.0,1593918.0,1555226.0,1482776.0,1434148.0,1439610.0,1390288.0,1299700.0,1263100.0,1288200.0,1290800.0,1277094.0,1255800.0,1231600.0,1245800.0,1273700.0,1262600.0,1244963.0,1246525.0,1250511.0,1248801.0,1309910.0,1292451.0,1267328.0,1296971.0,1309433.0,1263599.0,1254283.0,1278623.0,1272257.0
KAZ,,,,,,,,,,,,,,,,,,,,,,,,,,,,,,,,217300.0,194300.0,158200.0,113400.0,103400.0,81900.0,78900.0,97700.0,80226.0,112068.0,109765.0,105352.0,115753.0,110166.0,109340.0,107176.0,110499.0,106641.0,102971.0,112350.0,103319.0,99906.0,99817.0,95264.0,93867.0,91912.0
KEN,3016.0,2704.0,2392.0,2717.0,2867.0,2860.0,2652.0,3127.0,3608.0,2984.0,3120.0,3224.0,3172.0,3068.0,3055.0,3315.0,3432.0,3445.0,3640.0,3848.0,3900.0,4212.0,4303.0,4423.0,4758.0,4602.0,4675.0,5195.0,5362.0,5630.0,7000.0,7700.0,8400.0,7392.0,8482.0,10473.0,11522.0,10629.0,11081.0,13237.0,13800.0,14400.0,15301.0,16000.0,16500.0,16800.0,16200.0,16200.0,18130.0,15275.0,12800.0,12950.0,17445.0,17877.0,26001.0,10768.0,12953.0
KGZ,,,,,,,,,,,,,,,,,,,,,,,,,,,,,,,,35600.0,24800.0,18000.0,27955.0,28726.0,25684.0,30431.0,28641.0,23822.0,25712.0,23049.0,22103.0,25163.0,18663.0,19811.0,20446.0,18971.0,17258.0,16258.0,16335.0,16142.0,16300.0,15797.0,15397.0,16369.0,17535.0
KHM,9550.0,11600.0,15000.0,19850.0,23300.0,26250.0,29600.0,31800.0,35700.0,39000.0,39100.0,39050.0,38850.0,30800.0,24000.0,16000.0,12000.0,8000.0,5300.0,5250.0,9000.0,28900.0,32950.0,40350.0,48100.0,46450.0,50050.0,60000.0,69500.0,60600.0,62000.0,81700.0,84900.0,81000.0,81500.0,86000.0,97000.0,100000.0,102500.0,105000.0,107750.0,107400.0,117000.0,122650.0,135000.0,138500.0,120000.0,112500.0,115000.0,105000.0,110000.0,98500.0,102821.0,111550.0,110499.0,110423.0,98359.0
KIR,620.0,620.0,620.0,742.0,742.0,636.0,636.0,636.0,636.0,636.0,640.0,640.0,640.0,640.0,640.0,644.0,644.0,644.0,644.0,644.0,648.0,648.0,648.0,648.0,648.0,652.0,652.0,652.0,652.0,652.0,652.0,652.0,652.0,652.0,652.0,672.0,672.0,672.0,672.0,744.0,764.0,848.0,848.0,860.0,876.0,880.0,888.0,888.0,888.0,900.0,900.0,920.0,924.0,964.0,974.0,972.0,972.0
KNA,108.0,108.0,108.0,111.0,111.0,114.0,114.0,114.0,111.0,111.0,110.0,110.0,110.0,110.0,110.0,110.0,110.0,110.0,110.0,110.0,110.0,110.0,110.0,111.0,111.0,112.0,112.0,114.0,113.0,114.0,116.0,118.0,120.0,129.0,132.0,168.0,156.0,198.0,198.0,144.0,144.0,150.0,159.0,150.0,159.0,132.0,137.0,132.0,110.0,112.0,131.0,46.0,47.0,49.0,70.0,66.0,58.0
KOR,63045.0,39920.0,57903.0,65636.0,76272.0,95800.0,72154.0,61760.0,76080.0,82546.0,80880.0,90230.0,90126.0,95353.0,98848.0,113620.0,146276.0,171612.0,273427.0,293530.0,261563.0,299586.0,368640.0,429054.0,433750.0,322000.0,377000.0,425000.0,480000.0,550000.0,530000.0,752000.0,770000.0,786000.0,799000.0,886943.0,895806.0,939356.0,996282.0,915899.0,927692.0,1005192.0,1149000.0,959690.0,899392.0,1000000.0,1043000.0,1056000.0,1062000.0,1110000.0,837000.0,1086000.0,1252000.0,1200000.0,1217000.0,1266000.0,1280000.0
LAO,9000.0,9000.0,9000.0,11800.0,13400.0,14700.0,15000.0,15000.0,14200.0,13800.0,13600.0,12800.0,12000.0,10500.0,9000.0,11400.0,12400.0,10400.0,12400.0,16600.0,18000.0,18400.0,19500.0,20400.0,17800.0,19200.0,21200.0,19050.0,20600.0,20860.0,21487.0,22763.0,25485.0,27113.0,28816.0,29608.0,30514.0,31427.0,31600.0,27650.0,31550.0,31550.0,35500.0,37000.0,39000.0,43000.0,46000.0,50700.0,54500.0,59671.0,58178.0,60765.0,64372.0,68911.0,72339.0,82213.0,86283.0
LBN,303.0,303.0,303.0,303.0,407.0,407.0,407.0,605.0,605.0,715.0,605.0,550.0,770.0,715.0,770.0,660.0,990.0,660.0,605.0,660.0,715.0,825.0,1045.0,1430.0,1870.0,2475.0,3575.0,3465.0,3575.0,3740.0,3850.0,4290.0,5280.0,4950.0,4400.0,3850.0,2750.0,3300.0,2500.0,2400.0,2200.0,1900.0,1300.0,1200.0,1100.0,1000.0,900.0,864.0,800.0,770.0,759.0,770.0,784.0,798.0,780.0,635.0,632.0
LBR,1920.0,1984.0,2051.0,2113.0,2177.0,2273.0,2400.0,2496.0,2565.0,2624.0,2656.0,2688.0,2752.0,2840.0,2880.0,3000.0,3040.0,3120.0,3200.0,3320.0,3440.0,3600.0,3680.0,3840.0,4080.0,4160.0,4480.0,4480.0,4280.0,4000.0,4000.0,4000.0,4000.0,4000.0,4000.0,4000.0,4000.0,4000.0,4000.0,4400.0,4400.0,4400.0,4400.0,4400.0,4400.0,5100.0,5882.0,6783.0,7822.0,9020.0,9720.0,9800.0,9879.0,9811.0,9693.0,11555.0,12210.0
LCA,524.0,530.0,536.0,541.0,547.0,553.0,559.0,564.0,570.0,598.0,456.0,399.0,342.0,342.0,342.0,399.0,456.0,462.0,467.0,473.0,479.0,484.0,530.0,559.0,560.0,562.0,567.0,570.0,570.0,581.0,604.0,627.0,656.0,678.0,693.0,713.0,713.0,713.0,998.0,1003.0,1015.0,1020.0,1020.0,1026.0,1020.0,1020.0,1311.0,1368.0,1368.0,1368.0,1368.0,1425.0,2787.0,3201.0,3000.0,2723.0,2890.0
LKA,840.0,1170.0,970.0,1050.0,995.0,1250.0,1450.0,1350.0,1340.0,1340.0,1610.0,1490.0,1220.0,1120.0,930.0,960.0,1380.0,1330.0,1670.0,2280.0,1770.0,1550.0,1240.0,1390.0,1260.0,1140.0,1450.0,1460.0,1410.0,1580.0,2200.0,2020.0,1620.0,2000.0,2336.0,2250.0,2150.0,1920.0,1650.0,1750.0,1950.0,1860.0,2160.0,2120.0,2200.0,2290.0,2310.0,1560.0,1620.0,1370.0,1780.0,2190.0,2150.0,1720.0,1693.0,1530.0,1325.0
LSO,1632.0,1689.0,1740.0,1788.0,1824.0,1860.0,1920.0,1950.0,1980.0,1981.0,2050.0,2200.0,2300.0,2350.0,2450.0,2500.0,2550.0,2600.0,2650.0,2700.0,2250.0,2500.0,2400.0,2400.0,2500.0,3000.0,3000.0,3000.0,3000.0,2850.0,2125.0,1900.0,2600.0,1950.0,2800.0,2700.0,3325.0,3250.0,4350.0,5400.0,4900.0,4325.0,2950.0,4700.0,5650.0,9050.0,9706.0,4100.0,3970.0,3750.0,3600.0,3650.0,3700.0,2195.0,1257.0,1810.0,666.0
LTU,,,,,,,,,,,,,,,,,,,,,,,,,,,,,,,,155285.0,90198.0,81602.0,93058.0,88475.0,87109.0,95673.0,91020.0,84528.0,72251.0,94867.0,91348.0,97119.0,105621.0,106217.0,99288.0,75863.0,60424.0,73337.0,74927.0,79439.0,86965.0,84851.0,84314.0,74037.0,71476.0
LUX,,,,,,,,,,,,,,,,,,,,,,,,,,,,,,,,,,,,,,,,12510.0,11412.0,11692.0,12316.0,11447.0,10823.0,9834.0,9922.0,9947.0,10102.0,9762.0,9747.0,10608.0,11121.0,12150.0,12506.0,13982.0,12944.0
LVA,,,,,,,,,,,,,,,,,,,,,,,,,,,,,,,,100500.0,68100.0,53800.0,62600.0,39500.0,37053.0,36482.0,34617.0,31541.0,31648.0,35891.0,36905.0,36808.0,38450.0,37812.0,40433.0,40733.0,38846.0,37175.0,37562.0,35726.0,35924.0,37037.0,35940.0,36377.0,38073.0
MAR,2200.0,1850.0,1035.0,1000.0,995.0,700.0,800.0,1200.0,1800.0,1650.0,2185.0,2374.0,1884.0,1103.0,600.0,540.0,750.0,638.0,576.0,580.0,600.0,650.0,660.0,660.0,410.0,455.0,600.0,600.0,640.0,700.0,700.0,719.0,710.0,730.0,730.0,730.0,750.0,560.0,600.0,600.0,600.0,600.0,600.0,600.0,600.0,600.0,600.0,600.0,600.0,650.0,625.0,630.0,650.0,628.0,614.0,616.0,621.0
MDA,,,,,,,,,,,,,,,,,,,,,,,,,,,,,,,,113800.0,79100.0,61238.0,59572.0,63500.0,65506.0,57784.0,60800.0,49720.0,43600.0,44900.0,43200.0,41308.0,39666.0,47955.0,58938.0,35061.0,42230.0,56895.0,63923.0,64497.0,64497.0,61072.0,71923.0,72668.0,74257.0
MDG,15336.0,16146.0,17658.0,19170.0,17118.0,19332.0,18954.0,19386.0,19062.0,19440.0,23868.0,27216.0,23868.0,21978.0,23733.0,20142.0,20682.0,21276.0,24300.0,29538.0,35478.0,30726.0,32400.0,41400.0,40170.0,42360.0,45960.0,50440.0,52650.0,53950.0,54925.0,56225.0,57525.0,58825.0,64750.0,66150.0,67550.0,50750.0,39900.0,21000.0,18900.0,21700.0,24500.0,27650.0,50750.0,52500.0,53200.0,53900.0,54600.0,56000.0,57400.0,58450.0,58450.0,58493.0,61167.0,64267.0,64791.0
MEX,422000.0,422000.0,424000.0,426000.0,428000.0,430000.0,444000.0,446000.0,460000.0,479000.0,503570.0,572894.0,641441.0,719036.0,810019.0,909310.0,1009890.0,1084622.0,1166822.0,1250800.0,1306616.0,1365414.0,1485882.0,1455303.0,1293221.0,959259.0,914573.0,861200.0,726670.0,757351.0,811899.0,819782.0,821580.0,872907.0,921576.0,910290.0,939245.0,960689.0,994186.0,1029955.0,1057843.0,1070246.0,1035308.0,1064382.0,1102940.0,1108942.0,1152003.0,1160677.0,1162398.0,1174582.0,1201998.0,1238625.0,1283672.0,1290591.0,1322529.0,1376199.0,1441851.0
MKD,,,,,,,,,,,,,,,,,,,,,,,,,,,,,,,,10443.0,9634.0,9664.0,9335.0,9400.0,8709.0,8832.0,9189.0,9300.0,8400.0,10626.0,9609.0,9373.0,8897.0,8633.0,8856.0,8703.0,8291.0,8000.0,8340.0,10598.0,8845.0,9886.0,10826.0,12786.0,13105.0
MLI,292.0,558.0,548.0,864.0,800.0,752.0,800.0,920.0,1000.0,1000.0,960.0,800.0,640.0,680.0,800.0,960.0,1120.0,1280.0,1400.0,1536.0,1696.0,1440.0,1680.0,1664.0,1760.0,1628.0,1776.0,1840.0,1760.0,1792.0,1944.0,1836.0,1799.0,1770.0,1752.0,1744.0,1748.0,1767.0,1806.0,1868.0,2290.0,2316.0,2342.0,2368.0,2346.0,2420.0,2350.0,2400.0,2531.0,2550.0,2580.0,2600.0,2407.0,2154.0,2066.0,2297.0,2574.0
MLT,2018.0,1494.0,2549.0,2040.0,1948.0,2452.0,2545.0,2643.0,3399.0,4116.0,3871.0,3750.0,4506.0,4604.0,3691.0,4052.0,4922.0,4195.0,724.0,25.0,401.0,1482.0,3255.0,5093.0,7008.0,7100.0,7500.0,7773.0,8289.0,7814.0,8300.0,8400.0,8508.0,9300.0,8500.0,8600.0,10191.0,10397.0,10258.0,9069.0,9930.0,10405.0,9779.0,8469.0,8889.0,8217.0,8018.0,8503.0,7369.0,7511.0,7305.0,5665.0,5920.0,6153.0,5428.0,4931.0,4707.0
MMR,25080.0,24750.0,28710.0,31350.0,32780.0,39765.0,49335.0,45265.0,56925.0,61820.0,61710.0,57200.0,57750.0,55138.0,60638.0,68475.0,69300.0,73700.0,78100.0,79200.0,80300.0,81400.0,81950.0,82500.0,83050.0,84700.0,86075.0,86900.0,77000.0,55000.0,41181.0,43947.0,46623.0,56925.0,64092.0,71358.0,74561.0,81230.0,100212.0,118157.0,135267.0,164301.0,220103.0,260436.0,326508.0,367850.0,408770.0,463153.0,526321.0,576103.0,609331.0,661882.0,730540.0,821122.0,863235.0,874024.0,960555.0
MNE,,,,,,,,,,,,,,,,,,,,,,,,,,,,,,,,,,,,,,,,,,,,,,2913.0,2873.0,1878.0,2076.0,1895.0,4446.0,3780.0,540.0,2793.0,3308.0,3157.0,1484.0
MNG,300.0,300.0,400.0,400.0,500.0,500.0,300.0,400.0,400.0,300.0,400.0,400.0,500.0,500.0,600.0,500.0,400.0,600.0,900.0,1000.0,1400.0,1300.0,1500.0,1900.0,2200.0,2417.0,3046.0,3958.0,5510.0,7889.0,3849.0,1758.0,700.0,700.0,600.0,300.0,240.0,200.0,300.0,900.0,500.0,300.0,200.0,200.0,300.0,200.0,300.0,375.0,478.0,375.0,217.0,403.0,527.0,763.0,603.0,770.0,488.0
MOZ,5880.0,6300.0,6720.0,7140.0,10680.0,7980.0,8400.0,10140.0,8580.0,8880.0,10500.0,11520.0,12540.0,13740.0,10920.0,6900.0,7500.0,7920.0,8280.0,8640.0,9000.0,9360.0,9720.0,10080.0,10440.0,10800.0,11160.0,11520.0,11880.0,58464.0,67200.0,77280.0,87360.0,97440.0,115200.0,116640.0,118080.0,118800.0,120960.0,122400.0,118800.0,115320.0,97560.0,107490.0,117450.0,85200.0,97200.0,111000.0,93600.0,97200.0,108000.0,121800.0,129600.0,150056.0,120557.0,123715.0,124000.0
MSR,54.0,53.0,52.0,50.0,49.0,48.0,54.0,64.0,40.0,46.0,50.0,45.0,40.0,38.0,35.0,33.0,30.0,28.0,25.0,20.0,30.0,40.0,40.0,40.0,40.0,43.0,45.0,48.0,48.0,50.0,50.0,55.0,55.0,60.0,60.0,60.0,60.0,60.0,60.0,60.0,60.0,60.0,60.0,60.0,59.0,62.0,65.0,65.0,65.0,65.0,65.0,66.0,66.0,66.0,66.0,67.0,67.0
MTQ,1775.0,1500.0,1500.0,1350.0,1350.0,1350.0,1150.0,1200.0,1395.0,1330.0,1500.0,1550.0,1500.0,1500.0,1500.0,1550.0,1400.0,1400.0,1400.0,1400.0,1500.0,1600.0,1700.0,2150.0,1800.0,1900.0,1900.0,2000.0,1950.0,2000.0,2050.0,2000.0,1800.0,1800.0,1500.0,1500.0,1481.0,1535.0,1658.0,1842.0,1522.0,1653.0,1650.0,1532.0,1273.0,1324.0,1010.0,1080.0,1000.0,960.0,1000.0,1050.0,1100.0,1188.0,1133.0,874.0,819.0
MUS,371.0,394.0,434.0,445.0,474.0,497.0,565.0,554.0,548.0,570.0,620.0,751.0,765.0,775.0,745.0,597.0,606.0,620.0,523.0,687.0,639.0,608.0,601.0,616.0,540.0,620.0,732.0,690.0,690.0,875.0,945.0,1030.0,1080.0,1058.0,1038.0,1112.0,948.0,752.0,678.0,891.0,882.0,756.0,785.0,743.0,709.0,870.0,765.0,524.0,605.0,800.0,825.0,833.0,795.0,717.0,623.0,674.0,632.0
MWI,4020.0,4205.0,5115.0,5320.0,4950.0,4950.0,5700.0,6000.0,7250.0,5990.0,5855.0,6900.0,6895.0,7000.0,6185.0,7565.0,7155.0,8205.0,6975.0,7890.0,8225.0,7915.0,8470.0,7440.0,7390.0,11250.0,12500.0,10000.0,10250.0,10250.0,11050.0,13500.0,11025.0,11500.0,15500.0,14250.0,19150.0,19400.0,20250.0,21250.0,19900.0,12984.0,13140.0,11301.0,12041.0,16895.0,25033.0,33962.0,41872.0,31670.0,44201.0,66534.0,89035.0,102396.0,127292.0,162969.0,187440.0
MYS,55348.0,60335.0,56170.0,56444.0,58636.0,62691.0,60773.0,58910.0,66637.0,70418.0,69267.0,75295.0,74309.0,79844.0,113107.0,126040.0,116066.0,118149.0,120067.0,135575.0,144672.0,134479.0,143960.0,142754.0,153111.0,158865.0,174757.0,162701.0,196285.0,226599.0,233277.0,250893.0,262771.0,284789.0,283359.0,278303.0,282316.0,260172.0,158685.0,159818.0,184702.0,192900.0,190933.0,200180.0,208323.0,216747.0,200109.0,195070.0,206026.0,234000.0,214308.0,218471.0,217422.0,217558.0,222598.0,195176.0,194375.0
NAM,814.0,895.0,880.0,935.0,935.0,990.0,1045.0,1100.0,1155.0,1210.0,1265.0,1320.0,1375.0,1540.0,1705.0,1809.0,1929.0,1970.0,1753.0,1742.0,1823.0,1860.0,2073.0,1944.0,2047.0,2283.0,2506.0,2849.0,2964.0,2530.0,2447.0,1835.0,1662.0,1902.0,1821.0,1665.0,1459.0,990.0,1320.0,1760.0,1650.0,1760.0,1925.0,2475.0,2750.0,3135.0,3575.0,3795.0,4125.0,4400.0,4730.0,4648.0,4675.0,5964.0,5839.0,5986.0,6235.0
NCL,700.0,820.0,760.0,690.0,770.0,850.0,850.0,760.0,650.0,680.0,630.0,630.0,790.0,630.0,570.0,500.0,500.0,442.0,484.0,547.0,541.0,589.0,520.0,625.0,706.0,724.0,864.0,949.0,933.0,1063.0,1208.0,1307.0,1317.0,1269.0,1307.0,1302.0,1383.0,1497.0,1371.0,1423.0,1551.0,1627.0,1666.0,1766.0,1822.0,1972.0,2093.0,2373.0,2262.0,2255.0,2425.0,2557.0,2673.0,2816.0,3981.0,3927.0,4175.0
NER,284.0,473.0,536.0,551.0,583.0,599.0,630.0,662.0,693.0,725.0,819.0,788.0,788.0,788.0,819.0,833.0,869.0,945.0,1125.0,1125.0,1143.0,1152.0,1170.0,1260.0,1296.0,1310.0,1319.0,1323.0,1323.0,1346.0,1357.0,1377.0,1391.0,1391.0,1391.0,1391.0,1391.0,1395.0,1395.0,1395.0,1404.0,1409.0,1418.0,1418.0,1418.0,1418.0,1431.0,1431.0,1431.0,1431.0,1440.0,1485.0,1485.0,1491.0,1495.0,1493.0,1500.0
NGA,21600.0,22275.0,22919.0,23625.0,24300.0,24975.0,25987.0,26550.0,27878.0,28350.0,29190.0,29646.0,29430.0,29194.0,31500.0,33750.0,36000.0,38250.0,38250.0,38250.0,38250.0,38250.0,38250.0,49500.0,60750.0,76500.0,92250.0,99000.0,114750.0,106886.0,106277.0,112500.0,117000.0,121500.0,130500.0,135000.0,139500.0,144000.0,153000.0,157500.0,165375.0,192524.0,178875.0,186165.0,193455.0,201285.0,209250.0,217602.0,226307.0,234000.0,243000.0,248850.0,254250.0,252585.0,266494.0,274746.0,278051.0
NIC,6180.0,5275.0,5925.0,7215.0,9585.0,12300.0,11000.0,11720.0,13400.0,15710.0,15620.0,16400.0,12480.0,16211.0,17640.0,19320.0,21324.0,19500.0,21000.0,10500.0,12750.0,13800.0,13800.0,14250.0,12600.0,14300.0,13892.0,10718.0,13030.0,10488.0,9400.0,8500.0,8000.0,4899.0,5136.0,5290.0,5455.0,5636.0,5727.0,5870.0,6035.0,6273.0,6455.0,6500.0,6636.0,6818.0,6864.0,7091.0,7182.0,7681.0,8039.0,8721.0,9180.0,10149.0,10383.0,11056.0,11913.0
NIU,21.0,23.0,24.0,25.0,30.0,30.0,32.0,32.0,32.0,33.0,37.0,39.0,41.0,41.0,41.0,42.0,42.0,42.0,42.0,42.0,44.0,44.0,44.0,42.0,40.0,41.0,39.0,37.0,36.0,34.0,34.0,49.0,49.0,50.0,51.0,49.0,50.0,53.0,50.0,54.0,55.0,61.0,63.0,62.0,60.0,59.0,65.0,60.0,52.0,60.0,60.0,61.0,61.0,62.0,63.0,62.0,62.0
NLD,383075.0,399875.0,406450.0,415650.0,489075.0,496175.0,557900.0,627050.0,616825.0,700850.0,794950.0,789500.0,812475.0,882100.0,892125.0,936025.0,966800.0,1048425.0,1106674.0,1125369.0,1194071.0,1211200.0,1248310.0,1306286.0,1411868.0,1443428.0,1511000.0,1631000.0,1606000.0,1661377.0,1591130.0,1585477.0,1746778.0,1673300.0,1622074.0,1623971.0,1375578.0,1725049.0,1710743.0,1622761.0,1432470.0,1377121.0,1252898.0,1298000.0,1297281.0,1264897.0,1289935.0,1317705.0,1274980.0,1294000.0,1347166.0,1331731.0,1306950.0,1370890.0,1456220.0,1452840.0,1455677.0
NOR,54997.0,56998.0,51880.0,54139.0,58152.0,58017.0,58469.0,62428.0,65566.0,64750.0,69362.0,75909.0,75890.0,78230.0,75761.0,74924.0,79070.0,76341.0,78932.0,83109.0,82971.0,81439.0,81313.0,84152.0,83770.0,85123.0,92321.0,89795.0,83821.0,83326.0,85469.0,91140.0,90083.0,91135.0,95824.0,103327.0,105390.0,106377.0,109143.0,102846.0,108727.0,103998.0,106007.0,113487.0,112793.0,116345.0,117735.0,122692.0,131977.0,137566.0,139799.0,131559.0,127516.0,128820.0,134669.0,137716.0,137250.0
NPL,3395.0,3430.0,3500.0,3500.0,3600.0,3600.0,3900.0,3990.0,4200.0,4300.0,4410.0,4515.0,4585.0,4725.0,5000.0,5000.0,5000.0,5000.0,5500.0,5800.0,6000.0,6500.0,6500.0,7100.0,7234.0,7467.0,7727.0,8702.0,9399.0,9911.0,10242.0,10407.0,10447.0,10642.0,11027.0,11800.0,12374.0,13090.0,13924.0,14646.0,15239.0,15594.0,15626.0,15389.0,15724.0,15773.0,16035.0,16425.0,16992.0,17066.0,17923.0,18277.0,18709.0,19269.0,20135.0,23509.0,24535.0
NRU,22.0,22.0,23.0,23.0,24.0,25.0,25.0,26.0,27.0,28.0,29.0,32.0,34.0,36.0,36.0,30.0,30.0,36.0,38.0,39.0,45.0,48.0,51.0,45.0,48.0,51.0,54.0,57.0,57.0,60.0,63.0,66.0,69.0,69.0,69.0,69.0,69.0,69.0,69.0,69.0,69.0,69.0,69.0,69.0,69.0,69.0,72.0,74.0,74.0,73.0,73.0,73.0,73.0,73.0,73.0,74.0,74.0
NZL,39600.0,40200.0,42700.0,47000.0,44800.0,38500.0,36000.0,37400.0,36400.0,38600.0,43690.0,40600.0,35300.0,34400.0,34200.0,32800.0,39000.0,38200.0,35700.0,34500.0,32500.0,40100.0,39700.0,42900.0,47700.0,47600.0,44400.0,45600.0,45068.0,43240.0,42426.0,46118.0,48663.0,48759.0,50815.0,50818.0,47816.0,48338.0,48307.0,46092.0,46299.0,44683.0,46320.0,50887.0,50901.0,51074.0,50321.0,51703.0,47338.0,46666.0,49467.0,50591.0,47159.0,47771.0,45632.0,43846.0,46741.0
PAN,3807.0,3790.0,3891.0,3124.0,3280.0,3688.0,3710.0,3705.0,4428.0,4667.0,4167.0,3861.0,4887.0,5084.0,5425.0,5350.0,5984.0,6454.0,6515.0,7524.0,8257.0,8635.0,9258.0,10060.0,11811.0,13317.0,10454.0,9640.0,9680.0,11532.0,12268.0,14567.0,15569.0,15981.0,16783.0,18769.0,18755.0,19233.0,21060.0,21590.0,17857.0,18200.0,20349.0,20938.0,21332.0,25016.0,30477.0,34729.0,31252.0,29531.0,32321.0,34400.0,34289.0,34233.0,35954.0,39629.0,40752.0
PER,40530.0,42139.0,44238.0,46883.0,43134.0,41738.0,42947.0,42819.0,46697.0,46475.0,53602.0,53594.0,53191.0,54568.0,54649.0,54898.0,54000.0,53000.0,52500.0,55000.0,59200.0,58700.0,57600.0,54500.0,53500.0,59200.0,65000.0,73500.0,73400.0,66500.0,68700.0,72800.0,75700.0,77700.0,80100.0,83000.0,86600.0,70679.0,88590.0,91554.0,93313.0,92530.0,92738.0,98880.0,104254.0,109010.0,114520.0,115196.0,114718.0,115655.0,117588.0,122353.0,127684.0,135390.0,142925.0,149399.0,157741.0
PHL,206000.0,233469.0,244000.0,258000.0,290000.0,317000.0,338000.0,360000.0,383000.0,369000.0,374000.0,318240.0,357811.0,372123.0,323000.0,325000.0,289000.0,318000.0,376890.0,412000.0,455000.0,392000.0,452000.0,569340.0,396942.0,460079.0,500357.0,566384.0,638792.0,711760.0,845213.0,845250.0,880945.0,921761.0,969862.0,1036517.0,1085544.0,1123773.0,1171759.0,1212536.0,1265888.0,1332347.0,1384575.0,1365606.0,1415041.0,1564957.0,1616715.0,1605984.0,1628839.0,1635756.0,1641587.0,1652881.0,1681128.0,1690692.0,1775712.0,1863320.0,1837273.0
PNG,17600.0,18000.0,18400.0,18800.0,19200.0,19600.0,20200.0,20800.0,21400.0,22000.0,22600.0,23200.0,24000.0,24600.0,26000.0,28000.0,28400.0,29000.0,30000.0,30400.0,30800.0,31600.0,32400.0,32800.0,33600.0,34000.0,34400.0,35016.0,35600.0,36184.0,36192.0,39800.0,44000.0,48000.0,52000.0,53200.0,56000.0,58000.0,58000.0,58000.0,64000.0,68000.0,68000.0,68000.0,68000.0,68000.0,70000.0,70000.0,72000.0,74000.0,76000.0,77000.0,74400.0,75059.0,75826.0,79470.0,80233.0
POL,1255100.0,1238700.0,1111000.0,1092500.0,1298100.0,1342700.0,1312700.0,1294200.0,1312500.0,1292400.0,1329600.0,1587100.0,1770600.0,1885000.0,1811700.0,1542800.0,1551000.0,1784800.0,1795400.0,1711400.0,1345500.0,1462000.0,1396200.0,1303900.0,1486300.0,1728100.0,1729200.0,1828300.0,1854200.0,1854500.0,1947300.0,2035600.0,1903000.0,1681300.0,2007500.0,2063700.0,1891300.0,2026200.0,2043000.0,1923000.0,1849100.0,2023300.0,2190300.0,1956000.0,1955500.0,2097500.0,2150700.0,1920400.0,1735700.0,1894800.0,1936300.0,1848600.0,1775500.0,1864500.0,1976000.0,2008800.0,2047800.0
PRI,10558.0,10897.0,11477.0,11367.0,12517.0,12226.0,12235.0,12732.0,13950.0,13141.0,13377.0,14197.0,15031.0,14590.0,15474.0,18598.0,19835.0,25787.0,23239.0,16218.0,18861.0,20230.0,16564.0,15422.0,17894.0,25216.0,23734.0,22394.0,25106.0,28353.0,30343.0,18000.0,17132.0,15403.0,15375.0,14937.0,13186.0,14000.0,9361.0,9469.0,10095.0,9262.0,9223.0,11895.0,10743.0,11000.0,11200.0,11500.0,11900.0,11045.0,11119.0,10914.0,10708.0,10503.0,9313.0,8242.0,8366.0
PRK,49000.0,50000.0,51500.0,55000.0,55000.0,60000.0,65000.0,65000.0,70000.0,85000.0,90000.0,100000.0,100000.0,115000.0,125000.0,135000.0,145000.0,150000.0,160000.0,165000.0,175000.0,175000.0,185000.0,185000.0,195000.0,200000.0,205000.0,215000.0,220000.0,225000.0,235000.0,175000.0,150000.0,135000.0,115000.0,105100.0,84000.0,111500.0,133750.0,140000.0,145000.0,163000.0,163000.0,165000.0,168000.0,150000.0,130000.0,110000.0,110000.0,110000.0,110000.0,112500.0,112500.0,104618.0,109208.0,114156.0,123775.0
PRT,84309.0,79768.0,80259.0,75572.0,75419.0,81000.0,87000.0,95500.0,102300.0,93800.0,97800.0,105900.0,111000.0,115700.0,129248.0,124621.0,140000.0,155000.0,160000.0,155000.0,177977.0,178839.0,175763.0,183295.0,174490.0,171199.0,199255.0,183315.0,210822.0,279323.0,262521.0,264588.0,307287.0,315625.0,305036.0,324583.0,330041.0,358610.0,373248.0,355422.0,342609.0,355956.0,354875.0,340279.0,352998.0,365869.0,385864.0,404153.0,395970.0,407808.0,406814.0,384182.0,366414.0,381656.0,400296.0,399674.0,377866.0
PRY,25800.0,26214.0,28584.0,30882.0,32568.0,34625.0,36807.0,38574.0,40392.0,42324.0,44358.0,46578.0,48906.0,51600.0,54900.0,58752.0,61926.0,67806.0,77480.0,85175.0,93608.0,98289.0,100646.0,103665.0,106776.0,107304.0,107854.0,109471.0,114179.0,118125.0,120523.0,126485.0,126778.0,170390.0,173336.0,154269.0,156583.0,158400.0,160000.0,157040.0,143040.0,150400.0,84000.0,156000.0,152000.0,156000.0,148820.0,144000.0,144000.0,160000.0,164000.0,168000.0,176000.0,180000.0,185000.0,189800.0,192000.0
PYF,2325.0,2438.0,2762.0,2909.0,3162.0,3231.0,3017.0,3041.0,3059.0,3170.0,3323.0,3357.0,3447.0,3678.0,3762.0,4116.0,4217.0,4353.0,4329.0,4789.0,5281.0,5493.0,5774.0,6243.0,6563.0,6999.0,7087.0,7341.0,7742.0,7889.0,7529.0,7330.0,7462.0,7640.0,7497.0,7479.0,7448.0,7515.0,7515.0,7623.0,7849.0,7388.0,7247.0,7384.0,7390.0,7311.0,7224.0,7095.0,6727.0,7026.0,6861.0,6941.0,6800.0,6882.0,6802.0,6953.0,6914.0
ROU,283000.0,300000.0,245000.0,330000.0,357000.0,372000.0,406000.0,420000.0,417000.0,468000.0,474000.0,591000.0,674000.0,749000.0,754000.0,796000.0,829000.0,852000.0,925000.0,863000.0,855000.0,785000.0,790000.0,869000.0,853000.0,851000.0,872000.0,818000.0,798000.0,787835.0,833910.0,788750.0,761300.0,775300.0,673016.0,630646.0,666700.0,617188.0,595133.0,502337.0,460109.0,476168.0,532516.0,374039.0,436424.0,451832.0,470223.0,439029.0,470567.0,428891.0,454415.0,442942.0,396070.0,459756.0,470055.0,500777.0,451940.0
RUS,,,,,,,,,,,,,,,,,,,,,,,,,,,,,,,,2783500.0,2432100.0,2103500.0,1865400.0,1705200.0,1545500.0,1504900.0,1485000.0,1578200.0,1514700.0,1608300.0,1742600.0,1685800.0,1569100.0,1699200.0,1929700.0,2042059.0,2169475.0,2330806.0,2427636.0,2559477.0,2816178.0,2973928.0,3098678.0,3368235.0,3529610.0
RWA,1092.0,1197.0,990.0,754.0,546.0,630.0,828.0,646.0,483.0,414.0,325.0,672.0,686.0,989.0,1145.0,979.0,1746.0,2070.0,2384.0,2520.0,2940.0,3024.0,2898.0,1848.0,1865.0,2016.0,2372.0,2869.0,2730.0,2646.0,2646.0,2688.0,2730.0,2814.0,2268.0,2520.0,2646.0,2268.0,2940.0,3276.0,3318.0,3864.0,3906.0,6006.0,6384.0,6258.0,6090.0,5670.0,6930.0,7228.0,7460.0,7938.0,8905.0,10210.0,13287.0,14572.0,15210.0
SEN,698.0,833.0,990.0,990.0,1193.0,1913.0,1958.0,2025.0,3570.0,3780.0,3930.0,4110.0,4260.0,4410.0,3600.0,3720.0,3810.0,3900.0,3930.0,4050.0,4140.0,4200.0,4260.0,4290.0,3690.0,4080.0,4500.0,2295.0,2595.0,2625.0,3162.0,3720.0,3690.0,3870.0,3915.0,4110.0,4590.0,5130.0,6707.0,9259.0,9299.0,11199.0,9925.0,9270.0,9774.0,10316.0,10109.0,9608.0,9898.0,10640.0,11107.0,12113.0,12703.0,14882.0,15901.0,14926.0,15036.0
SGP,28200.0,27000.0,24800.0,22700.0,24500.0,26900.0,27300.0,25000.0,39642.0,45504.0,51642.0,59225.0,57215.0,52895.0,55323.0,66953.0,69300.0,65600.0,69000.0,65216.0,59930.0,61300.0,63230.0,67736.0,72156.0,71696.0,76845.0,73770.0,74543.0,76256.0,,,,,,,,,,,,,,,,,,,,,,,,,,,
SLB,640.0,672.0,700.0,720.0,760.0,800.0,840.0,880.0,960.0,1080.0,1120.0,1200.0,1280.0,1320.0,1348.0,1360.0,1400.0,1440.0,1480.0,1516.0,1520.0,1560.0,1600.0,1600.0,1640.0,1600.0,1640.0,1680.0,1720.0,1760.0,2000.0,2000.0,2080.0,2080.0,2080.0,2080.0,2120.0,2120.0,2080.0,2100.0,2200.0,2220.0,2240.0,2280.0,2320.0,2320.0,2320.0,2360.0,2400.0,2360.0,2340.0,2400.0,2430.0,2467.0,2484.0,2458.0,2472.0
SLE,435.0,545.0,696.0,870.0,1044.0,1160.0,1160.0,1218.0,1044.0,870.0,754.0,812.0,928.0,986.0,1160.0,1218.0,1305.0,1450.0,1508.0,1566.0,1653.0,1740.0,1827.0,1740.0,1914.0,2088.0,2204.0,2204.0,2204.0,2204.0,2204.0,2204.0,2204.0,2204.0,2204.0,2204.0,2204.0,2204.0,2291.0,2291.0,325.0,406.0,510.0,638.0,812.0,986.0,1276.0,1566.0,1914.0,2059.0,2262.0,2320.0,2595.0,2783.0,2720.0,2268.0,2163.0
SLV,11586.0,11575.0,11565.0,11554.0,11544.0,11534.0,11518.0,11508.0,11237.0,11014.0,10660.0,12480.0,12854.0,13156.0,13520.0,13676.0,13936.0,14352.0,15340.0,16120.0,13000.0,13000.0,13000.0,13000.0,13780.0,14248.0,14456.0,13260.0,10036.0,11024.0,10712.0,10972.0,11284.0,12740.0,10920.0,11128.0,10400.0,9880.0,14196.0,10660.0,8659.0,8659.0,8294.0,7848.0,10835.0,14207.0,9290.0,8849.0,8309.0,8286.0,8434.0,9487.0,7978.0,8573.0,7110.0,7343.0,8392.0
SOM,84.0,90.0,105.0,120.0,140.0,150.0,160.0,180.0,190.0,195.0,200.0,210.0,216.0,225.0,231.0,240.0,246.0,255.0,264.0,270.0,276.0,285.0,291.0,294.0,300.0,303.0,303.0,306.0,306.0,300.0,210.0,90.0,105.0,115.0,120.0,130.0,135.0,120.0,115.0,120.0,125.0,125.0,135.0,138.0,145.0,125.0,125.0,125.0,125.0,115.0,100.0,100.0,100.0,101.0,102.0,104.0,103.0
SPM,,,,,,,,,,,,,,,,,,,,,,,,,39.0,39.0,45.0,21.0,1.0,2.0,,,,,,,,,,,,,,,,,,,,,,,,,,,
SRB,,,,,,,,,,,,,,,,,,,,,,,,,,,,,,,,,,,,,,,,,,,,,,254870.0,289373.0,265655.0,252188.0,269273.0,271000.0,293383.0,302587.0,320363.0,287801.0,302914.0,312377.0
STP,155.0,173.0,173.0,135.0,145.0,209.0,180.0,178.0,173.0,134.0,208.0,166.0,221.0,70.0,145.0,245.0,145.0,110.0,75.0,50.0,75.0,80.0,85.0,85.0,90.0,90.0,100.0,100.0,100.0,105.0,110.0,120.0,55.0,59.0,63.0,66.0,70.0,74.0,77.0,80.0,84.0,88.0,92.0,95.0,97.0,101.0,150.0,200.0,260.0,300.0,340.0,360.0,361.0,358.0,456.0,550.0,615.0
SVK,,,,,,,,,,,,,,,,,,,,,,,,,,,,,,,,,241495.0,244274.0,242774.0,250823.0,254810.0,227037.0,220288.0,163603.0,153012.0,154310.0,183252.0,164906.0,139938.0,122258.0,113825.0,102406.0,88432.0,84092.0,70604.0,70604.0,64866.0,63073.0,52397.0,55928.0,57929.0
SVN,,,,,,,,,,,,,,,,,,,,,,,,,,,,,,,,41051.0,65337.0,71096.0,60800.0,62700.0,59200.0,64900.0,71200.0,60000.0,66400.0,62000.0,73700.0,71323.0,62600.0,61151.0,57331.0,54566.0,44090.0,44130.0,38975.0,35607.0,29569.0,29709.0,27317.0,30724.0,30034.0
SWE,202738.0,215921.0,204686.0,212168.0,216904.0,227693.0,234389.0,244022.0,239133.0,236082.0,256306.0,276025.0,263746.0,276970.0,282716.0,293690.0,303571.0,306760.0,313513.0,317371.0,320540.0,325020.0,318318.0,323734.0,331679.0,309379.0,287833.0,299387.0,306603.0,290795.0,267872.0,277885.0,291131.0,307593.0,308800.0,318900.0,329300.0,330400.0,325400.0,277000.0,275900.0,283800.0,287500.0,294500.0,275131.0,264448.0,264869.0,270758.0,260748.0,263478.0,256080.0,232980.0,234570.0,236480.0,233500.0,233890.0,240700.0
SWZ,450.0,400.0,350.0,375.0,275.0,325.0,435.0,450.0,475.0,460.0,450.0,575.0,625.0,650.0,725.0,750.0,815.0,650.0,750.0,600.0,750.0,650.0,650.0,750.0,650.0,750.0,850.0,900.0,800.0,925.0,1045.0,1165.0,1120.0,1110.0,1090.0,1133.0,1250.0,1168.0,1315.0,1245.0,1133.0,1225.0,1550.0,1350.0,1390.0,1500.0,1575.0,1150.0,1150.0,1200.0,1250.0,1275.0,1310.0,1330.0,1343.0,1362.0,1357.0
SYC,70.0,45.0,75.0,75.0,75.0,105.0,105.0,129.0,141.0,200.0,295.0,400.0,450.0,500.0,550.0,550.0,400.0,470.0,520.0,580.0,660.0,720.0,780.0,840.0,900.0,930.0,960.0,990.0,1020.0,1050.0,1080.0,1050.0,1080.0,1095.0,1065.0,1050.0,1080.0,1085.0,1069.0,722.0,332.0,365.0,420.0,420.0,457.0,450.0,560.0,510.0,450.0,408.0,522.0,490.0,520.0,460.0,458.0,504.0,475.0
TCD,94.0,94.0,94.0,94.0,94.0,94.0,94.0,94.0,94.0,103.0,107.0,113.0,113.0,103.0,94.0,113.0,131.0,141.0,150.0,159.0,169.0,178.0,191.0,193.0,203.0,213.0,223.0,235.0,248.0,260.0,327.0,342.0,360.0,378.0,396.0,414.0,432.0,465.0,480.0,510.0,510.0,555.0,555.0,577.0,578.0,600.0,624.0,649.0,666.0,690.0,720.0,726.0,735.0,2732.0,2200.0,2700.0,2500.0
TGO,2478.0,2635.0,2797.0,3122.0,3160.0,3136.0,3024.0,3388.0,3220.0,2730.0,2856.0,3052.0,3444.0,3430.0,3584.0,3780.0,3556.0,3612.0,3556.0,2912.0,3248.0,3248.0,3192.0,3108.0,4452.0,3304.0,3416.0,5376.0,6020.0,5180.0,6630.0,6765.0,6690.0,6570.0,5160.0,4500.0,5130.0,5692.0,6187.0,6501.0,6814.0,7161.0,7524.0,7887.0,8283.0,8695.0,9141.0,9610.0,10102.0,10500.0,10800.0,8192.0,7291.0,8585.0,9742.0,9191.0,9168.0
THA,129067.0,131865.0,130060.0,154900.0,150000.0,164350.0,170000.0,185000.0,195000.0,210000.0,164597.0,175000.0,209210.0,190000.0,175000.0,170000.0,180121.0,319305.0,255000.0,267000.0,273000.0,280000.0,219000.0,276500.0,377500.0,276000.0,325500.0,333500.0,334500.0,551320.0,562624.0,606631.0,642259.0,685125.0,684498.0,715795.0,746200.0,656530.0,635271.0,692950.0,701708.0,786841.0,866951.0,872019.0,907050.0,985278.0,1002308.0,894501.0,871019.0,895339.0,879573.0,949299.0,967296.0,948901.0,940609.0,921428.0,902330.0
TJK,,,,,,,,,,,,,,,,,,,,,,,,,,,,,,,,2700.0,790.0,520.0,500.0,100.0,75.0,200.0,400.0,800.0,1200.0,1600.0,2000.0,2100.0,2300.0,3100.0,3300.0,3100.0,2990.0,2670.0,2500.0,1600.0,3600.0,4300.0,3630.0,2800.0,1500.0
TKL,5.0,5.0,3.0,13.0,13.0,13.0,13.0,13.0,13.0,13.0,13.0,14.0,14.0,14.0,15.0,14.0,14.0,16.0,17.0,17.0,18.0,19.0,19.0,18.0,19.0,19.0,20.0,20.0,20.0,21.0,20.0,20.0,20.0,20.0,20.0,20.0,20.0,20.0,20.0,20.0,20.0,20.0,20.0,19.0,19.0,20.0,20.0,20.0,20.0,20.0,20.0,19.0,19.0,19.0,19.0,19.0,19.0
TKM,,,,,,,,,,,,,,,,,,,,,,,,,,,,,,,,7000.0,5000.0,4000.0,3000.0,1400.0,700.0,510.0,700.0,500.0,400.0,300.0,200.0,200.0,200.0,200.0,300.0,300.0,300.0,300.0,300.0,276.0,239.0,241.0,224.0,258.0,269.0
TLS,5200.0,5120.0,5360.0,5400.0,5600.0,5440.0,4280.0,4640.0,4320.0,4880.0,5400.0,5640.0,5200.0,5320.0,3600.0,2920.0,2400.0,1920.0,1680.0,1560.0,1920.0,2400.0,3120.0,3840.0,4400.0,4800.0,4760.0,5160.0,6280.0,6680.0,7680.0,9440.0,10880.0,8640.0,8680.0,4320.0,10160.0,9200.0,5600.0,6400.0,7600.0,8000.0,8000.0,8000.0,8120.0,8440.0,8760.0,9120.0,9480.0,9760.0,10200.0,10760.0,11320.0,11121.0,11372.0,11412.0,10839.0
TON,360.0,510.0,540.0,570.0,615.0,720.0,660.0,705.0,750.0,810.0,905.0,955.0,972.0,1072.0,1206.0,1326.0,1360.0,1394.0,1428.0,1462.0,1517.0,1406.0,1332.0,1314.0,1314.0,1440.0,1460.0,1480.0,1523.0,1523.0,1523.0,1540.0,1496.0,1496.0,1496.0,1496.0,1496.0,1496.0,1496.0,1496.0,1496.0,1496.0,1496.0,1492.0,1477.0,1500.0,1550.0,1538.0,1561.0,1611.0,1619.0,1650.0,1658.0,1669.0,1691.0,1674.0,1688.0
TTO,1700.0,1700.0,1700.0,1800.0,1860.0,1920.0,2100.0,2300.0,2400.0,2500.0,2700.0,2700.0,2800.0,2700.0,2800.0,2850.0,3097.0,2872.0,2418.0,2424.0,2457.0,2931.0,3519.0,3553.0,3364.0,2885.0,3382.0,2973.0,2286.0,2443.0,2449.0,2458.0,1938.0,1592.0,1565.0,1625.0,2076.0,1878.0,1924.0,1693.0,2039.0,2935.0,2838.0,2925.0,2925.0,3548.0,3866.0,3408.0,3429.0,3341.0,3334.0,3479.0,2666.0,2574.0,2072.0,2260.0,2521.0
TUN,112.0,136.0,111.0,112.0,138.0,155.0,185.0,110.0,105.0,120.0,165.0,110.0,115.0,145.0,155.0,90.0,56.0,56.0,70.0,111.0,142.0,91.0,52.0,80.0,80.0,80.0,80.0,60.0,115.0,170.0,150.0,150.0,169.0,174.0,157.0,150.0,158.0,155.0,114.0,165.0,155.0,150.0,155.0,150.0,152.0,173.0,155.0,150.0,140.0,129.0,114.0,110.0,110.0,180.0,150.0,130.0,127.0
TUR,432.0,432.0,432.0,336.0,432.0,488.0,504.0,504.0,491.0,490.0,494.0,490.0,492.0,495.0,513.0,513.0,395.0,225.0,335.0,325.0,125.0,245.0,390.0,753.0,505.0,447.0,334.0,348.0,470.0,330.0,115.0,110.0,95.0,80.0,445.0,1425.0,53.0,314.0,240.0,274.0,86.0,37.0,280.0,174.0,14.0,,,,3.0,,,,,,,,
TUV,18.0,18.0,18.0,18.0,18.0,18.0,18.0,18.0,18.0,18.0,18.0,18.0,18.0,18.0,18.0,18.0,21.0,21.0,23.0,24.0,21.0,23.0,25.0,30.0,35.0,40.0,45.0,50.0,58.0,60.0,105.0,105.0,84.0,87.0,87.0,87.0,105.0,105.0,108.0,108.0,108.0,111.0,111.0,111.0,111.0,111.0,114.0,114.0,114.0,114.0,115.0,117.0,117.0,118.0,119.0,120.0,121.0
TWN,182700.0,182100.0,210300.0,223900.0,241400.0,272110.0,314626.0,321602.0,342279.0,387939.0,397936.0,415572.0,486983.0,448961.0,387560.0,496880.0,556163.0,561018.0,678260.0,597875.0,595366.0,614444.0,655916.0,731560.0,830709.0,868332.0,937644.0,911124.0,916775.0,1008729.0,1126132.0,1126406.0,1135361.0,1203596.0,1233022.0,1269354.0,1029848.0,891776.0,822344.0,920603.0,961948.0,935354.0,892835.0,898208.0,911449.0,930609.0,913824.0,861836.0,857155.0,845464.0,864792.0,877628.0,855019.0,815257.0,832183.0,826409.0,809394.0
TZA,2600.0,2600.0,2680.0,2800.0,2800.0,2924.0,3012.0,3104.0,3200.0,3300.0,3400.0,3504.0,3616.0,3728.0,3840.0,3968.0,4096.0,4204.0,4336.0,4404.0,4608.0,2380.0,5044.0,7928.0,8064.0,8208.0,8236.0,8520.0,8680.0,8960.0,9240.0,9240.0,9380.0,9380.0,9800.0,10400.0,10800.0,11480.0,12480.0,12600.0,12800.0,12880.0,13000.0,13080.0,13200.0,13400.0,13600.0,13800.0,13920.0,14000.0,14120.0,14400.0,14400.0,14437.0,14531.0,14735.0,14778.0
UGA,720.0,720.0,664.0,843.0,1428.0,1428.0,1678.0,1680.0,1915.0,2855.0,3935.0,3970.0,3360.0,3215.0,4190.0,5490.0,7250.0,9910.0,8000.0,8400.0,8810.0,9257.0,9720.0,10205.0,10716.0,12600.0,25400.0,23100.0,38700.0,57600.0,60000.0,61200.0,63000.0,64800.0,66000.0,69000.0,70800.0,72540.0,75000.0,77400.0,80880.0,84000.0,87000.0,95400.0,98400.0,102000.0,105000.0,108000.0,111000.0,113100.0,117000.0,115000.0,117000.0,116446.0,118261.0,125851.0,126338.0
UKR,,,,,,,,,,,,,,,,,,,,,,,,,,,,,,,,1179800.0,1013000.0,916000.0,806900.0,789300.0,710000.0,668200.0,656300.0,675900.0,591200.0,599300.0,630900.0,558800.0,493700.0,526100.0,634700.0,589900.0,526500.0,631200.0,704400.0,700800.0,748300.0,742600.0,759700.0,748000.0,735900.0
URY,18000.0,19000.0,19000.0,20000.0,18000.0,21000.0,25084.0,21591.0,20500.0,21818.0,26039.0,22023.0,21307.0,26986.0,26876.0,27724.0,26678.0,26474.0,28412.0,24720.0,25037.0,22848.0,21892.0,19024.0,18251.0,17000.0,18827.0,19620.0,20325.0,22072.0,21805.0,22450.0,22800.0,22900.0,22000.0,20500.0,21700.0,25800.0,27000.0,26000.0,22600.0,19521.0,16797.0,17424.0,19754.0,18511.0,21057.0,20869.0,17290.0,18397.0,20853.0,17223.0,17650.0,16916.0,14211.0,13151.0,11839.0
USA,5174000.0,5365000.0,5637000.0,5676000.0,5053000.0,5143257.0,5706616.0,5925700.0,5876258.0,6090000.0,6705000.0,6176600.0,5783726.0,6261810.0,5217646.0,5631350.0,6008740.0,6074960.0,7008000.0,7536440.0,7200740.0,6454160.0,6895500.0,6718600.0,6715400.0,6379000.0,6520000.0,7114000.0,7172000.0,6964000.0,7257487.0,7816767.0,7750542.0,8027234.0,8095726.0,7763696.0,7835818.0,8623255.0,8757065.0,8596946.0,8691294.0,8928976.0,9056890.0,9312716.0,9391823.0,9558699.0,9961898.0,10598969.0,10441709.0,10185656.0,10330715.0,10554200.0,10524535.0,10368227.0,11120748.0,11320285.0,11611177.0
UZB,,,,,,,,,,,,,,,,,,,,,,,,,,,,,,,,36100.0,27000.0,20000.0,16000.0,9000.0,4000.0,15000.0,19800.0,14500.0,10500.0,4300.0,11200.0,13800.0,16000.0,18058.0,18000.0,19000.0,20000.0,21000.0,30000.0,32000.0,35000.0,37200.0,40000.0,29486.0,29090.0
VCT,222.0,222.0,228.0,228.0,240.0,240.0,228.0,210.0,198.0,180.0,198.0,210.0,216.0,216.0,252.0,264.0,279.0,279.0,288.0,294.0,360.0,408.0,450.0,480.0,516.0,540.0,600.0,690.0,660.0,600.0,546.0,552.0,558.0,564.0,570.0,570.0,570.0,570.0,570.0,570.0,570.0,570.0,550.0,550.0,550.0,550.0,552.0,557.0,576.0,516.0,384.0,306.0,388.0,416.0,428.0,381.0,367.0
VEN,27420.0,29620.0,29535.0,31054.0,30490.0,30244.0,32656.0,38185.0,43277.0,45389.0,45382.0,49547.0,74007.0,68764.0,79866.0,84187.0,77738.0,80509.0,73764.0,75639.0,78660.0,87071.0,100073.0,104529.0,117348.0,136099.0,133273.0,148318.0,140527.0,107116.0,111384.0,132869.0,133199.0,124650.0,139439.0,137864.0,132530.0,118192.0,127621.0,126199.0,119347.0,118811.0,120203.0,101363.0,126205.0,137111.0,154369.0,163660.0,165000.0,201843.0,219619.0,196846.0,205098.0,195903.0,186040.0,161707.0,162990.0
VGB,80.0,85.0,88.0,90.0,95.0,32.0,33.0,33.0,33.0,35.0,35.0,35.0,36.0,36.0,37.0,37.0,37.0,37.0,38.0,38.0,39.0,39.0,39.0,40.0,40.0,28.0,20.0,20.0,20.0,20.0,20.0,20.0,20.0,20.0,20.0,20.0,20.0,20.0,20.0,20.0,20.0,20.0,20.0,20.0,20.0,25.0,30.0,20.0,20.0,20.0,20.0,20.0,20.0,20.0,20.0,19.0,19.0
VIR,126.0,133.0,133.0,133.0,140.0,157.0,174.0,218.0,240.0,257.0,217.0,221.0,224.0,225.0,228.0,229.0,231.0,231.0,224.0,217.0,252.0,245.0,224.0,210.0,167.0,102.0,105.0,106.0,106.0,106.0,106.0,106.0,105.0,105.0,105.0,105.0,105.0,105.0,105.0,105.0,105.0,105.0,105.0,105.0,105.0,100.0,110.0,108.0,107.0,106.0,106.0,106.0,106.0,109.0,107.0,106.0,106.0
VNM,250000.0,257000.0,260000.0,265000.0,275000.0,285000.0,300000.0,290000.0,283000.0,270000.0,275000.0,278000.0,280000.0,265000.0,247000.0,250000.0,259000.0,270000.0,280000.0,292000.0,396000.0,451000.0,511000.0,531000.0,560668.0,625000.0,671000.0,662000.0,714000.0,728560.0,716320.0,792212.0,874415.0,957700.0,1007000.0,1079986.0,1154203.0,1227621.0,1318196.0,1418064.0,1515299.0,1653595.0,1795442.0,2288315.0,2288315.0,2570104.0,2552862.0,2771002.0,3035853.0,3036358.0,3098900.0,3160048.0,3228670.0,3351200.0,3491600.0,3664556.0,3733349.0
VUT,1260.0,1260.0,1260.0,1275.0,1290.0,1296.0,1320.0,1344.0,1368.0,1392.0,1416.0,1440.0,1440.0,1455.0,1470.0,1485.0,1643.0,1728.0,1870.0,2052.0,2183.0,2280.0,2640.0,2501.0,2646.0,2624.0,2574.0,2112.0,2016.0,2205.0,2499.0,2550.0,2550.0,2550.0,2550.0,2652.0,2703.0,2780.0,2805.0,2805.0,2805.0,2805.0,2805.0,2805.0,2856.0,3035.0,3366.0,3417.0,3417.0,3443.0,3468.0,3519.0,3519.0,3526.0,3526.0,3613.0,3650.0
WLF,116.0,117.0,117.0,118.0,118.0,119.0,125.0,126.0,126.0,127.0,127.0,128.0,128.0,129.0,130.0,132.0,133.0,250.0,250.0,250.0,250.0,275.0,275.0,275.0,300.0,300.0,300.0,300.0,300.0,300.0,305.0,310.0,315.0,315.0,315.0,315.0,315.0,315.0,315.0,315.0,315.0,315.0,315.0,315.0,315.0,312.0,309.0,314.0,315.0,314.0,314.0,314.0,314.0,314.0,314.0,314.0,314.0
WSM,1020.0,1020.0,1200.0,1200.0,1200.0,1300.0,1300.0,1300.0,1300.0,1300.0,1300.0,1300.0,1300.0,1300.0,1300.0,1230.0,1230.0,1230.0,1230.0,1580.0,1900.0,2200.0,2500.0,2900.0,3200.0,3400.0,3600.0,3800.0,4000.0,4100.0,3700.0,3500.0,3600.0,3600.0,3400.0,3400.0,3400.0,3400.0,3400.0,3500.0,3800.0,3500.0,3500.0,3500.0,3500.0,3500.0,3160.0,3026.0,2578.0,2867.0,2855.0,2840.0,2825.0,2810.0,2652.0,2853.0,2817.0
ZAF,57110.0,58743.0,58000.0,63000.0,65000.0,67000.0,75000.0,72000.0,82688.0,80924.0,78900.0,89700.0,99900.0,90800.0,87100.0,92500.0,93500.0,88000.0,87700.0,88800.0,95700.0,112000.0,113600.0,110400.0,107400.0,104300.0,107500.0,114900.0,126200.0,130800.0,123600.0,128700.0,125300.0,115200.0,121100.0,130400.0,121600.0,125700.0,116800.0,112400.0,116500.0,117100.0,148600.0,157500.0,160700.0,180600.0,185200.0,178000.0,184700.0,202200.0,201100.0,208700.0,216215.0,234463.0,237387.0,240210.0,235300.0
ZMB,2477.0,2345.0,1984.0,2279.0,2411.0,2904.0,3159.0,2996.0,3124.0,3124.0,2992.0,4360.0,4884.0,5079.0,5403.0,5698.0,7141.0,7480.0,6684.0,7209.0,7638.0,8103.0,6393.0,5487.0,5861.0,6156.0,6474.0,6815.0,9416.0,9460.0,9504.0,9460.0,9680.0,10120.0,9680.0,10340.0,10340.0,10428.0,10560.0,10120.0,10560.0,9020.0,8800.0,9460.0,9900.0,12980.0,17600.0,23100.0,23100.0,22880.0,26180.0,48400.0,35244.0,27730.0,26600.0,26850.0,31621.0
ZWE,6512.0,7095.0,7700.0,8140.0,7480.0,7222.0,8811.0,10511.0,10203.0,10802.0,9191.0,8976.0,10632.0,10681.0,11677.0,12513.0,13118.0,11303.0,8553.0,8663.0,9279.0,10368.0,11556.0,8960.0,8140.0,8487.0,10219.0,10896.0,11336.0,11391.0,11055.0,11407.0,8179.0,9955.0,13101.0,12727.0,11891.0,12925.0,12770.0,21835.0,29150.0,29260.0,29040.0,29150.0,29425.0,29700.0,29975.0,30250.0,17300.0,19300.0,19500.0,19400.0,20400.0,20800.0,18575.0,18975.0,19250.0
