### META ###
ID,Area|Land|Agriculture|Temporary_fallow__Historic__FAO_2020
category,Agriculture|Temporary_fallow
creator,AG
entity,Area|Land
modified,2021/05/06-02:56:15
pathway,Historic
scenario,Historic
source,FAO_2020
unit,Mha
variable,Area|Land|Agriculture|Temporary_fallow
### DATA ###
region,1991,1992,1993,1994,1995,1996,1997,1998,1999,2000,2001,2002,2003,2004,2005,2006,2007,2008,2009,2010,2011,2012,2013,2014,2015,2016,2017,2018
AFG,,,,,,,,,,,5.181,5.567,4.011,4.882,4.42,4.265,4.263,4.57,4.324,4.312,4.71,4.336,4.2940000000000005,4.2860000000000005,4.41,4.3100000000000005,4.827,5.494
ALB,,,,,,,,,,,,,,,,0.06,,0.21,0.20700000000000002,0.222,0.213,0.2093,0.2038,0.2067,0.202,0.202,0.18780000000000002,0.191046
AND,,,,,,,,,,,2e-05,3e-05,3e-05,3e-05,3e-05,3e-05,2e-05,2e-05,3e-05,5e-05,5e-05,5e-05,5e-05,4e-05,4e-05,4e-05,4e-05,6e-05
ARE,,,,,,,,,,,0.018000000000000002,0.018000000000000002,0.024,0.021,0.02,0.019,0.018000000000000002,0.017,0.017,0.016300000000000002,0.0174,0.0286,0.0297,0.030600000000000002,0.0318,0.0315,0.0305,0.0302
ARG,,,,,,,,,,,,4.2700000000000005,3.0,3.0,3.0,3.0,3.0,3.0,3.0,3.0,3.0,2.8000000000000003,2.8000000000000003,2.8000000000000003,2.8000000000000003,2.8000000000000003,2.8000000000000003,2.8000000000000003
ARM,,,,,,,,,,,,,,,,0.13587000000000002,0.13590000000000002,0.1355,0.13340000000000002,0.1559,0.1515,0.1295,0.13,0.1232,0.1092,0.09290000000000001,0.1515,0.2033
AUT,,,,,,,,,,,0.10790000000000001,0.101,0.103089,0.0917,0.0953,0.0932,0.0756,0.047799999999999995,0.0451,0.0418,0.040799999999999996,0.039200000000000006,0.0386,0.0349,0.04820000000000001,0.05017,0.05172,0.05303
AZE,,,,,,,,,,,0.0598,0.0541,0.0529,0.0499,0.0456,0.0458,0.0456,0.0418,0.0415,0.0414,0.0419,0.0418,0.041,0.0409,0.04020000000000001,0.04,0.039799999999999995,0.04
BEL,,,,,,,,,,,0.025,0.028,0.029,0.024,0.028,0.028,0.025,0.012,0.01,0.01,0.0073,0.0085,0.0085,0.008,0.009000000000000001,0.0092,0.009000000000000001,0.009000000000000001
BFA,,,,,,,,,,,,0.536,,,,,,,,,,,,,,,,
BGD,,,,,,,,,,,0.399,0.406,0.387,0.387,0.46900000000000003,0.614,0.613,0.647,0.47300000000000003,0.531,0.467,0.376,0.392,0.376,0.4217,0.40834,0.40230000000000005,0.367
BGR,,,,,,,,,,,0.516,0.316,0.578,0.438,0.34800000000000003,0.437,0.292,0.229,0.196,0.20800000000000002,0.17400000000000002,0.128,0.121,0.092,0.2352,0.192,0.16,0.15
BIH,,,,,,,,,,,0.41100000000000003,0.423,0.467,0.47100000000000003,0.47200000000000003,0.47000000000000003,0.466,0.451,0.47200000000000003,0.492,0.47800000000000004,0.47600000000000003,0.431,0.446,0.448,0.428,0.466,0.432
BLR,,,,,,,,,,,0.077,0.131,0.121,0.12,0.062,0.027,0.027,0.027,0.027,0.024,0.022,0.02,,,,,,
BLZ,,,,,,,,,,,,0.021,,,,,,,,,,,,,,,,
BOL,,,,,,,,,,,,,1.704,1.653,1.6480000000000001,1.6440000000000001,1.6400000000000001,1.6360000000000001,1.6320000000000001,1.6280000000000001,1.6300000000000001,1.633,1.6360000000000001,1.6400000000000001,1.6400000000000001,1.6400000000000001,1.6400000000000001,1.6400000000000001
BTN,,,,,,,,,,,,,,0.011,,,,0.025,,,,,,,,,,
BWA,,,,,,,,,,,,,0.099,0.068,,0.019,0.074,0.052000000000000005,0.063,0.016,0.035,0.022,0.022,0.022,0.1018,0.1018,0.1018,0.1018
CAN,,,,,,,,,,,4.68,4.445,4.21,3.975,3.74,3.5060000000000002,3.222,2.938,2.654,2.37,2.085,1.847,1.609,1.371,1.133,0.894,0.89,0.712
CHE,,,,,,,,,,,0.0035,0.004200000000000001,0.0038,0.0036000000000000003,0.0033,0.0032,0.003,0.0028,0.0024,0.0023,0.0025,0.0025,0.0024796,0.0025028000000000003,0.0028395,0.0029163,0.0029484,0.0029438
CHL,,,,,,,,,,,,,,,,,0.42,,,,,,,,,,,
COL,,,,,,,,,,,,,,0.10200000000000001,0.156,0.1082,0.16,0.066,0.073,0.112,0.093,0.077,0.046,0.0825,0.11900000000000001,0.1555,1.268,1.2690000000000001
CRI,,,,,,,,,,,,,,,,,,,,,,,,0.0475,0.0475,0.0475,0.0475,0.0475
CUB,,,,,,,,,,,0.9530000000000001,0.929,0.989,1.056,1.106,1.174,1.233,1.213,1.192,1.1715,1.151,1.3652,1.4563,1.3622,1.3247,1.3044000000000002,1.356,1.356
CYP,,,,,,,,,,,0.006,0.007,0.005,0.011,0.021,0.018000000000000002,0.016399999999999998,0.011800000000000001,0.013800000000000002,0.0095,0.0123,0.0114,0.0103,0.0121,0.01657,0.011470000000000001,0.01745,0.016665
CZE,,,,,,,,,,,0.116,0.083,0.177,0.055,,0.044,0.03,0.023,0.029,0.045,0.028,0.033,0.024,0.022,0.035,0.03,0.026000000000000002,0.026000000000000002
DEU,,,,,,,,,,,0.85,0.835,0.9390000000000001,0.784,0.794,0.741,0.648,0.31,0.246,0.252,0.229,0.215,0.199,0.189,0.31,0.31,0.318,0.36
DNK,,,,,,,,,,,0.001,0.001,0.001,0.001,0.017,0.013000000000000001,0.011,0.01,0.033,0.035,0.025,0.025,0.026000000000000002,0.022,0.027,0.034,0.037263,0.076
DZA,,,,,,,,,,,3.743,3.734,3.7015000000000002,3.383,3.59,3.4050000000000002,3.573,3.563,3.424,3.2760000000000002,3.247,3.1523000000000003,3.043,3.0655,3.0936999999999997,3.0305,2.9094188,
ECU,,,,,,,,,,,,0.28200000000000003,0.309,0.20400000000000001,0.198,0.19,0.187,0.23500000000000001,0.1708,0.194,0.1734,0.127,0.191,0.094,0.117,0.126,0.129,0.168
EGY,,,,,,,,,,,,,,,,,,,,,,0.1731,,,,,,
ESP,,,,,,,,,,,3.5100000000000002,3.137,3.353,3.4,3.5,3.8000000000000003,3.895,3.363,3.733,3.81,3.7110000000000003,3.601,3.076,3.0420000000000003,3.04193,3.28865,3.1738000000000004,3.026633
EST,,,,,,,,,,,0.033,0.0252,0.028399999999999998,0.0224,0.0229,0.019100000000000002,0.0188,0.0195,0.0297,0.0422,0.046200000000000005,0.0508,0.041,0.039,0.055,0.017,0.013000000000000001,0.013000000000000001
ETH,,,,,,,,,,,0.8220000000000001,0.84,1.076,1.369,1.3980000000000001,1.444,1.165,0.635,0.635,0.615,0.618,0.624,0.628,0.632,0.636,0.64,0.6422000000000001,0.55
FIN,,,,,,,,,,,0.202,0.211,0.22,0.196,0.241,0.253,0.232,0.189,0.23,0.307,0.276,0.267,0.254,0.247,0.27130000000000004,0.261,0.254,0.246
FJI,,,,,,,,,,,,,,,,,,,0.0342,,,,,,,,,
FRA,,,,,,,,,,,1.3423,1.2771,1.328,1.1529,1.2966,1.2624000000000002,1.1998,0.733,0.6607000000000001,0.6232000000000001,0.5473,0.4989,0.48660000000000003,0.4664,0.4611,0.46886700000000003,0.485038,0.4855
GEO,,,,,,,,,,,,,,0.081,0.1,0.132,0.166,0.13,0.125,0.12,0.115,0.11,0.105,0.10400000000000001,0.10400000000000001,0.10400000000000001,0.10400000000000001,0.10400000000000001
GIN,,,,,,,,,,,,,,,0.671,,,,,,,,,,,,,
GLP,,,,,,,,,,,0.002,0.001,0.001,0.001,0.002,0.002,0.0016,0.0018000000000000002,0.0016,0.0014,0.0011,0.0012,0.0013000000000000002,0.002,0.002,0.002,0.00209,0.00209
GRC,,,,,,,,,,,0.428,0.44,0.432,0.419,0.4035,0.453,0.47000000000000003,0.448,0.457,0.47500000000000003,0.481,0.502,0.499,0.391,0.367,0.353,0.355,0.355
GTM,,,,,,,,,,,,,0.53,,0.437,,,0.4,,,,,0.113,0.12990000000000002,0.17,0.17,0.17,0.17
HRV,,,,,,,,,,,,,0.025,0.032,0.015,0.017,0.017,0.013000000000000001,0.013000000000000001,0.012,0.011,0.0112,0.004900000000000001,0.005900000000000001,0.0337,0.016,0.022,0.025
HTI,,,,,,,,,,,,,,,,,,,0.004900000000000001,,,,,,,,,
HUN,,,,,,,,,,,,,0.26,0.137,0.243,0.359,0.33,0.278,0.331,0.2403,0.23600000000000002,0.136,0.145,0.07200000000000001,0.131,0.147,0.189,0.178
IDN,,,,,,,,,,,9.342,8.535,10.194,12.418000000000001,11.342,,,,,,,,,,,,,
IND,,,,,,,,,,,25.044,25.856,34.425000000000004,25.802,25.67,24.909,26.028000000000002,24.979,24.482,26.847,24.602,25.381,26.324,24.848,26.182000000000002,26.182000000000002,26.182000000000002,26.182000000000002
IRN,,,,,,,,,,,4.593,4.571,4.55,4.529,4.507,4.485,4.463,4.363,4.208,4.08,3.952,3.8240000000000003,3.569,3.569,3.569,3.569,3.569,3.569
IRQ,,,,,,,,,,,,,,,,,,,,,,,1.1,1.12925,3.43675,3.48125,3.392,3.891
ISL,,,,,,,,,,,0.001,0.001,0.001,0.001,0.001,0.001,0.001,0.001,0.001,0.001,0.0012,0.0012,0.0012,0.0012,0.001,0.001,0.001,0.001
ISR,,,,,,,,,,,0.084,0.09,0.09,0.09,0.09,0.09,0.09,0.09,0.09,0.09,0.09,0.09,0.09,0.09,0.09,0.09,0.09,0.09
ITA,,,,,,,,,,,,0.484,0.453,0.47500000000000003,0.47500000000000003,0.47500000000000003,0.501,0.517,0.532,0.548,0.581,0.639,0.375,0.377,0.271,0.277,0.26580000000000004,0.265
JOR,,,,,,,,,,,0.023,0.023,0.023,0.023,0.023,0.023,0.041,0.0314,0.0589,0.0436,0.061,0.056600000000000004,0.053700000000000005,0.048100000000000004,0.047700000000000006,0.0512,0.076,0.067
KAZ,,,,,,,,,,,7.0891,5.5456,5.6867,5.2484,5.1647,5.3667,5.4959,5.0247,4.545100000000001,4.514600000000001,4.5477,4.3167,4.3788,4.725300000000001,4.7984,4.9797,4.546600000000001,4.0671
KGZ,,,,,,,,,,,,,,,,,,,,,,,,0.003,0.0032,0.0037,0.0034,0.0023
KNA,,,,,,,,,,,,,,,3e-05,3e-05,3e-05,,,,,,,,,,,
KOR,,,,,,,,,,,,0.02,0.046,0.048,0.044,0.046,0.037,,,,,,,,,,,
LAO,,,,,,,,,,,,,,,,,,,,,0.198,,,,,,,
LBN,,,,,,,,,,,0.01,0.01,0.01,0.01,0.01,0.01,0.01,0.01,0.01,0.012,0.012,0.012,0.012,0.012,0.012,0.012,0.012,0.012
LSO,,,,,,,,,,,,,,,0.078,0.05,0.06,0.05,0.053,0.078,0.069,0.137,0.0736,0.0683,0.046,0.246,0.1554,0.15230000000000002
LTU,,,,,,,,,,,0.165,0.193,0.154,0.1856,0.1559,0.125,0.108,0.113,0.10779999999999999,0.11950000000000001,0.1062,0.08600000000000001,0.09140000000000001,0.0864,0.09090000000000001,0.0689,0.07579999999999999,0.11
LUX,,,,,,,,,,,0.002,0.002,0.002,0.001,0.002,0.001,0.00135,0.00014000000000000001,0.00012,0.00014000000000000001,0.00016,0.00029,0.00016,0.00014000000000000001,0.00028000000000000003,0.00022,0.00023,0.000263
LVA,,,,,,,,,,,,0.094,0.105,0.107,0.091,0.08700000000000001,0.062,0.056,0.053,0.07,0.07,0.055,0.06,0.058,0.06,0.054,0.075,0.085
MAR,,,,,,,,,,,2.31,2.341,1.697,1.624,1.854,1.691,2.497,2.011,1.827,2.023,1.4962,1.678,1.678,1.9872,1.164,1.816,1.168,1.168
MDA,,,,,,,,,,,,0.129,0.058,0.076,0.123,0.10200000000000001,0.092,0.091,0.029,0.034,0.036000000000000004,0.037,0.039,0.038,0.037,0.035,0.028,0.0265
MEX,9.523,9.523,9.523,9.523,9.358,9.193,9.028,8.863,8.698,8.533,8.368,8.203,8.038,7.873,7.708,7.543,7.378,7.05,6.721,6.72,6.391,6.390000000000001,6.061,5.08,5.08,5.08,5.08,5.08
MKD,,,,,,,,,,,,0.176,0.16,0.14100000000000001,0.132,0.14100000000000001,0.139,0.137,0.127,0.137,0.137,0.138,0.132,0.134,0.137,0.135,0.14,0.139
MLI,,,,,,,,,,,1.5190000000000001,1.346,1.0,1.1,1.0,1.0,1.0,1.0,1.0,1.0,1.0,1.0,1.0,1.0,1.0,1.0,1.0,1.0
MLT,,,,,,,,,,,,,0.0007,,0.0011,,0.0007,0.0007,0.0007,0.00101,0.00101,0.001,0.00096,0.00096,0.00096,0.00085,0.00085,0.00085
MMR,,,,,,,,,,,0.686,0.622,0.584,0.517,0.439,0.368,0.298,0.264,0.257,0.241,0.23,0.322,0.44,0.457,0.443,0.45,0.465,0.465
MNE,,,,,,,,,,,,,,,,0.014,0.014,0.014,0.014,0.014,0.014,0.013000000000000001,6e-05,6e-05,,,,
MNG,,,,,,,,,,,,,0.47578,0.4712,0.4784,0.47950000000000004,0.47250000000000003,0.3633,0.31206,0.30661,0.33036000000000004,0.292,0.30495,0.30495,0.30495,0.26063000000000003,0.24101,0.2316
MOZ,,,,,,,,,,,,,,0.336,0.36,0.355,,,,,,,,,,,,
MTQ,,,,,,,,,,,0.001,0.001,0.001,0.001,,0.002,0.0025,0.0029,0.0023,0.0021000000000000003,0.0021000000000000003,0.0021000000000000003,0.002,0.002,0.0027,0.0025,0.00233,0.0037
MYS,,,,,,,,,,,,,,,,,,,,,,,0.1169,0.11850000000000001,0.12,0.12,0.12,0.12
MYT,,,,,,,,,,,,,,,,,,,,0.0129,0.01262,0.012240000000000001,0.011859999999999999,0.01148,0.011,0.0111,0.01104,0.01104
NCL,,,,,,,,,,,,0.0018000000000000002,,,,,,,,,,0.0018000000000000002,0.0018000000000000002,0.0018000000000000002,0.0017800000000000001,0.0017800000000000001,0.0017800000000000001,0.0017800000000000001
NIC,,,,,,,,,,,1.196,1.196,1.196,1.196,1.196,1.1,1.02,0.9400000000000001,0.86,0.78,0.7020000000000001,0.7000000000000001,0.7000000000000001,0.7000000000000001,0.7000000000000001,0.7000000000000001,0.7000000000000001,0.7000000000000001
NLD,,,,,,,,,,,0.027,0.006,0.004,0.0253,0.0349,0.0205,0.0171,0.0076,0.0074,0.0073,0.007200000000000001,0.0079,0.0079,0.0079,0.007,0.007,0.007,0.008
NOR,,,,,,,,,,,,0.002,0.002,0.002,0.002,0.002,0.0018000000000000002,0.0017,0.00098,0.0011,0.001,0.0012,0.0029464,0.0015600000000000002,0.001944,0.0016710000000000002,0.001188,0.001174
NPL,,,,,,,,,,,0.018000000000000002,,,,,,,,,,0.031,,,,,,,
PAK,,,,,,,,,,,15.9,15.55,15.58,14.34,14.790000000000001,14.93,14.02,13.11,13.18,13.49,14.38,15.25,15.25,14.81,14.69,15.35,15.56,15.56
PAN,,,,,,,,,,,,,,,,,,,,0.2859,0.28600000000000003,0.28600000000000003,0.28600000000000003,0.28600000000000003,0.28600000000000003,0.28600000000000003,0.28600000000000003,0.28600000000000003
PER,,,,,,,,,,,,,,,,,,,,,,2.1944000000000004,,,1.354,1.598,1.567,1.3829
PHL,,,,,,,,,,,,0.055,,,,,,,,,,,,,,,,
POL,,,,,,,,,,,1.296,2.302,1.762,1.399,1.029,0.984,0.441,0.492,0.528,0.432,0.468,0.44,0.447,0.47500000000000003,0.134,0.166,0.15,0.18
PRI,,,,,,,,,,,,0.025,0.022,,,,0.024,,,,,0.0309,,,,,,0.027100000000000003
PRT,,,,,,,,,,0.55195,0.54098,0.53,0.51903,0.44694,0.37486,0.35047000000000006,0.327,0.334,0.342,0.339,0.337,0.335,0.33307,0.30597,0.27886,0.25176,0.25176,0.25176
PRY,,,,,,,,,,,,,,,,,,0.47200000000000003,,,,,,,,,,
PSE,,,,,,,,,,,,,,,,,,,,0.0068,0.006,0.005,,,,,,
QAT,,,,,,,,,,,0.0087,0.0068,0.0058,0.0063,0.0064,0.006,0.006,0.006,0.006,0.006,0.006,0.006,0.006,0.006,0.006,0.006,0.006,0.006
ROU,,,,,,,,,,,0.467,0.375,0.498,0.387,0.517,1.055,0.898,0.923,0.905,1.339,0.913,0.739,0.58,0.543,0.513,0.17300000000000001,0.23600000000000002,0.219
RUS,,,,,,,,,,,,,,,,,10.447600000000001,10.1712,10.2254,10.552,9.766399999999999,9.727200000000002,8.645,8.522,7.906493,7.764932,7.612748,7.619921000000001
SDN,,,,,,,,,,,,,,,,,,,,,0.712,0.705,0.504,0.48934,0.48934,0.48934,0.48934,0.48934
SEN,,,,,,,,,,,0.85,0.8,0.8,0.8,0.8,0.798,0.8,0.8,0.8,0.8,0.8,0.8,0.8,0.8,0.8,0.8,0.8,0.8
SLV,,,,,,,,,,,,,0.06,0.06,0.06,0.059000000000000004,0.06,0.06,0.06,0.06,0.06,0.05,0.05,0.05,0.05,0.05,0.05,0.05
SRB,,,,,,,,,,,,,,,,0.0213,0.021,0.0223,0.0237,0.0233,0.021500000000000002,0.0221,0.0193,0.0197,0.018000000000000002,0.017,0.015,0.009000000000000001
SVK,,,,,,,,,,,0.004,0.004,0.005,0.011,0.01,0.014,0.011,0.01,0.013000000000000001,0.011300000000000001,0.0121,0.0125,0.017,0.0174,0.046,0.042,0.045,0.045
SVN,,,,,,,,,,,0.001,,,0.001,0.002,0.001,0.002,,,,,,,,,,,
SWE,,,,,,,,,,,0.266,0.269,0.276,0.268,0.321,0.307,0.28200000000000003,0.148,0.153,0.177,0.154,0.1515,0.1581,0.1325,0.16340000000000002,0.1686,0.161,0.165
SYC,,,,,,,,,,,,,,,,,,,,,2e-06,,,,,,,
SYR,,,,,,,,,,,0.901,0.8300000000000001,0.8170000000000001,0.896,0.6900000000000001,0.845,0.963,1.055,1.325,0.903,1.1360000000000001,1.237,1.5230000000000001,,,,,
THA,,,,,,,,,,,0.439,,,,,,,,,,,,,,,,,
TJK,,,,,,,,,,,0.023899999999999998,0.0229,0.0227,0.0223,,,,,0.0304,0.0297,0.0338,0.031,0.03,0.0297,0.0293,0.0285,0.027100000000000003,0.0257
TON,,,,,,,,,,,,,,,,,,,,,,,,,0.0103,0.0103,0.0103,0.0103
TUN,,,,,,,,,,,1.072,1.12,0.874,0.712,0.913,0.786,0.898,0.9390000000000001,0.869,0.869,0.8140000000000001,0.847,1.145,0.556,1.27,0.62,0.617,0.617
TUR,,,,,,,,,,,4.914,5.04,4.9910000000000005,4.956,4.876,4.691,4.219,4.259,4.323,4.249,4.017,4.2860000000000005,4.148,4.108,4.114,3.998,3.697,3.513
TZA,,,,,,,,,,,,,0.879,,,,,1.643,,,,,,,,,,
UKR,,,,,,,,,,,2.712,2.692,3.509,2.33,2.428,1.866,1.625,1.413,1.5230000000000001,1.465,1.211,1.247,0.251,0.23900000000000002,0.234,0.231,0.229,0.19
URY,,,,,,,,,,,0.312,0.3,0.289,0.277,0.266,0.254,0.243,0.231,0.22,0.20800000000000002,0.197,0.19,0.19,0.19,0.19,0.19,0.19,0.19
USA,,,,,,,,,,,,6.7015,6.6297,6.5579,6.4861,6.4143,6.3422589,6.2187,6.0952,5.9717,5.8482,5.724711,5.9574,6.1901,6.4228000000000005,6.6555,6.888,6.888
UZB,,,,,,,,,,,,,,,,,,,,,,,,,0.07690000000000001,0.0768,0.07640000000000001,0.076
VEN,,,,,,,,,,,,,,,,,0.68,,,,,,,,,,,
WSM,,,,,,,,,,,,,,,,,,,0.0012,,,,,,0.0045000000000000005,,,
YEM,,,,,,,,,,,,0.4,0.4,0.35000000000000003,0.3,0.3,0.145,0.145,0.145,0.1,0.04,0.0,0.0,0.1,0.327,0.359,0.368,0.368
ZAF,,,,,,,,,,,,,,,,,,,,0.15,0.025,,,,,,,
