### META ###
ID,Area|Land|Aquaculture__Historic__FAO_2020
category,Aquaculture
creator,AG
entity,Area|Land
modified,2021/05/06-02:56:15
pathway,Historic
scenario,Historic
source,FAO_2020
unit,Mha
variable,Area|Land|Aquaculture
### DATA ###
region,2007,2008,2009,2010,2011,2012,2013,2014,2015,2016,2017,2018
BGD,,0.519,0.528,0.663,0.669,0.774,,,,,1.1162,0.8076920000000001
BGR,,,,,,,,,,,,0.001212
BLZ,,,0.0123,0.0101,,,,,,,,
CRI,,,,,,,0.0021000000000000003,0.0021000000000000003,0.0021000000000000003,0.0021000000000000003,0.0021000000000000003,0.0021000000000000003
DZA,,,,,,,,5.2e-05,2e-05,3.9e-05,6.7e-05,
HKG,,,,,,0.0017,0.0017,0.0017,0.0017,0.0017,0.0017,0.0016
ISR,0.0021000000000000003,0.0022,0.0022,0.0022,0.0022,0.0021000000000000003,0.002,0.0209,0.0205,0.0219,0.0217,0.0205
LTU,,,,,,,0.009444000000000001,0.009007999999999999,0.009623,0.009668,0.009642,0.00956
LVA,,,,,,,0.0054,0.005200000000000001,0.005,0.005,0.005,0.005
MYS,0.02725,0.03199,0.032299999999999995,0.032810000000000006,0.0347,0.03719,0.039009999999999996,0.028460000000000003,0.037340000000000005,0.03941,,
NCL,,,,,,,3.1e-06,3.1e-06,3.1e-06,3.1e-06,,
NPL,,,0.0106,0.0111,0.0107,0.0123,0.0132,0.0141,,0.015050000000000001,0.01753,
OMN,,,,,,,8.000000000000001e-07,8.000000000000001e-07,8.000000000000001e-07,8.000000000000001e-07,,
SGP,0.000509,0.000509,0.000509,0.000509,0.000509,0.000509,0.0005,0.0005,,,,
SRB,,,,,,,0.0147,0.013859999999999999,0.01244,0.01332,0.01236,0.01093
SVN,,,,,,,0.00023,0.00023,0.00023,0.00023,0.00023,0.00023
