"Description: ","Annual sum of daily precipitation > 99th percentile"
"Station: ","model_biascorrected"
"Latitude: ","1"
"Longitude: ","1"
"ClimPACT2_version: ","1.2.7"
"Date_of_calculation: ","2020-01-30"
time, r99p, normalised (all years)
1970, 0, -0.924747740239591
1971, 40.7268701847273, -0.720402416140894
1972, 42.6724872255698, -0.710640366099248
1973, 0, -0.924747740239591
1974, 219.380395219604, 0.175983982053703
1975, 136.205266723588, -0.241343657226639
1976, 250.605133952202, 0.332652769202553
1977, 395.087897288382, 1.05758883639091
1978, 88.0788423675716, -0.482815926962445
1979, 569.979551076736, 1.93510020697839
1980, 445.689463890505, 1.31148002617083
1981, 0, -0.924747740239591
1982, 75.1805052829794, -0.547532779986757
1983, 398.292645924805, 1.07366852520064
1984, 46.2911969345126, -0.692483645365763
1985, 65.0056870880062, -0.598584493812702
1986, 114.248081502024, -0.35151289218244
1987, 267.993223835831, 0.41989676429992
1988, 45.0631124193709, -0.698645506739567
1989, 170.24494074932, -0.0705510529962584
1990, 33.013395533444, -0.759104444320183
1991, 38.9727101399252, -0.729203838917803
1992, 80.3049983932125, -0.521820855630615
1993, 239.866293795921, 0.278771099380494
1994, 222.376438481965, 0.191016500601874
1995, 0, -0.924747740239591
1996, 170.907278465352, -0.0672278019182489
1997, 296.311610871781, 0.561983056484081
1998, 38.8209244133346, -0.729965417289846
1999, 428.491106165115, 1.22518800403852
2000, 88.8688180809633, -0.478852257707947
2001, 0, -0.924747740239591
2002, 131.084223288959, -0.267038272983417
2003, 900.28426535359, 3.59238994184102
2004, 491.804727369197, 1.54286138247706
2005, 103.165998623112, -0.407116767641279
