"Description: ","Annual percentage of days when TX < 10th percentile"
"Station: ","model_biascorrected"
"Latitude: ","1"
"Longitude: ","1"
"ClimPACT2_version: ","1.2.7"
"Date_of_calculation: ","2020-01-30"
time, tx10p, normalised (all years)
1970, 2.19178082191781, -2.14492041323982
1971, 7.25555030703826, -0.780583947142956
1972, 16.7608818541549, 1.7804470180657
1973, 10.4676428908833, 0.0848533634408706
1974, 10.8833254605574, 0.196851133045846
1975, 11.8658478979688, 0.461573133930305
1976, 6.840022611645, -0.892539988815878
1977, 17.6665092111479, 2.02445110069054
1978, 9.43788379782711, -0.192595656716882
1979, 7.80349551251771, -0.632950523572773
1980, 7.54663651780667, -0.702156298867049
1981, 14.5488899385923, 1.18446782865327
1982, 7.73736419461502, -0.650768350555381
1983, 16.5422768068021, 1.72154804198619
1984, 4.82381759939702, -1.43576811746988
1985, 13.4907888521493, 0.899382596931553
1986, 10.8833254605574, 0.196851133045846
1987, 11.610769957487, 0.392847229854533
1988, 8.95986433013002, -0.321388918969387
1989, 12.9617383089277, 0.75683998107067
1990, 3.42938119981105, -1.81147250827958
1991, 11.2706660368446, 0.301212691086839
1992, 7.28283399283965, -0.773232876447944
1993, 10.4865375531412, 0.0899441711501844
1994, 9.34341048653755, -0.218049695263465
1995, 10.4015115729806, 0.0670355364582603
1996, 12.4269832296966, 0.612760386379532
1997, 11.6485592820028, 0.40302884527316
1998, 7.14218233349079, -0.811128793398856
1999, 6.83986773736419, -0.892581716747924
2000, 17.8537780290183, 2.07490712518656
2001, 6.84931506849315, -0.890036312893264
2002, 12.3287671232877, 0.586297922808577
2003, 9.31506849315068, -0.22568590682744
2004, 10.9289617486339, 0.209146963688025
2005, 7.67123287671233, -0.668586177537989
