"Description: ","Annual sum of 18 - TM"
"Station: ","model_biascorrected"
"Latitude: ","1"
"Longitude: ","1"
"ClimPACT2_version: ","1.2.7"
"Date_of_calculation: ","2020-01-30"
time, hddheat18, normalised (all years)
1970, 2.29314445831255, -0.695985638859882
1971, 1.68089630554168, -0.731276192937436
1972, 8.72472968047927, -0.325263073083168
1973, 7.75843152770851, -0.380961399098631
1974, 12.1358296804794, -0.128644090291399
1975, 7.48263706939593, -0.396858448687627
1976, 0, -0.828164622410051
1977, 42.5428556665002, 1.62404522374046
1978, 11.4050389166251, -0.170767550941232
1979, 4.52228522216682, -0.567495887903101
1980, 9.42998522216682, -0.284611486435207
1981, 19.7517667498752, 0.310345619652805
1982, 30.6297667498752, 0.937363676821692
1983, 98.2818131802298, 4.8368906777649
1984, 13.5075315277085, -0.0495779175331195
1985, 6.87482783325019, -0.431893139474298
1986, 10.030887069396, -0.249974943982658
1987, 29.3103112081877, 0.861309029802973
1988, 6.59658891662507, -0.447931089918411
1989, 11.0140815277085, -0.193302699170163
1990, 1.92024261108332, -0.717480048840059
1991, 5.13338337493763, -0.532271620897231
1992, 2.23294445831251, -0.699455622960047
1993, 0, -0.828164622410051
1994, 22.913325986021, 0.492580840269876
1995, 5.70178891662515, -0.499508195779292
1996, 25.7433519720421, 0.65570617539512
1997, 14.4484741387919, 0.00465889143074637
1998, 18.2502833749376, 0.223798718694472
1999, 13.9554870693958, -0.0237573426621131
2000, 20.8839204443335, 0.375604013651318
2001, 0.065648152770855, -0.824380601707062
2002, 6.00614076385424, -0.481965071680621
2003, 10.4916778332502, -0.223414534944854
2004, 21.0778241387918, 0.386780803298047
2005, 14.4374278332501, 0.00402217208530479
