"Description: ","Annual number of days when precipitation >= 10 mm"
"Station: ","model"
"Latitude: ","1"
"Longitude: ","1"
"ClimPACT2_version: ","1.2.7"
"Date_of_calculation: ","2020-01-30"
time, r10mm, normalised (all years)
1970, 2, -1.69411590521044
1971, 7, 0.211764488151305
1972, 5, -0.550587669193394
1973, 2, -1.69411590521044
1974, 11, 1.73646880284071
1975, 4, -0.931763747865744
1976, 3, -1.31293982653809
1977, 12, 2.11764488151305
1978, 3, -1.31293982653809
1979, 6, -0.169411590521044
1980, 7, 0.211764488151305
1981, 10, 1.35529272416836
1982, 8, 0.592940566823655
1983, 9, 0.974116645496005
1984, 4, -0.931763747865744
1985, 8, 0.592940566823655
1986, 5, -0.550587669193394
1987, 9, 0.974116645496005
1988, 6, -0.169411590521044
1989, 7, 0.211764488151305
1990, 2, -1.69411590521044
1991, 6, -0.169411590521044
1992, 8, 0.592940566823655
1993, 9, 0.974116645496005
1994, 10, 1.35529272416836
1995, 5, -0.550587669193394
1996, 6, -0.169411590521044
1997, 5, -0.550587669193394
1998, 6, -0.169411590521044
1999, 8, 0.592940566823655
2000, 7, 0.211764488151305
2001, 2, -1.69411590521044
2002, 9, 0.974116645496005
2003, 8, 0.592940566823655
2004, 7, 0.211764488151305
2005, 6, -0.169411590521044
