"Description: ","Maximum monthly number of consecutive wet days (when precipitation >= 1.0 mm)"
"Station: ","observed"
"Latitude: ","1"
"Longitude: ","1"
"ClimPACT2_version: ","1.2.7"
"Date_of_calculation: ","2020-01-30"
time, cwd, normalised (all years)
1970-01, 0, -1.11295824190726
1970-02, 1, -0.755689293664762
1970-03, 3, -0.0411513971797642
1970-04, 2, -0.398420345422263
1970-05, 5, 0.673386499305234
1970-06, 6, 1.03065544754773
1970-07, 3, -0.0411513971797642
1970-08, 11, 2.81700018876023
1970-09, 4, 0.316117551062735
1970-10, 2, -0.398420345422263
1970-11, 1, -0.755689293664762
1970-12, 4, 0.316117551062735
1971-01, 0, -1.11295824190726
1971-02, 0, -1.11295824190726
1971-03, 1, -0.755689293664762
1971-04, 1, -0.755689293664762
1971-05, 10, 2.45973124051773
1971-06, 5, 0.673386499305234
1971-07, 6, 1.03065544754773
1971-08, 9, 2.10246229227523
1971-09, 4, 0.316117551062735
1971-10, 4, 0.316117551062735
1971-11, 2, -0.398420345422263
1971-12, 2, -0.398420345422263
1972-01, 0, -1.11295824190726
1972-02, 1, -0.755689293664762
1972-03, 1, -0.755689293664762
1972-04, 4, 0.316117551062735
1972-05, 2, -0.398420345422263
1972-06, 3, -0.0411513971797642
1972-07, 3, -0.0411513971797642
1972-08, 7, 1.38792439579023
1972-09, 3, -0.0411513971797642
1972-10, 2, -0.398420345422263
1972-11, 4, 0.316117551062735
1972-12, 2, -0.398420345422263
1973-01, 0, -1.11295824190726
1973-02, 0, -1.11295824190726
1973-03, 2, -0.398420345422263
1973-04, 1, -0.755689293664762
1973-05, 9, 2.10246229227523
1973-06, 4, 0.316117551062735
1973-07, 2, -0.398420345422263
1973-08, 7, 1.38792439579023
1973-09, 6, 1.03065544754773
1973-10, 4, 0.316117551062735
1973-11, 2, -0.398420345422263
1973-12, 0, -1.11295824190726
1974-01, 0, -1.11295824190726
1974-02, 0, -1.11295824190726
1974-03, 1, -0.755689293664762
1974-04, 2, -0.398420345422263
1974-05, 7, 1.38792439579023
1974-06, 2, -0.398420345422263
1974-07, 5, 0.673386499305234
1974-08, 4, 0.316117551062735
1974-09, 5, 0.673386499305234
1974-10, 3, -0.0411513971797642
1974-11, 6, 1.03065544754773
1974-12, 1, -0.755689293664762
1975-01, 3, -0.0411513971797642
1975-02, 0, -1.11295824190726
1975-03, 2, -0.398420345422263
1975-04, 2, -0.398420345422263
1975-05, 2, -0.398420345422263
1975-06, 6, 1.03065544754773
1975-07, 6, 1.03065544754773
1975-08, 16, 4.60334492997272
1975-09, 4, 0.316117551062735
1975-10, 4, 0.316117551062735
1975-11, 3, -0.0411513971797642
1975-12, 3, -0.0411513971797642
1976-01, 0, -1.11295824190726
1976-02, 1, -0.755689293664762
1976-03, 1, -0.755689293664762
1976-04, 1, -0.755689293664762
1976-05, 5, 0.673386499305234
1976-06, 2, -0.398420345422263
1976-07, 4, 0.316117551062735
1976-08, 3, -0.0411513971797642
1976-09, 11, 2.81700018876023
1976-10, 2, -0.398420345422263
1976-11, 3, -0.0411513971797642
1976-12, 1, -0.755689293664762
1977-01, 4, 0.316117551062735
1977-02, 1, -0.755689293664762
1977-03, 1, -0.755689293664762
1977-04, 2, -0.398420345422263
1977-05, 3, -0.0411513971797642
1977-06, 4, 0.316117551062735
1977-07, 4, 0.316117551062735
1977-08, 5, 0.673386499305234
1977-09, 5, 0.673386499305234
1977-10, 3, -0.0411513971797642
1977-11, 1, -0.755689293664762
1977-12, 2, -0.398420345422263
1978-01, 3, -0.0411513971797642
1978-02, 2, -0.398420345422263
1978-03, 0, -1.11295824190726
1978-04, 1, -0.755689293664762
1978-05, 9, 2.10246229227523
1978-06, 3, -0.0411513971797642
1978-07, 5, 0.673386499305234
1978-08, 5, 0.673386499305234
1978-09, 8, 1.74519334403273
1978-10, 3, -0.0411513971797642
1978-11, 1, -0.755689293664762
1978-12, 1, -0.755689293664762
1979-01, 0, -1.11295824190726
1979-02, 0, -1.11295824190726
1979-03, 1, -0.755689293664762
1979-04, 1, -0.755689293664762
1979-05, 3, -0.0411513971797642
1979-06, 3, -0.0411513971797642
1979-07, 2, -0.398420345422263
1979-08, 7, 1.38792439579023
1979-09, 5, 0.673386499305234
1979-10, 4, 0.316117551062735
1979-11, 0, -1.11295824190726
1979-12, 0, -1.11295824190726
1980-01, 0, -1.11295824190726
1980-02, 0, -1.11295824190726
1980-03, 1, -0.755689293664762
1980-04, 2, -0.398420345422263
1980-05, 6, 1.03065544754773
1980-06, 5, 0.673386499305234
1980-07, 4, 0.316117551062735
1980-08, 3, -0.0411513971797642
1980-09, 6, 1.03065544754773
1980-10, 3, -0.0411513971797642
1980-11, 2, -0.398420345422263
1980-12, 2, -0.398420345422263
1981-01, 0, -1.11295824190726
1981-02, 0, -1.11295824190726
1981-03, 1, -0.755689293664762
1981-04, 2, -0.398420345422263
1981-05, 5, 0.673386499305234
1981-06, 7, 1.38792439579023
1981-07, 6, 1.03065544754773
1981-08, 9, 2.10246229227523
1981-09, 5, 0.673386499305234
1981-10, 2, -0.398420345422263
1981-11, 4, 0.316117551062735
1981-12, 2, -0.398420345422263
1982-01, 0, -1.11295824190726
1982-02, 0, -1.11295824190726
1982-03, 0, -1.11295824190726
1982-04, 3, -0.0411513971797642
1982-05, 3, -0.0411513971797642
1982-06, 5, 0.673386499305234
1982-07, 3, -0.0411513971797642
1982-08, 4, 0.316117551062735
1982-09, 7, 1.38792439579023
1982-10, 2, -0.398420345422263
1982-11, 1, -0.755689293664762
1982-12, 0, -1.11295824190726
1983-01, 0, -1.11295824190726
1983-02, 0, -1.11295824190726
1983-03, 0, -1.11295824190726
1983-04, 2, -0.398420345422263
1983-05, 8, 1.74519334403273
1983-06, 3, -0.0411513971797642
1983-07, 3, -0.0411513971797642
1983-08, 4, 0.316117551062735
1983-09, 8, 1.74519334403273
1983-10, 6, 1.03065544754773
1983-11, 6, 1.03065544754773
1983-12, 2, -0.398420345422263
1984-01, 0, -1.11295824190726
1984-02, 1, -0.755689293664762
1984-03, 0, -1.11295824190726
1984-04, 2, -0.398420345422263
1984-05, 4, 0.316117551062735
1984-06, 2, -0.398420345422263
1984-07, 4, 0.316117551062735
1984-08, 4, 0.316117551062735
1984-09, 6, 1.03065544754773
1984-10, 7, 1.38792439579023
1984-11, 0, -1.11295824190726
1984-12, 0, -1.11295824190726
1985-01, 1, -0.755689293664762
1985-02, 0, -1.11295824190726
1985-03, 0, -1.11295824190726
1985-04, 2, -0.398420345422263
1985-05, 5, 0.673386499305234
1985-06, 6, 1.03065544754773
1985-07, 4, 0.316117551062735
1985-08, 4, 0.316117551062735
1985-09, 6, 1.03065544754773
1985-10, 4, 0.316117551062735
1985-11, 6, 1.03065544754773
1985-12, 0, -1.11295824190726
1986-01, 0, -1.11295824190726
1986-02, 0, -1.11295824190726
1986-03, 1, -0.755689293664762
1986-04, 1, -0.755689293664762
1986-05, -99.9, -99.9
1986-06, -99.9, -99.9
1986-07, 5, 0.673386499305234
1986-08, 6, 1.03065544754773
1986-09, 2, -0.398420345422263
1986-10, 4, 0.316117551062735
1986-11, 2, -0.398420345422263
1986-12, 2, -0.398420345422263
1987-01, 1, -0.755689293664762
1987-02, 1, -0.755689293664762
1987-03, 1, -0.755689293664762
1987-04, 2, -0.398420345422263
1987-05, 3, -0.0411513971797642
1987-06, 7, 1.38792439579023
1987-07, 3, -0.0411513971797642
1987-08, 7, 1.38792439579023
1987-09, 4, 0.316117551062735
1987-10, 1, -0.755689293664762
1987-11, 3, -0.0411513971797642
1987-12, 0, -1.11295824190726
1988-01, 0, -1.11295824190726
1988-02, 0, -1.11295824190726
1988-03, 0, -1.11295824190726
1988-04, 4, 0.316117551062735
1988-05, 3, -0.0411513971797642
1988-06, 7, 1.38792439579023
1988-07, 7, 1.38792439579023
1988-08, 6, 1.03065544754773
1988-09, 2, -0.398420345422263
1988-10, 3, -0.0411513971797642
1988-11, 4, 0.316117551062735
1988-12, 0, -1.11295824190726
1989-01, 0, -1.11295824190726
1989-02, 0, -1.11295824190726
1989-03, 1, -0.755689293664762
1989-04, 1, -0.755689293664762
1989-05, 6, 1.03065544754773
1989-06, 2, -0.398420345422263
1989-07, 5, 0.673386499305234
1989-08, 3, -0.0411513971797642
1989-09, 4, 0.316117551062735
1989-10, 6, 1.03065544754773
1989-11, 1, -0.755689293664762
1989-12, 0, -1.11295824190726
1990-01, 1, -0.755689293664762
1990-02, 2, -0.398420345422263
1990-03, 1, -0.755689293664762
1990-04, 2, -0.398420345422263
1990-05, 7, 1.38792439579023
1990-06, 4, 0.316117551062735
1990-07, 4, 0.316117551062735
1990-08, 3, -0.0411513971797642
1990-09, 5, 0.673386499305234
1990-10, 2, -0.398420345422263
1990-11, 3, -0.0411513971797642
1990-12, 0, -1.11295824190726
1991-01, 1, -0.755689293664762
1991-02, 0, -1.11295824190726
1991-03, 2, -0.398420345422263
1991-04, 2, -0.398420345422263
1991-05, 2, -0.398420345422263
1991-06, 3, -0.0411513971797642
1991-07, 6, 1.03065544754773
1991-08, 6, 1.03065544754773
1991-09, 4, 0.316117551062735
1991-10, 3, -0.0411513971797642
1991-11, 2, -0.398420345422263
1991-12, 1, -0.755689293664762
1992-01, 0, -1.11295824190726
1992-02, 3, -0.0411513971797642
1992-03, 0, -1.11295824190726
1992-04, 1, -0.755689293664762
1992-05, 2, -0.398420345422263
1992-06, 4, 0.316117551062735
1992-07, 5, 0.673386499305234
1992-08, 11, 2.81700018876023
1992-09, 9, 2.10246229227523
1992-10, 5, 0.673386499305234
1992-11, 2, -0.398420345422263
1992-12, 2, -0.398420345422263
1993-01, 0, -1.11295824190726
1993-02, 0, -1.11295824190726
1993-03, 0, -1.11295824190726
1993-04, 2, -0.398420345422263
1993-05, 3, -0.0411513971797642
1993-06, 3, -0.0411513971797642
1993-07, 3, -0.0411513971797642
1993-08, 2, -0.398420345422263
1993-09, 4, 0.316117551062735
1993-10, 4, 0.316117551062735
1993-11, 1, -0.755689293664762
1993-12, 0, -1.11295824190726
1994-01, 1, -0.755689293664762
1994-02, 1, -0.755689293664762
1994-03, 5, 0.673386499305234
1994-04, 2, -0.398420345422263
1994-05, 4, 0.316117551062735
1994-06, 5, 0.673386499305234
1994-07, 4, 0.316117551062735
1994-08, 12, 3.17426913700273
1994-09, 8, 1.74519334403273
1994-10, 4, 0.316117551062735
1994-11, 3, -0.0411513971797642
1994-12, 3, -0.0411513971797642
1995-01, 0, -1.11295824190726
1995-02, 0, -1.11295824190726
1995-03, 1, -0.755689293664762
1995-04, 2, -0.398420345422263
1995-05, 2, -0.398420345422263
1995-06, 4, 0.316117551062735
1995-07, 3, -0.0411513971797642
1995-08, 7, 1.38792439579023
1995-09, 3, -0.0411513971797642
1995-10, 4, 0.316117551062735
1995-11, 2, -0.398420345422263
1995-12, 0, -1.11295824190726
1996-01, 0, -1.11295824190726
1996-02, 4, 0.316117551062735
1996-03, 1, -0.755689293664762
1996-04, 4, 0.316117551062735
1996-05, 3, -0.0411513971797642
1996-06, 5, 0.673386499305234
1996-07, 3, -0.0411513971797642
1996-08, 7, 1.38792439579023
1996-09, 6, 1.03065544754773
1996-10, 7, 1.38792439579023
1996-11, 3, -0.0411513971797642
1996-12, 0, -1.11295824190726
1997-01, 0, -1.11295824190726
1997-02, 0, -1.11295824190726
1997-03, 2, -0.398420345422263
1997-04, 3, -0.0411513971797642
1997-05, 2, -0.398420345422263
1997-06, 2, -0.398420345422263
1997-07, 6, 1.03065544754773
1997-08, 11, 2.81700018876023
1997-09, 6, 1.03065544754773
1997-10, 4, 0.316117551062735
1997-11, 1, -0.755689293664762
1997-12, 0, -1.11295824190726
1998-01, 1, -0.755689293664762
1998-02, 0, -1.11295824190726
1998-03, 0, -1.11295824190726
1998-04, 1, -0.755689293664762
1998-05, 5, 0.673386499305234
1998-06, 3, -0.0411513971797642
1998-07, 6, 1.03065544754773
1998-08, 7, 1.38792439579023
1998-09, 10, 2.45973124051773
1998-10, 2, -0.398420345422263
1998-11, 3, -0.0411513971797642
1998-12, -99.9, -99.9
1999-01, -99.9, -99.9
1999-02, -99.9, -99.9
1999-03, -99.9, -99.9
1999-04, -99.9, -99.9
1999-05, -99.9, -99.9
1999-06, -99.9, -99.9
1999-07, -99.9, -99.9
1999-08, -99.9, -99.9
1999-09, -99.9, -99.9
1999-10, -99.9, -99.9
1999-11, 2, -0.398420345422263
1999-12, -99.9, -99.9
2000-01, -99.9, -99.9
2000-02, -99.9, -99.9
2000-03, -99.9, -99.9
2000-04, -99.9, -99.9
2000-05, -99.9, -99.9
2000-06, -99.9, -99.9
2000-07, -99.9, -99.9
2000-08, -99.9, -99.9
2000-09, -99.9, -99.9
2000-10, -99.9, -99.9
2000-11, -99.9, -99.9
2000-12, -99.9, -99.9
2001-01, -99.9, -99.9
2001-02, -99.9, -99.9
2001-03, -99.9, -99.9
2001-04, -99.9, -99.9
2001-05, -99.9, -99.9
2001-06, -99.9, -99.9
2001-07, -99.9, -99.9
2001-08, -99.9, -99.9
2001-09, -99.9, -99.9
2001-10, -99.9, -99.9
2001-11, -99.9, -99.9
2001-12, -99.9, -99.9
2002-01, -99.9, -99.9
2002-02, -99.9, -99.9
2002-03, -99.9, -99.9
2002-04, -99.9, -99.9
2002-05, -99.9, -99.9
2002-06, -99.9, -99.9
2002-07, -99.9, -99.9
2002-08, -99.9, -99.9
2002-09, 10, 2.45973124051773
2002-10, 4, 0.316117551062735
2002-11, 4, 0.316117551062735
2002-12, 2, -0.398420345422263
2003-01, 2, -0.398420345422263
2003-02, 0, -1.11295824190726
2003-03, 2, -0.398420345422263
2003-04, 1, -0.755689293664762
2003-05, 3, -0.0411513971797642
2003-06, 2, -0.398420345422263
2003-07, 9, 2.10246229227523
2003-08, 2, -0.398420345422263
2003-09, 7, 1.38792439579023
2003-10, 1, -0.755689293664762
2003-11, 1, -0.755689293664762
2003-12, 0, -1.11295824190726
2004-01, 2, -0.398420345422263
2004-02, 1, -0.755689293664762
2004-03, 0, -1.11295824190726
2004-04, 0, -1.11295824190726
2004-05, 7, 1.38792439579023
2004-06, 11, 2.81700018876023
2004-07, 6, 1.03065544754773
2004-08, 16, 4.60334492997272
2004-09, 15, 4.24607598173022
2004-10, 2, -0.398420345422263
2004-11, 2, -0.398420345422263
2004-12, 0, -1.11295824190726
2005-01, 0, -1.11295824190726
2005-02, 0, -1.11295824190726
2005-03, 1, -0.755689293664762
2005-04, 3, -0.0411513971797642
2005-05, 4, 0.316117551062735
2005-06, 7, 1.38792439579023
2005-07, 8, 1.74519334403273
2005-08, -99.9, -99.9
2005-09, 9, 2.10246229227523
2005-10, -99.9, -99.9
2005-11, -99.9, -99.9
2005-12, -99.9, -99.9
