"Description: ","Number of days when precipitation >= 30"
"Station: ","model_biascorrected"
"Latitude: ","1"
"Longitude: ","1"
"ClimPACT2_version: ","1.2.7"
"Date_of_calculation: ","2020-01-30"
time, r30mm, normalised (all years)
1970, 0, -1.39472296948354
1971, 1, -0.80401677064345
1972, 1, -0.80401677064345
1973, 0, -1.39472296948354
1974, 4, 0.968101825876807
1975, 1, -0.80401677064345
1976, 2, -0.213310571803364
1977, 6, 2.14951422355698
1978, 2, -0.213310571803364
1979, 4, 0.968101825876807
1980, 2, -0.213310571803364
1981, 0, -1.39472296948354
1982, 2, -0.213310571803364
1983, 5, 1.55880802471689
1984, 1, -0.80401677064345
1985, 2, -0.213310571803364
1986, 3, 0.377395627036721
1987, 3, 0.377395627036721
1988, 1, -0.80401677064345
1989, 3, 0.377395627036721
1990, 1, -0.80401677064345
1991, 1, -0.80401677064345
1992, 3, 0.377395627036721
1993, 4, 0.968101825876807
1994, 5, 1.55880802471689
1995, 0, -1.39472296948354
1996, 3, 0.377395627036721
1997, 2, -0.213310571803364
1998, 1, -0.80401677064345
1999, 5, 1.55880802471689
2000, 2, -0.213310571803364
2001, 0, -1.39472296948354
2002, 4, 0.968101825876807
2003, 4, 0.968101825876807
2004, 5, 1.55880802471689
2005, 2, -0.213310571803364
