"Description: ","Annual warmest daily TX"
"Station: ","model"
"Latitude: ","1"
"Longitude: ","1"
"ClimPACT2_version: ","1.2.7"
"Date_of_calculation: ","2020-01-30"
time, txx, normalised (all years)
1970, 38.2015, 1.50391620635376
1971, 36.4901, -1.00894900775786
1972, 36.019, -1.7006697056473
1973, 37.1674, -0.0144628505077713
1974, 36.9045, -0.400481469644122
1975, 36.9401, -0.348209644458671
1976, 36.8709, -0.449816675437127
1977, 38.1897, 1.48659015193836
1978, 36.8986, -0.409144496851817
1979, 36.9712, -0.302545212906213
1980, 36.6732, -0.7401015023799
1981, 37.8653, 1.01027048648445
1982, 36.8, -0.553919832899157
1983, 36.2545, -1.35488277218739
1984, 36.7114, -0.684012071984286
1985, 35.9242, -1.839865464849
1986, 37.4951, 0.466702236943659
1987, 36.4452, -1.07487611311816
1988, 37.381, 0.299168100604909
1989, 37.4279, 0.368031825357648
1990, 36.6979, -0.703834252883262
1991, 38.743, 2.29900590685712
1992, 37.0537, -0.181409662968035
1993, 37.4083, 0.339252955311722
1994, 36.7002, -0.700457140581947
1995, 37.6305, 0.665511369811899
1996, 36.353, -1.21025426710968
1997, 37.8513, 0.989714150737373
1998, 36.8586, -0.467876884700633
1999, 36.9748, -0.297259297999822
2000, 38.1753, 1.46544649231279
2001, 37.8099, 0.928926129313844
2002, 37.7355, 0.819683887915049
2003, 37.8033, 0.919235285318791
2004, 38.189, 1.485562335151
2005, 36.7659, -0.603989193540266
