"Description: ","Maximum monthly 1-day precipitation total"
"Station: ","observed"
"Latitude: ","1"
"Longitude: ","1"
"ClimPACT2_version: ","1.2.7"
"Date_of_calculation: ","2020-01-30"
time, rx1day, normalised (all years)
1970-01, 0.3, -1.01176589677313
1970-02, 1.8, -0.962375302301291
1970-03, 69.8, 1.2766649804221
1970-04, 23, -0.264321567099294
1970-05, 113.3, 2.70899222010544
1970-06, 56.6, 0.842027749069909
1970-07, 79.5, 1.59605749133999
1970-08, 66, 1.15154214109344
1970-09, 32.3, 0.0419001186261101
1970-10, 12.6, -0.606763022104047
1970-11, 2.9, -0.926155533021942
1970-12, 13.5, -0.577128665420944
1971-01, 0, -1.0216440156675
1971-02, 0, -1.0216440156675
1971-03, 7.9, -0.761520218115811
1971-04, 16, -0.494811007967878
1971-05, 59.7, 0.94410164431171
1971-06, 46.4, 0.506171706661401
1971-07, 67.6, 1.2042254418634
1971-08, 44.5, 0.443610286997071
1971-09, 71.4, 1.32934828119206
1971-10, 56.5, 0.838735042771786
1971-11, 13.1, -0.590299490613434
1971-12, 5.7, -0.833959756674509
1972-01, 0, -1.0216440156675
1972-02, 6.3, -0.814203518885773
1972-03, 5.2, -0.850423288165122
1972-04, 48.1, 0.562147713729485
1972-05, 27.6, -0.112857077385653
1972-06, 33.6, 0.0847053005017044
1972-07, 17.4, -0.448713119794161
1972-08, 50.5, 0.641172664884428
1972-09, 51, 0.657636196375041
1972-10, 16, -0.494811007967878
1972-11, 59.5, 0.937516231715465
1972-12, 10.1, -0.689080679557113
1973-01, 0, -1.0216440156675
1973-02, 0, -1.0216440156675
1973-03, 48.9, 0.588489364114466
1973-04, 4.3, -0.880057644848225
1973-05, 47, 0.525927944450136
1973-06, 42, 0.361292629544005
1973-07, 75.4, 1.46105653311696
1973-08, 69.4, 1.2634941552296
1973-09, 41.5, 0.344829098053392
1973-10, 9.4, -0.712129623643971
1973-11, 15.6, -0.507981833160368
1973-12, 0, -1.0216440156675
1974-01, 0, -1.0216440156675
1974-02, 0, -1.0216440156675
1974-03, 6.3, -0.814203518885773
1974-04, 22.2, -0.290663217484275
1974-05, 22.7, -0.274199685993662
1974-06, 40.6, 0.315194741370288
1974-07, 42.6, 0.381048867332741
1974-08, 45.5, 0.476537349978297
1974-09, 66.4, 1.16471296628593
1974-10, 70.8, 1.30959204340332
1974-11, 41.8, 0.35470721694776
1974-12, 5, -0.857008700761367
1975-01, 27.1, -0.129320608876266
1975-02, 4.5, -0.87347223225198
1975-03, 3.5, -0.906399295233206
1975-04, 5.5, -0.840545169270754
1975-05, 77.1, 1.51703254018505
1975-06, 46.4, 0.506171706661401
1975-07, 40.7, 0.318487447668411
1975-08, 57.8, 0.88154022464738
1975-09, 36.7, 0.186779195743506
1975-10, 42.1, 0.364585335842128
1975-11, 25.4, -0.185296615944351
1975-12, 38.1, 0.232877083917223
1976-01, 0, -1.0216440156675
1976-02, 5.4, -0.843837875568876
1976-03, 3.1, -0.919570120425697
1976-04, 13.1, -0.590299490613434
1976-05, 45.3, 0.469951937382052
1976-06, 30.8, -0.00749047584572918
1976-07, 36.7, 0.186779195743506
1976-08, 46.3, 0.502879000363278
1976-09, 52.4, 0.703734084548758
1976-10, 74.9, 1.44459300162635
1976-11, 1.8, -0.962375302301291
1976-12, 6.6, -0.804325399991405
1977-01, 24.9, -0.201760147434964
1977-02, 2.2, -0.949204477108801
1977-03, 25, -0.198467441136842
1977-04, 27.5, -0.116149783683776
1977-05, 40, 0.295438503581552
1977-06, 38.6, 0.249340615407836
1977-07, 25.3, -0.188589322242474
1977-08, 69.7, 1.27337227412397
1977-09, 59.4, 0.934223525417342
1977-10, 55.3, 0.799222567194314
1977-11, 3, -0.922862826723819
1977-12, 25, -0.198467441136842
1978-01, 18, -0.428956882005425
1978-02, 14.6, -0.540908896141595
1978-03, 0, -1.0216440156675
1978-04, 8.3, -0.74834939292332
1978-05, 65.3, 1.12849319700658
1978-06, 17.5, -0.445420413496039
1978-07, 115.5, 2.78143175866414
1978-08, 81, 1.64544808581183
1978-09, 40.2, 0.302023916177798
1978-10, 35.3, 0.140681307569789
1978-11, 2, -0.955789889705046
1978-12, 4.5, -0.87347223225198
1979-01, 0, -1.0216440156675
1979-02, 0.7, -0.99859507158064
1979-03, 1.7, -0.965668008599414
1979-04, 24.7, -0.208345560031209
1979-05, 50.7, 0.647758077480674
1979-06, 52, 0.690563259356268
1979-07, 33.4, 0.0781198879054591
1979-08, 37.2, 0.203242727234119
1979-09, 66.2, 1.15812755368968
1979-10, 34, 0.0978761256941948
1979-11, 0, -1.0216440156675
1979-12, 0, -1.0216440156675
1980-01, 0, -1.0216440156675
1980-02, 0, -1.0216440156675
1980-03, 17.9, -0.432249588303548
1980-04, 12.9, -0.596884903209679
1980-05, 64.4, 1.09885884032347
1980-06, 38.2, 0.236169790215345
1980-07, 38.7, 0.252633321705958
1980-08, 32.1, 0.035314706029865
1980-09, 39.6, 0.282267678389062
1980-10, 68.3, 1.22727438595026
1980-11, 17.3, -0.452005826092284
1980-12, 92.9, 2.03728013528842
1981-01, 0, -1.0216440156675
1981-02, 0, -1.0216440156675
1981-03, 9.7, -0.702251504749604
1981-04, 16.8, -0.468469357582897
1981-05, 34, 0.0978761256941948
1981-06, 29, -0.0667591892119365
1981-07, 45.2, 0.466659231083929
1981-08, 49.6, 0.611538308201325
1981-09, 75.1, 1.45117841422259
1981-10, 16.8, -0.468469357582897
1981-11, 36.5, 0.180193783147261
1981-12, 41.6, 0.348121804351515
1982-01, 0, -1.0216440156675
1982-02, 0, -1.0216440156675
1982-03, 0, -1.0216440156675
1982-04, 34.1, 0.101168831992318
1982-05, 42.5, 0.377756161034618
1982-06, 21.2, -0.323590280465501
1982-07, 31.7, 0.0221438808373744
1982-08, 16.4, -0.481640182775388
1982-09, 87.5, 1.8594739951898
1982-10, 18.4, -0.415786056812935
1982-11, 3.6, -0.903106588935084
1982-12, 0, -1.0216440156675
1983-01, 0, -1.0216440156675
1983-02, 0, -1.0216440156675
1983-03, 0, -1.0216440156675
1983-04, 2.5, -0.939326358214433
1983-05, 32.1, 0.035314706029865
1983-06, 42.1, 0.364585335842128
1983-07, 13.7, -0.570543252824698
1983-08, 38.5, 0.246047909109713
1983-09, 45.4, 0.473244643680174
1983-10, 54.7, 0.779466329405579
1983-11, 43.7, 0.41726863661209
1983-12, 7.6, -0.771398337010179
1984-01, 0, -1.0216440156675
1984-02, 6, -0.824081637780141
1984-03, 0, -1.0216440156675
1984-04, 7.5, -0.774691043308301
1984-05, 28.8, -0.0733446018081817
1984-06, 23.2, -0.257736154503049
1984-07, 33.3, 0.0748271816073364
1984-08, 23.8, -0.237979916714313
1984-09, 36.3, 0.173608370551015
1984-10, 25.7, -0.175418497049983
1984-11, 0.6, -1.00188777787876
1984-12, 0, -1.0216440156675
1985-01, 1.4, -0.975546127493782
1985-02, 0, -1.0216440156675
1985-03, 0.2, -1.01505860307125
1985-04, 73.6, 1.40178781975075
1985-05, 29.5, -0.0502956577213233
1985-06, 34, 0.0978761256941948
1985-07, 39.3, 0.272389559494694
1985-08, 50.4, 0.637879958586306
1985-09, 51.1, 0.660928902673164
1985-10, 35.1, 0.134095894973544
1985-11, 50.8, 0.651050783778796
1985-12, 0, -1.0216440156675
1986-01, 0, -1.0216440156675
1986-02, 0, -1.0216440156675
1986-03, 1, -0.988716952686272
1986-04, 8.9, -0.728593155134584
1986-05, -99.9, -99.9
1986-06, -99.9, -99.9
1986-07, 29, -0.0667591892119365
1986-08, 22.1, -0.293955923782398
1986-09, 36.1, 0.16702295795477
1986-10, 34, 0.0978761256941948
1986-11, 24.9, -0.201760147434964
1986-12, 56.9, 0.851905867964276
1987-01, 17, -0.461883944986652
1987-02, 8.9, -0.728593155134584
1987-03, 7.9, -0.761520218115811
1987-04, 43.9, 0.423854049208335
1987-05, 19.1, -0.392737112726076
1987-06, 40.9, 0.325072860264656
1987-07, 26.9, -0.135906021472512
1987-08, 122.9, 3.02509202472521
1987-09, 55.1, 0.792637154598069
1987-10, 13, -0.593592196911557
1987-11, 65, 1.11861507811221
1987-12, 0, -1.0216440156675
1988-01, 0, -1.0216440156675
1988-02, 0, -1.0216440156675
1988-03, 0, -1.0216440156675
1988-04, 25.9, -0.168833084453738
1988-05, 72.9, 1.3787388756639
1988-06, 71.9, 1.34581181268267
1988-07, 23.1, -0.261028860801171
1988-08, 50, 0.624709133393815
1988-09, 93, 2.04057284158654
1988-10, 79, 1.57959395984938
1988-11, 40.9, 0.325072860264656
1988-12, 0.5, -1.00518048417688
1989-01, 0, -1.0216440156675
1989-02, 0, -1.0216440156675
1989-03, 7.9, -0.761520218115811
1989-04, 31, -0.000905063249483947
1989-05, 59.9, 0.950687056907955
1989-06, 22.1, -0.293955923782398
1989-07, 51.1, 0.660928902673164
1989-08, 59.9, 0.950687056907955
1989-09, 63, 1.05276095214976
1989-10, 38.1, 0.232877083917223
1989-11, 3, -0.922862826723819
1989-12, 0, -1.0216440156675
1990-01, 2, -0.955789889705046
1990-02, 32, 0.0320219997317423
1990-03, 30, -0.0338321262307102
1990-04, 14, -0.56066513393033
1990-05, 58.9, 0.917759993926729
1990-06, 14, -0.56066513393033
1990-07, 39.9, 0.29214579728343
1990-08, 49, 0.591782070412589
1990-09, 32, 0.0320219997317423
1990-10, 55.9, 0.81897880498305
1990-11, 87.1, 1.84630316999731
1990-12, 0, -1.0216440156675
1991-01, 5.1, -0.853715994463244
1991-02, 0, -1.0216440156675
1991-03, 4.1, -0.886643057444471
1991-04, 47, 0.525927944450136
1991-05, 49, 0.591782070412589
1991-06, 15, -0.527738070949104
1991-07, 24.9, -0.201760147434964
1991-08, 56.9, 0.851905867964276
1991-09, 34, 0.0978761256941948
1991-10, 20.1, -0.35981004974485
1991-11, 14, -0.56066513393033
1991-12, 17, -0.461883944986652
1992-01, 0, -1.0216440156675
1992-02, 10.9, -0.662739029172132
1992-03, 0, -1.0216440156675
1992-04, 7.9, -0.761520218115811
1992-05, 4.1, -0.886643057444471
1992-06, 27.9, -0.102978958491285
1992-07, 105.9, 2.46533195404436
1992-08, 34, 0.0978761256941948
1992-09, 56.9, 0.851905867964276
1992-10, 33, 0.0649490627129686
1992-11, 5.1, -0.853715994463244
1992-12, 53.1, 0.726783028635617
1993-01, 0, -1.0216440156675
1993-02, 0, -1.0216440156675
1993-03, 0.3, -1.01176589677313
1993-04, 13, -0.593592196911557
1993-05, 26.9, -0.135906021472512
1993-06, 22.1, -0.293955923782398
1993-07, 46, 0.49300088146891
1993-08, 19.1, -0.392737112726076
1993-09, 102.1, 2.3402091147157
1993-10, 43.9, 0.423854049208335
1993-11, 101.1, 2.30728205173448
1993-12, 0, -1.0216440156675
1994-01, 50, 0.624709133393815
1994-02, 50, 0.624709133393815
1994-03, 99.1, 2.24142792577202
1994-04, 50, 0.624709133393815
1994-05, 39.1, 0.265804146898449
1994-06, 52.1, 0.69385596565439
1994-07, 25.9, -0.168833084453738
1994-08, 151.9, 3.97997685118077
1994-09, 215.9, 6.08730888197925
1994-10, 39.9, 0.29214579728343
1994-11, 23.1, -0.261028860801171
1994-12, 21.1, -0.326882986763624
1995-01, 0, -1.0216440156675
1995-02, 0, -1.0216440156675
1995-03, 3, -0.922862826723819
1995-04, 16, -0.494811007967878
1995-05, 151.9, 3.97997685118077
1995-06, 68.1, 1.22068897335401
1995-07, 40.9, 0.325072860264656
1995-08, 64, 1.08568801513098
1995-09, 30, -0.0338321262307102
1995-10, 37.1, 0.199950020935996
1995-11, 26.9, -0.135906021472512
1995-12, 0, -1.0216440156675
1996-01, 0, -1.0216440156675
1996-02, 15, -0.527738070949104
1996-03, 7.1, -0.787861868500792
1996-04, 119.1, 2.89996918539655
1996-05, 11.9, -0.629811966190906
1996-06, 30, -0.0338321262307102
1996-07, 16, -0.494811007967878
1996-08, 42.9, 0.390926986227109
1996-09, 54.1, 0.759710091616843
1996-10, 36.1, 0.16702295795477
1996-11, 23.9, -0.23468721041619
1996-12, 0, -1.0216440156675
1997-01, 0, -1.0216440156675
1997-02, 0, -1.0216440156675
1997-03, 2, -0.955789889705046
1997-04, 36.1, 0.16702295795477
1997-05, 23.9, -0.23468721041619
1997-06, 20.1, -0.35981004974485
1997-07, 56.9, 0.851905867964276
1997-08, 47, 0.525927944450136
1997-09, 34, 0.0978761256941948
1997-10, 65, 1.11861507811221
1997-11, 11.9, -0.629811966190906
1997-12, 0, -1.0216440156675
1998-01, 14, -0.56066513393033
1998-02, 0, -1.0216440156675
1998-03, 0, -1.0216440156675
1998-04, 9.9, -0.695666092153358
1998-05, 77, 1.51373983388692
1998-06, 25.9, -0.168833084453738
1998-07, 26.9, -0.135906021472512
1998-08, 31, -0.000905063249483947
1998-09, 42.9, 0.390926986227109
1998-10, 8.9, -0.728593155134584
1998-11, 11.9, -0.629811966190906
1998-12, -99.9, -99.9
1999-01, -99.9, -99.9
1999-02, -99.9, -99.9
1999-03, -99.9, -99.9
1999-04, -99.9, -99.9
1999-05, -99.9, -99.9
1999-06, -99.9, -99.9
1999-07, -99.9, -99.9
1999-08, -99.9, -99.9
1999-09, -99.9, -99.9
1999-10, -99.9, -99.9
1999-11, 13, -0.593592196911557
1999-12, -99.9, -99.9
2000-01, -99.9, -99.9
2000-02, -99.9, -99.9
2000-03, -99.9, -99.9
2000-04, -99.9, -99.9
2000-05, -99.9, -99.9
2000-06, -99.9, -99.9
2000-07, -99.9, -99.9
2000-08, -99.9, -99.9
2000-09, -99.9, -99.9
2000-10, -99.9, -99.9
2000-11, -99.9, -99.9
2000-12, -99.9, -99.9
2001-01, -99.9, -99.9
2001-02, -99.9, -99.9
2001-03, -99.9, -99.9
2001-04, -99.9, -99.9
2001-05, -99.9, -99.9
2001-06, -99.9, -99.9
2001-07, -99.9, -99.9
2001-08, -99.9, -99.9
2001-09, -99.9, -99.9
2001-10, -99.9, -99.9
2001-11, -99.9, -99.9
2001-12, -99.9, -99.9
2002-01, -99.9, -99.9
2002-02, -99.9, -99.9
2002-03, -99.9, -99.9
2002-04, -99.9, -99.9
2002-05, -99.9, -99.9
2002-06, -99.9, -99.9
2002-07, -99.9, -99.9
2002-08, -99.9, -99.9
2002-09, 38.6, 0.249340615407836
2002-10, 56.1, 0.825564217579295
2002-11, 120.9, 2.95923789876276
2002-12, 62, 1.01983388916853
2003-01, 7.6, -0.771398337010179
2003-02, 0, -1.0216440156675
2003-03, 42.7, 0.384341573630863
2003-04, 7.9, -0.761520218115811
2003-05, 84.1, 1.74752198105363
2003-06, 19.3, -0.386151700129831
2003-07, 15.5, -0.511274539458491
2003-08, 44.2, 0.433732168102703
2003-09, 67.8, 1.21081085445964
2003-10, 5.1, -0.853715994463244
2003-11, 6.1, -0.820788931482018
2003-12, 0, -1.0216440156675
2004-01, 2.8, -0.929448239320065
2004-02, 4.8, -0.863594113357612
2004-03, 0, -1.0216440156675
2004-04, 0.3, -1.01176589677313
2004-05, 113.8, 2.72545575159605
2004-06, 58.7, 0.911174581330484
2004-07, 42.7, 0.384341573630863
2004-08, 21.6, -0.310419455273011
2004-09, 137.7, 3.51241255684736
2004-10, 22.1, -0.293955923782398
2004-11, 16.3, -0.48493288907351
2004-12, 0, -1.0216440156675
2005-01, 0, -1.0216440156675
2005-02, 0, -1.0216440156675
2005-03, 12.7, -0.603470315805925
2005-04, 41.4, 0.341536391755269
2005-05, 28.7, -0.0766373081063044
2005-06, 28.7, -0.0766373081063044
2005-07, 40.9, 0.325072860264656
2005-08, -99.9, -99.9
2005-09, 103.1, 2.37313617769693
2005-10, -99.9, -99.9
2005-11, -99.9, -99.9
2005-12, -99.9, -99.9
