"Description: ","Monthly percentage of days when TX > 50th percentile"
"Station: ","observed"
"Latitude: ","1"
"Longitude: ","1"
"ClimPACT2_version: ","1.2.7"
"Date_of_calculation: ","2020-01-30"
time, txgt50p, normalised (all years)
1970-01, 70.9677419354839, 1.01841871224533
1970-02, 50, 0.130182328484519
1970-03, 77.4193548387097, 1.29172221494096
1970-04, 20, -1.14067895905018
1970-05, 35.4838709677419, -0.48475055258066
1970-06, 50, 0.130182328484519
1970-07, 25.8064516129032, -0.894705806624111
1970-08, 41.9354838709677, -0.211447049885026
1970-09, 46.6666666666667, -0.0110244812415578
1970-10, 38.7096774193548, -0.348098801232843
1970-11, 43.3333333333333, -0.152231290967638
1970-12, 51.6129032258064, 0.198508204158425
1971-01, 35.4838709677419, -0.48475055258066
1971-02, 12.4384236453202, -1.46100278111352
1971-03, 23.8042269187987, -0.979524135046892
1971-04, 68.3908045977011, 0.909254382145635
1971-05, 34.0378197997775, -0.546008234219337
1971-06, 14.1379310344828, -1.38900817615466
1971-07, 12.9032258064516, -1.44131281201538
1971-08, 13.7931034482759, -1.40361577716081
1971-09, 43.2183908045977, -0.157100491303019
1971-10, 25.8064516129032, -0.894705806624111
1971-11, 16.6666666666667, -1.28188576877626
1971-12, 45.1612903225806, -0.0747952985372092
1972-01, 17.1301446051168, -1.26225189645617
1972-02, 48.6325802615933, 0.072255634839455
1972-03, 21.2458286985539, -1.08790311025378
1972-04, 3.33333333333333, -1.84671300768057
1972-05, 57.6195773081201, 0.452963189426775
1972-06, 65.9770114942529, 0.807001175102616
1972-07, 46.0511679644049, -0.0370982636826369
1972-08, 44.2714126807564, -0.112492333391777
1972-09, 44.0229885057471, -0.123016088955346
1972-10, 48.9432703003337, 0.0854170995947162
1972-11, 48.8505747126437, 0.0814903251306995
1972-12, 41.3793103448276, -0.23500769666913
1973-01, 26.1401557285873, -0.880569418553647
1973-02, 87.4384236453202, 1.71615043772322
1973-03, 32.258064516129, -0.621402303928477
1973-04, 63.3333333333333, 0.695009567388828
1973-05, 23.2480533926585, -1.003084781831
1973-06, 49.8850574712644, 0.125313128149138
1973-07, 43.1590656284761, -0.15961362695999
1973-08, 38.7096774193548, -0.348098801232843
1973-09, 17.5862068965517, -1.2429321660932
1973-10, 48.3870967741936, 0.0618564528106122
1973-11, 13.3333333333333, -1.42309257850234
1973-12, 27.9199110122358, -0.805175348844506
1974-01, 21.9132369299221, -1.05963033411286
1974-02, 34.6059113300493, -0.521942716432711
1974-03, 43.2703003337041, -0.15490149760317
1974-04, 19.7701149425287, -1.15041735972095
1974-05, 22.5806451612903, -1.03135755797193
1974-06, 30.9195402298851, -0.67810492718889
1974-07, 64.5161290322581, 0.745115209549697
1974-08, 54.0600667408231, 0.302175050008494
1974-09, 24.2528735632184, -0.960518546641047
1974-10, 56.7296996662959, 0.415266154572207
1974-11, 26.6666666666667, -0.858265339598024
1974-12, 54.3937708565072, 0.316311438078958
1975-01, 38.0422691879866, -0.376371577373771
1975-02, 10.5911330049261, -1.53925778650359
1975-03, 12.9032258064516, -1.44131281201538
1975-04, 57.7011494252874, 0.456418750955114
1975-05, 47.3859844271413, 0.0194472885992199
1975-06, 34.9425287356322, -0.507682915450521
1975-07, 41.1568409343715, -0.244431955382774
1975-08, 19.3548387096774, -1.16800930931975
1975-09, 21.7241379310345, -1.06764095401945
1975-10, 49.833147942158, 0.123114134449289
1975-11, 45.2873563218391, -0.0694548852661423
1975-12, 29.4771968854283, -0.739205537849006
1976-01, 0, -1.98791981740665
1976-02, 14.268727705113, -1.38346736197992
1976-03, 23.2480533926585, -1.003084781831
1976-04, 29.5402298850575, -0.736535331213475
1976-05, 19.3548387096774, -1.16800930931975
1976-06, 50.8045977011494, 0.164266730832191
1976-07, 60.2892102335929, 0.566054293990488
1976-08, 18.7986651835373, -1.19156995610385
1976-09, 50.3448275862069, 0.144789929490664
1976-10, 28.587319243604, -0.776902572703578
1976-11, 50, 0.130182328484519
1976-12, 48.3870967741936, 0.0618564528106122
1977-01, 25.8064516129032, -0.894705806624111
1977-02, 0, -1.98791981740665
1977-03, 0, -1.98791981740665
1977-04, 0, -1.98791981740665
1977-05, 0, -1.98791981740665
1977-06, 13.3333333333333, -1.42309257850234
1977-07, 6.7853170189099, -1.70047992664055
1977-08, 3.2258064516129, -1.85126806605883
1977-09, 0, -1.98791981740665
1977-10, 14.460511679644, -1.37534300101988
1977-11, 0, -1.98791981740665
1977-12, 5.33926585094549, -1.76173760827923
1978-01, 1.66852057842047, -1.91723787705433
1978-02, 0, -1.98791981740665
1978-03, 27.1412680756396, -0.838160254342255
1978-04, 64.367816091954, 0.738832370407266
1978-05, 45.2725250278087, -0.070083169180385
1978-06, 93.3333333333333, 1.96587085492353
1978-07, 48.3870967741936, 0.0618564528106122
1978-08, 72.1913236929922, 1.07025213517036
1978-09, 47.4712643678161, 0.023059921106115
1978-10, 49.3882091212458, 0.104265617022
1978-11, 89.0804597701149, 1.78571044251439
1978-12, 77.0856507230256, 1.2775858268705
1979-01, 94.4382647385984, 2.01267800653462
1979-02, 85.0985221674877, 1.61702743089581
1979-03, 74.6384872080089, 1.17391898102043
1979-04, 69.3103448275862, 0.948207984828693
1979-05, 61.8464961067853, 0.632024104985984
1979-06, 59.1954022988506, 0.519718355315079
1979-07, 83.5372636262514, 1.55088932956614
1979-08, 36.5962180200222, -0.437629259012448
1979-09, 71.4942528735632, 1.04072279120095
1979-10, 55.2836484983315, 0.35400847293353
1979-11, 65.2873563218391, 0.777785973090324
1979-12, 68.8542825361513, 0.928888254465727
1980-01, 85.3170189098999, 1.62628339927528
1980-02, 72.4137931034483, 1.07967639388401
1980-03, 65.5172413793103, 0.787524373761086
1980-04, 68.6206896551724, 0.9189927828164
1980-05, 74.1935483870968, 1.15507046359315
1980-06, 57.5862068965517, 0.451549550619729
1980-07, 48.3870967741936, 0.0618564528106122
1980-08, 64.6273637374861, 0.749827338906517
1980-09, 63.3333333333333, 0.695009567388828
1980-10, 45.6062291434928, -0.0559467811099209
1980-11, 80.6896551724138, 1.43025881803151
1980-12, 78.0867630700779, 1.31999499108189
1981-01, 31.9243604004449, -0.635538691998941
1981-02, 66.256157635468, 0.818826375917115
1981-03, 66.7408231368187, 0.839357796686122
1981-04, 62.2988505747126, 0.65118676437039
1981-05, 58.0645161290323, 0.471811706854063
1981-06, 26.6666666666667, -0.858265339598024
1981-07, 24.916573971079, -0.932402841478679
1981-08, 49.6106785317019, 0.113689875735644
1981-09, 61.7241379310345, 0.626840762693482
1981-10, 73.7486095661847, 1.13622194616586
1981-11, 49.7701149425287, 0.120443927813753
1981-12, 9.67741935483871, -1.5779645633632
1982-01, 21.6907675194661, -1.0690545928265
1982-02, 50.615763546798, 0.156267330281206
1982-03, 74.1935483870968, 1.15507046359315
1982-04, 23.3333333333333, -0.999472149324105
1982-05, 57.7308120133482, 0.457675318783599
1982-06, 21.6091954022989, -1.07251015435483
1982-07, 56.7296996662959, 0.415266154572207
1982-08, 54.8387096774194, 0.335159955506246
1982-09, 43.3333333333333, -0.152231290967638
1982-10, 74.1935483870968, 1.15507046359315
1982-11, 93.3333333333333, 1.96587085492353
1982-12, 41.3793103448276, -0.23500769666913
1983-01, 40.1557285873192, -0.286841119594167
1983-02, 78.6945812807882, 1.34574341221024
1983-03, 82.6473859844271, 1.51319229471156
1983-04, 96.6666666666667, 2.10707766464961
1983-05, 85.5394883203559, 1.63570765798892
1983-06, 76.6666666666667, 1.25983680629314
1983-07, 80.6451612903226, 1.42837396628878
1983-08, 72.6362625139043, 1.08910065259765
1983-09, 48.3908045977011, 0.0620135237891685
1983-10, 43.2703003337041, -0.15490149760317
1983-11, 16.4367816091954, -1.29162416944702
1983-12, 41.4905450500556, -0.23029556731231
1984-01, 47.0522803114572, 0.00531090052875576
1984-02, 75.8620689655172, 1.22575240394546
1984-03, 53.8375973303671, 0.292750791294854
1984-04, 58.0459770114943, 0.47102635196126
1984-05, 69.6329254727475, 0.961873159963475
1984-06, 38.735632183908, -0.346999304382918
1984-07, 64.5161290322581, 0.745115209549697
1984-08, 70.1890989988877, 0.985433806747583
1984-09, 67.3563218390805, 0.8654315791272
1984-10, 23.8042269187987, -0.979524135046892
1984-11, 66.8965517241379, 0.84595477778567
1984-12, 84.8720800889878, 1.60743488184799
1985-01, 82.5361512791991, 1.50848016535474
1985-02, 80.5418719211823, 1.42399841760031
1985-03, 68.8542825361513, 0.928888254465727
1985-04, 51.8390804597701, 0.20808953385063
1985-05, 58.0645161290323, 0.471811706854063
1985-06, 23.3333333333333, -0.999472149324105
1985-07, 38.2647385984427, -0.366947318660127
1985-08, 54.8387096774194, 0.335159955506246
1985-09, 63.3333333333333, 0.695009567388828
1985-10, 65.7397107897664, 0.79694863247473
1985-11, 56.6666666666667, 0.412595947936675
1985-12, 49.0545050055617, 0.0901292289515362
1986-01, -99.9, -99.9
1986-02, 58.0049261083744, 0.469287351841479
1986-03, 54.8387096774194, 0.335159955506246
1986-04, 50, 0.130182328484519
1986-05, -99.9, -99.9
1986-06, 54.7126436781609, 0.329819542235179
1986-07, -99.9, -99.9
1986-08, 80.6451612903226, 1.42837396628878
1986-09, 67.0114942528736, 0.850823978121055
1986-10, 64.9610678531702, 0.763963726976982
1986-11, -99.9, -99.9
1986-12, 67.741935483871, 0.881766960897514
1987-01, 56.3959955506118, 0.401129766501743
1987-02, 50.8620689655172, 0.166701330999882
1987-03, -99.9, -99.9
1987-04, 59.5402298850575, 0.534325956321225
1987-05, -99.9, -99.9
1987-06, 56.3218390804598, 0.397988346930529
1987-07, 67.741935483871, 0.881766960897514
1987-08, 76.6407119021135, 1.25873730944322
1987-09, 65.8620689655172, 0.802131974767231
1987-10, 83.8709677419355, 1.5650257176366
1987-11, 79.1954022988506, 1.36695921367154
1987-12, -99.9, -99.9
1988-01, -99.9, -99.9
1988-02, -99.9, -99.9
1988-03, -99.9, -99.9
1988-04, -99.9, -99.9
1988-05, 35.817575083426, -0.470614164510196
1988-06, -99.9, -99.9
1988-07, -99.9, -99.9
1988-08, 52.6140155728587, 0.240917368369817
1988-09, -99.9, -99.9
1988-10, 32.258064516129, -0.621402303928477
1988-11, -99.9, -99.9
1988-12, -99.9, -99.9
1989-01, -99.9, -99.9
1989-02, -99.9, -99.9
1989-03, -99.9, -99.9
1989-04, -99.9, -99.9
1989-05, -99.9, -99.9
1989-06, -99.9, -99.9
1989-07, -99.9, -99.9
1989-08, -99.9, -99.9
1989-09, -99.9, -99.9
1989-10, -99.9, -99.9
1989-11, -99.9, -99.9
1989-12, -99.9, -99.9
1990-01, -99.9, -99.9
1990-02, -99.9, -99.9
1990-03, -99.9, -99.9
1990-04, -99.9, -99.9
1990-05, -99.9, -99.9
1990-06, -99.9, -99.9
1990-07, -99.9, -99.9
1990-08, -99.9, -99.9
1990-09, -99.9, -99.9
1990-10, -99.9, -99.9
1990-11, -99.9, -99.9
1990-12, -99.9, -99.9
1991-01, -99.9, -99.9
1991-02, -99.9, -99.9
1991-03, -99.9, -99.9
1991-04, -99.9, -99.9
1991-05, -99.9, -99.9
1991-06, -99.9, -99.9
1991-07, -99.9, -99.9
1991-08, -99.9, -99.9
1991-09, -99.9, -99.9
1991-10, -99.9, -99.9
1991-11, -99.9, -99.9
1991-12, -99.9, -99.9
1992-01, -99.9, -99.9
1992-02, -99.9, -99.9
1992-03, -99.9, -99.9
1992-04, -99.9, -99.9
1992-05, -99.9, -99.9
1992-06, -99.9, -99.9
1992-07, -99.9, -99.9
1992-08, -99.9, -99.9
1992-09, -99.9, -99.9
1992-10, -99.9, -99.9
1992-11, -99.9, -99.9
1992-12, -99.9, -99.9
1993-01, 24.916573971079, -0.932402841478679
1993-02, 8.2512315270936, -1.63838079333101
1993-03, 35.59510567297, -0.480038423223836
1993-04, -99.9, -99.9
1993-05, -99.9, -99.9
1993-06, -99.9, -99.9
1993-07, -99.9, -99.9
1993-08, -99.9, -99.9
1993-09, -99.9, -99.9
1993-10, -99.9, -99.9
1993-11, -99.9, -99.9
1993-12, -99.9, -99.9
1994-01, -99.9, -99.9
1994-02, -99.9, -99.9
1994-03, -99.9, -99.9
1994-04, -99.9, -99.9
1994-05, -99.9, -99.9
1994-06, 17.816091954023, -1.23319376542244
1994-07, -99.9, -99.9
1994-08, -99.9, -99.9
1994-09, -99.9, -99.9
1994-10, -99.9, -99.9
1994-11, -99.9, -99.9
1994-12, -99.9, -99.9
1995-01, -99.9, -99.9
1995-02, -99.9, -99.9
1995-03, -99.9, -99.9
1995-04, -99.9, -99.9
1995-05, -99.9, -99.9
1995-06, -99.9, -99.9
1995-07, 38.7096774193548, -0.348098801232843
1995-08, 39.4883203559511, -0.315113895735091
1995-09, -99.9, -99.9
1995-10, -99.9, -99.9
1995-11, -99.9, -99.9
1995-12, -99.9, -99.9
1996-01, -99.9, -99.9
1996-02, -99.9, -99.9
1996-03, -99.9, -99.9
1996-04, -99.9, -99.9
1996-05, -99.9, -99.9
1996-06, -99.9, -99.9
1996-07, -99.9, -99.9
1996-08, -99.9, -99.9
1996-09, 25.0574712643678, -0.926434144293374
1996-10, -99.9, -99.9
1996-11, -99.9, -99.9
1996-12, -99.9, -99.9
1997-01, -99.9, -99.9
1997-02, -99.9, -99.9
1997-03, -99.9, -99.9
1997-04, -99.9, -99.9
1997-05, -99.9, -99.9
1997-06, -99.9, -99.9
1997-07, -99.9, -99.9
1997-08, -99.9, -99.9
1997-09, -99.9, -99.9
1997-10, -99.9, -99.9
1997-11, -99.9, -99.9
1997-12, -99.9, -99.9
1998-01, -99.9, -99.9
1998-02, -99.9, -99.9
1998-03, -99.9, -99.9
1998-04, -99.9, -99.9
1998-05, -99.9, -99.9
1998-06, -99.9, -99.9
1998-07, -99.9, -99.9
1998-08, -99.9, -99.9
1998-09, 66.6666666666667, 0.836216377114908
1998-10, 84.3159065628476, 1.58387423506388
1998-11, -99.9, -99.9
1998-12, 70.9677419354839, 1.01841871224533
1999-01, -99.9, -99.9
1999-02, 60.7142857142857, 0.584061359746911
1999-03, -99.9, -99.9
1999-04, 8.16091954022989, -1.64220659359453
1999-05, -99.9, -99.9
1999-06, 38.1609195402299, -0.371345306059826
1999-07, 74.860956618465, 1.18334323973408
1999-08, 49.2769744160178, 0.0995534876651803
1999-09, 43.2183908045977, -0.157100491303019
1999-10, -99.9, -99.9
1999-11, -99.9, -99.9
1999-12, -99.9, -99.9
2000-01, -99.9, -99.9
2000-02, -99.9, -99.9
2000-03, -99.9, -99.9
2000-04, -99.9, -99.9
2000-05, -99.9, -99.9
2000-06, -99.9, -99.9
2000-07, -99.9, -99.9
2000-08, -99.9, -99.9
2000-09, -99.9, -99.9
2000-10, -99.9, -99.9
2000-11, -99.9, -99.9
2000-12, -99.9, -99.9
2001-01, -99.9, -99.9
2001-02, -99.9, -99.9
2001-03, -99.9, -99.9
2001-04, -99.9, -99.9
2001-05, -99.9, -99.9
2001-06, -99.9, -99.9
2001-07, -99.9, -99.9
2001-08, -99.9, -99.9
2001-09, -99.9, -99.9
2001-10, -99.9, -99.9
2001-11, -99.9, -99.9
2001-12, -99.9, -99.9
2002-01, -99.9, -99.9
2002-02, -99.9, -99.9
2002-03, -99.9, -99.9
2002-04, -99.9, -99.9
2002-05, -99.9, -99.9
2002-06, -99.9, -99.9
2002-07, -99.9, -99.9
2002-08, -99.9, -99.9
2002-09, -99.9, -99.9
2002-10, -99.9, -99.9
2002-11, -99.9, -99.9
2002-12, -99.9, -99.9
2003-01, -99.9, -99.9
2003-02, -99.9, -99.9
2003-03, -99.9, -99.9
2003-04, -99.9, -99.9
2003-05, -99.9, -99.9
2003-06, -99.9, -99.9
2003-07, -99.9, -99.9
2003-08, -99.9, -99.9
2003-09, -99.9, -99.9
2003-10, -99.9, -99.9
2003-11, -99.9, -99.9
2003-12, -99.9, -99.9
2004-01, -99.9, -99.9
2004-02, -99.9, -99.9
2004-03, -99.9, -99.9
2004-04, -99.9, -99.9
2004-05, -99.9, -99.9
2004-06, -99.9, -99.9
2004-07, -99.9, -99.9
2004-08, -99.9, -99.9
2004-09, -99.9, -99.9
2004-10, -99.9, -99.9
2004-11, -99.9, -99.9
2004-12, -99.9, -99.9
2005-01, -99.9, -99.9
2005-02, -99.9, -99.9
2005-03, -99.9, -99.9
2005-04, -99.9, -99.9
2005-05, -99.9, -99.9
2005-06, -99.9, -99.9
2005-07, -99.9, -99.9
2005-08, -99.9, -99.9
2005-09, -99.9, -99.9
2005-10, -99.9, -99.9
2005-11, -99.9, -99.9
2005-12, -99.9, -99.9
