"Description: ","Number of 2 consecutive days where both TX > 95th percentile and TN > 95th percentile"
"Station: ","observed"
"Latitude: ","1"
"Longitude: ","1"
"ClimPACT2_version: ","1.2.7"
"Date_of_calculation: ","2020-01-30"
time, tx2tn2, normalised (all years)
1970, 0, -0.25
1971, 0, -0.25
1972, 0, -0.25
1973, 0, -0.25
1974, 0, -0.25
1975, 0, -0.25
1976, 0, -0.25
1977, 0, -0.25
1978, 1, 3.75
1979, 0, -0.25
1980, 0, -0.25
1981, 0, -0.25
1982, 0, -0.25
1983, 0, -0.25
1984, 0, -0.25
1985, 0, -0.25
1986, -99.9, -99.9
1987, -99.9, -99.9
1988, -99.9, -99.9
1989, -99.9, -99.9
1990, -99.9, -99.9
1991, -99.9, -99.9
1992, -99.9, -99.9
1993, -99.9, -99.9
1994, -99.9, -99.9
1995, -99.9, -99.9
1996, -99.9, -99.9
1997, -99.9, -99.9
1998, -99.9, -99.9
1999, -99.9, -99.9
2000, -99.9, -99.9
2001, -99.9, -99.9
2002, -99.9, -99.9
2003, -99.9, -99.9
2004, -99.9, -99.9
2005, -99.9, -99.9
