"Description: ","Outliers shown in *boxseries.pdf"
"Station: ","observed"
"Latitude: ","1"
"Longitude: ","1"
"ClimPACT2_version: ","1.2.7"
"Date_of_calculation: ","2020-01-30"
Date,Prec,TX,TN,DTR
"Prec up"
1970-3-23,69.8,28.2,21,7.2
1994-3-27,99.1,22.6,NA,NA
1985-4-17,73.6,30.5,NA,NA
1996-4-21,119.1,30.5,NA,NA
1996-4-22,56.9,NA,21.5,NA
1970-5-14,71.9,36.4,24,12.4
1970-5-20,113.3,30,22,8
1975-5-31,77.1,33.7,25,8.7
1988-5-6,72.9,28.8,22.2,6.6
1995-5-5,151.9,NA,NA,NA
1998-5-17,77,35.6,NA,NA
2003-5-1,84.1,28.3,NA,NA
2004-5-5,113.8,NA,NA,NA
1970-6-1,56.6,33,23.4,9.6
1988-6-3,66,NA,23.2,NA
1988-6-5,59.9,30.7,23.2,7.5
1988-6-6,71.9,26.3,NA,NA
1995-6-11,68.1,29.1,24.2,4.9
2004-6-15,58.7,31,23.4,7.6
1970-7-30,79.5,32.5,22.9,9.6
1971-7-14,67.6,26.2,22.8,3.4
1973-7-5,75.4,32.5,23.9,8.6
1978-7-1,81.8,37.5,26.8,10.7
1978-7-2,93.3,28.7,24.5,4.2
1978-7-8,115.5,33,25.4,7.6
1992-7-15,105.9,29.3,21.8,7.5
1978-8-12,81,31.8,25.2,6.6
1987-8-18,97,29,23.1,5.9
1987-8-24,122.9,NA,22,NA
1994-8-20,151.9,NA,22.8,NA
2001-8-12,90.4,NA,22.8,NA
1993-9-12,102.1,31.5,22.9,8.6
1994-9-15,215.9,30.4,NA,NA
2004-9-9,137.7,30,NA,NA
2005-9-19,103.1,29.1,22,7.1
1990-11-6,87.1,31.2,NA,NA
1993-11-20,101.1,NA,17.9,NA
2002-11-3,120.9,NA,NA,NA
2002-11-17,108,30.9,NA,NA
1980-12-12,92.9,30.3,20.2,10.1
"TX up"
"TX low"
1977-1-3,20.3,20.2,18.2,2
1978-1-6,3.4,18.1,17,1.1
1992-2-26,5.1,21,NA,NA
1973-3-8,7.9,24.9,19.5,5.4
1974-3-28,0,25.6,19.8,5.8
1977-3-24,4,25,20,5
1986-3-2,0.3,22,NA,NA
1986-3-3,0,21,13.1,7.9
1986-3-4,0,24.9,13,11.9
1993-3-12,0,25.4,NA,NA
1994-3-27,99.1,22.6,NA,NA
1994-3-28,50,24,NA,NA
1999-3-1,NA,24.5,19.8,4.7
2001-3-10,NA,22,NA,NA
2001-3-11,NA,23.2,NA,NA
2001-3-12,NA,21.5,NA,NA
2001-3-13,NA,24.2,19.8,4.4
2001-3-15,19.1,25.3,20.2,5.1
1972-4-11,48.1,22.7,19.5,3.2
1972-4-12,8.7,23.5,21,2.5
1977-4-3,3.1,24,17.8,6.2
1977-4-5,0.3,23.5,18,5.5
1977-9-22,3.4,23.8,20.8,3
1971-10-29,0,23.6,20,3.6
1977-10-24,9.3,21.5,18,3.5
1992-10-15,7.1,22.7,NA,NA
1992-10-16,3,20.6,18.2,2.4
1992-10-18,11.9,21.2,17.3,3.9
1992-10-19,3,23.7,17.9,5.8
1992-10-30,0,23.2,NA,NA
1985-11-23,0,19.4,NA,NA
"TN up"
"TN low"
1993-6-28,0,34.2,15.7,18.5
1977-9-24,0,30,18.2,11.8
1977-9-25,0,29,16.8,12.2
1977-9-26,0,29.3,17.6,11.7
1971-10-15,0,28.9,15.2,13.7
1971-10-16,0,29.6,14.2,15.4
1971-10-17,0,30.4,13.3,17.1
1978-10-30,0,30.5,15.4,15.1
1994-10-23,0,28.8,15,13.8
1994-10-26,0,29.6,14,15.6
1994-10-27,0,NA,15.3,NA
1971-11-19,0,26,7.9,18.1
1971-11-20,0,25.3,7.8,17.5
1971-11-21,0,25.8,6,19.8
1971-11-22,0,26.7,7.6,19.1
"DTR up"
1993-6-28,0,34.2,15.7,18.5
"DTR low"
1975-1-5,20.1,21.5,18,3.5
1975-1-7,3.4,21.8,18,3.8
1975-1-9,14.7,21.2,19.6,1.6
1975-1-10,27.1,22,19.6,2.4
1977-1-1,18,21.7,18.9,2.8
1977-1-3,20.3,20.2,18.2,2
1978-1-5,8,21.4,18.7,2.7
1978-1-6,3.4,18.1,17,1.1
1978-1-11,18,22.2,18.6,3.6
1978-9-8,6.5,25.3,24.5,0.800000000000001
