"Description: ","Mean monthly difference between daily TX and daily TN"
"Station: ","model"
"Latitude: ","1"
"Longitude: ","1"
"ClimPACT2_version: ","1.2.7"
"Date_of_calculation: ","2020-01-30"
time, dtr, normalised (all years)
1970-01, 18.0744451612903, 1.45226542292391
1970-02, 18.0540285714286, 1.44494633458054
1970-03, 19.4244387096774, 1.93622097625336
1970-04, 18.8436366666667, 1.72801081522264
1970-05, 14.6466387096774, 0.223440314849454
1970-06, 14.3009566666667, 0.0995176897367821
1970-07, 15.2420548387097, 0.436889440240743
1970-08, 15.1628677419355, 0.408501871069247
1970-09, 10.26092, -1.34878418016766
1970-10, 13.7404129032258, -0.101430135180992
1970-11, 14.4961266666667, 0.169483657689857
1970-12, 15.1788258064516, 0.414222634662661
1971-01, 15.2214516129032, 0.4295034452799
1971-02, 16.2679142857143, 0.80464703205036
1971-03, 19.231864516129, 1.86718557196789
1971-04, 14.7527133333333, 0.261466721158534
1971-05, 15.8878161290323, 0.668386666986899
1971-06, 9.72913666666667, -1.53942175591178
1971-07, 14.7370064516129, 0.255836003409432
1971-08, 14.711664516129, 0.246751241171714
1971-09, 11.1786266666667, -1.01979798746219
1971-10, 12.2085096774194, -0.65059799911491
1971-11, 10.4475433333333, -1.28188208374252
1971-12, 14.9584225806452, 0.335210875511537
1972-01, 12.3961096774193, -0.583345780085398
1972-02, 17.2412275862069, 1.15356749723746
1972-03, 17.8904612903226, 1.38630954025747
1972-04, 15.25383, 0.441110686116028
1972-05, 11.5265838709677, -0.895059745902707
1972-06, 11.2555033333333, -0.992238678160896
1972-07, 11.5350483870968, -0.892025324299864
1972-08, 14.8067451612903, 0.280836445723198
1972-09, 11.9646533333333, -0.738017403508423
1972-10, 10.6635580645161, -1.20444354421633
1972-11, 11.2703366666667, -0.986921116421684
1972-12, 12.506364516129, -0.543820819733733
1973-01, 15.6814129032258, 0.594393730151377
1973-02, 14.7076357142857, 0.245306966843397
1973-03, 19.8011451612903, 2.07126545809619
1973-04, 17.0755633333333, 1.09417896514993
1973-05, 13.9407129032258, -0.0296251273365444
1973-06, 8.84453333333333, -1.85654082375614
1973-07, 15.5661258064516, 0.553064769151701
1973-08, 13.1154129032258, -0.325484702843399
1973-09, 11.6517133333333, -0.850202421755261
1973-10, 11.0708129032258, -1.05844785331149
1973-11, 10.19424, -1.37268811388243
1973-12, 14.1479806451613, 0.0446777275590107
1974-01, 14.4783193548387, 0.163099962405293
1974-02, 17.4435642857143, 1.22610263600605
1974-03, 16.7757612903226, 0.986703737740216
1974-04, 16.9306866666667, 1.04224251888696
1974-05, 10.4737516129032, -1.27248674814539
1974-06, 10.819, -1.148719583174
1974-07, 15.0705419354839, 0.375404241231493
1974-08, 15.6847677419355, 0.595596397250063
1974-09, 12.48232, -0.552440473599229
1974-10, 10.6861032258065, -1.19636139003105
1974-11, 13.0206733333333, -0.359447636239857
1974-12, 13.2053516129032, -0.293242816902783
1975-01, 14.5864516129032, 0.201864004534896
1975-02, 18.8343928571429, 1.72469702682838
1975-03, 16.8580870967742, 1.01621649449537
1975-04, 18.35026, 1.55114154203107
1975-05, 13.5655451612903, -0.164118001288927
1975-06, 8.64987000000001, -1.92632515813969
1975-07, 13.7669677419355, -0.091910562530677
1975-08, 13.4960419354839, -0.18903402562364
1975-09, 10.1906366666667, -1.37397986314984
1975-10, 12.0317935483871, -0.713948488537799
1975-11, 12.8583833333333, -0.417626541497347
1975-12, 13.8745774193548, -0.0533338589299216
1976-01, 13.0911290322581, -0.334190162380738
1976-02, 16.7638931034483, 0.982449143373724
1976-03, 18.7404290322581, 1.69101218817163
1976-04, 16.75634, 0.979741451649535
1976-05, 12.7261774193548, -0.465020683735534
1976-06, 14.2571033333333, 0.0837968263118695
1976-07, 14.6454516129032, 0.223014755722227
1976-08, 14.0073709677419, -0.00572905721435582
1976-09, 10.2680666666667, -1.34622219087128
1976-10, 11.5887225806452, -0.87278380713168
1976-11, 11.4097266666667, -0.936951570523344
1976-12, 12.5230451612903, -0.537841020149821
1977-01, 12.2453387096774, -0.637395258474924
1977-02, 15.9548785714286, 0.692427701446879
1977-03, 17.1832548387097, 1.13278500303476
1977-04, 18.7352266666667, 1.68914720613419
1977-05, 11.3964870967742, -0.941697788296624
1977-06, 11.3182166666667, -0.969756744102203
1977-07, 14.293135483871, 0.0967138949689433
1977-08, 11.8434451612903, -0.781468994843215
1977-09, 9.50865, -1.6184634275523
1977-10, 13.1105451612903, -0.327229726547159
1977-11, 11.9475766666667, -0.744139171775783
1977-12, 14.1267548387097, 0.0370685453385321
1978-01, 18.4022548387097, 1.56978103180352
1978-02, 21.2041785714286, 2.57423512869531
1978-03, 20.0985129032258, 2.17786801946596
1978-04, 17.6846133333333, 1.31251566024559
1978-05, 14.5196612903226, 0.17792052157517
1978-06, 10.1101233333333, -1.40284287129556
1978-07, 10.8367161290323, -1.14236857576443
1978-08, 11.1476741935484, -1.03089405623436
1978-09, 11.7647, -0.809698135752663
1978-10, 11.7322935483871, -0.821315437361624
1978-11, 14.6475533333333, 0.223768195821928
1978-12, 16.6688741935484, 0.948386070129924
1979-01, 16.5858741935484, 0.918631623544356
1979-02, 18.2245321428572, 1.50606970095067
1979-03, 19.2601516129032, 1.87732613714896
1979-04, 18.5302533333333, 1.61566686760245
1979-05, 13.5802322580645, -0.158852863500193
1979-06, 12.25755, -0.633017665876795
1979-07, 9.84724193548388, -1.49708251600219
1979-08, 14.0467516129032, 0.00838840426705486
1979-09, 10.5037166666667, -1.26174465667985
1979-10, 10.2111806451613, -1.36661510759837
1979-11, 12.1953066666667, -0.655331110900571
1979-12, 15.1692193548387, 0.410778843682024
1980-01, 15.8751870967742, 0.663859319206766
1980-02, 18.9174172413793, 1.75446021485322
1980-03, 19.5725709677419, 1.98932451071336
1980-04, 14.9139833333333, 0.3192799693616
1980-05, 12.1949419354839, -0.655461862400531
1980-06, 11.2976233333333, -0.977139192736991
1980-07, 13.7808612903226, -0.086929901767208
1980-08, 15.8454225806452, 0.653189117938024
1980-09, 12.1434133333333, -0.673934212283893
1980-10, 12.4446064516129, -0.565960302045448
1980-11, 13.23546, -0.282449342256406
1980-12, 15.7907967741935, 0.63360645962163
1981-01, 17.7234483870968, 1.32643753413539
1981-02, 20.5782642857143, 2.3498528012082
1981-03, 18.1679806451613, 1.48579670676361
1981-04, 17.27654, 1.16622654940631
1981-05, 12.4479903225806, -0.564747227250739
1981-06, 9.54476666666667, -1.60551606093564
1981-07, 13.1002870967742, -0.330907112483492
1981-08, 13.0524225806452, -0.348065934031737
1981-09, 10.868, -1.13115370506927
1981-10, 11.3713612903226, -0.950705071019316
1981-11, 10.6878666666667, -1.1957292188638
1981-12, 11.1607225806452, -1.0262163750669
1982-01, 16.4045064516129, 0.853613589932732
1982-02, 17.868, 1.37825745274968
1982-03, 19.4695064516129, 1.95237718974917
1982-04, 18.0569433333333, 1.44599123972998
1982-05, 10.5807709677419, -1.23412166769756
1982-06, 11.8246633333333, -0.78820204179172
1982-07, 13.6366806451613, -0.138616833154251
1982-08, 13.0238129032258, -0.358322140280001
1982-09, 10.37664, -1.30730002885583
1982-10, 14.7245387096774, 0.251366476162896
1982-11, 15.9458133333333, 0.689177928643361
1982-12, 12.752235483871, -0.455679198328659
1983-01, 14.8462161290323, 0.294986286703439
1983-02, 18.2499571428571, 1.51518424076314
1983-03, 17.8979161290323, 1.38898200532002
1983-04, 12.6206666666667, -0.502844949459161
1983-05, 10.2828870967742, -1.34090925477479
1983-06, 12.3801866666667, -0.589053977349489
1983-07, 15.1448419354839, 0.4020398482352
1983-08, 14.3018838709677, 0.0998500807108546
1983-09, 11.2497733333333, -0.994292810437225
1983-10, 12.0269677419355, -0.715678478902816
1983-11, 13.62574, -0.142538915588751
1983-12, 13.5883096774194, -0.155957211177969
1984-01, 15.1958677419355, 0.420331952241822
1984-02, 18.0079172413793, 1.42841600799089
1984-03, 20.7030838709677, 2.39459903834381
1984-04, 18.22938, 1.50780759620862
1984-05, 13.436364516129, -0.210427623052073
1984-06, 10.3333733333333, -1.32281057972655
1984-07, 15.0953935483871, 0.384313229047077
1984-08, 14.5270451612903, 0.180567545602918
1984-09, 11.71622, -0.8270776004571
1984-10, 12.9581677419355, -0.381855097451244
1984-11, 12.33607, -0.604869242432232
1984-12, 15.6179419354839, 0.571640193772935
1985-01, 13.3536419354839, -0.240082618319843
1985-02, 17.0766071428571, 1.09455315761645
1985-03, 16.5938806451613, 0.921501834831777
1985-04, 15.7315066666667, 0.612351708567911
1985-05, 13.432764516129, -0.211718177361808
1985-06, 14.34282, 0.114525163418222
1985-07, 14.4124483870968, 0.139486056487029
1985-08, 13.4229193548387, -0.215247542732152
1985-09, 11.71073, -0.829045695779447
1985-10, 8.87046451612903, -1.84724482383571
1985-11, 12.3491566666667, -0.600177838524793
1985-12, 12.9881161290323, -0.371118980774188
1986-01, 15.4954806451613, 0.527739375439158
1986-02, 13.8800107142857, -0.0513860916551617
1986-03, 20.0003806451613, 2.14268885041896
1986-04, 16.96536, 1.05467246882201
1986-05, 16.091635483871, 0.741453318874283
1986-06, 12.9667633333333, -0.378773687028145
1986-07, 14.6665580645161, 0.230581150747852
1986-08, 14.5141774193548, 0.175954623433078
1986-09, 10.68391, -1.19714763364683
1986-10, 10.9296, -1.10907088688046
1986-11, 10.6264466666667, -1.21774750933712
1986-12, 12.7744032258065, -0.447732344192003
1987-01, 14.842335483871, 0.293595124665253
1987-02, 17.3636678571429, 1.19746078038792
1987-03, 19.507835483871, 1.96611766135158
1987-04, 15.84626, 0.65348932214841
1987-05, 13.3862451612903, -0.228394775659918
1987-06, 12.0173333333333, -0.719132292109295
1987-07, 13.5784258064516, -0.159500453476403
1987-08, 14.3991322580645, 0.134712393233798
1987-09, 10.7531266666667, -1.17233433712676
1987-10, 13.136564516129, -0.317902118068376
1987-11, 13.6633066666667, -0.129071742375111
1987-12, 13.8498161290323, -0.0622104672466754
1988-01, 13.2377709677419, -0.281620889651137
1988-02, 16.6635068965517, 0.946461962276945
1988-03, 18.7889290322581, 1.70839882262223
1988-04, 18.8300566666667, 1.72314255757647
1988-05, 11.1952290322581, -1.01384625011059
1988-06, 10.4767933333333, -1.27139632997592
1988-07, 13.6873419354839, -0.120455403553531
1988-08, 14.3094548387097, 0.102564176557606
1988-09, 13.4895, -0.191379226466074
1988-10, 12.2227580645161, -0.645490133177569
1988-11, 12.5618633333333, -0.523925198142559
1988-12, 10.8403677419355, -1.14105951888395
1989-01, 10.902164516129, -1.11890615964418
1989-02, 20.1451571428571, 2.19458938737721
1989-03, 17.1932870967742, 1.13638144022407
1989-04, 16.17749, 0.77223107326332
1989-05, 10.1218258064516, -1.3986476832074
1989-06, 9.99259666666667, -1.44497468967764
1989-07, 14.7587677419355, 0.263637149801442
1989-08, 13.8201419354839, -0.0728482890166232
1989-09, 11.02468, -1.07498591361112
1989-10, 10.4079870967742, -1.29606249251149
1989-11, 13.0174433333333, -0.360605550245536
1989-12, 13.9041967741936, -0.0427156961413667
1990-01, 17.3251870967742, 1.18366591618355
1990-02, 18.0485178571429, 1.44297081344967
1990-03, 18.7523419354839, 1.69528281278261
1990-04, 18.1349666666667, 1.47396161447813
1990-05, 15.0705387096774, 0.375403084820804
1990-06, 9.75452666666667, -1.53031976315506
1990-07, 11.3707806451613, -0.950913224940245
1990-08, 14.2552483870968, 0.0831318516285803
1990-09, 11.11785, -1.04158565110055
1990-10, 11.8633903225806, -0.774318907659447
1990-11, 13.06194, -0.344654059985655
1990-12, 13.7590387096774, -0.0947530199619892
1991-01, 15.070264516129, 0.375304789913696
1991-02, 15.3898321428571, 0.489865728226441
1991-03, 19.1008193548387, 1.82020754483645
1991-04, 19.34234, 1.90678963080951
1991-05, 13.0937903225806, -0.333236123576527
1991-06, 9.78499666666667, -1.51939665487238
1991-07, 10.1249935483871, -1.39751208792768
1991-08, 10.3695709677419, -1.30983418720204
1991-09, 10.8240166666667, -1.14692117184422
1991-10, 11.6389483870968, -0.854778492971665
1991-11, 15.96948, 0.69766212827219
1991-12, 12.633835483871, -0.498124095626626
1992-01, 12.3868903225806, -0.586650801785416
1992-02, 18.3617344827586, 1.55525499846888
1992-03, 18.9888387096774, 1.78006390477537
1992-04, 19.5029566666667, 1.96436866730452
1992-05, 15.0043451612903, 0.351673537835344
1992-06, 9.59392666666666, -1.58789282486159
1992-07, 15.0842806451613, 0.380329394282708
1992-08, 12.5473741935484, -0.529119370863048
1992-09, 12.0607933333333, -0.703552433692321
1992-10, 11.3763774193548, -0.948906852424679
1992-11, 11.35796, -0.955509263514274
1992-12, 13.0958419354839, -0.332500646389232
1993-01, 13.823635483871, -0.0715958962590562
1993-02, 17.5628535714286, 1.26886633094601
1993-03, 19.2073612903226, 1.85840147650487
1993-04, 17.9234733333333, 1.39814393869654
1993-05, 11.6565935483871, -0.848452926596895
1993-06, 13.0492766666667, -0.349193704265907
1993-07, 15.5966806451613, 0.564018291035055
1993-08, 15.1746709677419, 0.412733177717367
1993-09, 10.7254233333333, -1.18226563052328
1993-10, 9.4914935483871, -1.6246137977103
1993-11, 10.1583433333333, -1.38555661329127
1993-12, 12.5605483870968, -0.524396589679388
1994-01, 16.954264516129, 1.05069487867525
1994-02, 17.9523035714286, 1.40847921314781
1994-03, 18.784364516129, 1.7067625015216
1994-04, 17.47275, 1.23656534415997
1994-05, 12.9517516129032, -0.384155198277481
1994-06, 13.21879, -0.288425325685097
1994-07, 11.9283903225806, -0.751017232622556
1994-08, 13.1037193548387, -0.329676691528696
1994-09, 10.4966566666667, -1.26427557707616
1994-10, 8.89705806451613, -1.83771137425734
1994-11, 13.8978766666667, -0.0449813744765979
1994-12, 14.0285709677419, 0.00187087372075247
1995-01, 13.1204548387097, -0.323677232963355
1995-02, 15.6396285714286, 0.579414577517962
1995-03, 19.4935806451613, 1.96100748259286
1995-04, 16.87363, 1.02178842803533
1995-05, 11.9848935483871, -0.730761543295186
1995-06, 13.4315166666667, -0.212165515556661
1995-07, 15.8442129032258, 0.65275546393608
1995-08, 15.1143612903226, 0.391112923797302
1995-09, 11.58214, -0.875143578748581
1995-10, 10.4373, -1.28555418873679
1995-11, 10.5524333333333, -1.24428034997915
1995-12, 11.5418193548387, -0.889598018299756
1996-01, 14.163635483871, 0.0502897885492927
1996-02, 13.9078, -0.0414239854209782
1996-03, 17.6319516129032, 1.29363710184027
1996-04, 17.3638433333333, 1.19752368637508
1996-05, 10.3675129032258, -1.31057197721064
1996-06, 12.53933, -0.532003112155335
1996-07, 14.8497161290323, 0.296240992282349
1996-08, 12.2171322580645, -0.647506913389194
1996-09, 10.91618, -1.11388178655731
1996-10, 11.1249032258064, -1.03905715916666
1996-11, 12.2952666666667, -0.619496719566916
1996-12, 15.0035290322581, 0.351380965935399
1997-01, 16.0695225806452, 0.733526123719055
1997-02, 16.0294785714286, 0.719170854643065
1997-03, 20.3958322580645, 2.28445323467564
1997-04, 16.5365166666667, 0.900937576590172
1997-05, 16.1819032258065, 0.773813158703436
1997-06, 9.51046, -1.61781456552435
1997-07, 13.0298419354839, -0.356160808734383
1997-08, 12.3862451612903, -0.586882083919768
1997-09, 11.53953, -0.890418722953533
1997-10, 11.144435483871, -1.03205509254885
1997-11, 12.7658333333333, -0.450804541876797
1997-12, 13.2180064516129, -0.28870621783728
1998-01, 13.5722548387097, -0.161712667091555
1998-02, 16.6141642857143, 0.928773262535332
1998-03, 18.5236548387097, 1.61330139102627
1998-04, 15.37462, 0.484412368080735
1998-05, 11.1168193548387, -1.04195512431019
1998-06, 13.83476, -0.0676078984162779
1998-07, 15.3505677419355, 0.475789938829621
1998-08, 13.2476935483871, -0.278063770424648
1998-09, 12.1383833333333, -0.67573740344444
1998-10, 11.334564516129, -0.963896247552626
1998-11, 12.77026, -0.449217638058888
1998-12, 14.1587419354839, 0.0485355135601618
1999-01, 14.6393290322581, 0.220819888267161
1999-02, 16.9026285714286, 1.03218404785015
1999-03, 18.2789870967742, 1.52559111080179
1999-04, 17.30137, 1.1751277892704
1999-05, 10.0169451612903, -1.43624606337983
1999-06, 13.07984, -0.338237137167803
1999-07, 16.7896322580645, 0.99167630362897
1999-08, 14.0156548387097, -0.00275939460913739
1999-09, 13.43232, -0.211877530752371
1999-10, 12.8071387096774, -0.43599708869454
1999-11, 11.88692, -0.765883816937144
1999-12, 11.9695193548387, -0.736272996557018
2000-01, 12.1300387096774, -0.678728845117285
2000-02, 16.5404965517241, 0.902364314871583
2000-03, 13.9098806451613, -0.0406781005376599
2000-04, 19.02513, 1.7930738717564
2000-05, 12.4571806451613, -0.561452613246744
2000-06, 11.62581, -0.859488437996873
2000-07, 10.7780774193548, -1.16338980895655
2000-08, 11.4262451612903, -0.931029899849225
2000-09, 10.1696833333333, -1.38149136721561
2000-10, 12.6927516129032, -0.477003411116782
2000-11, 14.07018, 0.0167871836942565
2000-12, 16.8922870967742, 1.02847676043786
2001-01, 17.4874935483871, 1.24185071913546
2001-02, 17.8473607142857, 1.37085853076955
2001-03, 18.8414096774194, 1.72721246784185
2001-04, 15.8739233333333, 0.66340627605256
2001-05, 11.523235483871, -0.896260100180015
2001-06, 11.2937466666667, -0.978528928535321
2001-07, 11.9213967741936, -0.753524330958998
2001-08, 11.4306, -0.929468745442278
2001-09, 11.1513866666667, -1.02956318173919
2001-10, 14.8059387096774, 0.280547343055248
2001-11, 14.85315, 0.297471991442471
2001-12, 15.0368580645161, 0.363329000996474
2002-01, 13.8740838709677, -0.053510789762709
2002-02, 16.9232642857143, 1.03958168951845
2002-03, 17.9087322580645, 1.39285945030257
2002-04, 16.53613, 0.900798961497633
2002-05, 15.8675806451613, 0.661132502842649
2002-06, 12.3387733333333, -0.603900131742248
2002-07, 13.1054967741936, -0.329039509248509
2002-08, 14.3219225806452, 0.107033703804142
2002-09, 10.8865566666667, -1.12450137558565
2002-10, 10.8856451612903, -1.1248281386945
2002-11, 12.6058166666667, -0.50816848598682
2002-12, 11.0779, -1.05590721906553
2003-01, 13.8595870967742, -0.0587076993217876
2003-02, 17.6317285714286, 1.29355714430241
2003-03, 19.0776, 1.81188370082079
2003-04, 18.1191766666667, 1.46830109988071
2003-05, 10.886364516129, -1.12457025911469
2003-06, 11.23242, -1.00051376019322
2003-07, 11.0696935483871, -1.0588491278146
2003-08, 13.7421612903226, -0.100803360596864
2003-09, 12.0992066666667, -0.689781741224343
2003-10, 13.0376419354839, -0.353364607729955
2003-11, 12.0927866666667, -0.69208322974337
2003-12, 12.2109225806452, -0.649733003932401
2004-01, 12.0022193548387, -0.72455046157692
2004-02, 16.0501931034483, 0.726596751468669
2004-03, 18.894935483871, 1.74640079011912
2004-04, 15.62055, 0.57257515180108
2004-05, 13.6537064516129, -0.132513297628464
2004-06, 9.44214666666666, -1.64230402850927
2004-07, 11.6594580645161, -0.847426033920343
2004-08, 10.7103935483871, -1.18765361767237
2004-09, 12.0743033333333, -0.698709270157731
2004-10, 12.1391774193548, -0.675452733684065
2004-11, 12.0618366666667, -0.703178411934013
2004-12, 13.0720064516129, -0.341045364843218
2005-01, 15.4493483870968, 0.511201546421667
2005-02, 18.2250107142857, 1.50624126273389
2005-03, 18.7290548387097, 1.68693468414284
2005-04, 17.1543233333333, 1.12241342554847
2005-05, 13.0979967741935, -0.331728164060494
2005-06, 12.9922566666667, -0.369634650582883
2005-07, 13.6488612903226, -0.134250226457508
2005-08, 14.8451322580645, 0.294597732717692
2005-09, 11.39089, -0.943704276453277
2005-10, 10.0806580645161, -1.41340579620099
2005-11, 13.1717366666667, -0.305293348496406
2005-12, 11.2588838709677, -0.991026798323869
