"Description: ","100*r95p / PRCPTOT"
"Station: ","observed"
"Latitude: ","1"
"Longitude: ","1"
"ClimPACT2_version: ","1.2.7"
"Date_of_calculation: ","2020-01-30"
time, r95ptot, normalised (all years)
1970, 35.7515288059221, 0.97277034428679
1971, 27.335088691796, 0.148905258129495
1972, 28.0419318607263, 0.218096436391793
1973, 22.3174627912413, -0.342258076821033
1974, 15.681057419964, -0.991879841943022
1975, 14.9958202044885, -1.05895606537131
1976, 26.2423714036617, 0.0419417901398213
1977, 18.2874762808349, -0.736743766564867
1978, 36.916096399881, 1.08676706595568
1979, 23.3392244516062, -0.242240284626933
1980, 22.5689584191025, -0.31763977450955
1981, 19.8095238095238, -0.587754193615356
1982, 21.0698293597967, -0.464385913596659
1983, 14.1215751743101, -1.14453380932764
1984, 0, -2.52686084901427
1985, 18.5818869786954, -0.707924611236788
1986, -99.9, -99.9
1987, 33.9374115983027, 0.795190772723478
1988, 38.74701584316, 1.26599136796817
1989, 31.7723818962669, 0.583261220820995
1990, 25.2470568015812, -0.0554871631085213
1991, 17.2010349870627, -0.843092892556529
1992, 25.5226900472107, -0.0285060874305484
1993, 44.5994550408719, 1.83887256933983
1994, 50.0457456541629, 2.37199686233227
1995, 32.8397716932749, 0.687745441602113
1996, 21.6083583979737, -0.411670600896788
1997, 18.7229797140007, -0.694113382623236
1998, -99.9, -99.9
1999, -99.9, -99.9
2000, -99.9, -99.9
2001, -99.9, -99.9
2002, -99.9, -99.9
2003, 33.1733714519093, 0.720400719862585
2004, 30.1260675071167, 0.422107463690026
2005, -99.9, -99.9
