"Description: ","Maximum monthly 1-day precipitation total"
"Station: ","model_biascorrected"
"Latitude: ","1"
"Longitude: ","1"
"ClimPACT2_version: ","1.2.7"
"Date_of_calculation: ","2020-01-30"
time, rx1day, normalised (all years)
1970-01, 1.33847413448028, -0.521753928457851
1970-02, 9.74705842003617, -0.313040623145295
1970-03, 10.0954756560736, -0.304392400032856
1970-04, 6.23356381702543, -0.400250675026665
1970-05, 7.44095027854115, -0.370281585033067
1970-06, 10.8268068841917, -0.286239694093877
1970-07, 10.2541607338728, -0.300453605347983
1970-08, 9.57457463981964, -0.317321921715809
1970-09, 15.9340516164031, -0.15947044342096
1970-10, 21.9554603837622, -0.0100103103243174
1970-11, 3.28236633752059, -0.473503693568159
1970-12, 6.42157113746145, -0.395584059584804
1971-01, 4.31381934321544, -0.447901528116485
1971-02, 9.47798372289838, -0.319719448915297
1971-03, 5.45221229264455, -0.419644957551093
1971-04, 21.0016250791648, -0.0336858914192593
1971-05, 5.91446882362485, -0.408171077382115
1971-06, 40.7268701847273, 0.455923413104718
1971-07, 6.88210283063959, -0.384152992401532
1971-08, 9.82295128333145, -0.311156851774269
1971-09, 23.9855944769108, 0.0403805738506327
1971-10, 10.7422898318856, -0.288337530393428
1971-11, 16.8551150027594, -0.136608309054415
1971-12, 9.61424590926944, -0.316337223044591
1972-01, 10.2869326521139, -0.299640158619587
1972-02, 13.6469166907319, -0.216240462465975
1972-03, 9.16406324290429, -0.327511412313632
1972-04, 12.1100862090026, -0.254386832729255
1972-05, 16.5032480911177, -0.145342158138263
1972-06, 22.8058054202297, 0.0110964916283164
1972-07, 16.2307237183756, -0.152106609879674
1972-08, 13.2847007522772, -0.225231189464054
1972-09, 42.6724872255698, 0.504216460980117
1972-10, 26.710838204332, 0.108025091264754
1972-11, 11.4529230063777, -0.270698580282911
1972-12, 17.1862838607752, -0.128388215799027
1973-01, 5.69541442274986, -0.413608326566668
1973-02, 15.5442382731138, -0.16914617819032
1973-03, 2.28541008786904, -0.498249599305729
1973-04, 19.8114869956708, -0.063226851555804
1973-05, 11.9927972384554, -0.257298115757203
1973-06, 20.930906729276, -0.0354412238331706
1973-07, 6.60957845789747, -0.390917444142944
1973-08, 16.0220183443136, -0.157286981149996
1973-09, 15.8978300225577, -0.160369516120766
1973-10, 11.2217947408875, -0.276435520367401
1973-11, 10.026482143987, -0.306104919461061
1973-12, 14.1885157606118, -0.202797184954562
1974-01, 5.35734621352545, -0.421999671764876
1974-02, 2.97534520873516, -0.481124405023673
1974-03, 22.7488857727583, 0.00968366310004819
1974-04, 8.41893331236888, -0.346006622138253
1974-05, 34.526078285943, 0.302010729494741
1974-06, 28.8444625656105, 0.160984754582012
1974-07, 5.01582832869672, -0.430476642934493
1974-08, 3.36860822762885, -0.471363044282902
1974-09, 80.1859845848631, 1.4353560870812
1974-10, 14.8042828559849, -0.187512949057825
1974-11, 8.15675796643976, -0.352514195965434
1974-12, 5.8523746627469, -0.4097123448675
1975-01, 1.98011379688578, -0.505827497775539
1975-02, 1.83177774589956, -0.509509414546181
1975-03, 24.0028428549325, 0.0408087037076852
1975-04, 6.14214741351067, -0.402519763269037
1975-05, 23.5043647301067, 0.0284357508388992
1975-06, 136.205266723588, 2.82583623681272
1975-07, 8.50345036467498, -0.343908785838701
1975-08, 13.6848631223796, -0.215298576780461
1975-09, 23.319807085275, 0.023854761368449
1975-10, 12.5654433887743, -0.243084204503097
1975-11, 15.5321644084986, -0.169445869090257
1975-12, 9.39346667059228, -0.321817285214849
1976-01, 14.785309640161, -0.187983891900583
1976-02, 3.71875030146841, -0.462672008184758
1976-03, 15.3993518977319, -0.172742468989552
1976-04, 13.3122981571119, -0.224546181692771
1976-05, 15.1337268761984, -0.179335668788145
1976-06, 9.49868177652437, -0.319205693086835
1976-07, 12.4947250388855, -0.244839536917008
1976-08, 15.1733981456482, -0.178350970116927
1976-09, 77.3296531844774, 1.36445778275349
1976-10, 173.275480767725, 3.74597292558759
1976-11, 6.2697854108709, -0.399351602326857
1976-12, 11.7219977035155, -0.264019754512909
1977-01, 15.2475661711413, -0.176510011731606
1977-02, 64.0794491882435, 1.03556842656661
1977-03, 8.02567029347519, -0.355767982879025
1977-04, 3.49969590059342, -0.468109257369311
1977-05, 38.406963340815, 0.398339947331306
1977-06, 34.505380232317, 0.301496973666279
1977-07, 21.7950504681609, -0.0139919179948937
1977-08, 20.0184675319306, -0.0580892932711882
1977-09, 139.75153324484, 2.91385973542249
1977-10, 11.7789173509869, -0.262606925984641
1977-11, 13.396815209418, -0.222448345393219
1977-12, 5.43151423901856, -0.420158713379555
1978-01, 2.48376643511805, -0.493326105949638
1978-02, 1.42299118678638, -0.519656092158299
1978-03, 3.36860822762885, -0.471363044282902
1978-04, 7.99117353743188, -0.356624242593127
1978-05, 15.7391449447585, -0.164308310805639
1978-06, 19.9167021016028, -0.0606152594277926
1978-07, 88.0788423675716, 1.63126830966792
1978-08, 13.584822529854, -0.217781729951359
1978-09, 25.8001238447887, 0.0854198348124394
1978-10, 30.6572670956862, 0.205981202558112
1978-11, 7.52891700645158, -0.368098122762105
1978-12, 1.72483780216531, -0.5121638196599
1979-01, 3.41000433488082, -0.470335532625978
1979-02, 2.98396939774599, -0.480910340095148
1979-03, 3.78084446234636, -0.461130740699373
1979-04, 11.9651998336208, -0.257983123528485
1979-05, 30.3243733998683, 0.197718296317021
1979-06, 17.1172903486885, -0.130100735227234
1979-07, 28.1459032557335, 0.143645495371429
1979-08, 17.821024171972, -0.112633037059536
1979-09, 319.272651694205, 7.36983528761342
1979-10, 17.163860969347, -0.128944784613195
1979-11, 12.134233938233, -0.253787450929381
1979-12, 6.03348263197426, -0.405216981368461
1980-01, 3.68770322102943, -0.463442641927451
1980-02, 1.19531259690056, -0.525307406271378
1980-03, 5.717837314178, -0.413051757752502
1980-04, 25.1602090201854, 0.0695362171158333
1980-05, 400.207215885208, 9.37874901585569
1980-06, 20.2168238791796, -0.0531657999150974
1980-07, 8.87084081653619, -0.334789619883506
1980-08, 8.91913627499682, -0.333590856283762
1980-09, 45.4822480052971, 0.573958814693789
1980-10, 8.0601670495185, -0.354911723164922
1980-11, 5.35907105132762, -0.42195685877917
1980-12, 7.31676195678525, -0.373364120003837
1981-01, 2.56310897401765, -0.491356708607202
1981-02, 1.02282881668403, -0.529588704841892
1981-03, 8.31199336863463, -0.348661027251971
1981-04, 17.5243520699996, -0.119996870600819
1981-05, 12.6585846300912, -0.24077230327502
1981-06, 24.2788169032789, 0.0476587814205064
1981-07, 21.1361624277337, -0.0303464785342582
1981-08, 26.8419258772966, 0.111278878178345
1981-09, 24.7065766782159, 0.058276401875381
1981-10, 21.6950098756353, -0.016475071165792
1981-11, 29.851767842075, 0.185987538233812
1981-12, 20.6670065455447, -0.0419916106460571
1982-01, 6.03175779417209, -0.405259794354166
1982-02, 1.53510564392713, -0.516873248087465
1982-03, 8.23955018094369, -0.350459172651587
1982-04, 9.01227751631375, -0.331278955055685
1982-05, 40.3387816792401, 0.446290491321062
1982-06, 14.8732763680715, -0.185800429629619
1982-07, 11.5322655452773, -0.268729182940475
1982-08, 15.3286335478431, -0.174497801403463
1982-09, 27.6336264284904, 0.130930038617002
1982-10, 5.0020296262794, -0.430819146820134
1982-11, 4.13961072519674, -0.452225639672704
1982-12, 22.2055618650762, -0.00380242739707151
1983-01, 74.4319256768396, 1.29253196676885
1983-02, 9.33654702312083, -0.323230113743118
1983-03, 3.69977708564459, -0.463142951027515
1983-04, 200.69005279534, 4.42644252038507
1983-05, 22.7023151520998, 0.00852771248600851
1983-06, 18.92664520316, -0.0851899132225406
1983-07, 14.6145506977467, -0.19222237748539
1983-08, 9.28480188905587, -0.324514503314272
1983-09, 42.2809490444783, 0.49449791322505
1983-10, 6.98731793657167, -0.381541400273519
1983-11, 22.8127047714384, 0.011267743571138
1983-12, 38.9261395192667, 0.411226656028552
1984-01, 2.82873399555111, -0.48476350880861
1984-02, 2.25436300743006, -0.499020233048422
1984-03, 3.02881518060229, -0.479797202466814
1984-04, 4.58979339156189, -0.441051450403663
1984-05, 14.9991895276295, -0.182675081673146
1984-06, 20.5704156286235, -0.0443891378455435
1984-07, 4.75192814496543, -0.43702702974738
1984-08, 16.4377042546354, -0.146969051595059
1984-09, 18.1435688409769, -0.104627008732675
1984-10, 9.77810550047515, -0.312269989402602
1984-11, 46.2911969345126, 0.594038104989499
1984-12, 1.0590504105295, -0.528689632142084
1985-01, 8.58106806577242, -0.34198220148197
1985-02, 32.8685091580622, 0.260867450232103
1985-03, 3.73599867949006, -0.462243878327707
1985-04, 15.8823064823382, -0.160754832992113
1985-05, 15.42177478916, -0.172185900175387
1985-06, 5.99036168692012, -0.406287306011089
1985-07, 13.9694613597368, -0.208234434139114
1985-08, 24.9963494289797, 0.0654689834738452
1985-09, 21.5432241490447, -0.0202426139078456
1985-10, 32.1371779299441, 0.242714744293124
1985-11, 11.0734586899013, -0.280117437138043
1985-12, 12.6896317105302, -0.240001669532327
1986-01, 37.979203565878, 0.387722326876432
1986-02, 15.3148348454258, -0.174840305289104
1986-03, 1.55062918414661, -0.516487931216119
1986-04, 12.3032680428452, -0.249591778330277
1986-05, 8.98295527367694, -0.332006775812672
1986-06, 19.5096403802918, -0.0707191240542053
1986-07, 19.5648351899611, -0.0693491085116405
1986-08, 18.405744186906, -0.0981194349054947
1986-09, 15.1320020383963, -0.179378481773848
1986-10, 76.2688779361457, 1.33812779654483
1986-11, 31.9715935009362, 0.23860469766543
1986-12, 7.56168892469272, -0.367284676033707
1987-01, 4.87611646672133, -0.43394449477661
1987-02, 9.16233840510213, -0.327554225299337
1987-03, 42.6069433890875, 0.502589567523321
1987-04, 20.9343564048804, -0.0353555978617586
1987-05, 21.5190764198144, -0.0208419957077172
1987-06, 28.1666013093595, 0.144159251199891
1987-07, 25.3292431247976, 0.073731889714937
1987-08, 10.7077930758422, -0.289193790107533
1987-09, 127.2136872609, 2.60265214233182
1987-10, 10.1696436815667, -0.302551441647535
1987-11, 11.8272128094475, -0.261408162384898
1987-12, 6.77516288690534, -0.386807397515251
1988-01, 6.87692831723309, -0.384281431358648
1988-02, 3.9481537291564, -0.456977881085975
1988-03, 8.40168493434723, -0.346434751995304
1988-04, 4.43973250277351, -0.44477618016001
1988-05, 28.9013822130819, 0.16239758311028
1988-06, 16.7550744102338, -0.139091462225313
1988-07, 16.3238649596925, -0.149794708651598
1988-08, 7.30986260557659, -0.373535371946657
1988-09, 16.8637391917702, -0.13639424412589
1988-10, 45.0631124193709, 0.56355525916744
1988-11, 11.7133735145046, -0.264233819441436
1988-12, 12.6051146582241, -0.242099505831878
1989-01, 20.2685690132446, -0.0518814103439422
1989-02, 0.52607552966042, -0.541918844724972
1989-03, 15.8736822933274, -0.160968897920638
1989-04, 9.34689604993382, -0.322973235828887
1989-05, 90.5815820185134, 1.69338995192607
1989-06, 12.1463078028481, -0.253487760029446
1989-07, 16.8309672735291, -0.137207690854286
1989-08, 18.259132973722, -0.10175853869043
1989-09, 23.1162762246195, 0.0188028290552427
1989-10, 22.8937721481402, 0.0132799538992803
1989-11, 12.6240878740479, -0.241628562989122
1989-12, 11.1424522019879, -0.278404917709837
1990-01, 1.3177760808543, -0.522267684286313
1990-02, 3.6049110065255, -0.465497665241297
1990-03, 3.40138014586999, -0.470549597554504
1990-04, 5.25903045880203, -0.424440011950069
1990-05, 10.7836859391375, -0.287310018736507
1990-06, 33.013395533444, 0.264463741031333
1990-07, 11.268365361546, -0.275279569753361
1990-08, 11.2442176323157, -0.275878951553233
1990-09, 9.86779706618774, -0.310043714145935
1990-10, 9.08644554180686, -0.329437996670363
1990-11, 3.84811313663081, -0.459461034256873
1990-12, 11.2666405237438, -0.275322382739067
1991-01, 1.92836866282082, -0.507111887346693
1991-02, 6.37672535460515, -0.396697197213138
1991-03, 5.89032109439454, -0.408770459181987
1991-04, 2.82873399555111, -0.48476350880861
1991-05, 29.9086874895465, 0.187400366762083
1991-06, 19.3388814378775, -0.0749576096390124
1991-07, 21.8036746571717, -0.0137778530663686
1991-08, 22.0244538958489, -0.0082977908961097
1991-09, 38.9727101399252, 0.412382606642592
1991-10, 8.65006157785903, -0.340269682053764
1991-11, 13.1605124305213, -0.228313724434824
1991-12, 9.95403895629601, -0.307903064860678
1992-01, 28.3218367115544, 0.148012419913354
1992-02, 1.74381101798913, -0.511692876817143
1992-03, 7.06838531327344, -0.379529189945377
1992-04, 1.74381101798913, -0.511692876817143
1992-05, 37.47900060325, 0.37530656102194
1992-06, 21.4552574211343, -0.022426076178807
1992-07, 8.13261023720944, -0.353113577765306
1992-08, 20.565241115217, -0.0445175768026591
1992-09, 31.9060496644539, 0.236977804208634
1992-10, 42.8259977899625, 0.508026816707874
1992-11, 12.1480326406503, -0.25344494704374
1992-12, 6.44226919108744, -0.395070303756343
1993-01, 18.2729316761393, -0.10141603480479
1993-02, 2.77181434807965, -0.48617633733688
1993-03, 15.5511376243224, -0.168974926247501
1993-04, 12.6965310617388, -0.239830417589508
1993-05, 25.2930215309521, 0.0728328170151284
1993-06, 23.6682243213124, 0.0325029844808874
1993-07, 11.8013402424151, -0.262050357170473
1993-08, 10.6939943734249, -0.289536293993174
1993-09, 83.5511431368876, 1.51888422219193
1993-10, 15.1940961992742, -0.177837214288465
1993-11, 75.5220231678081, 1.3195897737345
1993-12, 9.52800401916118, -0.318477872329848
1994-01, 2.43374613885525, -0.494567682535087
1994-02, 36.1715735492087, 0.342854317857444
1994-03, 3.26856763510326, -0.4738461974538
1994-04, 18.5989260207485, -0.0933243805065194
1994-05, 32.1509766323614, 0.243057248178764
1994-06, 16.1289582880478, -0.154632576036279
1994-07, 18.8162555838214, -0.0879299443076701
1994-08, 9.25030513301256, -0.325370763028375
1994-09, 77.5607814499675, 1.37019472283798
1994-10, 32.6253070279568, 0.254830819247676
1994-11, 2.69247180918005, -0.488145734679316
1994-12, 5.97483814670064, -0.406672622882435
1995-01, 8.95363303104013, -0.332734596569659
1995-02, 27.9768691511213, 0.139449822772325
1995-03, 1.76795874721944, -0.511093495017271
1995-04, 19.2474650343627, -0.0772266978813858
1995-05, 27.8837279098044, 0.137137921544248
1995-06, 11.9600253202143, -0.2581115624856
1995-07, 3.44105141531979, -0.469564898883286
1995-08, 19.0456590115094, -0.0822358172088861
1995-09, 20.5324691969759, -0.0453310235310557
1995-10, 25.0687926166706, 0.06726712887346
1995-11, 12.4326308780076, -0.246380804402392
1995-12, 4.09131526673612, -0.453424403272448
1996-01, 22.4556633463902, 0.00240545553017451
1996-02, 80.006601453438, 1.43090353656787
1996-03, 3.10298320609539, -0.477956244081493
1996-04, 13.4606342080981, -0.220864264922129
1996-05, 16.9913771891305, -0.133226083183708
1996-06, 15.7563933227801, -0.163880180948589
1996-07, 18.7420875583283, -0.0897709026929908
1996-08, 11.7495951083501, -0.263334746741628
1996-09, 46.0290215885835, 0.587530531162318
1996-10, 12.6413362520696, -0.24120043313207
1996-11, 15.4390231671817, -0.171757770318334
1996-12, 9.77638066267298, -0.312312802388308
1997-01, 4.2862219383808, -0.448586535887767
1997-02, 2.90290202104422, -0.482922550423289
1997-03, 4.71398171331779, -0.437968915432893
1997-04, 20.4514018202741, -0.047343233859198
1997-05, 7.82386427062185, -0.360777102206526
1997-06, 15.2820629271847, -0.175653752017501
1997-07, 20.3013409314857, -0.0510679636155456
1997-08, 17.2604518862683, -0.126547257413706
1997-09, 259.748499141481, 5.89235915092907
1997-10, 19.3595794915034, -0.0744438538105529
1997-11, 21.7847014413479, -0.0142487959091247
1997-12, 14.2092138142378, -0.202283429126099
1998-01, 38.8209244133346, 0.408615063900538
1998-02, 1.92146931161216, -0.507283139289514
1998-03, 4.86749227771051, -0.434158559705135
1998-04, 17.0758942414366, -0.131128246884156
1998-05, 13.7918030661138, -0.212644171666743
1998-06, 24.1580782571273, 0.0446618724211459
1998-07, 9.2830770512537, -0.324557316299978
1998-08, 28.3632328188064, 0.149039931570278
1998-09, 20.7756713270812, -0.0392943925466312
1998-10, 27.326605299705, 0.123309327161488
1998-11, 13.8194004709485, -0.21195916389546
1998-12, 7.36160773964155, -0.372250982375503
1999-01, 5.96276428208548, -0.406972313782372
1999-02, 2.36647746457081, -0.496237388977588
1999-03, 4.24482583112883, -0.449614047544691
1999-04, 32.9806236152029, 0.263650294302936
1999-05, 200.120856320626, 4.41231423510238
1999-06, 16.5101474423264, -0.145170906195441
1999-07, 9.1537142160913, -0.327768290227863
1999-08, 10.8371559110046, -0.285982816179648
1999-09, 24.8600872426086, 0.0620867576031382
1999-10, 8.68973284730884, -0.339284983382546
1999-11, 18.2850055407545, -0.101116343904853
1999-12, 6.31118151812287, -0.398324090669933
2000-01, 13.5968963944691, -0.217482039051424
2000-02, 7.57203795150571, -0.367027798119476
2000-03, 22.7609596373734, 0.00998335399998275
2000-04, 5.90584463461402, -0.408385142310641
2000-05, 53.1491520359219, 0.764262536153135
2000-06, 15.9771725614573, -0.15840011877833
2000-07, 16.7861214906728, -0.13832082848262
2000-08, 35.7196660450414, 0.331637315602698
2000-09, 16.9793033245153, -0.133525774083645
2000-10, 7.38748030667402, -0.371608787589926
2000-11, 6.46469208251558, -0.394513734942176
2000-12, 0.217329563072829, -0.549582369166192
2001-01, 2.94602296609835, -0.481852225780661
2001-02, 2.67349859335623, -0.488616677522073
2001-03, 3.71185095025975, -0.462843260127579
2001-04, 8.83806889829505, -0.335603066611904
2001-05, 14.690443561042, -0.190338606114364
2001-06, 26.7246369067493, 0.108367595150394
2001-07, 15.2906871161955, -0.175439687088976
2001-08, 12.2325496929564, -0.251347110744188
2001-09, 20.377233794781, -0.0491841922445188
2001-10, 4.47077958321248, -0.444005546417317
2001-11, 9.27617770004504, -0.324728568242798
2001-12, 1.76968358502161, -0.511050682031566
2002-01, 20.6877045991707, -0.041477854817595
2002-02, 6.23356381702543, -0.400250675026665
2002-03, 15.7011985131108, -0.165250196491154
2002-04, 49.2717166566543, 0.668018944287981
2002-05, 6.03175779417209, -0.405259794354166
2002-06, 20.3272134985182, -0.050425768829968
2002-07, 33.0427177760809, 0.265191561788322
2002-08, 13.2243314292014, -0.226729643963734
2002-09, 31.4869140785277, 0.226574248682284
2002-10, 48.7697888562242, 0.655560365447786
2002-11, 5.37114491594278, -0.421657167879234
2002-12, 16.7705979504533, -0.138706145353967
2003-01, 9.61769558487377, -0.316251597073181
2003-02, 1.07457395074899, -0.528304315270737
2003-03, 14.2333615434681, -0.201684047326228
2003-04, 7.19429847283151, -0.376403841988902
2003-05, 43.4710871279723, 0.524038873361595
2003-06, 11.7219977035155, -0.264019754512909
2003-07, 410.259570596228, 9.62826309654526
2003-08, 14.3040798933569, -0.199928714912317
2003-09, 19.8459837517141, -0.0623705918417014
2003-10, 5.19866113572625, -0.425938466449748
2003-11, 27.618102888271, 0.130544721745658
2003-12, 9.82812579673794, -0.311028412817154
2004-01, 13.3191975083205, -0.224374929749952
2004-02, 15.0388607970793, -0.181690383001928
2004-03, 3.63423324916231, -0.46476984448431
2004-04, 9.65736685432357, -0.315266898401962
2004-05, 16.5929396568303, -0.143115882881595
2004-06, 95.9354785564346, 1.82628145955483
2004-07, 17.9296889535084, -0.109935818960113
2004-08, 138.045668658498, 2.8715176925601
2004-09, 19.8011379688578, -0.0634837294700351
2004-10, 144.163668342779, 3.02337535285624
2004-11, 11.5339903830794, -0.268686369954771
2004-12, 4.94510997880795, -0.432231975348404
2005-01, 5.936891715053, -0.407614508567949
2005-02, 5.03997605792704, -0.429877261134621
2005-03, 4.23792647992017, -0.449785299487511
2005-04, 18.0383537350448, -0.107238600860689
2005-05, 11.6116080841769, -0.266759785598038
2005-06, 18.1038975715271, -0.105611707403893
2005-07, 11.5063929782448, -0.269371377726052
2005-08, 28.9979731300032, 0.164795110309769
2005-09, 59.0377482925142, 0.91042606935048
2005-10, 23.7665400760358, 0.0349433246660798
2005-11, 7.29778874096143, -0.373835062846593
2005-12, 16.7102286273775, -0.140204599853647
