"Description: ","Annual number of days contributing to events where 6 or more consecutive days experience TX > 90th percentile"
"Station: ","model"
"Latitude: ","1"
"Longitude: ","1"
"ClimPACT2_version: ","1.2.7"
"Date_of_calculation: ","2020-01-30"
time, wsdi, normalised (all years)
1970, 32, 1.81180019380594
1971, 0, -0.982301309894785
1972, 0, -0.982301309894785
1973, 0, -0.982301309894785
1974, 6, -0.458407277950899
1975, 0, -0.982301309894785
1976, 7, -0.371091605960252
1977, 0, -0.982301309894785
1978, 15, 0.327433769964928
1979, 16, 0.414749441955576
1980, 0, -0.982301309894785
1981, 16, 0.414749441955576
1982, 23, 1.02595914589011
1983, 0, -0.982301309894785
1984, 0, -0.982301309894785
1985, 0, -0.982301309894785
1986, 8, -0.283775933969604
1987, 6, -0.458407277950899
1988, 0, -0.982301309894785
1989, 28, 1.46253750584335
1990, 0, -0.982301309894785
1991, 24, 1.11327481788076
1992, 6, -0.458407277950899
1993, 6, -0.458407277950899
1994, 11, -0.0218289179976619
1995, 7, -0.371091605960252
1996, 7, -0.371091605960252
1997, 34, 1.98643153778723
1998, 17, 0.502065113946223
1999, 24, 1.11327481788076
2000, 6, -0.458407277950899
2001, 32, 1.81180019380594
2002, 28, 1.46253750584335
2003, 0, -0.982301309894785
2004, 16, 0.414749441955576
2005, 30, 1.63716884982464
