"Description: ","Annual number of days when TN > 20 degrees_C"
"Station: ","observed"
"Latitude: ","1"
"Longitude: ","1"
"ClimPACT2_version: ","1.2.7"
"Date_of_calculation: ","2020-01-30"
time, tr, normalised (all years)
1970, 222, -0.0343010621945718
1971, 194, -1.20815963507548
1972, 226, 0.133393019645558
1973, 225, 0.0914694991855255
1974, 224, 0.0495459787254931
1975, 254, 1.30725159252647
1976, 221, -0.0762245826546042
1977, 169, -2.25624764657629
1978, 227, 0.17531654010559
1979, 242, 0.804169347006077
1980, 247, 1.01378694930624
1981, -99.9, -99.9
1982, -99.9, -99.9
1983, -99.9, -99.9
1984, -99.9, -99.9
1985, -99.9, -99.9
1986, -99.9, -99.9
1987, -99.9, -99.9
1988, -99.9, -99.9
1989, -99.9, -99.9
1990, -99.9, -99.9
1991, -99.9, -99.9
1992, -99.9, -99.9
1993, -99.9, -99.9
1994, -99.9, -99.9
1995, -99.9, -99.9
1996, -99.9, -99.9
1997, -99.9, -99.9
1998, -99.9, -99.9
1999, -99.9, -99.9
2000, -99.9, -99.9
2001, -99.9, -99.9
2002, -99.9, -99.9
2003, -99.9, -99.9
2004, -99.9, -99.9
2005, -99.9, -99.9
