"Description: ","Monthly number of days when TN < -20 degrees_C"
"Station: ","observed"
"Latitude: ","1"
"Longitude: ","1"
"ClimPACT2_version: ","1.2.7"
"Date_of_calculation: ","2020-01-30"
time, tnltm20, normalised (all years)
1970-01, 0, NaN
1970-02, 0, NaN
1970-03, 0, NaN
1970-04, 0, NaN
1970-05, 0, NaN
1970-06, 0, NaN
1970-07, 0, NaN
1970-08, 0, NaN
1970-09, 0, NaN
1970-10, 0, NaN
1970-11, 0, NaN
1970-12, 0, NaN
1971-01, 0, NaN
1971-02, 0, NaN
1971-03, 0, NaN
1971-04, 0, NaN
1971-05, 0, NaN
1971-06, 0, NaN
1971-07, 0, NaN
1971-08, 0, NaN
1971-09, 0, NaN
1971-10, 0, NaN
1971-11, 0, NaN
1971-12, 0, NaN
1972-01, 0, NaN
1972-02, 0, NaN
1972-03, 0, NaN
1972-04, 0, NaN
1972-05, 0, NaN
1972-06, 0, NaN
1972-07, 0, NaN
1972-08, 0, NaN
1972-09, 0, NaN
1972-10, 0, NaN
1972-11, 0, NaN
1972-12, 0, NaN
1973-01, 0, NaN
1973-02, 0, NaN
1973-03, 0, NaN
1973-04, 0, NaN
1973-05, 0, NaN
1973-06, 0, NaN
1973-07, 0, NaN
1973-08, 0, NaN
1973-09, 0, NaN
1973-10, 0, NaN
1973-11, 0, NaN
1973-12, 0, NaN
1974-01, 0, NaN
1974-02, 0, NaN
1974-03, 0, NaN
1974-04, 0, NaN
1974-05, 0, NaN
1974-06, 0, NaN
1974-07, 0, NaN
1974-08, 0, NaN
1974-09, 0, NaN
1974-10, 0, NaN
1974-11, 0, NaN
1974-12, 0, NaN
1975-01, 0, NaN
1975-02, 0, NaN
1975-03, 0, NaN
1975-04, 0, NaN
1975-05, 0, NaN
1975-06, 0, NaN
1975-07, 0, NaN
1975-08, 0, NaN
1975-09, 0, NaN
1975-10, 0, NaN
1975-11, 0, NaN
1975-12, 0, NaN
1976-01, 0, NaN
1976-02, 0, NaN
1976-03, 0, NaN
1976-04, 0, NaN
1976-05, 0, NaN
1976-06, 0, NaN
1976-07, 0, NaN
1976-08, 0, NaN
1976-09, 0, NaN
1976-10, 0, NaN
1976-11, 0, NaN
1976-12, 0, NaN
1977-01, 0, NaN
1977-02, 0, NaN
1977-03, 0, NaN
1977-04, 0, NaN
1977-05, 0, NaN
1977-06, 0, NaN
1977-07, 0, NaN
1977-08, 0, NaN
1977-09, 0, NaN
1977-10, 0, NaN
1977-11, 0, NaN
1977-12, 0, NaN
1978-01, 0, NaN
1978-02, 0, NaN
1978-03, 0, NaN
1978-04, 0, NaN
1978-05, 0, NaN
1978-06, 0, NaN
1978-07, 0, NaN
1978-08, 0, NaN
1978-09, 0, NaN
1978-10, 0, NaN
1978-11, 0, NaN
1978-12, 0, NaN
1979-01, 0, NaN
1979-02, 0, NaN
1979-03, 0, NaN
1979-04, 0, NaN
1979-05, 0, NaN
1979-06, 0, NaN
1979-07, 0, NaN
1979-08, 0, NaN
1979-09, 0, NaN
1979-10, 0, NaN
1979-11, 0, NaN
1979-12, 0, NaN
1980-01, 0, NaN
1980-02, 0, NaN
1980-03, 0, NaN
1980-04, 0, NaN
1980-05, 0, NaN
1980-06, 0, NaN
1980-07, 0, NaN
1980-08, 0, NaN
1980-09, 0, NaN
1980-10, 0, NaN
1980-11, 0, NaN
1980-12, 0, NaN
1981-01, -99.9, -99.9
1981-02, -99.9, -99.9
1981-03, -99.9, -99.9
1981-04, -99.9, -99.9
1981-05, -99.9, -99.9
1981-06, -99.9, -99.9
1981-07, -99.9, -99.9
1981-08, -99.9, -99.9
1981-09, -99.9, -99.9
1981-10, -99.9, -99.9
1981-11, -99.9, -99.9
1981-12, -99.9, -99.9
1982-01, -99.9, -99.9
1982-02, -99.9, -99.9
1982-03, -99.9, -99.9
1982-04, -99.9, -99.9
1982-05, -99.9, -99.9
1982-06, -99.9, -99.9
1982-07, -99.9, -99.9
1982-08, -99.9, -99.9
1982-09, -99.9, -99.9
1982-10, -99.9, -99.9
1982-11, -99.9, -99.9
1982-12, -99.9, -99.9
1983-01, -99.9, -99.9
1983-02, -99.9, -99.9
1983-03, -99.9, -99.9
1983-04, -99.9, -99.9
1983-05, -99.9, -99.9
1983-06, -99.9, -99.9
1983-07, -99.9, -99.9
1983-08, -99.9, -99.9
1983-09, -99.9, -99.9
1983-10, -99.9, -99.9
1983-11, -99.9, -99.9
1983-12, -99.9, -99.9
1984-01, -99.9, -99.9
1984-02, -99.9, -99.9
1984-03, -99.9, -99.9
1984-04, -99.9, -99.9
1984-05, -99.9, -99.9
1984-06, -99.9, -99.9
1984-07, -99.9, -99.9
1984-08, -99.9, -99.9
1984-09, -99.9, -99.9
1984-10, -99.9, -99.9
1984-11, -99.9, -99.9
1984-12, -99.9, -99.9
1985-01, -99.9, -99.9
1985-02, -99.9, -99.9
1985-03, -99.9, -99.9
1985-04, -99.9, -99.9
1985-05, -99.9, -99.9
1985-06, -99.9, -99.9
1985-07, -99.9, -99.9
1985-08, -99.9, -99.9
1985-09, -99.9, -99.9
1985-10, -99.9, -99.9
1985-11, -99.9, -99.9
1985-12, -99.9, -99.9
1986-01, -99.9, -99.9
1986-02, -99.9, -99.9
1986-03, -99.9, -99.9
1986-04, -99.9, -99.9
1986-05, -99.9, -99.9
1986-06, -99.9, -99.9
1986-07, -99.9, -99.9
1986-08, -99.9, -99.9
1986-09, -99.9, -99.9
1986-10, -99.9, -99.9
1986-11, -99.9, -99.9
1986-12, -99.9, -99.9
1987-01, -99.9, -99.9
1987-02, -99.9, -99.9
1987-03, -99.9, -99.9
1987-04, -99.9, -99.9
1987-05, -99.9, -99.9
1987-06, -99.9, -99.9
1987-07, -99.9, -99.9
1987-08, -99.9, -99.9
1987-09, -99.9, -99.9
1987-10, -99.9, -99.9
1987-11, -99.9, -99.9
1987-12, -99.9, -99.9
1988-01, -99.9, -99.9
1988-02, -99.9, -99.9
1988-03, -99.9, -99.9
1988-04, -99.9, -99.9
1988-05, -99.9, -99.9
1988-06, -99.9, -99.9
1988-07, -99.9, -99.9
1988-08, -99.9, -99.9
1988-09, -99.9, -99.9
1988-10, -99.9, -99.9
1988-11, -99.9, -99.9
1988-12, -99.9, -99.9
1989-01, -99.9, -99.9
1989-02, -99.9, -99.9
1989-03, -99.9, -99.9
1989-04, -99.9, -99.9
1989-05, -99.9, -99.9
1989-06, 0, NaN
1989-07, -99.9, -99.9
1989-08, -99.9, -99.9
1989-09, -99.9, -99.9
1989-10, -99.9, -99.9
1989-11, -99.9, -99.9
1989-12, 0, NaN
1990-01, -99.9, -99.9
1990-02, -99.9, -99.9
1990-03, -99.9, -99.9
1990-04, -99.9, -99.9
1990-05, -99.9, -99.9
1990-06, -99.9, -99.9
1990-07, -99.9, -99.9
1990-08, -99.9, -99.9
1990-09, -99.9, -99.9
1990-10, -99.9, -99.9
1990-11, -99.9, -99.9
1990-12, -99.9, -99.9
1991-01, -99.9, -99.9
1991-02, -99.9, -99.9
1991-03, -99.9, -99.9
1991-04, -99.9, -99.9
1991-05, -99.9, -99.9
1991-06, -99.9, -99.9
1991-07, -99.9, -99.9
1991-08, -99.9, -99.9
1991-09, -99.9, -99.9
1991-10, -99.9, -99.9
1991-11, -99.9, -99.9
1991-12, -99.9, -99.9
1992-01, -99.9, -99.9
1992-02, -99.9, -99.9
1992-03, 0, NaN
1992-04, -99.9, -99.9
1992-05, -99.9, -99.9
1992-06, -99.9, -99.9
1992-07, -99.9, -99.9
1992-08, -99.9, -99.9
1992-09, -99.9, -99.9
1992-10, -99.9, -99.9
1992-11, -99.9, -99.9
1992-12, -99.9, -99.9
1993-01, -99.9, -99.9
1993-02, -99.9, -99.9
1993-03, -99.9, -99.9
1993-04, -99.9, -99.9
1993-05, -99.9, -99.9
1993-06, -99.9, -99.9
1993-07, -99.9, -99.9
1993-08, -99.9, -99.9
1993-09, -99.9, -99.9
1993-10, -99.9, -99.9
1993-11, -99.9, -99.9
1993-12, -99.9, -99.9
1994-01, -99.9, -99.9
1994-02, -99.9, -99.9
1994-03, -99.9, -99.9
1994-04, -99.9, -99.9
1994-05, -99.9, -99.9
1994-06, -99.9, -99.9
1994-07, -99.9, -99.9
1994-08, -99.9, -99.9
1994-09, -99.9, -99.9
1994-10, -99.9, -99.9
1994-11, -99.9, -99.9
1994-12, -99.9, -99.9
1995-01, -99.9, -99.9
1995-02, -99.9, -99.9
1995-03, -99.9, -99.9
1995-04, -99.9, -99.9
1995-05, -99.9, -99.9
1995-06, -99.9, -99.9
1995-07, -99.9, -99.9
1995-08, -99.9, -99.9
1995-09, -99.9, -99.9
1995-10, -99.9, -99.9
1995-11, -99.9, -99.9
1995-12, -99.9, -99.9
1996-01, -99.9, -99.9
1996-02, -99.9, -99.9
1996-03, -99.9, -99.9
1996-04, -99.9, -99.9
1996-05, -99.9, -99.9
1996-06, -99.9, -99.9
1996-07, -99.9, -99.9
1996-08, -99.9, -99.9
1996-09, -99.9, -99.9
1996-10, -99.9, -99.9
1996-11, -99.9, -99.9
1996-12, -99.9, -99.9
1997-01, -99.9, -99.9
1997-02, -99.9, -99.9
1997-03, -99.9, -99.9
1997-04, -99.9, -99.9
1997-05, -99.9, -99.9
1997-06, -99.9, -99.9
1997-07, -99.9, -99.9
1997-08, -99.9, -99.9
1997-09, -99.9, -99.9
1997-10, -99.9, -99.9
1997-11, -99.9, -99.9
1997-12, -99.9, -99.9
1998-01, -99.9, -99.9
1998-02, -99.9, -99.9
1998-03, -99.9, -99.9
1998-04, -99.9, -99.9
1998-05, -99.9, -99.9
1998-06, -99.9, -99.9
1998-07, -99.9, -99.9
1998-08, -99.9, -99.9
1998-09, -99.9, -99.9
1998-10, -99.9, -99.9
1998-11, -99.9, -99.9
1998-12, -99.9, -99.9
1999-01, -99.9, -99.9
1999-02, -99.9, -99.9
1999-03, -99.9, -99.9
1999-04, -99.9, -99.9
1999-05, -99.9, -99.9
1999-06, -99.9, -99.9
1999-07, -99.9, -99.9
1999-08, -99.9, -99.9
1999-09, -99.9, -99.9
1999-10, -99.9, -99.9
1999-11, -99.9, -99.9
1999-12, -99.9, -99.9
2000-01, -99.9, -99.9
2000-02, -99.9, -99.9
2000-03, -99.9, -99.9
2000-04, -99.9, -99.9
2000-05, -99.9, -99.9
2000-06, -99.9, -99.9
2000-07, -99.9, -99.9
2000-08, -99.9, -99.9
2000-09, -99.9, -99.9
2000-10, -99.9, -99.9
2000-11, -99.9, -99.9
2000-12, -99.9, -99.9
2001-01, -99.9, -99.9
2001-02, -99.9, -99.9
2001-03, -99.9, -99.9
2001-04, -99.9, -99.9
2001-05, -99.9, -99.9
2001-06, -99.9, -99.9
2001-07, -99.9, -99.9
2001-08, -99.9, -99.9
2001-09, -99.9, -99.9
2001-10, -99.9, -99.9
2001-11, -99.9, -99.9
2001-12, -99.9, -99.9
2002-01, -99.9, -99.9
2002-02, -99.9, -99.9
2002-03, -99.9, -99.9
2002-04, -99.9, -99.9
2002-05, -99.9, -99.9
2002-06, -99.9, -99.9
2002-07, -99.9, -99.9
2002-08, -99.9, -99.9
2002-09, -99.9, -99.9
2002-10, -99.9, -99.9
2002-11, -99.9, -99.9
2002-12, -99.9, -99.9
2003-01, -99.9, -99.9
2003-02, -99.9, -99.9
2003-03, -99.9, -99.9
2003-04, -99.9, -99.9
2003-05, -99.9, -99.9
2003-06, -99.9, -99.9
2003-07, -99.9, -99.9
2003-08, -99.9, -99.9
2003-09, -99.9, -99.9
2003-10, -99.9, -99.9
2003-11, -99.9, -99.9
2003-12, -99.9, -99.9
2004-01, -99.9, -99.9
2004-02, -99.9, -99.9
2004-03, -99.9, -99.9
2004-04, -99.9, -99.9
2004-05, -99.9, -99.9
2004-06, -99.9, -99.9
2004-07, -99.9, -99.9
2004-08, -99.9, -99.9
2004-09, -99.9, -99.9
2004-10, -99.9, -99.9
2004-11, -99.9, -99.9
2004-12, -99.9, -99.9
2005-01, -99.9, -99.9
2005-02, -99.9, -99.9
2005-03, -99.9, -99.9
2005-04, -99.9, -99.9
2005-05, -99.9, -99.9
2005-06, -99.9, -99.9
2005-07, -99.9, -99.9
2005-08, -99.9, -99.9
2005-09, -99.9, -99.9
2005-10, -99.9, -99.9
2005-11, -99.9, -99.9
2005-12, -99.9, -99.9
