"Description: ","Number of days when precipitation >= 30"
"Station: ","model"
"Latitude: ","1"
"Longitude: ","1"
"ClimPACT2_version: ","1.2.7"
"Date_of_calculation: ","2020-01-30"
time, r30mm, normalised (all years)
1970, 0, -0.796819072889596
1971, 0, -0.796819072889596
1972, 0, -0.796819072889596
1973, 0, -0.796819072889596
1974, 1, 0.0996023841111995
1975, 1, 0.0996023841111995
1976, 2, 0.996023841111995
1977, 3, 1.89244529811279
1978, 1, 0.0996023841111995
1979, 3, 1.89244529811279
1980, 1, 0.0996023841111995
1981, 0, -0.796819072889596
1982, 0, -0.796819072889596
1983, 2, 0.996023841111995
1984, 0, -0.796819072889596
1985, 0, -0.796819072889596
1986, 1, 0.0996023841111995
1987, 2, 0.996023841111995
1988, 0, -0.796819072889596
1989, 1, 0.0996023841111995
1990, 0, -0.796819072889596
1991, 0, -0.796819072889596
1992, 0, -0.796819072889596
1993, 2, 0.996023841111995
1994, 1, 0.0996023841111995
1995, 0, -0.796819072889596
1996, 1, 0.0996023841111995
1997, 1, 0.0996023841111995
1998, 0, -0.796819072889596
1999, 2, 0.996023841111995
2000, 0, -0.796819072889596
2001, 0, -0.796819072889596
2002, 0, -0.796819072889596
2003, 3, 1.89244529811279
2004, 4, 2.78886675511359
2005, 0, -0.796819072889596
