"Description: ","Annual number of days when TX > 25 degrees_C"
"Station: ","model_biascorrected"
"Latitude: ","1"
"Longitude: ","1"
"ClimPACT2_version: ","1.2.7"
"Date_of_calculation: ","2020-01-30"
time, su, normalised (all years)
1970, 361, 1.86199578949523
1971, 343, 0.462258815489535
1972, 332, -0.393136001958388
1973, 331, -0.470899167180926
1974, 344, 0.540021980712073
1975, 335, -0.159846506290772
1976, 346, 0.69554831115715
1977, 316, -1.637346645519
1978, 357, 1.55094312860507
1979, 348, 0.851074641602227
1980, 352, 1.16212730249238
1981, 326, -0.859714993293618
1982, 334, -0.237609671513311
1983, 307, -2.33721513252185
1984, 345, 0.617785145934612
1985, 313, -1.87063614118662
1986, 333, -0.315372836735849
1987, 327, -0.78195182807108
1988, 337, -0.0043201758456956
1989, 317, -1.55958348029646
1990, 356, 1.47317996338253
1991, 342, 0.384495650266997
1992, 346, 0.69554831115715
1993, 347, 0.773311476379689
1994, 346, 0.69554831115715
1995, 338, 0.0734429893768428
1996, 322, -1.17076765418377
1997, 338, 0.0734429893768428
1998, 334, -0.237609671513311
1999, 342, 0.384495650266997
2000, 340, 0.22896931982192
2001, 356, 1.47317996338253
2002, 331, -0.470899167180926
2003, 323, -1.09300448896123
2004, 328, -0.704188662848541
2005, 341, 0.306732485044458
