"Description: ","Heatwave definitions and aspects"
"Station: ","model_biascorrected"
"Latitude: ","1"
"Longitude: ","1"
"ClimPACT2_version: ","1.2.7"
"Date_of_calculation: ","2020-01-30"
time, CWM, CWA, CWN, CWD, CWF
1970, -8.36293242120837, -12.1325974912625, 1, 3, 3
1971, -1.94472631069998, -2.78231571260135, 1, 3, 3
1972, -2.27823563659793, -6.97614936785552, 4, 11, 24
1973, -1.32717730987464, -3.16367882829585, 3, 8, 18
1974, -3.6730166016894, -19.6842019224376, 3, 20, 27
1975, -3.29691173404969, -12.324896240764, 1, 12, 12
1976, NA, NA, 0, NA, 0
1977, -5.48386641063468, -34.1324269844624, 3, 30, 37
1978, -4.00463235961791, -12.1828739960125, 1, 9, 9
1979, -2.8061798100265, -8.10694486379032, 3, 11, 20
1980, -6.47557046008376, -13.5052329360681, 2, 5, 8
1981, -4.27070917798005, -16.110319178925, 2, 28, 31
1982, -6.33619595107173, -25.2244048788124, 2, 21, 34
1983, -4.95379437386711, -35.5429982447834, 4, 33, 56
1984, -3.64039722473815, -15.8710214710709, 3, 7, 16
1985, -2.5391944666998, -7.49216577184169, 1, 20, 20
1986, -5.93241047444498, -12.1284533533264, 2, 4, 8
1987, -6.20092619143445, -30.0154321554541, 3, 16, 24
1988, -7.32563538478509, -16.6245132624082, 1, 7, 7
1989, -4.00479066808165, -11.0759665728708, 2, 8, 14
1990, -1.52718356265583, -2.99853872181251, 1, 5, 5
1991, -3.02992854164889, -8.16780953936255, 4, 4, 15
1992, -1.83934101695324, -4.69824167575969, 2, 3, 4
1993, NA, NA, 0, NA, 0
1994, -8.98751925498936, -20.4918535524083, 3, 9, 19
1995, -3.42310687808695, -8.00638480833758, 1, 7, 7
1996, -4.62317406168319, -30.2019921207877, 4, 14, 32
1997, -4.79853238868508, -11.8180145191931, 3, 15, 21
1998, -5.78882411189816, -23.3852964581653, 3, 8, 20
1999, -5.10864062082733, -14.7377397371749, 2, 5, 9
2000, -3.82738154884673, -18.9430472468749, 3, 18, 26
2001, -0.707718995262515, -1.61905555315003, 1, 5, 5
2002, -4.68535820967583, -11.8088910736334, 3, 9, 15
2003, -2.86107534246003, -8.53272464873612, 4, 13, 31
2004, -5.11201276120295, -15.3100346014751, 5, 8, 27
2005, -5.0678877813612, -13.3331726221374, 3, 6, 15
