"Description: ","Number of days when precipitation >= 30"
"Station: ","observed"
"Latitude: ","1"
"Longitude: ","1"
"ClimPACT2_version: ","1.2.7"
"Date_of_calculation: ","2020-01-30"
time, r30mm, normalised (all years)
1970, 15, 1.35488878449828
1971, 13, 0.755014360827285
1972, 9, -0.444734486514702
1973, 13, 0.755014360827285
1974, 9, -0.444734486514702
1975, 12, 0.455077148991788
1976, 9, -0.444734486514702
1977, 11, 0.155139937156292
1978, 14, 1.05495157266278
1979, 10, -0.144797274679205
1980, 12, 0.455077148991788
1981, 9, -0.444734486514702
1982, 6, -1.34454612202119
1983, 9, -0.444734486514702
1984, 2, -2.54429496936318
1985, 10, -0.144797274679205
1986, -99.9, -99.9
1987, 8, -0.744671698350199
1988, 12, 0.455077148991788
1989, 14, 1.05495157266278
1990, 13, 0.755014360827285
1991, 7, -1.0446089101857
1992, 11, 0.155139937156292
1993, 8, -0.744671698350199
1994, 20, 2.85457484367576
1995, 10, -0.144797274679205
1996, 13, 0.755014360827285
1997, 9, -0.444734486514702
1998, -99.9, -99.9
1999, -99.9, -99.9
2000, -99.9, -99.9
2001, -99.9, -99.9
2002, -99.9, -99.9
2003, 8, -0.744671698350199
2004, 8, -0.744671698350199
2005, -99.9, -99.9
