"Description: ","Maximum 3-day precipitation total"
"Station: ","model"
"Latitude: ","1"
"Longitude: ","1"
"ClimPACT2_version: ","1.2.7"
"Date_of_calculation: ","2020-01-30"
time, rx3day, normalised (all years)
1970-01, 1.707264, -0.582068591055692
1970-02, 6.905952, -0.420309103513814
1970-03, 7.778592, -0.393156522091627
1970-04, 8.429184, -0.372913062872908
1970-05, 8.95536, -0.356540862787648
1970-06, 10.60992, -0.305058493061423
1970-07, 12.53232, -0.245242162700666
1970-08, 12.120192, -0.258065708580253
1970-09, 21.464352, 0.0326819825890032
1970-10, 14.527296, -0.183167597845389
1970-11, 3.278016, -0.533193944495756
1970-12, 5.4648, -0.465151188476395
1971-01, 5.111424, -0.476146639765182
1971-02, 9.820224, -0.329630235061303
1971-03, 5.899392, -0.451628665253266
1971-04, 20.434464, 0.000636559762026434
1971-05, 24.471072, 0.126237411647626
1971-06, 43.572384, 0.720583223609708
1971-07, 8.610624, -0.367267476636611
1971-08, 10.911456, -0.295676066411579
1971-09, 23.458464, 0.094729663700297
1971-10, 11.692512, -0.271373161851522
1971-11, 15.76368, -0.144696960206628
1971-12, 8.10432, -0.383021350610276
1972-01, 11.023776, -0.292181179693871
1972-02, 8.79552, -0.361514355424386
1972-03, 8.779104, -0.362025146560051
1972-04, 14.34672, -0.188786300337703
1972-05, 22.311072, 0.0590280516917189
1972-06, 31.110048, 0.332812100408104
1972-07, 18.129312, -0.0710892691829181
1972-08, 15.873408, -0.141282724720868
1972-09, 30.072384, 0.300524723885286
1972-10, 29.078784, 0.269608418305568
1972-11, 10.740384, -0.300999047720086
1972-12, 15.419808, -0.155396690311608
1973-01, 4.52995199999999, -0.494239399465312
1973-02, 16.006464, -0.137142628147584
1973-03, 2.31551999999999, -0.563142435292109
1973-04, 20.763648, 0.0108792662193068
1973-05, 13.989888, -0.199889286602419
1973-06, 26.967168, 0.203904548012673
1973-07, 13.817088, -0.205266035398892
1973-08, 19.917792, -0.0154399191394266
1973-09, 20.303136, -0.00344976932329274
1973-10, 9.37958399999999, -0.343340944492309
1973-11, 10.698912, -0.30228946743124
1973-12, 12.011328, -0.26145306032203
1974-01, 5.41987199999999, -0.466549143163478
1974-02, 3.19075199999999, -0.535909202637975
1974-03, 23.321088, 0.0904551484071013
1974-04, 11.028096, -0.29204676097396
1974-05, 43.94304, 0.732116349778142
1974-06, 38.93616, 0.576325053400348
1974-07, 6.08428799999999, -0.445875544041041
1974-08, 4.78655999999999, -0.48625492750255
1974-09, 59.845824, 1.22693854151752
1974-10, 35.342784, 0.4645155621777
1974-11, 7.390656, -0.405227323139708
1974-12, 6.29942399999999, -0.439181491789433
1975-01, 1.93363199999999, -0.575025050132313
1975-02, 1.82390399999999, -0.578439285618073
1975-03, 26.120448, 0.177558478909957
1975-04, 6.759936, -0.424852456246833
1975-05, 21.638016, 0.0380856151294582
1975-06, 84.539808, 1.99530282827743
1975-07, 11.019456, -0.292315598413783
1975-08, 11.549088, -0.275835863352595
1975-09, 27.216, 0.211647066279594
1975-10, 11.338272, -0.282395496884291
1975-11, 10.96416, -0.294036158028654
1975-12, 6.27695999999999, -0.439880469132974
1976-01, 15.859584, -0.141712864624586
1976-02, 3.6072, -0.522951238038476
1976-03, 14.429664, -0.186205460915396
1976-04, 12.946176, -0.232364849333114
1976-05, 14.633568, -0.179860897335559
1976-06, 10.966752, -0.293955506796707
1976-07, 10.275552, -0.315462501982598
1976-08, 18.491328, -0.0598249804543079
1976-09, 48.15504, 0.863174601692161
1976-10, 91.963296, 2.2262879565739
1976-11, 7.03728, -0.416222774428494
1976-12, 11.377152, -0.281185728405085
1977-01, 12.097728, -0.258764685923794
1977-02, 39.518496, 0.594444696844461
1977-03, 37.676448, 0.537128554674063
1977-04, 4.057344, -0.508944807423664
1977-05, 37.937376, 0.545247445356736
1977-06, 34.052832, 0.424378132412032
1977-07, 16.655328, -0.116952936416829
1977-08, 16.81344, -0.112033211268057
1977-09, 77.436, 1.77426468525444
1977-10, 7.76908800000001, -0.393452243275433
1977-11, 13.505184, -0.214971066976525
1977-12, 3.37219200000002, -0.530263616401678
1978-01, 1.81958400000002, -0.578573704337984
1978-02, 0.721440000000015, -0.612742942939567
1978-03, 2.39673600000002, -0.560615363357765
1978-04, 10.736928, -0.301106582696016
1978-05, 16.642368, -0.117356192576565
1978-06, 27.012096, 0.205302502699756
1978-07, 54.213408, 1.05168341449649
1978-08, 19.247328, -0.0363017044697403
1978-09, 25.735968, 0.165595212837806
1978-10, 23.30208, 0.0898637060394893
1978-11, 6.81782400000001, -0.423051245400014
1978-12, 1.02816000000001, -0.603199213825829
1979-01, 3.47673600000001, -0.527010683379812
1979-02, 3.34195200000001, -0.531204547441061
1979-03, 4.53513600000001, -0.494078097001417
1979-04, 15.283296, -0.159644321860822
1979-05, 21.955968, 0.0479788329149677
1979-06, 16.99056, -0.106522043751673
1979-07, 26.8488, 0.200221475087089
1979-08, 19.65168, -0.0237201122859944
1979-09, 285.512256, 8.24864986478294
1979-10, 14.256, -0.191609093455851
1979-11, 8.57088000000002, -0.368504128859799
1979-12, 3.35404800000003, -0.530828175025307
1980-01, 3.46809600000002, -0.527279520819635
1980-02, 1.46880000000003, -0.589488504394823
1980-03, 6.84028800000003, -0.422352268056472
1980-04, 21.162816, 0.0232995559391585
1980-05, 214.03872, 6.02471902758595
1980-06, 23.715072, 0.102714135663059
1980-07, 9.18259200000004, -0.349470438120286
1980-08, 10.23408, -0.316752921693751
1980-09, 32.729184, 0.383192236631052
1980-10, 8.95104000000004, -0.356675281507559
1980-11, 7.05196800000004, -0.415765750780793
1980-12, 3.89232000000004, -0.514079602524294
1981-01, 1.50163200000004, -0.588466922123493
1981-02, 0.545184000000039, -0.618227226711969
1981-03, 5.67388800000004, -0.458645322432662
1981-04, 19.445184, -0.0301453270977791
1981-05, 16.130016, -0.133298252758106
1981-06, 27.546912, 0.221943540224839
1981-07, 27.275616, 0.213502044614377
1981-08, 27.132192, 0.209039343113305
1981-09, 29.081376, 0.269689069537515
1981-10, 16.422912, -0.124184663548085
1981-11, 24.255936, 0.119543359396018
1981-12, 13.03344, -0.229649591190895
1982-01, 3.31344000000004, -0.532091710992478
1982-02, 1.56643200000004, -0.586450641324816
1982-03, 7.15737600000004, -0.412485934014945
1982-04, 11.398752, -0.280513634805526
1982-05, 41.885856, 0.668106155356135
1982-06, 20.393856, -0.000626976205144593
1982-07, 12.814848, -0.236451178418433
1982-08, 14.089248, -0.196797656044447
1982-09, 35.545824, 0.470833242013556
1982-10, 6.28128000000004, -0.439746050413061
1982-11, 4.42886400000004, -0.497384797511247
1982-12, 14.052096, -0.197953657035689
1983-01, 61.36992, 1.2743614659024
1983-02, 5.61859200000004, -0.460365882047533
1983-03, 4.56364800000004, -0.493190933449998
1983-04, 115.868448, 2.97010738507791
1983-05, 28.2277440000001, 0.243127930482944
1983-06, 16.18272, -0.131658344375182
1983-07, 17.1357120000001, -0.102005574762632
1983-08, 11.839392, -0.266802925374521
1983-09, 25.583904, 0.16086367389691
1983-10, 8.80848000000005, -0.361111099264649
1983-11, 17.230752, -0.0990483629245756
1983-12, 35.6495040000001, 0.474059291291442
1984-01, 3.48537600000005, -0.526741845939987
1984-02, 1.47139200000005, -0.589407853162875
1984-03, 1.82649600000005, -0.578358634386124
1984-04, 6.41347200000005, -0.435632837583759
1984-05, 17.762976, -0.08248797663144
1984-06, 28.959552, 0.265898461636002
1984-07, 8.93548800000005, -0.357159188899241
1984-08, 16.168896, -0.1320884842789
1984-09, 19.851264, -0.0175099674260685
1984-10, 8.67974400000005, -0.365116777118021
1984-11, 44.3111040000001, 0.743568824714631
1984-12, 2.17209600000005, -0.567605136793179
1985-01, 6.00652800000005, -0.448295080999452
1985-02, 27.439776, 0.218609955971026
1985-03, 4.35024000000005, -0.499831218213642
1985-04, 18.252864, -0.0672448937934401
1985-05, 14.876352, -0.172306565276515
1985-06, 7.54963200000005, -0.400280714246952
1985-07, 17.255808, -0.0982687343490871
1985-08, 26.656992, 0.194253283923005
1985-09, 26.073792, 0.17610675673491
1985-10, 30.550176, 0.315391434307533
1985-11, 11.630304, -0.273308791418253
1985-12, 9.51091200000004, -0.339254615406988
1986-01, 37.194336, 0.522127425531904
1986-02, 20.996064, 0.0181109933505625
1986-03, 1.43942400000004, -0.590402551690223
1986-04, 14.543712, -0.182656806709725
1986-05, 7.53753600000004, -0.400657086662705
1986-06, 26.134272, 0.177988618813675
1986-07, 21.67776, 0.0393222673526468
1986-08, 23.30208, 0.0898637060394893
1986-09, 18.039456, -0.0738851785570837
1986-10, 61.597152, 1.28143189056977
1986-11, 18.892224, -0.0473509232464915
1986-12, 5.88729600000004, -0.452005037669018
1987-01, 4.14028800000004, -0.506363968001356
1987-02, 26.859168, 0.200544080014878
1987-03, 33.12144, 0.395397456399045
1987-04, 16.415136, -0.124426617243926
1987-05, 21.717504, 0.0405589195758356
1987-06, 27.498528, 0.220438050561826
1987-07, 26.873856, 0.201001103662578
1987-08, 14.849568, -0.173139961339968
1987-09, 116.202816, 2.98051139399909
1987-10, 9.15753600000004, -0.350250066695774
1987-11, 9.19641600000004, -0.349040298216568
1987-12, 7.32326400000004, -0.407324255170331
1988-01, 4.59561600000004, -0.492196234922651
1988-02, 5.36889600000004, -0.468135284058436
1988-03, 7.68960000000004, -0.395925547721809
1988-04, 6.06528000000004, -0.446466986408651
1988-05, 35.355744, 0.464918818337436
1988-06, 18.99504, -0.0441517577125903
1988-07, 23.9976, 0.111505119945291
1988-08, 9.31478400000004, -0.345357225290984
1988-09, 21.196512, 0.0243480219544706
1988-10, 28.751328, 0.259419479336253
1988-11, 12.058848, -0.259974454403001
1988-12, 8.49484800000004, -0.370869898330247
1989-01, 23.137056, 0.084728910938858
1989-02, 0.585792000000043, -0.616963690744798
1989-03, 17.426016, -0.0929726367845615
1989-04, 14.215392, -0.192872629423022
1989-05, 71.46144, 1.5883635956164
1989-06, 15.615936, -0.149294080427612
1989-07, 20.190816, -0.00694465604099983
1989-08, 16.405632, -0.124722338427732
1989-09, 20.66688, 0.0078682868932821
1989-10, 19.30176, -0.0346080285988514
1989-11, 9.05472000000004, -0.353449232229675
1989-12, 10.99008, -0.293229645709184
1990-01, 0.89424000000004, -0.607366194143094
1990-02, 4.06512000000004, -0.508702853727822
1990-03, 4.17830400000004, -0.505181083266132
1990-04, 4.72867200000004, -0.488056138349367
1990-05, 14.56704, -0.181930945622201
1990-06, 36.040896, 0.486237627315449
1990-07, 14.60592, -0.180721177142994
1990-08, 10.400832, -0.311564359105155
1990-09, 12.5064, -0.246048675020137
1990-10, 10.262592, -0.315865758142333
1990-11, 4.68374400000004, -0.48945409303645
1990-12, 9.05040000000004, -0.353583650949587
1991-01, 1.69948800000004, -0.582310544751532
1991-02, 6.10329600000004, -0.445284101673428
1991-03, 3.58214400000004, -0.523730866613963
1991-04, 1.94832000000004, -0.574568026484611
1991-05, 29.785536, 0.291599320883141
1991-06, 21.666528, 0.0389727786808761
1991-07, 18.497376, -0.0596367942464314
1991-08, 20.025792, -0.0120794511416312
1991-09, 36.848736, 0.511373927938959
1991-10, 11.787552, -0.268415950013463
1991-11, 11.583648, -0.2747605135933
1991-12, 11.614752, -0.273792698809935
1992-01, 24.065856, 0.113628935719898
1992-02, 1.29772800000004, -0.594811485703331
1992-03, 7.86931200000004, -0.390333728973478
1992-04, 2.31120000000004, -0.563276854012019
1992-05, 33.872256, 0.418759429919718
1992-06, 26.145504, 0.178338107485446
1992-07, 12.570336, -0.244059277965442
1992-08, 20.056032, -0.0111385201022486
1992-09, 30.416256, 0.311224453990266
1992-10, 41.880672, 0.667944852892241
1992-11, 9.86083200000003, -0.328366699094131
1992-12, 4.37270400000003, -0.499132240870101
1993-01, 11.757312, -0.269356881052845
1993-02, 2.70691200000003, -0.550964099268097
1993-03, 8.25552000000003, -0.378316695413362
1993-04, 21.550752, 0.0353703569872395
1993-05, 25.761024, 0.166374841413294
1993-06, 29.093472, 0.270065441953269
1993-07, 13.293504, -0.221557584252204
1993-08, 10.378368, -0.312263336448697
1993-09, 62.945856, 1.32339741492623
1993-10, 13.69008, -0.209217945764299
1993-11, 62.149248, 1.29861060297449
1993-12, 8.80675200000003, -0.361164866752614
1994-01, 1.49731200000003, -0.588601340843405
1994-02, 20.77056, 0.0110943361711657
1994-03, 3.63744000000003, -0.522010306999092
1994-04, 17.917632, -0.0776757864585969
1994-05, 34.759584, 0.446369034989605
1994-06, 19.655136, -0.023612577310065
1994-07, 17.554752, -0.0889669589311894
1994-08, 13.61232, -0.211637482722712
1994-09, 57.265056, 1.1466367982422
1994-10, 34.950528, 0.452310342409707
1994-11, 4.19990400000003, -0.504508989666574
1994-12, 5.42678400000003, -0.466334073211618
1995-01, 9.65865600000003, -0.334657495186004
1995-02, 16.10928, -0.133943462613683
1995-03, 2.19888000000003, -0.566771740729726
1995-04, 21.87648, 0.0455055284685904
1995-05, 26.311392, 0.18349978633006
1995-06, 14.008032, -0.19932472797879
1995-07, 4.08326400000004, -0.508138295104192
1995-08, 17.7768, -0.0820578367277221
1995-09, 21.240576, 0.0257190928975712
1995-10, 26.532576, 0.190382024789545
1995-11, 11.902464, -0.264840412063808
1995-12, 5.02848000000003, -0.478727479187487
1996-01, 15.417216, -0.155477341543556
1996-02, 64.4232960000001, 1.36936861713608
1996-03, 3.55968000000003, -0.524429843957505
1996-04, 11.962944, -0.262958549985043
1996-05, 18.549216, -0.0580237696074896
1996-06, 18.963936, -0.0451195724959553
1996-07, 15.488064, -0.153272874537002
1996-08, 16.01424, -0.136900674451743
1996-09, 43.187904, 0.708619957537556
1996-10, 14.151456, -0.194862026477717
1996-11, 11.762496, -0.269195578588951
1996-12, 5.68080000000003, -0.458430252480803
1997-01, 5.76028800000003, -0.455956948034426
1997-02, 3.62188800000003, -0.522494214390774
1997-03, 5.16672000000004, -0.474426080150309
1997-04, 24.964416, 0.141588029461556
1997-05, 8.93289600000004, -0.357239840131189
1997-06, 20.594304, 0.00561005239876367
1997-07, 27.14688, 0.209496366761005
1997-08, 17.990208, -0.0754175519640785
1997-09, 155.775744, 4.21184063587928
1997-10, 17.070912, -0.104021855561313
1997-11, 13.384224, -0.218734791134056
1997-12, 9.22838400000004, -0.348045599689221
1998-01, 22.012128, 0.0497262762738214
1998-02, 4.05561600000004, -0.508998574911628
1998-03, 4.98268800000004, -0.480152317618552
1998-04, 22.214304, 0.0560170723656942
1998-05, 20.44224, 0.000878513457867804
1998-06, 21.795264, 0.0429784565342482
1998-07, 12.003552, -0.261695014017872
1998-08, 34.27488, 0.4312872546155
1998-09, 15.583104, -0.150315662698942
1998-10, 27.15552, 0.209765204200828
1998-11, 14.34672, -0.188786300337703
1998-12, 6.90422400000004, -0.420362871001777
1999-01, 4.31827200000004, -0.50082591674099
1999-02, 2.50473600000004, -0.557254895359969
1999-03, 3.91824000000004, -0.513273090204824
1999-04, 25.869024, 0.16973530941109
1999-05, 194.601312, 5.41991543921473
1999-06, 18.415296, -0.0621907499247558
1999-07, 8.89142400000003, -0.358530259842342
1999-08, 13.430016, -0.21730995270299
1999-09, 21.854016, 0.044806551125049
1999-10, 13.61232, -0.211637482722712
1999-11, 15.02928, -0.167548142591637
1999-12, 5.54083200000003, -0.462785419005946
2000-01, 9.70704000000003, -0.333152005522992
2000-02, 4.65868800000003, -0.490233721611939
2000-03, 17.892576, -0.0784554150340855
2000-04, 4.00204800000003, -0.510665367038535
2000-05, 49.165056, 0.894601698407544
2000-06, 28.322784, 0.246085142321001
2000-07, 17.925408, -0.0774338327627557
2000-08, 28.84032, 0.262188504966436
2000-09, 18.658944, -0.0546095341217294
2000-10, 6.71932800000003, -0.426115992214003
2000-11, 5.26608000000003, -0.471334449592338
2000-12, 0.218592000000028, -0.628389281937302
2001-01, 1.57248000000003, -0.586262455116939
2001-02, 2.70950400000003, -0.55088344803615
2001-03, 3.29702400000003, -0.532602502128143
2001-04, 11.6424, -0.272932419002499
2001-05, 19.473696, -0.0292581635463612
2001-06, 28.82304, 0.261650830086789
2001-07, 19.27584, -0.0354145409183224
2001-08, 16.193088, -0.131335739447394
2001-09, 18.667584, -0.0543406966819058
2001-10, 4.84185600000003, -0.484534367887678
2001-11, 5.88643200000003, -0.452031921413001
2001-12, 2.31120000000003, -0.563276854012019
2002-01, 16.025472, -0.136551185779972
2002-02, 5.43974400000003, -0.465930817051883
2002-03, 18.562176, -0.0576205134477541
2002-04, 39.375936, 0.590008879087371
2002-05, 11.913696, -0.264490923392038
2002-06, 20.500992, 0.00270660804866844
2002-07, 19.436544, -0.0304141645376028
2002-08, 15.540768, -0.151632966154078
2002-09, 37.705824, 0.538042601969463
2002-10, 35.893152, 0.481640507094465
2002-11, 4.79520000000002, -0.485986090062726
2002-12, 11.039328, -0.291697272302189
2003-01, 5.87692800000002, -0.452327642596807
2003-02, 0.961632000000024, -0.60526926211247
2003-03, 8.11123200000002, -0.382806280658416
2003-04, 6.55776000000002, -0.431143252338705
2003-05, 45.824832, 0.790669144171728
2003-06, 13.12848, -0.226692379352835
2003-07, 429.192, 12.719308954074
2003-08, 16.785792, -0.112893491075492
2003-09, 21.885984, 0.0458012496523964
2003-10, 5.74128000000004, -0.456548390402038
2003-11, 24.876288, 0.138845887575355
2003-12, 8.67542400000004, -0.365251195837933
2004-01, 10.399104, -0.31161812659312
2004-02, 8.63827200000004, -0.366407196829174
2004-03, 2.92204800000004, -0.544270047016488
2004-04, 13.706496, -0.208707154628634
2004-05, 16.32528, -0.127222526618092
2004-06, 104.989824, 2.63161416459598
2004-07, 21.84192, 0.0444301787092958
2004-08, 84.295296, 1.98769472873042
2004-09, 82.432512, 1.92973337670445
2004-10, 88.778592, 2.12719447625491
2004-11, 8.98214400000002, -0.355707466724195
2004-12, 4.33728000000002, -0.500234474373378
2005-01, 6.22425600000002, -0.441520377515897
2005-02, 5.56675200000002, -0.461978906686476
2005-03, 4.33900800000002, -0.500180706885413
2005-04, 17.056224, -0.104478879209013
2005-05, 15.155424, -0.163623115970212
2005-06, 20.687616, 0.0085134967488588
2005-07, 15.169248, -0.163192976066494
2005-08, 24.138432, 0.115887170214417
2005-09, 48.0816, 0.86088948345366
2005-10, 18.235584, -0.0677825686730874
2005-11, 5.41296000000002, -0.466764213115336
2005-12, 12.088224, -0.2590604071076
