"Description: ","Monthly percentage of days when TX > 90th percentile"
"Station: ","observed"
"Latitude: ","1"
"Longitude: ","1"
"ClimPACT2_version: ","1.2.7"
"Date_of_calculation: ","2020-01-30"
time, tx90p, normalised (all years)
1970-01, 0, -0.728044298604929
1970-02, 10.7142857142857, 0.16310537245557
1970-03, 38.7096774193548, 2.49159322264591
1970-04, 0, -0.728044298604929
1970-05, 0, -0.728044298604929
1970-06, 3.33333333333333, -0.450797734274996
1970-07, 0, -0.728044298604929
1970-08, 0, -0.728044298604929
1970-09, 6.66666666666667, -0.173551169945062
1970-10, 0, -0.728044298604929
1970-11, 0, -0.728044298604929
1970-12, 16.1290322580645, 0.613471335249586
1971-01, 0, -0.728044298604929
1971-02, 0, -0.728044298604929
1971-03, 3.2258064516129, -0.459741171834026
1971-04, 0, -0.728044298604929
1971-05, 0, -0.728044298604929
1971-06, 0, -0.728044298604929
1971-07, 0, -0.728044298604929
1971-08, 0, -0.728044298604929
1971-09, 0, -0.728044298604929
1971-10, 0, -0.728044298604929
1971-11, 0, -0.728044298604929
1971-12, 0, -0.728044298604929
1972-01, 0, -0.728044298604929
1972-02, 0, -0.728044298604929
1972-03, 0, -0.728044298604929
1972-04, 0, -0.728044298604929
1972-05, 2.55839822024472, -0.515252163579729
1972-06, 8.39080459770115, -0.0301477746019931
1972-07, 16.0177975528365, 0.604219503291972
1972-08, 3.2258064516129, -0.459741171834026
1972-09, 16.2068965517241, 0.619947617619917
1972-10, 0, -0.728044298604929
1972-11, 0, -0.728044298604929
1972-12, 9.67741935483871, 0.076865081707781
1973-01, 0, -0.728044298604929
1973-02, 2.95566502463054, -0.482209906588239
1973-03, 12.0133481646274, 0.271153552817748
1973-04, 0, -0.728044298604929
1973-05, 0, -0.728044298604929
1973-06, 0, -0.728044298604929
1973-07, 0, -0.728044298604929
1973-08, 0, -0.728044298604929
1973-09, 0, -0.728044298604929
1973-10, 16.1290322580645, 0.613471335249586
1973-11, 6.66666666666667, -0.173551169945062
1973-12, 6.45161290322581, -0.191438045063122
1974-01, 0, -0.728044298604929
1974-02, 0, -0.728044298604929
1974-03, 0, -0.728044298604929
1974-04, 0, -0.728044298604929
1974-05, 0, -0.728044298604929
1974-06, 0, -0.728044298604929
1974-07, 6.11790878754171, -0.219193540935975
1974-08, 0, -0.728044298604929
1974-09, 0, -0.728044298604929
1974-10, 3.2258064516129, -0.459741171834026
1974-11, 1.37931034482759, -0.613321582330474
1974-12, 3.2258064516129, -0.459741171834026
1975-01, 0, -0.728044298604929
1975-02, 0, -0.728044298604929
1975-03, 0, -0.728044298604929
1975-04, 3.33333333333333, -0.450797734274996
1975-05, 0, -0.728044298604929
1975-06, 0, -0.728044298604929
1975-07, 3.11457174638487, -0.468993003791643
1975-08, 0, -0.728044298604929
1975-09, 0, -0.728044298604929
1975-10, 12.9032258064516, 0.345168208478683
1975-11, 2.75862068965517, -0.498598866056019
1975-12, 15.7953281423804, 0.585715839376734
1976-01, 0, -0.728044298604929
1976-02, 0, -0.728044298604929
1976-03, 0, -0.728044298604929
1976-04, 0, -0.728044298604929
1976-05, 3.2258064516129, -0.459741171834026
1976-06, 0, -0.728044298604929
1976-07, 12.9032258064516, 0.345168208478683
1976-08, 0, -0.728044298604929
1976-09, 3.33333333333333, -0.450797734274996
1976-10, 2.11345939933259, -0.552259491410199
1976-11, 0, -0.728044298604929
1976-12, 25.8064516129032, 1.4183807155623
1977-01, 5.56173526140156, -0.265452700724061
1977-02, 0, -0.728044298604929
1977-03, 0, -0.728044298604929
1977-04, 0, -0.728044298604929
1977-05, 0, -0.728044298604929
1977-06, 0, -0.728044298604929
1977-07, 0, -0.728044298604929
1977-08, 0, -0.728044298604929
1977-09, 0, -0.728044298604929
1977-10, 3.2258064516129, -0.459741171834026
1977-11, 0, -0.728044298604929
1977-12, 0, -0.728044298604929
1978-01, 0, -0.728044298604929
1978-02, 0, -0.728044298604929
1978-03, 0, -0.728044298604929
1978-04, 14.0229885057471, 0.43830331685203
1978-05, 22.1357063403782, 1.11307026096092
1978-06, 44.367816091954, 2.96220307489004
1978-07, 6.22914349276974, -0.209941708978357
1978-08, 0, -0.728044298604929
1978-09, 10, 0.103695394384871
1978-10, 15.6840934371524, 0.576464007419119
1978-11, 25.9770114942529, 1.43256685789731
1978-12, 28.476084538376, 1.64042468254512
1979-01, 14.7942157953281, 0.502449351758176
1979-02, 6.40394088669951, -0.195403115902101
1979-03, 5.33926585094549, -0.283956364639296
1979-04, 6.66666666666667, -0.173551169945062
1979-05, 9.01001112347052, 0.0213540899620766
1979-06, 2.75862068965517, -0.498598866056019
1979-07, 12.9032258064516, 0.345168208478683
1979-08, 8.78754171301446, 0.00285042604684213
1979-09, 25.9770114942529, 1.43256685789731
1979-10, 0, -0.728044298604929
1979-11, 9.08045977011494, 0.0272135835352343
1979-12, 18.020022246941, 0.770752478529079
1980-01, 0, -0.728044298604929
1980-02, 3.44827586206897, -0.441237507918791
1980-03, 16.1290322580645, 0.613471335249586
1980-04, 22.2988505747126, 1.12663961449876
1980-05, 45.0500556173526, 3.0189476442301
1980-06, 9.31034482758621, 0.0463340362476439
1980-07, 11.3459399332592, 0.215642561072043
1980-08, 12.9032258064516, 0.345168208478683
1980-09, 3.2183908045977, -0.4603579606312
1980-10, 18.1312569521691, 0.780004310486702
1980-11, 13.3333333333333, 0.380941958714802
1980-12, 8.78754171301446, 0.00285042604684213
1981-01, 0, -0.728044298604929
1981-02, 5.04926108374384, -0.308077212243084
1981-03, 2.55839822024472, -0.515252163579729
1981-04, 10, 0.103695394384871
1981-05, 0, -0.728044298604929
1981-06, 0, -0.728044298604929
1981-07, 3.2258064516129, -0.459741171834026
1981-08, 9.67741935483871, 0.076865081707781
1981-09, 25.1724137931034, 1.36564527340387
1981-10, 28.0311457174639, 1.60341735471465
1981-11, 24.9425287356322, 1.34652482069147
1981-12, 3.2258064516129, -0.459741171834026
1982-01, 0, -0.728044298604929
1982-02, 6.89655172413793, -0.154430717232653
1982-03, 22.3581757508343, 1.13157392487616
1982-04, 0, -0.728044298604929
1982-05, 0, -0.728044298604929
1982-06, 0, -0.728044298604929
1982-07, 16.1290322580645, 0.613471335249586
1982-08, 9.67741935483871, 0.076865081707781
1982-09, 9.54022988505747, 0.0654544889600527
1982-10, 16.0177975528365, 0.604219503291972
1982-11, 27.0114942528736, 1.51860889510316
1982-12, 0, -0.728044298604929
1983-01, 3.11457174638487, -0.468993003791643
1983-02, 6.77339901477833, -0.164673816900015
1983-03, 20.8008898776418, 1.00204827746951
1983-04, 66.4367816091954, 4.79776653528133
1983-05, 35.1501668520578, 2.19553460000215
1983-06, 21.9540229885057, 1.09795893543015
1983-07, 37.9310344827586, 2.42683039894259
1983-08, 12.9032258064516, 0.345168208478683
1983-09, 22.7586206896552, 1.16488051992358
1983-10, 5.45050055617353, -0.274704532681678
1983-11, 0, -0.728044298604929
1983-12, 0, -0.728044298604929
1984-01, 0, -0.728044298604929
1984-02, 44.8275862068966, 3.00044398031487
1984-03, 10.789766407119, 0.169383401283953
1984-04, 6.32183908045977, -0.202231849013676
1984-05, 3.2258064516129, -0.459741171834026
1984-06, 2.18390804597701, -0.546399997837042
1984-07, 9.67741935483871, 0.076865081707781
1984-08, 15.2391546162403, 0.539456679588652
1984-09, 13.1034482758621, 0.361821506002398
1984-10, 0, -0.728044298604929
1984-11, 33.2183908045977, 2.0348611183382
1984-12, 3.33704115684093, -0.450489339876409
1985-01, 21.6907675194661, 1.07606293313046
1985-02, 27.9556650246305, 1.59713932588626
1985-03, 16.1290322580645, 0.613471335249586
1985-04, 19.3103448275862, 0.878073729237443
1985-05, 9.56618464961068, 0.0676132497501637
1985-06, 0, -0.728044298604929
1985-07, 3.2258064516129, -0.459741171834026
1985-08, 12.9032258064516, 0.345168208478683
1985-09, 29.5402298850575, 1.72893387493966
1985-10, 14.5717463848721, 0.483945687842946
1985-11, 0, -0.728044298604929
1985-12, 3.2258064516129, -0.459741171834026
1986-01, -99.9, -99.9
1986-02, 3.44827586206897, -0.441237507918791
1986-03, 15.9065628476085, 0.594967671334357
1986-04, 3.33333333333333, -0.450797734274996
1986-05, -99.9, -99.9
1986-06, 18.9655172413793, 0.849393050168829
1986-07, -99.9, -99.9
1986-08, 25.4727474972191, 1.39062521968944
1986-09, 23.2183908045977, 1.2031214253484
1986-10, 9.67741935483871, 0.076865081707781
1986-11, -99.9, -99.9
1986-12, 6.89655172413793, -0.154430717232653
1987-01, 2.55839822024472, -0.515252163579729
1987-02, 3.44827586206897, -0.441237507918791
1987-03, -99.9, -99.9
1987-04, 16.551724137931, 0.648628296688531
1987-05, -99.9, -99.9
1987-06, 20.9195402298851, 1.01191689822431
1987-07, 15.7953281423804, 0.585715839376734
1987-08, 44.2714126807564, 2.95418482052678
1987-09, 30, 1.76717478036447
1987-10, 31.2569521690768, 1.87172048148555
1987-11, 35.9770114942529, 2.26430655088711
1987-12, -99.9, -99.9
1988-01, -99.9, -99.9
1988-02, -99.9, -99.9
1988-03, -99.9, -99.9
1988-04, -99.9, -99.9
1988-05, 0, -0.728044298604929
1988-06, -99.9, -99.9
1988-07, -99.9, -99.9
1988-08, 3.2258064516129, -0.459741171834026
1988-09, -99.9, -99.9
1988-10, 0, -0.728044298604929
1988-11, -99.9, -99.9
1988-12, -99.9, -99.9
1989-01, -99.9, -99.9
1989-02, -99.9, -99.9
1989-03, -99.9, -99.9
1989-04, -99.9, -99.9
1989-05, -99.9, -99.9
1989-06, -99.9, -99.9
1989-07, -99.9, -99.9
1989-08, -99.9, -99.9
1989-09, -99.9, -99.9
1989-10, -99.9, -99.9
1989-11, -99.9, -99.9
1989-12, -99.9, -99.9
1990-01, -99.9, -99.9
1990-02, -99.9, -99.9
1990-03, -99.9, -99.9
1990-04, -99.9, -99.9
1990-05, -99.9, -99.9
1990-06, -99.9, -99.9
1990-07, -99.9, -99.9
1990-08, -99.9, -99.9
1990-09, -99.9, -99.9
1990-10, -99.9, -99.9
1990-11, -99.9, -99.9
1990-12, -99.9, -99.9
1991-01, -99.9, -99.9
1991-02, -99.9, -99.9
1991-03, -99.9, -99.9
1991-04, -99.9, -99.9
1991-05, -99.9, -99.9
1991-06, -99.9, -99.9
1991-07, -99.9, -99.9
1991-08, -99.9, -99.9
1991-09, -99.9, -99.9
1991-10, -99.9, -99.9
1991-11, -99.9, -99.9
1991-12, -99.9, -99.9
1992-01, -99.9, -99.9
1992-02, -99.9, -99.9
1992-03, -99.9, -99.9
1992-04, -99.9, -99.9
1992-05, -99.9, -99.9
1992-06, -99.9, -99.9
1992-07, -99.9, -99.9
1992-08, -99.9, -99.9
1992-09, -99.9, -99.9
1992-10, -99.9, -99.9
1992-11, -99.9, -99.9
1992-12, -99.9, -99.9
1993-01, 0, -0.728044298604929
1993-02, 0, -0.728044298604929
1993-03, 2.44716351501669, -0.524503995537347
1993-04, -99.9, -99.9
1993-05, -99.9, -99.9
1993-06, -99.9, -99.9
1993-07, -99.9, -99.9
1993-08, -99.9, -99.9
1993-09, -99.9, -99.9
1993-10, -99.9, -99.9
1993-11, -99.9, -99.9
1993-12, -99.9, -99.9
1994-01, -99.9, -99.9
1994-02, -99.9, -99.9
1994-03, -99.9, -99.9
1994-04, -99.9, -99.9
1994-05, -99.9, -99.9
1994-06, 0, -0.728044298604929
1994-07, -99.9, -99.9
1994-08, -99.9, -99.9
1994-09, -99.9, -99.9
1994-10, -99.9, -99.9
1994-11, -99.9, -99.9
1994-12, -99.9, -99.9
1995-01, -99.9, -99.9
1995-02, -99.9, -99.9
1995-03, -99.9, -99.9
1995-04, -99.9, -99.9
1995-05, -99.9, -99.9
1995-06, -99.9, -99.9
1995-07, 3.2258064516129, -0.459741171834026
1995-08, 0, -0.728044298604929
1995-09, -99.9, -99.9
1995-10, -99.9, -99.9
1995-11, -99.9, -99.9
1995-12, -99.9, -99.9
1996-01, -99.9, -99.9
1996-02, -99.9, -99.9
1996-03, -99.9, -99.9
1996-04, -99.9, -99.9
1996-05, -99.9, -99.9
1996-06, -99.9, -99.9
1996-07, -99.9, -99.9
1996-08, -99.9, -99.9
1996-09, 3.33333333333333, -0.450797734274996
1996-10, -99.9, -99.9
1996-11, -99.9, -99.9
1996-12, -99.9, -99.9
1997-01, -99.9, -99.9
1997-02, -99.9, -99.9
1997-03, -99.9, -99.9
1997-04, -99.9, -99.9
1997-05, -99.9, -99.9
1997-06, -99.9, -99.9
1997-07, -99.9, -99.9
1997-08, -99.9, -99.9
1997-09, -99.9, -99.9
1997-10, -99.9, -99.9
1997-11, -99.9, -99.9
1997-12, -99.9, -99.9
1998-01, -99.9, -99.9
1998-02, -99.9, -99.9
1998-03, -99.9, -99.9
1998-04, -99.9, -99.9
1998-05, -99.9, -99.9
1998-06, -99.9, -99.9
1998-07, -99.9, -99.9
1998-08, -99.9, -99.9
1998-09, 34.9425287356322, 2.17826451368127
1998-10, 43.2703003337041, 2.87091833290822
1998-11, -99.9, -99.9
1998-12, 59.7330367074527, 4.24018946263559
1999-01, -99.9, -99.9
1999-02, 25, 1.35130493386957
1999-03, -99.9, -99.9
1999-04, 0, -0.728044298604929
1999-05, -99.9, -99.9
1999-06, 3.33333333333333, -0.450797734274996
1999-07, 6.45161290322581, -0.191438045063122
1999-08, 12.5695216907675, 0.317412712605831
1999-09, 0, -0.728044298604929
1999-10, -99.9, -99.9
1999-11, -99.9, -99.9
1999-12, -99.9, -99.9
2000-01, -99.9, -99.9
2000-02, -99.9, -99.9
2000-03, -99.9, -99.9
2000-04, -99.9, -99.9
2000-05, -99.9, -99.9
2000-06, -99.9, -99.9
2000-07, -99.9, -99.9
2000-08, -99.9, -99.9
2000-09, -99.9, -99.9
2000-10, -99.9, -99.9
2000-11, -99.9, -99.9
2000-12, -99.9, -99.9
2001-01, -99.9, -99.9
2001-02, -99.9, -99.9
2001-03, -99.9, -99.9
2001-04, -99.9, -99.9
2001-05, -99.9, -99.9
2001-06, -99.9, -99.9
2001-07, -99.9, -99.9
2001-08, -99.9, -99.9
2001-09, -99.9, -99.9
2001-10, -99.9, -99.9
2001-11, -99.9, -99.9
2001-12, -99.9, -99.9
2002-01, -99.9, -99.9
2002-02, -99.9, -99.9
2002-03, -99.9, -99.9
2002-04, -99.9, -99.9
2002-05, -99.9, -99.9
2002-06, -99.9, -99.9
2002-07, -99.9, -99.9
2002-08, -99.9, -99.9
2002-09, -99.9, -99.9
2002-10, -99.9, -99.9
2002-11, -99.9, -99.9
2002-12, -99.9, -99.9
2003-01, -99.9, -99.9
2003-02, -99.9, -99.9
2003-03, -99.9, -99.9
2003-04, -99.9, -99.9
2003-05, -99.9, -99.9
2003-06, -99.9, -99.9
2003-07, -99.9, -99.9
2003-08, -99.9, -99.9
2003-09, -99.9, -99.9
2003-10, -99.9, -99.9
2003-11, -99.9, -99.9
2003-12, -99.9, -99.9
2004-01, -99.9, -99.9
2004-02, -99.9, -99.9
2004-03, -99.9, -99.9
2004-04, -99.9, -99.9
2004-05, -99.9, -99.9
2004-06, -99.9, -99.9
2004-07, -99.9, -99.9
2004-08, -99.9, -99.9
2004-09, -99.9, -99.9
2004-10, -99.9, -99.9
2004-11, -99.9, -99.9
2004-12, -99.9, -99.9
2005-01, -99.9, -99.9
2005-02, -99.9, -99.9
2005-03, -99.9, -99.9
2005-04, -99.9, -99.9
2005-05, -99.9, -99.9
2005-06, -99.9, -99.9
2005-07, -99.9, -99.9
2005-08, -99.9, -99.9
2005-09, -99.9, -99.9
2005-10, -99.9, -99.9
2005-11, -99.9, -99.9
2005-12, -99.9, -99.9
