"Description: ","Annual number of days when TN < 0 degrees_C"
"Station: ","model_biascorrected"
"Latitude: ","1"
"Longitude: ","1"
"ClimPACT2_version: ","1.2.7"
"Date_of_calculation: ","2020-01-30"
time, fd, normalised (all years)
1970, 0, NaN
1971, 0, NaN
1972, 0, NaN
1973, 0, NaN
1974, 0, NaN
1975, 0, NaN
1976, 0, NaN
1977, 0, NaN
1978, 0, NaN
1979, 0, NaN
1980, 0, NaN
1981, 0, NaN
1982, 0, NaN
1983, 0, NaN
1984, 0, NaN
1985, 0, NaN
1986, 0, NaN
1987, 0, NaN
1988, 0, NaN
1989, 0, NaN
1990, 0, NaN
1991, 0, NaN
1992, 0, NaN
1993, 0, NaN
1994, 0, NaN
1995, 0, NaN
1996, 0, NaN
1997, 0, NaN
1998, 0, NaN
1999, 0, NaN
2000, 0, NaN
2001, 0, NaN
2002, 0, NaN
2003, 0, NaN
2004, 0, NaN
2005, 0, NaN
