"Description: ","Annual percentage of days when TX > 90th percentile"
"Station: ","model"
"Latitude: ","1"
"Longitude: ","1"
"ClimPACT2_version: ","1.2.7"
"Date_of_calculation: ","2020-01-30"
time, tx90p, normalised (all years)
1970, 26.027397260274, 2.86196266359766
1971, 17.5059045819556, 1.150959662093
1972, 4.48464292443942, -1.46353742432404
1973, 9.74964572508267, -0.406394511116881
1974, 8.67264997638167, -0.622641010198402
1975, 9.02220122815305, -0.552455742952645
1976, 11.4565667985679, -0.0636673399141589
1977, 7.51062824752008, -0.855959601312671
1978, 9.32451582427964, -0.49175497128064
1979, 9.29617383089277, -0.497445668624891
1980, 13.256076879593, 0.297650479170023
1981, 14.8606518658479, 0.619827909962958
1982, 8.75767595654228, -0.605568918165649
1983, 4.9881908360888, -1.36243166495097
1984, 6.86828716789146, -0.984933192762285
1985, 4.77090222012282, -1.40606034459022
1986, 9.91025035427492, -0.374147226166129
1987, 8.39867737364195, -0.677651084526156
1988, 11.3340870548332, -0.0882596522078483
1989, 10.8644307982995, -0.182560415576359
1990, 11.7997165800661, 0.00523259678389722
1991, 12.1492678318375, 0.0754178640296585
1992, 10.2035048049746, -0.315265611841869
1993, 15.918752952291, 0.83228061081498
1994, 12.03589985829, 0.0526550746526509
1995, 14.5488899385923, 0.557230239176192
1996, 5.31373657433578, -1.29706638725908
1997, 19.5370807746812, 1.5587929717643
1998, 13.1412376003779, 0.274592271078429
1999, 13.7364194615021, 0.394096915307682
2000, 9.52515545505936, -0.451469187622297
2001, 18.3561643835616, 1.32168058242051
2002, 22.1917808219178, 2.09182162300908
2003, 10.6849315068493, -0.218601498756619
2004, 7.92349726775956, -0.773060963770517
2005, 19.7260273972603, 1.5967309540593
