"Description: ","Maximum 3-day precipitation total"
"Station: ","model_biascorrected"
"Latitude: ","1"
"Longitude: ","1"
"ClimPACT2_version: ","1.2.7"
"Date_of_calculation: ","2020-01-30"
time, rx3day, normalised (all years)
1970-01, 3.40827949707865, -0.582068591055692
1970-02, 13.7866285527073, -0.420309103513814
1970-03, 15.5287147328943, -0.393156522091626
1970-04, 16.8275175979248, -0.372913062872907
1970-05, 17.8779438194434, -0.356540862787649
1970-06, 21.18100821059, -0.305058493061423
1970-07, 25.0187723204078, -0.245242162700666
1970-08, 24.196024688775, -0.258065708580252
1970-09, 42.8501455191928, 0.0326819825890034
1970-10, 29.0014228056075, -0.18316759784539
1970-11, 6.54403462141519, -0.533193944495755
1970-12, 10.9095990986956, -0.465151188476395
1971-01, 10.20414043761, -0.476146639765181
1971-02, 19.6045064594109, -0.329630235061303
1971-03, 11.7771925131847, -0.451628665253267
1971-04, 40.7941388590118, 0.000636559762027455
1971-05, 48.8525810707281, 0.126237411647627
1971-06, 86.9852952009988, 0.720583223609709
1971-07, 17.1897335363795, -0.367267476636611
1971-08, 21.7829766035457, -0.295676066411578
1971-09, 46.8310711665903, 0.0947296637002966
1971-10, 23.3422299767031, -0.271373161851523
1971-11, 31.4696657005061, -0.144696960206628
1971-12, 16.1789785843106, -0.383021350610276
1972-01, 22.0072055178272, -0.292181179693871
1972-02, 17.5588488260429, -0.361514355424385
1972-03, 17.5260769078017, -0.362025146560051
1972-04, 28.640931704955, -0.188786300337703
1972-05, 44.5404865653148, 0.059028051691719
1972-06, 62.1062347425663, 0.332812100408104
1972-07, 36.1922716028347, -0.0710892691829179
1972-08, 31.6887201013811, -0.141282724720867
1972-09, 60.0347045421658, 0.300524723885286
1972-10, 58.0511410696757, 0.269608418305569
1972-11, 21.441458718717, -0.300999047720086
1972-12, 30.7831802552443, -0.155396690311608
1973-01, 9.04332459675271, -0.494239399465312
1973-02, 31.9543451229145, -0.137142628147584
1973-03, 4.62256530980302, -0.563142435292108
1973-04, 41.4513020616367, 0.0108792662193065
1973-05, 27.9285736926607, -0.199889286602419
1973-06, 53.8356374811837, 0.203904548012674
1973-07, 27.5836061322276, -0.205266035398892
1973-08, 39.7626858533169, -0.0154399191394263
1973-09, 40.5319635130826, -0.00344976932329287
1973-10, 18.7248391803066, -0.343340944492308
1973-11, 21.358666504213, -0.30228946743124
1973-12, 23.9786951257021, -0.261453060322031
1974-01, 10.819907532983, -0.466549143163477
1974-02, 6.36982600339648, -0.535909202637974
1974-03, 46.5568219560461, 0.0904551484071022
1974-04, 22.015829706838, -0.29204676097396
1974-05, 87.7252506181277, 0.732116349778142
1974-06, 77.7298155545797, 0.576325053400348
1974-07, 12.1463078028481, -0.445875544041041
1974-08, 9.55560142399581, -0.48625492750255
1974-09, 119.472615204782, 1.22693854151751
1974-10, 70.5562151353742, 0.464515562177701
1974-11, 14.7542625597221, -0.405227323139707
1974-12, 12.5757924155873, -0.439181491789432
1975-01, 3.86018700124595, -0.575025050132313
1975-02, 3.64113260037096, -0.578439285618073
1975-03, 52.1452964350617, 0.177558478909958
1975-04, 13.4951309641414, -0.424852456246832
1975-05, 43.196837917428, 0.0380856151294579
1975-06, 168.770204428469, 1.99530282827743
1975-07, 21.9985813288164, -0.292315598413782
1975-08, 23.0559069015437, -0.275835863352595
1975-09, 54.3323907682073, 0.211647066279594
1975-10, 22.6350464778154, -0.28239549688429
1975-11, 21.8881917094778, -0.294036158028654
1975-12, 12.530946632731, -0.439880469132973
1976-01, 31.6611226965464, -0.141712864624586
1976-02, 7.20119782404017, -0.522951238038475
1976-03, 28.8065161339629, -0.186205460915395
1976-04, 25.844969627645, -0.232364849333114
1976-05, 29.2135778552739, -0.179860897335558
1976-06, 21.8933662228843, -0.293955506796707
1976-07, 20.513495981152, -0.315462501982598
1976-08, 36.914978641942, -0.0598249804543073
1976-09, 96.1338349036836, 0.863174601692162
1976-10, 183.590010824673, 2.22628795657389
1976-11, 14.0488038986365, -0.416222774428493
1976-12, 22.7126641789128, -0.281185728405085
1977-01, 24.1511789059187, -0.258764685923794
1977-02, 78.8923562332392, 0.594444696844462
1977-03, 75.2150020390227, 0.537128554674063
1977-04, 8.09983831896832, -0.508944807423664
1977-05, 75.7359030552767, 0.545247445356738
1977-06, 67.9810322967414, 0.424378132412033
1977-07, 33.2496983123407, -0.116952936416829
1977-08, 33.565343630137, -0.112033211268056
1977-09, 154.588588019066, 1.77426468525444
1977-10, 15.5097415170705, -0.393452243275432
1977-11, 26.960939685646, -0.214971066976524
1977-12, 6.73204194185125, -0.530263616401677
1978-01, 3.63250841136019, -0.578573704337983
1978-02, 1.44023956480808, -0.612742942939567
1978-03, 4.78470006320661, -0.560615363357765
1978-04, 21.4345593675084, -0.301106582696014
1978-05, 33.2238257453082, -0.117356192576565
1978-06, 53.9253290468963, 0.205302502699757
1978-07, 108.228397572467, 1.0516834144965
1978-08, 38.4242117188367, -0.0363017044697388
1978-09, 51.3777436130981, 0.165595212837806
1978-10, 46.5188755243985, 0.0898637060394908
1978-11, 13.6106950968865, -0.423051245400014
1978-12, 2.05255698457675, -0.603199213825828
1979-01, 6.94074731591324, -0.527010683379811
1979-02, 6.67167261877545, -0.53120454744106
1979-03, 9.05367362356574, -0.494078097001417
1979-04, 30.5106558825022, -0.159644321860821
1979-05, 43.8315782286249, 0.0479788329149685
1979-06, 33.9189353795809, -0.106522043751671
1979-07, 53.5993347022871, 0.200221475087091
1979-08, 39.23143581025, -0.0237201122859939
1979-09, 569.979551076736, 8.24864986478295
1979-10, 28.4598237357277, -0.19160909345585
1979-11, 17.1103909974799, -0.368504128859799
1979-12, 6.69582034800577, -0.530828175025307
1980-01, 6.92349893789159, -0.527279520819635
1980-02, 2.93222426368106, -0.589488504394823
1980-03, 13.6555408797428, -0.422352268056472
1980-04, 42.2481771262372, 0.0232995559391601
1980-05, 427.294068730412, 6.02471902758594
1980-06, 47.3433479938334, 0.102714135663058
1980-07, 18.3315761614129, -0.349470438120287
1980-08, 20.4307037666481, -0.316752921693751
1980-09, 65.3385807838241, 0.383192236631052
1980-10, 17.8693196304326, -0.35667528150756
1980-11, 14.0781261412733, -0.415765750780793
1980-12, 7.77039429875473, -0.514079602524295
1981-01, 2.99776810016332, -0.588466922123494
1981-02, 1.08837265316632, -0.61822722671197
1981-03, 11.3270098468196, -0.458645322432663
1981-04, 38.8191995755325, -0.0301453270977785
1981-05, 32.2009969286242, -0.133298252758105
1981-06, 54.9930036464366, 0.221943540224839
1981-07, 54.4514045765567, 0.213502044614377
1981-08, 54.1650815013973, 0.209039343113306
1981-09, 58.0563155830822, 0.269689069537516
1981-10, 32.7857169435582, -0.124184663548085
1981-11, 48.4230964579889, 0.119543359396018
1981-12, 26.0191782456637, -0.229649591190895
1982-01, 6.61475297130397, -0.532091710992479
1982-02, 3.12713093532571, -0.586450641324817
1982-03, 14.2885563531374, -0.412485934014946
1982-04, 22.7557851239669, -0.280513634805526
1982-05, 83.6184118111721, 0.668106155356136
1982-06, 40.71307148231, -0.000626976205144129
1982-07, 25.5827942817159, -0.236451178418432
1982-08, 28.1269300399097, -0.196797656044447
1982-09, 70.961552018883, 0.470833242013555
1982-10, 12.5395708217418, -0.439746050413062
1982-11, 8.84151857389938, -0.497384797511248
1982-12, 28.0527620144166, -0.197953657035689
1983-01, 122.515229087802, 1.2743614659024
1983-02, 11.216620227481, -0.460365882047534
1983-03, 9.11059327103717, -0.493190933449999
1983-04, 231.312823134983, 2.97010738507791
1983-05, 56.3521758345428, 0.24312793048294
1983-06, 32.3062120345563, -0.131658344375181
1983-07, 34.2087081303446, -0.102005574762635
1983-08, 23.6354524030712, -0.266802925374521
1983-09, 51.074172159917, 0.16086367389691
1983-10, 17.5847213930753, -0.361111099264651
1983-11, 34.3984402885828, -0.0990483629245751
1983-12, 71.1685325551429, 0.47405929129144
1984-01, 6.95799569393485, -0.526741845939989
1984-02, 2.93739877708751, -0.589407853162877
1984-03, 3.64630711377746, -0.578358634386125
1984-04, 12.8034710054731, -0.43563283758376
1984-05, 35.4609403747166, -0.0824879766314399
1984-06, 57.8131134529769, 0.265898461636003
1984-07, 17.8382725499936, -0.357159188899243
1984-08, 32.2786146297216, -0.1320884842789
1984-09, 39.6298733425502, -0.0175099674260679
1984-10, 17.3277205605527, -0.365116777118022
1984-11, 88.4600315218501, 0.743568824714628
1984-12, 4.33624223464359, -0.56760513679318
1985-01, 11.9910724006532, -0.448295080999454
1985-02, 54.7791237589681, 0.218609955971026
1985-03, 8.68455833390233, -0.499831218213643
1985-04, 36.4389234085443, -0.0672448937934406
1985-05, 29.6982572776823, -0.172306565276515
1985-06, 15.0716327153205, -0.400280714246952
1985-07, 34.4484605848456, -0.0982687343490865
1985-08, 53.2164207102063, 0.194253283923005
1985-09, 52.0521551937447, 0.17610675673491
1985-10, 60.9885398467632, 0.315391434307533
1985-11, 23.2180416549472, -0.273308791418253
1985-12, 18.9870145262357, -0.339254615406989
1986-01, 74.2525425454144, 0.522127425531904
1986-02, 41.9152834304192, 0.0181109933505626
1986-03, 2.8735797784074, -0.590402551690224
1986-04, 29.0341947238487, -0.182656806709724
1986-05, 15.0474849860902, -0.400657086662705
1986-06, 52.1728938398963, 0.177988618813675
1986-07, 43.2761804563276, 0.0393222673526465
1986-08, 46.5188755243984, 0.0898637060394893
1986-09, 36.0128884714095, -0.0738851785570838
1986-10, 122.968861429771, 1.28143189056976
1986-11, 37.7153033821467, -0.0473509232464909
1986-12, 11.7530447839544, -0.45200503766902
1987-01, 8.26542274797617, -0.506363968001357
1987-02, 53.620032755913, 0.200544080014878
1987-03, 66.1216571460072, 0.395397456399045
1987-04, 32.7701934033387, -0.124426617243926
1987-05, 43.3555229952272, 0.0405589195758351
1987-06, 54.8964127295153, 0.220438050561826
1987-07, 53.6493549985498, 0.201001103662578
1987-08, 29.6447873058152, -0.173139961339968
1987-09, 231.980335364421, 2.98051139399909
1987-10, 18.2815558651501, -0.350250066695776
1987-11, 18.3591735662476, -0.349040298216568
1987-12, 14.6197252111532, -0.407324255170331
1988-01, 9.17441226971728, -0.492196234922652
1988-02, 10.7181421026552, -0.468135284058438
1988-03, 15.3510564392713, -0.395925547721809
1988-04, 12.1083613712005, -0.446466986408652
1988-05, 70.5820877024067, 0.464918818337436
1988-06, 37.9205590806044, -0.0441517577125893
1988-07, 47.9073699551415, 0.111505119945292
1988-08, 18.5954763451442, -0.345357225290985
1988-09, 42.3154458005216, 0.0243480219544716
1988-10, 57.397427542655, 0.259419479336253
1988-11, 24.0735612048212, -0.259974454403001
1988-12, 16.9586052708893, -0.370869898330248
1989-01, 46.1894315041849, 0.0847289109388591
1989-02, 1.16944002986808, -0.616963690744799
1989-03, 34.7882536318722, -0.0929726367845604
1989-04, 28.3787563590259, -0.192872629423021
1989-05, 142.661334617093, 1.58836359561641
1989-06, 31.1747184363358, -0.149294080427612
1989-07, 40.3077345988011, -0.00694465604100027
1989-08, 32.7512201875149, -0.124722338427732
1989-09, 41.2581202277942, 0.00786828689328202
1989-10, 38.532876500373, -0.0346080285988517
1989-11, 18.0763001666925, -0.353449232229676
1989-12, 21.9399368435427, -0.293229645709184
1990-01, 1.7852071252411, -0.607366194143095
1990-02, 8.11536185918779, -0.508702853727823
1990-03, 8.34131561127144, -0.505181083266133
1990-04, 9.44003729125074, -0.488056138349368
1990-05, 29.0807653445071, -0.181930945622201
1990-06, 71.9498840795238, 0.48623762731545
1990-07, 29.1583830456046, -0.180721177142994
1990-08, 20.763597462466, -0.311564359105155
1990-09, 24.9670271863429, -0.246048675020136
1990-10, 20.4876234141196, -0.315865758142332
1990-11, 9.35034572553815, -0.489454093036451
1990-12, 18.0676759776816, -0.353583650949589
1991-01, 3.39275595685917, -0.582310544751533
1991-02, 12.1842542344958, -0.445284101673428
1991-03, 7.15117752777738, -0.523730866613964
1991-04, 3.88950924388278, -0.574568026484612
1991-05, 59.4620583918469, 0.291599320883141
1991-06, 43.2537575648995, 0.0389727786808766
1991-07, 36.9270525065571, -0.0596367942464317
1991-08, 39.9782905785876, -0.0120794511416305
1991-09, 73.5626074245483, 0.511373927938959
1991-10, 23.5319621349413, -0.268415950013463
1991-11, 23.1249004136303, -0.2747605135933
1991-12, 23.1869945745083, -0.273792698809934
1992-01, 48.0436321415126, 0.113628935719899
1992-02, 2.5907063788523, -0.594811485703331
1992-03, 15.7098227021216, -0.390333728973479
1992-04, 4.61394112079221, -0.56327685401202
1992-05, 67.6205411960888, 0.418759429919718
1992-06, 52.1953167313245, 0.178338107485447
1992-07, 25.0946651837031, -0.244059277965441
1992-08, 40.0386599016634, -0.0111385201022475
1992-09, 60.7211899874276, 0.311224453990267
1992-10, 83.6080627843591, 0.667944852892242
1992-11, 19.6855738361127, -0.328366699094132
1992-12, 8.72940411675864, -0.499132240870102
1993-01, 23.4715928118656, -0.269356881052844
1993-02, 5.40391683418392, -0.550964099268098
1993-03, 16.4808251996895, -0.378316695413363
1993-04, 43.0226292994093, 0.0353703569872392
1993-05, 51.4277639093609, 0.166374841413295
1993-06, 58.0804633123125, 0.270065441953269
1993-07, 26.5383544241155, -0.221557584252203
1993-08, 20.7187516796097, -0.312263336448696
1993-09, 125.661333238952, 1.32339741492624
1993-10, 27.3300549753094, -0.209217945764298
1993-11, 124.071032785355, 1.29861060297449
1993-12, 17.581271717471, -0.361164866752615
1994-01, 2.98914391115248, -0.588601340843406
1994-02, 41.4651007640541, 0.0110943361711665
1994-03, 7.26156714711596, -0.522010306999092
1994-04, 35.7696863413042, -0.0776757864585968
1994-05, 69.3919496189126, 0.446369034989605
1994-06, 39.2383351614586, -0.0236125773100654
1994-07, 35.0452544643948, -0.0889669589311888
1994-08, 27.1748195731145, -0.211637482722711
1994-09, 114.320524689715, 1.1466367982422
1994-10, 69.7731387731911, 0.452310342409707
1994-11, 8.38443655632557, -0.504508989666574
1994-12, 10.8337062354003, -0.466334073211619
1995-01, 19.281961790406, -0.334657495186005
1995-02, 32.1596008213722, -0.133943462613683
1995-03, 4.38971220651071, -0.566771740729727
1995-04, 43.6728931508257, 0.0455055284685912
1995-05, 52.5264855893402, 0.18349978633006
1995-06, 27.9647952865062, -0.199324727978789
1995-07, 8.15158345303325, -0.508138295104193
1995-08, 35.4885377795513, -0.0820578367277213
1995-09, 42.403412528432, 0.0257190928975716
1995-10, 52.9680440666945, 0.190382024789545
1995-11, 23.7613655626293, -0.264840412063808
1995-12, 10.0385560086021, -0.478727479187488
1996-01, 30.7780057418378, -0.155477341543555
1996-02, 128.610805880654, 1.36936861713607
1996-03, 7.10633174492109, -0.524429843957505
1996-04, 23.8821042087809, -0.262958549985042
1996-05, 37.0305427746871, -0.0580237696074886
1996-06, 37.8584649197264, -0.0451195724959551
1996-07, 30.9194424416154, -0.153272874537001
1996-08, 31.969868663134, -0.136900674451743
1996-09, 86.2177423790352, 0.708619957537556
1996-10, 28.2511183616656, -0.194862026477717
1996-11, 23.4819418386786, -0.26919557858895
1996-12, 11.3408085492369, -0.458430252480804
1997-01, 11.4994936270361, -0.455956948034427
1997-02, 7.23052006667699, -0.522494214390775
1997-03, 10.3145300569486, -0.474426080150309
1997-04, 49.8374634557645, 0.141588029461556
1997-05, 17.8330980365872, -0.357239840131189
1997-06, 41.1132338524124, 0.00561005239876484
1997-07, 54.1944037440341, 0.209496366761006
1997-08, 35.9145727166861, -0.0754175519640781
1997-09, 310.981356379197, 4.21184063587928
1997-10, 34.0793452951822, -0.104021855561312
1997-11, 26.7194623933428, -0.218734791134056
1997-12, 18.4229925649277, -0.348045599689221
1998-01, 43.9436926857656, 0.0497262762738213
1998-02, 8.09638864336399, -0.508998574911628
1998-03, 9.94713960508737, -0.480152317618553
1998-04, 44.3473047314723, 0.0560170723656946
1998-05, 40.8096623992313, 0.000878513457868874
1998-06, 43.5107583974222, 0.0429784565342497
1998-07, 23.9631715854827, -0.261695014017871
1998-08, 68.4243156118979, 0.4312872546155
1998-09, 31.1091745998536, -0.150315662698941
1998-10, 54.2116521220558, 0.20976520420083
1998-11, 28.640931704955, -0.188786300337703
1998-12, 13.783178877103, -0.420362871001778
1999-01, 8.62073933522225, -0.50082591674099
1999-02, 5.00030478847726, -0.55725489535997
1999-03, 7.82213943281971, -0.513273090204824
1999-04, 51.6433686346316, 0.169735309411091
1999-05, 388.490392695099, 5.41991543921472
1999-06, 36.7631929153514, -0.0621907499247561
1999-07, 17.7503058220832, -0.358530259842343
1999-08, 26.8108787968576, -0.21730995270299
1999-09, 43.6280473679694, 0.0448065511250498
1999-10, 27.1748195731145, -0.211637482722711
1999-11, 30.0035535686656, -0.167548142591636
1999-12, 11.0613848252861, -0.462785419005947
2000-01, 19.3785527073273, -0.333152005522992
2000-02, 9.30032542927536, -0.490233721611939
2000-03, 35.7196660450414, -0.0784554150340854
2000-04, 7.98944869962972, -0.510665367038535
2000-05, 98.1501702944148, 0.894601698407544
2000-06, 56.541907992781, 0.246085142321
2000-07, 35.7852098815237, -0.0774338327627554
2000-08, 57.5750858362781, 0.262188504966437
2000-09, 37.2495971755621, -0.0546095341217283
2000-10, 13.4140635874396, -0.426115992214004
2000-11, 10.5128864041976, -0.471334449592338
2000-12, 0.436383963947829, -0.628389281937303
2001-01, 3.13920479994087, -0.58626245511694
2001-02, 5.40909134759042, -0.55088344803615
2001-03, 6.58198105306283, -0.532602502128143
2001-04, 23.2421893841776, -0.272932419002499
2001-05, 38.8761192230039, -0.0292581635463615
2001-06, 57.5405890802348, 0.26165083008679
2001-07, 38.4811313663081, -0.0354145409183217
2001-08, 32.3269100881823, -0.131335739447392
2001-09, 37.2668455535837, -0.0543406966819056
2001-10, 9.66599104333441, -0.484534367887678
2001-11, 11.7513199461523, -0.452031921413001
2001-12, 4.61394112079221, -0.56327685401202
2002-01, 31.9922915545622, -0.136551185779971
2002-02, 10.8595788024328, -0.465930817051883
2002-03, 37.0564153417195, -0.0576205134477543
2002-04, 78.6077579958819, 0.590008879087372
2002-05, 23.7837884540575, -0.264490923392037
2002-06, 40.9269513697785, 0.00270660804866892
2002-07, 38.8019511975108, -0.0304141645376028
2002-08, 31.0246575475474, -0.151632966154078
2002-09, 75.2736465242963, 0.538042601969463
2002-10, 71.6549368153535, 0.481640507094466
2002-11, 9.57284980201749, -0.485986090062726
2002-12, 22.0382525982662, -0.291697272302188
2003-01, 11.7323467303285, -0.452327642596807
2003-02, 1.91974447381001, -0.60526926211247
2003-03, 16.1927772867279, -0.382806280658417
2003-04, 13.0915189184347, -0.431143252338706
2003-05, 91.4819473512438, 0.79066914417173
2003-06, 26.2089104039019, -0.226692379352835
2003-07, 856.813178225618, 12.719308954074
2003-08, 33.5101488204677, -0.112893491075492
2003-09, 43.6918663666495, 0.0458012496523969
2003-10, 11.4615471953885, -0.456548390402038
2003-11, 49.6615299999436, 0.138845887575355
2003-12, 17.3190963715419, -0.365251195837934
2004-01, 20.7601477868617, -0.311618126593119
2004-02, 17.2449283460488, -0.366407196829175
2004-03, 5.83340144692308, -0.544270047016489
2004-04, 27.3628268935505, -0.208707154628634
2004-05, 32.5908102719135, -0.127222526618092
2004-06, 209.59539036792, 2.63161416459598
2004-07, 43.603899638739, 0.0444301787092954
2004-08, 168.282075330456, 1.98769472873042
2004-09, 164.563325028988, 1.92973337670445
2004-10, 177.232258685892, 2.1271944762549
2004-11, 17.9314137913106, -0.355707466724194
2004-12, 8.65868576686984, -0.500234474373379
2005-01, 12.4257315267989, -0.441520377515898
2005-02, 11.1131299593511, -0.461978906686476
2005-03, 8.66213544247417, -0.500180706885414
2005-04, 34.0500230525454, -0.104478879209013
2005-05, 30.2553798877817, -0.163623115970211
2005-06, 41.2995163350462, 0.00851349674885921
2005-07, 30.2829772926163, -0.163192976066494
2005-08, 48.1885185168944, 0.115887170214416
2005-09, 95.9872236904995, 0.86088948345366
2005-10, 36.404426652501, -0.0677825686730877
2005-11, 10.8061088305656, -0.466764213115338
2005-12, 24.1322056900948, -0.259060407107601
