"Description: ","Maximum monthly number of consecutive dry days (when precipitation < 1.0 mm)"
"Station: ","model"
"Latitude: ","1"
"Longitude: ","1"
"ClimPACT2_version: ","1.2.7"
"Date_of_calculation: ","2020-01-30"
time, cdd, normalised (all years)
1970-01, -99.9, -99.9
1970-02, 38, 2.11744437573471
1970-03, 16, 0.316054185729878
1970-04, 34, 1.78991888664292
1970-05, 2, -0.83028502609138
1970-06, 4, -0.666522281545486
1970-07, 4, -0.666522281545486
1970-08, 6, -0.502759536999592
1970-09, 0, -0.994047770637274
1970-10, 9, -0.257115420180751
1970-11, 15, 0.234172813456931
1970-12, 20, 0.643579674821666
1971-01, 1, -0.912166398364327
1971-02, 32, 1.62615614209703
1971-03, 27, 1.21674928073229
1971-04, 9, -0.257115420180751
1971-05, 3, -0.748403653818433
1971-06, 0, -0.994047770637274
1971-07, 8, -0.338996792453698
1971-08, 5, -0.584640909272539
1971-09, 5, -0.584640909272539
1971-10, 6, -0.502759536999592
1971-11, 5, -0.584640909272539
1971-12, 10, -0.175234047907804
1972-01, 28, 1.29863065300524
1972-02, 14, 0.152291441183984
1972-03, 15, 0.234172813456931
1972-04, 11, -0.0933526756348574
1972-05, 2, -0.83028502609138
1972-06, 1, -0.912166398364327
1972-07, 0, -0.994047770637274
1972-08, 10, -0.175234047907804
1972-09, 11, -0.0933526756348574
1972-10, 6, -0.502759536999592
1972-11, 5, -0.584640909272539
1972-12, 10, -0.175234047907804
1973-01, 8, -0.338996792453698
1973-02, 30, 1.46239339755114
1973-03, 14, 0.152291441183984
1973-04, 27, 1.21674928073229
1973-05, 7, -0.420878164726645
1973-06, 3, -0.748403653818433
1973-07, 12, -0.0114713033619104
1973-08, 4, -0.666522281545486
1973-09, 4, -0.666522281545486
1973-10, 6, -0.502759536999592
1973-11, 7, -0.420878164726645
1973-12, 9, -0.257115420180751
1974-01, 5, -0.584640909272539
1974-02, 36, 1.95368163118882
1974-03, 5, -0.584640909272539
1974-04, 27, 1.21674928073229
1974-05, 2, -0.83028502609138
1974-06, 2, -0.83028502609138
1974-07, 7, -0.420878164726645
1974-08, 7, -0.420878164726645
1974-09, 7, -0.420878164726645
1974-10, 3, -0.748403653818433
1974-11, 10, -0.175234047907804
1974-12, 11, -0.0933526756348574
1975-01, -99.9, -99.9
1975-02, -99.9, -99.9
1975-03, 70, 4.73764828846901
1975-04, 17, 0.397935558002825
1975-05, 10, -0.175234047907804
1975-06, 0, -0.994047770637274
1975-07, 9, -0.257115420180751
1975-08, 5, -0.584640909272539
1975-09, 2, -0.83028502609138
1975-10, 4, -0.666522281545486
1975-11, 9, -0.257115420180751
1975-12, 8, -0.338996792453698
1976-01, 17, 0.397935558002825
1976-02, 13, 0.0704100689110366
1976-03, 34, 1.78991888664292
1976-04, 10, -0.175234047907804
1976-05, 1, -0.912166398364327
1976-06, 6, -0.502759536999592
1976-07, 7, -0.420878164726645
1976-08, 5, -0.584640909272539
1976-09, 2, -0.83028502609138
1976-10, 8, -0.338996792453698
1976-11, 18, 0.479816930275772
1976-12, 20, 0.643579674821666
1977-01, 19, 0.561698302548719
1977-02, 14, 0.152291441183984
1977-03, 3, -0.748403653818433
1977-04, 37, 2.03556300346176
1977-05, 7, -0.420878164726645
1977-06, 3, -0.748403653818433
1977-07, 10, -0.175234047907804
1977-08, 1, -0.912166398364327
1977-09, 2, -0.83028502609138
1977-10, 15, 0.234172813456931
1977-11, 12, -0.0114713033619104
1977-12, 12, -0.0114713033619104
1978-01, 44, 2.60873260937239
1978-02, -99.9, -99.9
1978-03, 64, 4.24636005483133
1978-04, 10, -0.175234047907804
1978-05, 4, -0.666522281545486
1978-06, 0, -0.994047770637274
1978-07, 1, -0.912166398364327
1978-08, 1, -0.912166398364327
1978-09, 4, -0.666522281545486
1978-10, 7, -0.420878164726645
1978-11, 13, 0.0704100689110366
1978-12, -99.9, -99.9
1979-01, 55, 3.50942770437481
1979-02, 25, 1.0529865361864
1979-03, 2, -0.83028502609138
1979-04, 38, 2.11744437573471
1979-05, 8, -0.338996792453698
1979-06, 6, -0.502759536999592
1979-07, 0, -0.994047770637274
1979-08, 8, -0.338996792453698
1979-09, 1, -0.912166398364327
1979-10, 3, -0.748403653818433
1979-11, 7, -0.420878164726645
1979-12, 4, -0.666522281545486
1980-01, 40, 2.28120712028061
1980-02, -99.9, -99.9
1980-03, 66, 4.41012279937723
1980-04, 9, -0.257115420180751
1980-05, 5, -0.584640909272539
1980-06, 4, -0.666522281545486
1980-07, 11, -0.0933526756348574
1980-08, 11, -0.0933526756348574
1980-09, 4, -0.666522281545486
1980-10, 6, -0.502759536999592
1980-11, 13, 0.0704100689110366
1980-12, 14, 0.152291441183984
1981-01, 24, 0.971105163913453
1981-02, -99.9, -99.9
1981-03, 47, 2.85437672619123
1981-04, 26, 1.13486790845935
1981-05, 1, -0.912166398364327
1981-06, 5, -0.584640909272539
1981-07, 12, -0.0114713033619104
1981-08, 6, -0.502759536999592
1981-09, 2, -0.83028502609138
1981-10, 7, -0.420878164726645
1981-11, 7, -0.420878164726645
1981-12, 8, -0.338996792453698
1982-01, 17, 0.397935558002825
1982-02, -99.9, -99.9
1982-03, 56, 3.59130907664776
1982-04, 10, -0.175234047907804
1982-05, 3, -0.748403653818433
1982-06, 8, -0.338996792453698
1982-07, 5, -0.584640909272539
1982-08, 9, -0.257115420180751
1982-09, 2, -0.83028502609138
1982-10, 4, -0.666522281545486
1982-11, 23, 0.889223791640506
1982-12, 17, 0.397935558002825
1983-01, 17, 0.397935558002825
1983-02, 15, 0.234172813456931
1983-03, 42, 2.4449698648265
1983-04, 4, -0.666522281545486
1983-05, 2, -0.83028502609138
1983-06, 2, -0.83028502609138
1983-07, 7, -0.420878164726645
1983-08, 5, -0.584640909272539
1983-09, 3, -0.748403653818433
1983-10, 4, -0.666522281545486
1983-11, 11, -0.0933526756348574
1983-12, 9, -0.257115420180751
1984-01, 33, 1.70803751436998
1984-02, 13, 0.0704100689110366
1984-03, 40, 2.28120712028061
1984-04, 30, 1.46239339755114
1984-05, 4, -0.666522281545486
1984-06, 8, -0.338996792453698
1984-07, 9, -0.257115420180751
1984-08, 4, -0.666522281545486
1984-09, 7, -0.420878164726645
1984-10, 6, -0.502759536999592
1984-11, 19, 0.561698302548719
1984-12, 36, 1.95368163118882
1985-01, 19, 0.561698302548719
1985-02, 8, -0.338996792453698
1985-03, 16, 0.316054185729878
1985-04, 6, -0.502759536999592
1985-05, 7, -0.420878164726645
1985-06, 3, -0.748403653818433
1985-07, 7, -0.420878164726645
1985-08, 9, -0.257115420180751
1985-09, 5, -0.584640909272539
1985-10, 2, -0.83028502609138
1985-11, 6, -0.502759536999592
1985-12, 14, 0.152291441183984
1986-01, 19, 0.561698302548719
1986-02, 12, -0.0114713033619104
1986-03, -99.9, -99.9
1986-04, 36, 1.95368163118882
1986-05, 8, -0.338996792453698
1986-06, 6, -0.502759536999592
1986-07, 9, -0.257115420180751
1986-08, 12, -0.0114713033619104
1986-09, 2, -0.83028502609138
1986-10, 4, -0.666522281545486
1986-11, 7, -0.420878164726645
1986-12, 7, -0.420878164726645
1987-01, 19, 0.561698302548719
1987-02, 24, 0.971105163913453
1987-03, 0, -0.994047770637274
1987-04, 32, 1.62615614209703
1987-05, 6, -0.502759536999592
1987-06, 6, -0.502759536999592
1987-07, 5, -0.584640909272539
1987-08, 1, -0.912166398364327
1987-09, 2, -0.83028502609138
1987-10, 7, -0.420878164726645
1987-11, 27, 1.21674928073229
1987-12, 12, -0.0114713033619104
1988-01, 26, 1.13486790845935
1988-02, 15, 0.234172813456931
1988-03, 25, 1.0529865361864
1988-04, 20, 0.643579674821666
1988-05, 2, -0.83028502609138
1988-06, 2, -0.83028502609138
1988-07, 7, -0.420878164726645
1988-08, 6, -0.502759536999592
1988-09, 3, -0.748403653818433
1988-10, 16, 0.316054185729878
1988-11, 12, -0.0114713033619104
1988-12, 4, -0.666522281545486
1989-01, 6, -0.502759536999592
1989-02, -99.9, -99.9
1989-03, 50, 3.10002084301008
1989-04, 12, -0.0114713033619104
1989-05, 9, -0.257115420180751
1989-06, 1, -0.912166398364327
1989-07, 12, -0.0114713033619104
1989-08, 9, -0.257115420180751
1989-09, 2, -0.83028502609138
1989-10, 5, -0.584640909272539
1989-11, 16, 0.316054185729878
1989-12, 1, -0.912166398364327
1990-01, -99.9, -99.9
1990-02, 64, 4.24636005483133
1990-03, 30, 1.46239339755114
1990-04, 12, -0.0114713033619104
1990-05, 5, -0.584640909272539
1990-06, 2, -0.83028502609138
1990-07, 1, -0.912166398364327
1990-08, 8, -0.338996792453698
1990-09, 2, -0.83028502609138
1990-10, 6, -0.502759536999592
1990-11, 4, -0.666522281545486
1990-12, 32, 1.62615614209703
1991-01, -99.9, -99.9
1991-02, 39, 2.19932574800766
1991-03, 21, 0.725461047094613
1991-04, 27, 1.21674928073229
1991-05, 16, 0.316054185729878
1991-06, 0, -0.994047770637274
1991-07, 0, -0.994047770637274
1991-08, 1, -0.912166398364327
1991-09, 1, -0.912166398364327
1991-10, 9, -0.257115420180751
1991-11, 29, 1.38051202527819
1991-12, 19, 0.561698302548719
1992-01, 5, -0.584640909272539
1992-02, -99.9, -99.9
1992-03, 54, 3.42754633210186
1992-04, -99.9, -99.9
1992-05, 47, 2.85437672619123
1992-06, 1, -0.912166398364327
1992-07, 6, -0.502759536999592
1992-08, 5, -0.584640909272539
1992-09, 3, -0.748403653818433
1992-10, 5, -0.584640909272539
1992-11, 6, -0.502759536999592
1992-12, 15, 0.234172813456931
1993-01, 22, 0.807342419367559
1993-02, 9, -0.257115420180751
1993-03, 24, 0.971105163913453
1993-04, 28, 1.29863065300524
1993-05, 4, -0.666522281545486
1993-06, 7, -0.420878164726645
1993-07, 10, -0.175234047907804
1993-08, 6, -0.502759536999592
1993-09, 4, -0.666522281545486
1993-10, 6, -0.502759536999592
1993-11, 8, -0.338996792453698
1993-12, 6, -0.502759536999592
1994-01, 43, 2.52685123709945
1994-02, 9, -0.257115420180751
1994-03, 18, 0.479816930275772
1994-04, 12, -0.0114713033619104
1994-05, 4, -0.666522281545486
1994-06, 10, -0.175234047907804
1994-07, 6, -0.502759536999592
1994-08, 5, -0.584640909272539
1994-09, 2, -0.83028502609138
1994-10, 2, -0.83028502609138
1994-11, 28, 1.29863065300524
1994-12, 5, -0.584640909272539
1995-01, 24, 0.971105163913453
1995-02, 9, -0.257115420180751
1995-03, -99.9, -99.9
1995-04, 59, 3.8369531934666
1995-05, 2, -0.83028502609138
1995-06, 5, -0.584640909272539
1995-07, 14, 0.152291441183984
1995-08, 5, -0.584640909272539
1995-09, 9, -0.257115420180751
1995-10, 11, -0.0933526756348574
1995-11, 5, -0.584640909272539
1995-12, 10, -0.175234047907804
1996-01, 18, 0.479816930275772
1996-02, 11, -0.0933526756348574
1996-03, 19, 0.561698302548719
1996-04, 11, -0.0933526756348574
1996-05, 0, -0.994047770637274
1996-06, 8, -0.338996792453698
1996-07, 11, -0.0933526756348574
1996-08, 3, -0.748403653818433
1996-09, 3, -0.748403653818433
1996-10, 7, -0.420878164726645
1996-11, 10, -0.175234047907804
1996-12, 27, 1.21674928073229
1997-01, 11, -0.0933526756348574
1997-02, 23, 0.889223791640506
1997-03, 11, -0.0933526756348574
1997-04, 18, 0.479816930275772
1997-05, 7, -0.420878164726645
1997-06, 3, -0.748403653818433
1997-07, 12, -0.0114713033619104
1997-08, 6, -0.502759536999592
1997-09, 2, -0.83028502609138
1997-10, 10, -0.175234047907804
1997-11, 15, 0.234172813456931
1997-12, 16, 0.316054185729878
1998-01, 29, 1.38051202527819
1998-02, 33, 1.70803751436998
1998-03, 14, 0.152291441183984
1998-04, 16, 0.316054185729878
1998-05, 2, -0.83028502609138
1998-06, 5, -0.584640909272539
1998-07, 7, -0.420878164726645
1998-08, 10, -0.175234047907804
1998-09, 4, -0.666522281545486
1998-10, 10, -0.175234047907804
1998-11, 8, -0.338996792453698
1998-12, 8, -0.338996792453698
1999-01, 14, 0.152291441183984
1999-02, 27, 1.21674928073229
1999-03, 26, 1.13486790845935
1999-04, 27, 1.21674928073229
1999-05, 2, -0.83028502609138
1999-06, 6, -0.502759536999592
1999-07, 14, 0.152291441183984
1999-08, 4, -0.666522281545486
1999-09, 7, -0.420878164726645
1999-10, 15, 0.234172813456931
1999-11, 13, 0.0704100689110366
1999-12, 20, 0.643579674821666
2000-01, 7, -0.420878164726645
2000-02, 20, 0.643579674821666
2000-03, 7, -0.420878164726645
2000-04, 14, 0.152291441183984
2000-05, 3, -0.748403653818433
2000-06, 1, -0.912166398364327
2000-07, 10, -0.175234047907804
2000-08, 4, -0.666522281545486
2000-09, 2, -0.83028502609138
2000-10, 6, -0.502759536999592
2000-11, 13, 0.0704100689110366
2000-12, -99.9, -99.9
2001-01, 45, 2.69061398164534
2001-02, 30, 1.46239339755114
2001-03, 13, 0.0704100689110366
2001-04, 7, -0.420878164726645
2001-05, 1, -0.912166398364327
2001-06, 3, -0.748403653818433
2001-07, 4, -0.666522281545486
2001-08, 1, -0.912166398364327
2001-09, 2, -0.83028502609138
2001-10, 11, -0.0933526756348574
2001-11, 9, -0.257115420180751
2001-12, -99.9, -99.9
2002-01, 56, 3.59130907664776
2002-02, 21, 0.725461047094613
2002-03, 19, 0.561698302548719
2002-04, 10, -0.175234047907804
2002-05, 13, 0.0704100689110366
2002-06, 8, -0.338996792453698
2002-07, 5, -0.584640909272539
2002-08, 8, -0.338996792453698
2002-09, 6, -0.502759536999592
2002-10, 3, -0.748403653818433
2002-11, 13, 0.0704100689110366
2002-12, 7, -0.420878164726645
2003-01, 16, 0.316054185729878
2003-02, -99.9, -99.9
2003-03, 37, 2.03556300346176
2003-04, 33, 1.70803751436998
2003-05, 1, -0.912166398364327
2003-06, 2, -0.83028502609138
2003-07, 1, -0.912166398364327
2003-08, 12, -0.0114713033619104
2003-09, 6, -0.502759536999592
2003-10, 7, -0.420878164726645
2003-11, 8, -0.338996792453698
2003-12, 18, 0.479816930275772
2004-01, 17, 0.397935558002825
2004-02, 13, 0.0704100689110366
2004-03, 12, -0.0114713033619104
2004-04, 20, 0.643579674821666
2004-05, 5, -0.584640909272539
2004-06, 4, -0.666522281545486
2004-07, 2, -0.83028502609138
2004-08, 1, -0.912166398364327
2004-09, 3, -0.748403653818433
2004-10, 5, -0.584640909272539
2004-11, 6, -0.502759536999592
2004-12, 6, -0.502759536999592
2005-01, 21, 0.725461047094613
2005-02, 17, 0.397935558002825
2005-03, 25, 1.0529865361864
2005-04, 19, 0.561698302548719
2005-05, 3, -0.748403653818433
2005-06, 14, 0.152291441183984
2005-07, 6, -0.502759536999592
2005-08, 5, -0.584640909272539
2005-09, 4, -0.666522281545486
2005-10, 6, -0.502759536999592
2005-11, 11, -0.0933526756348574
2005-12, 11, -0.0933526756348574
