"Description: ","Dates where precipitation > 200 mm or abs(temperature) > 50 degrees."
"Station: ","model_biascorrected"
"Latitude: ","1"
"Longitude: ","1"
"ClimPACT2_version: ","1.2.7"
"Date_of_calculation: ","2020-01-30"
Date,Prec,TX,TN
1979-9-21,319.272651694205,34.2429434681312,26.0974602263272
1980-5-4,400.207215885208,25.7056434681311,24.9366602263272
1983-4-7,200.69005279534,25.8054434681312,24.1795602263272
1997-9-11,259.748499141481,27.8675434681311,25.6559602263272
1999-5-21,200.120856320626,26.1593434681311,25.4822602263272
2003-7-4,271.625732247191,28.5390434681311,25.7746602263272
2003-7-6,410.259570596228,25.8235434681312,25.2467602263272
