"Description: ","Annual number of days with at least 30 consecutive days when TX > 90th percentile"
"Station: ","model"
"Latitude: ","1"
"Longitude: ","1"
"ClimPACT2_version: ","1.2.7"
"Date_of_calculation: ","2020-01-30"
time, wsdi2, normalised (all years)
1970, 80, 2.65841904032481
1971, 48, 0.826781041249344
1972, 11, -1.29105039518167
1973, 23, -0.604186145528367
1974, 21, -0.718663520470583
1975, 24, -0.546947458057258
1976, 29, -0.260754020701716
1977, 23, -0.604186145528367
1978, 20, -0.775902207941692
1979, 26, -0.432470083115041
1980, 36, 0.139916791596043
1981, 44, 0.59782629136491
1982, 28, -0.317992708172825
1983, 14, -1.11933433276834
1984, 15, -1.06209564529723
1985, 6, -1.57724383253721
1986, 28, -0.317992708172825
1987, 23, -0.604186145528367
1988, 25, -0.48970877058615
1989, 36, 0.139916791596043
1990, 27, -0.375231395643933
1991, 36, 0.139916791596043
1992, 22, -0.661424832999475
1993, 44, 0.59782629136491
1994, 31, -0.146276645759499
1995, 41, 0.426110228951585
1996, 15, -1.06209564529723
1997, 58, 1.39916791596043
1998, 41, 0.426110228951585
1999, 43, 0.540587603893802
2000, 27, -0.375231395643933
2001, 63, 1.68536135331597
2002, 74, 2.31498691549816
2003, 36, 0.139916791596043
2004, 23, -0.604186145528367
2005, 67, 1.9143161032004
