"Description: ","Monthly percentage of days when TX > 90th percentile"
"Station: ","model"
"Latitude: ","1"
"Longitude: ","1"
"ClimPACT2_version: ","1.2.7"
"Date_of_calculation: ","2020-01-30"
time, tx90p, normalised (all years)
1970-01, 51.6129032258064, 3.07830048721894
1970-02, 14.2857142857143, 0.194228856418142
1970-03, 25.8064516129032, 1.08437442148011
1970-04, 30, 1.40838740716268
1970-05, 25.8064516129032, 1.08437442148011
1970-06, 36.6666666666667, 1.92348497414521
1970-07, 35.4838709677419, 1.83209669613217
1970-08, 16.1290322580645, 0.336652146828055
1970-09, 0, -0.909551644258709
1970-10, 38.7096774193548, 2.08133745434953
1970-11, 20, 0.635741056688881
1970-12, 16.1290322580645, 0.336652146828055
1971-01, 32.258064516129, 1.58285593791482
1971-02, 24.384236453202, 0.974487486206951
1971-03, 28.476084538376, 1.29064263517724
1971-04, 0, -0.909551644258709
1971-05, 34.3715239154616, 1.74615160709171
1971-06, 0, -0.909551644258709
1971-07, 22.5806451612903, 0.835133663262762
1971-08, 15.0166852057842, 0.25070705778759
1971-09, 16.6666666666667, 0.378192273197618
1971-10, 22.3581757508343, 0.817944645454673
1971-11, 6.66666666666667, -0.394454077276179
1971-12, 6.45161290322581, -0.411070127824003
1972-01, 3.2258064516129, -0.660310886041356
1972-02, 6.77764565992866, -0.385879325863866
1972-03, 0, -0.909551644258709
1972-04, 3.33333333333333, -0.652002860767445
1972-05, 0, -0.909551644258709
1972-06, 0, -0.909551644258709
1972-07, 0, -0.909551644258709
1972-08, 5.45050055617353, -0.488420707960423
1972-09, 13.3333333333333, 0.120643489706348
1972-10, 15.4616240266963, 0.285085093403775
1972-11, 6.55172413793103, -0.403335069810361
1972-12, 0, -0.909551644258709
1973-01, 0, -0.909551644258709
1973-02, 0, -0.909551644258709
1973-03, 3.2258064516129, -0.660310886041356
1973-04, 3.33333333333333, -0.652002860767445
1973-05, 16.1290322580645, 0.336652146828055
1973-06, 0, -0.909551644258709
1973-07, 5.89543937708565, -0.454042672344236
1973-08, 11.4571746384872, -0.0243172271419037
1973-09, 13.1034482758621, 0.10288150463799
1973-10, 19.3548387096774, 0.585892905045409
1973-11, 6.20689655172414, -0.429978047412905
1973-12, 36.8186874304783, 1.93523080298074
1974-01, 9.45494994438265, -0.179018387414743
1974-02, 12.807881773399, 0.0800446666929482
1974-03, 6.11790878754171, -0.436853654536143
1974-04, 12.183908045977, 0.0318335643645344
1974-05, 0, -0.909551644258709
1974-06, 3.2183908045977, -0.660883853301626
1974-07, 3.2258064516129, -0.660310886041356
1974-08, 22.0244716351502, 0.792161118742533
1974-09, 33.3333333333333, 1.66593619065394
1974-10, 0, -0.909551644258709
1974-11, 0, -0.909551644258709
1974-12, 2.55839822024472, -0.711877939465636
1975-01, 3.11457174638487, -0.668905394945403
1975-02, 17.3645320197044, 0.432112585012287
1975-03, 0, -0.909551644258709
1975-04, 25.8620689655172, 1.08867167593214
1975-05, 15.4616240266963, 0.285085093403775
1975-06, 0, -0.909551644258709
1975-07, 0, -0.909551644258709
1975-08, 0, -0.909551644258709
1975-09, 0, -0.909551644258709
1975-10, 6.34037819799778, -0.419664636728049
1975-11, 6.20689655172414, -0.429978047412905
1975-12, 34.5939933259177, 1.7633406248998
1976-01, 25.6952169076752, 1.07577991257607
1976-02, 6.89655172413793, -0.376692092207816
1976-03, 14.7942157953281, 0.233518039979494
1976-04, 0, -0.909551644258709
1976-05, 0, -0.909551644258709
1976-06, 39.0804597701149, 2.10998581736302
1976-07, 12.2358175750834, 0.0358443351864217
1976-08, 12.7919911012236, 0.0788168797066584
1976-09, 0, -0.909551644258709
1976-10, 12.7919911012236, 0.0788168797066584
1976-11, 13.1034482758621, 0.10288150463799
1976-12, 0, -0.909551644258709
1977-01, 18.5761957730812, 0.525731342717083
1977-02, 0, -0.909551644258709
1977-03, 22.5806451612903, 0.835133663262762
1977-04, 26.6666666666667, 1.15083862367141
1977-05, 6.45161290322581, -0.411070127824003
1977-06, 0, -0.909551644258709
1977-07, 8.5650723025584, -0.247774458647116
1977-08, 0, -0.909551644258709
1977-09, 0, -0.909551644258709
1977-10, 0, -0.909551644258709
1977-11, 0, -0.909551644258709
1977-12, 6.45161290322581, -0.411070127824003
1978-01, 15.3503893214683, 0.27649058449973
1978-02, 6.65024630541872, -0.395722790495348
1978-03, 0, -0.909551644258709
1978-04, 12.8735632183908, 0.0851195195696241
1978-05, 6.45161290322581, -0.411070127824003
1978-06, 0, -0.909551644258709
1978-07, 0, -0.909551644258709
1978-08, 0, -0.909551644258709
1978-09, 3.33333333333333, -0.652002860767445
1978-10, 5.78420467185762, -0.462637181248283
1978-11, 6.55172413793103, -0.403335069810361
1978-12, 54.1713014460512, 3.27597419201202
1979-01, 5.45050055617353, -0.488420707960423
1979-02, 0, -0.909551644258709
1979-03, 32.258064516129, 1.58285593791482
1979-04, 2.8735632183908, -0.687526830904171
1979-05, 0, -0.909551644258709
1979-06, 32.2988505747126, 1.5860072578463
1979-07, 0, -0.909551644258709
1979-08, 12.9032258064516, 0.0874113886107026
1979-09, 3.2183908045977, -0.660883853301626
1979-10, 0, -0.909551644258709
1979-11, 9.08045977011494, -0.207953234058367
1979-12, 12.9032258064516, 0.0874113886107026
1980-01, 22.3581757508343, 0.817944645454673
1980-02, 0, -0.909551644258709
1980-03, 0, -0.909551644258709
1980-04, 0, -0.909551644258709
1980-05, 9.12124582869856, -0.204801914126882
1980-06, 19.4252873563218, 0.59133609401797
1980-07, 0, -0.909551644258709
1980-08, 29.0322580645161, 1.33361517969747
1980-09, 31.7241379310345, 1.5416022951754
1980-10, 18.1312569521691, 0.491353307100899
1980-11, 15.9770114942529, 0.324906317992528
1980-12, 12.9032258064516, 0.0874113886107026
1981-01, 41.7130144605117, 2.31338919475879
1981-02, 24.2610837438424, 0.964972137063185
1981-03, 3.2258064516129, -0.660310886041356
1981-04, 43.1034482758621, 2.42082055605938
1981-05, 3.2258064516129, -0.660310886041356
1981-06, 6.66666666666667, -0.394454077276179
1981-07, 22.2469410456062, 0.809350136550621
1981-08, 3.2258064516129, -0.660310886041356
1981-09, 3.33333333333333, -0.652002860767445
1981-10, 15.3503893214683, 0.27649058449973
1981-11, 13.1034482758621, 0.10288150463799
1981-12, 0, -0.909551644258709
1982-01, 2.22469410456062, -0.737661466177776
1982-02, 24.1379310344828, 0.95545678791942
1982-03, 2.89210233592881, -0.686094412753496
1982-04, 2.64367816091954, -0.705288815972534
1982-05, 2.89210233592881, -0.686094412753496
1982-06, 19.7701149425287, 0.617979071620515
1982-07, 0, -0.909551644258709
1982-08, 0, -0.909551644258709
1982-09, 0, -0.909551644258709
1982-10, 29.0322580645161, 1.33361517969747
1982-11, 23.3333333333333, 0.893289840180143
1982-12, 0, -0.909551644258709
1983-01, 0, -0.909551644258709
1983-02, 24.384236453202, 0.974487486206951
1983-03, 21.46829810901, 0.749188574222296
1983-04, 0, -0.909551644258709
1983-05, 0, -0.909551644258709
1983-06, 2.64367816091954, -0.705288815972534
1983-07, 12.6807563959956, 0.0702223708026141
1983-08, 0, -0.909551644258709
1983-09, 0, -0.909551644258709
1983-10, 0, -0.909551644258709
1983-11, 0, -0.909551644258709
1983-12, 0, -0.909551644258709
1984-01, 0, -0.909551644258709
1984-02, 0, -0.909551644258709
1984-03, 0, -0.909551644258709
1984-04, 3.10344827586207, -0.669764845835807
1984-05, 3.2258064516129, -0.660310886041356
1984-06, 16.4367816091954, 0.360430288129252
1984-07, 6.45161290322581, -0.411070127824003
1984-08, 6.00667408231368, -0.44544816344019
1984-09, 19.8850574712644, 0.626860064154702
1984-10, 2.89210233592881, -0.686094412753496
1984-11, 3.10344827586207, -0.669764845835807
1984-12, 21.357063403782, 0.740594065318252
1985-01, 3.2258064516129, -0.660310886041356
1985-02, 0, -0.909551644258709
1985-03, 0, -0.909551644258709
1985-04, 0, -0.909551644258709
1985-05, 12.4582869855395, 0.0530333529945179
1985-06, 19.3103448275862, 0.582455101483791
1985-07, 12.7919911012236, 0.0788168797066584
1985-08, 3.2258064516129, -0.660310886041356
1985-09, 2.64367816091954, -0.705288815972534
1985-10, 3.2258064516129, -0.660310886041356
1985-11, 0, -0.909551644258709
1985-12, 0, -0.909551644258709
1986-01, 3.2258064516129, -0.660310886041356
1986-02, 0, -0.909551644258709
1986-03, 0, -0.909551644258709
1986-04, 0, -0.909551644258709
1986-05, 25.3615127919911, 1.04999638586393
1986-06, 25.2873563218391, 1.04426671326123
1986-07, 15.6840934371524, 0.302274111211871
1986-08, 29.0322580645161, 1.33361517969747
1986-09, 0, -0.909551644258709
1986-10, 12.4582869855395, 0.0530333529945179
1986-11, 0, -0.909551644258709
1986-12, 6.45161290322581, -0.411070127824003
1987-01, 6.45161290322581, -0.411070127824003
1987-02, 0, -0.909551644258709
1987-03, 0, -0.909551644258709
1987-04, 0, -0.909551644258709
1987-05, 18.020022246941, 0.482758798196847
1987-06, 6.66666666666667, -0.394454077276179
1987-07, 8.45383759733037, -0.256368967551163
1987-08, 6.45161290322581, -0.411070127824003
1987-09, 9.88505747126437, -0.145786286319096
1987-10, 21.9132369299221, 0.783566609838481
1987-11, 20, 0.635741056688881
1987-12, 2.22469410456062, -0.737661466177776
1988-01, 9.67741935483871, -0.16182936960665
1988-02, 15.8145065398335, 0.312350431995923
1988-03, 18.9098998887653, 0.551514869429224
1988-04, 16.0919540229885, 0.333787310526708
1988-05, 6.22914349276974, -0.428259145632096
1988-06, 0, -0.909551644258709
1988-07, 3.2258064516129, -0.660310886041356
1988-08, 9.45494994438265, -0.179018387414743
1988-09, 35.2873563218391, 1.81691306373503
1988-10, 3.2258064516129, -0.660310886041356
1988-11, 9.6551724137931, -0.163548271387459
1988-12, 9.23248053392659, -0.196207405222836
1989-01, 0, -0.909551644258709
1989-02, 71.1822660098522, 4.59032016083801
1989-03, 28.587319243604, 1.29923714408128
1989-04, 13.3333333333333, 0.120643489706348
1989-05, 3.11457174638487, -0.668905394945403
1989-06, 0, -0.909551644258709
1989-07, 0, -0.909551644258709
1989-08, 9.67741935483871, -0.16182936960665
1989-09, 0, -0.909551644258709
1989-10, 0, -0.909551644258709
1989-11, 9.6551724137931, -0.163548271387459
1989-12, 0, -0.909551644258709
1990-01, 5.89543937708565, -0.454042672344236
1990-02, 17.3645320197044, 0.432112585012287
1990-03, 2.89210233592881, -0.686094412753496
1990-04, 12.183908045977, 0.0318335643645344
1990-05, 18.7986651835373, 0.54292036052518
1990-06, 0, -0.909551644258709
1990-07, 0, -0.909551644258709
1990-08, 28.2536151279199, 1.27345361736914
1990-09, 0, -0.909551644258709
1990-10, 12.6807563959956, 0.0702223708026141
1990-11, 15.632183908046, 0.298263340389984
1990-12, 27.8086763070078, 1.23907558175296
1991-01, 9.12124582869856, -0.204801914126882
1991-02, 10.5911330049261, -0.0912316178948384
1991-03, 15.5728587319244, 0.293679602307827
1991-04, 39.8850574712644, 2.17215276510229
1991-05, 31.9243604004449, 1.55707241120268
1991-06, 0, -0.909551644258709
1991-07, 0, -0.909551644258709
1991-08, 0, -0.909551644258709
1991-09, 0, -0.909551644258709
1991-10, 9.45494994438265, -0.179018387414743
1991-11, 29.7701149425287, 1.39062542209431
1991-12, 0, -0.909551644258709
1992-01, 0, -0.909551644258709
1992-02, 9.3935790725327, -0.183760185430769
1992-03, 32.258064516129, 1.58285593791482
1992-04, 9.42528735632184, -0.181310256455822
1992-05, 34.4827586206897, 1.75474611599576
1992-06, 0, -0.909551644258709
1992-07, 9.34371523915462, -0.187612896318789
1992-08, 6.45161290322581, -0.411070127824003
1992-09, 15.1724137931034, 0.262739370253252
1992-10, 0, -0.909551644258709
1992-11, 0, -0.909551644258709
1992-12, 5.33926585094549, -0.49701521686447
1993-01, 32.035595105673, 1.56566692010673
1993-02, 0, -0.909551644258709
1993-03, 16.1290322580645, 0.336652146828055
1993-04, 3.33333333333333, -0.652002860767445
1993-05, 15.6840934371524, 0.302274111211871
1993-06, 20, 0.635741056688881
1993-07, 22.0244716351502, 0.792161118742533
1993-08, 38.5984427141268, 2.07274294544548
1993-09, 8.85057471264368, -0.22571521912673
1993-10, 9.67741935483871, -0.16182936960665
1993-11, 10, -0.136905293784914
1993-12, 12.4582869855395, 0.0530333529945179
1994-01, 0, -0.909551644258709
1994-02, 13.3004926108374, 0.11810606326801
1994-03, 9.67741935483871, -0.16182936960665
1994-04, 2.8735632183908, -0.687526830904171
1994-05, 9.67741935483871, -0.16182936960665
1994-06, 15.4022988505747, 0.280501355321618
1994-07, 2.78086763070078, -0.694688921657543
1994-08, 3.2258064516129, -0.660310886041356
1994-09, 3.33333333333333, -0.652002860767445
1994-10, 6.34037819799778, -0.419664636728049
1994-11, 46.6666666666667, 2.696131324619
1994-12, 31.9243604004449, 1.55707241120268
1995-01, 3.2258064516129, -0.660310886041356
1995-02, 0, -0.909551644258709
1995-03, 0, -0.909551644258709
1995-04, 13.3333333333333, 0.120643489706348
1995-05, 0, -0.909551644258709
1995-06, 32.2988505747126, 1.5860072578463
1995-07, 41.2680756395996, 2.27901115914261
1995-08, 37.5973303670745, 1.99539236530906
1995-09, 16.6666666666667, 0.378192273197618
1995-10, 3.11457174638487, -0.668905394945403
1995-11, 10, -0.136905293784914
1995-12, 16.1290322580645, 0.336652146828055
1996-01, 0, -0.909551644258709
1996-02, 0, -0.909551644258709
1996-03, 0, -0.909551644258709
1996-04, 2.98850574712644, -0.678645838369989
1996-05, 0, -0.909551644258709
1996-06, 23.3333333333333, 0.893289840180143
1996-07, 8.78754171301446, -0.230585440839023
1996-08, 0, -0.909551644258709
1996-09, 3.33333333333333, -0.652002860767445
1996-10, 15.9065628476085, 0.319463129019967
1996-11, 9.6551724137931, -0.163548271387459
1996-12, 0, -0.909551644258709
1997-01, 31.4794215795328, 1.5226943755865
1997-02, 7.14285714285714, -0.357661393920285
1997-03, 41.7130144605117, 2.31338919475879
1997-04, 35.1724137931034, 1.80803207120084
1997-05, 57.285873192436, 3.51662044132532
1997-06, 0, -0.909551644258709
1997-07, 12.6807563959956, 0.0702223708026141
1997-08, 2.78086763070078, -0.694688921657543
1997-09, 26.6666666666667, 1.15083862367141
1997-10, 6.45161290322581, -0.411070127824003
1997-11, 11.7241379310345, -0.00369040577218967
1997-12, 0, -0.909551644258709
1998-01, 11.9021134593993, 0.0100608084742812
1998-02, 24.6305418719212, 0.993518184494482
1998-03, 0, -0.909551644258709
1998-04, 3.33333333333333, -0.652002860767445
1998-05, 0, -0.909551644258709
1998-06, 13.2183908045977, 0.111762497172169
1998-07, 28.9210233592881, 1.32502067079342
1998-08, 18.9098998887653, 0.551514869429224
1998-09, 23.3333333333333, 0.893289840180143
1998-10, 15.9065628476085, 0.319463129019967
1998-11, 10, -0.136905293784914
1998-12, 8.5650723025584, -0.247774458647116
1999-01, 3.11457174638487, -0.668905394945403
1999-02, 0, -0.909551644258709
1999-03, 3.11457174638487, -0.668905394945403
1999-04, 13.1034482758621, 0.10288150463799
1999-05, 0, -0.909551644258709
1999-06, 13.2183908045977, 0.111762497172169
1999-07, 54.3937708565072, 3.29316320982011
1999-08, 0, -0.909551644258709
1999-09, 39.6551724137931, 2.15439078003393
1999-10, 25.2502780867631, 1.04140187695989
1999-11, 6.66666666666667, -0.394454077276179
1999-12, 5.56173526140156, -0.479826199056376
2000-01, 5.45050055617353, -0.488420707960423
2000-02, 3.44827586206897, -0.643121868233262
2000-03, 6.45161290322581, -0.411070127824003
2000-04, 25.9770114942529, 1.09755266846632
2000-05, 0, -0.909551644258709
2000-06, 16.6666666666667, 0.378192273197618
2000-07, 6.45161290322581, -0.411070127824003
2000-08, 0, -0.909551644258709
2000-09, 0, -0.909551644258709
2000-10, 28.1423804226919, 1.2648591084651
2000-11, 18.8505747126437, 0.546931131347067
2000-12, 3.2258064516129, -0.660310886041356
2001-01, 32.258064516129, 1.58285593791482
2001-02, 0, -0.909551644258709
2001-03, 32.258064516129, 1.58285593791482
2001-04, 13.3333333333333, 0.120643489706348
2001-05, 0, -0.909551644258709
2001-06, 3.33333333333333, -0.652002860767445
2001-07, 0, -0.909551644258709
2001-08, 0, -0.909551644258709
2001-09, 0, -0.909551644258709
2001-10, 48.3870967741936, 2.82905972900159
2001-11, 40, 2.18103375763647
2001-12, 48.3870967741936, 2.82905972900159
2002-01, 25.8064516129032, 1.08437442148011
2002-02, 28.5714285714286, 1.29800935709499
2002-03, 35.4838709677419, 1.83209669613217
2002-04, 26.6666666666667, 1.15083862367141
2002-05, 35.4838709677419, 1.83209669613217
2002-06, 23.3333333333333, 0.893289840180143
2002-07, 3.2258064516129, -0.660310886041356
2002-08, 29.0322580645161, 1.33361517969747
2002-09, 36.6666666666667, 1.92348497414521
2002-10, 6.45161290322581, -0.411070127824003
2002-11, 13.3333333333333, 0.120643489706348
2002-12, 3.2258064516129, -0.660310886041356
2003-01, 9.67741935483871, -0.16182936960665
2003-02, 7.14285714285714, -0.357661393920285
2003-03, 12.9032258064516, 0.0874113886107026
2003-04, 36.6666666666667, 1.92348497414521
2003-05, 0, -0.909551644258709
2003-06, 3.33333333333333, -0.652002860767445
2003-07, 0, -0.909551644258709
2003-08, 6.45161290322581, -0.411070127824003
2003-09, 30, 1.40838740716268
2003-10, 22.5806451612903, 0.835133663262762
2003-11, 0, -0.909551644258709
2003-12, 0, -0.909551644258709
2004-01, 0, -0.909551644258709
2004-02, 0, -0.909551644258709
2004-03, 3.2258064516129, -0.660310886041356
2004-04, 10, -0.136905293784914
2004-05, 22.5806451612903, 0.835133663262762
2004-06, 3.33333333333333, -0.652002860767445
2004-07, 0, -0.909551644258709
2004-08, 0, -0.909551644258709
2004-09, 23.3333333333333, 0.893289840180143
2004-10, 16.1290322580645, 0.336652146828055
2004-11, 16.6666666666667, 0.378192273197618
2004-12, 0, -0.909551644258709
2005-01, 6.45161290322581, -0.411070127824003
2005-02, 21.4285714285714, 0.746119106756564
2005-03, 9.67741935483871, -0.16182936960665
2005-04, 6.66666666666667, -0.394454077276179
2005-05, 9.67741935483871, -0.16182936960665
2005-06, 33.3333333333333, 1.66593619065394
2005-07, 16.1290322580645, 0.336652146828055
2005-08, 54.8387096774194, 3.3275412454363
2005-09, 23.3333333333333, 0.893289840180143
2005-10, 29.0322580645161, 1.33361517969747
2005-11, 6.66666666666667, -0.394454077276179
2005-12, 19.3548387096774, 0.585892905045409
