"Description: ","Dates where TX values have been repeated more than 4 times."
"Station: ","observed"
"Latitude: ","1"
"Longitude: ","1"
"ClimPACT2_version: ","1.2.7"
"Date_of_calculation: ","2020-01-30"
"Date","TN","Number of duplicates"
1973-10-21,21,4
1976-6-27,22,4
1977-12-13,10,4
1996-7-14,24,4
2001-7-11,23.4,4
