"Description: ","Monthly number of days when TN > 20 degrees_C"
"Station: ","model"
"Latitude: ","1"
"Longitude: ","1"
"ClimPACT2_version: ","1.2.7"
"Date_of_calculation: ","2020-01-30"
time, tr, normalised (all years)
1970-01, 0, -0.691991942130751
1970-02, 0, -0.691991942130751
1970-03, 0, -0.691991942130751
1970-04, 0, -0.691991942130751
1970-05, 5, 0.218856683708629
1970-06, 3, -0.145482766627123
1970-07, 5, 0.218856683708629
1970-08, 8, 0.765365859212257
1970-09, 12, 1.49404475988376
1970-10, 2, -0.327652491794999
1970-11, 0, -0.691991942130751
1970-12, 0, -0.691991942130751
1971-01, 0, -0.691991942130751
1971-02, 0, -0.691991942130751
1971-03, 0, -0.691991942130751
1971-04, 1, -0.509822216962875
1971-05, 1, -0.509822216962875
1971-06, 14, 1.85838421021951
1971-07, 3, -0.145482766627123
1971-08, 5, 0.218856683708629
1971-09, 10, 1.12970530954801
1971-10, 1, -0.509822216962875
1971-11, 0, -0.691991942130751
1971-12, 0, -0.691991942130751
1972-01, 0, -0.691991942130751
1972-02, 0, -0.691991942130751
1972-03, 0, -0.691991942130751
1972-04, 0, -0.691991942130751
1972-05, 8, 0.765365859212257
1972-06, 5, 0.218856683708629
1972-07, 6, 0.401026408876505
1972-08, 3, -0.145482766627123
1972-09, 5, 0.218856683708629
1972-10, 2, -0.327652491794999
1972-11, 0, -0.691991942130751
1972-12, 0, -0.691991942130751
1973-01, 0, -0.691991942130751
1973-02, 0, -0.691991942130751
1973-03, 0, -0.691991942130751
1973-04, 0, -0.691991942130751
1973-05, 3, -0.145482766627123
1973-06, 18, 2.58706311089102
1973-07, 1, -0.509822216962875
1973-08, 10, 1.12970530954801
1973-09, 6, 0.401026408876505
1973-10, 7, 0.583196134044381
1973-11, 0, -0.691991942130751
1973-12, 0, -0.691991942130751
1974-01, 0, -0.691991942130751
1974-02, 0, -0.691991942130751
1974-03, 0, -0.691991942130751
1974-04, 1, -0.509822216962875
1974-05, 10, 1.12970530954801
1974-06, 8, 0.765365859212257
1974-07, 0, -0.691991942130751
1974-08, 1, -0.509822216962875
1974-09, 8, 0.765365859212257
1974-10, 2, -0.327652491794999
1974-11, 0, -0.691991942130751
1974-12, 0, -0.691991942130751
1975-01, 0, -0.691991942130751
1975-02, 0, -0.691991942130751
1975-03, 0, -0.691991942130751
1975-04, 0, -0.691991942130751
1975-05, 6, 0.401026408876505
1975-06, 18, 2.58706311089102
1975-07, 2, -0.327652491794999
1975-08, 3, -0.145482766627123
1975-09, 9, 0.947535584380132
1975-10, 0, -0.691991942130751
1975-11, 0, -0.691991942130751
1975-12, 0, -0.691991942130751
1976-01, 0, -0.691991942130751
1976-02, 0, -0.691991942130751
1976-03, 0, -0.691991942130751
1976-04, 0, -0.691991942130751
1976-05, 2, -0.327652491794999
1976-06, 2, -0.327652491794999
1976-07, 7, 0.583196134044381
1976-08, 8, 0.765365859212257
1976-09, 17, 2.40489338572314
1976-10, 1, -0.509822216962875
1976-11, 0, -0.691991942130751
1976-12, 0, -0.691991942130751
1977-01, 0, -0.691991942130751
1977-02, 0, -0.691991942130751
1977-03, 0, -0.691991942130751
1977-04, 0, -0.691991942130751
1977-05, 10, 1.12970530954801
1977-06, 7, 0.583196134044381
1977-07, 4, 0.0366869585407528
1977-08, 10, 1.12970530954801
1977-09, 14, 1.85838421021951
1977-10, 0, -0.691991942130751
1977-11, 0, -0.691991942130751
1977-12, 0, -0.691991942130751
1978-01, 0, -0.691991942130751
1978-02, 0, -0.691991942130751
1978-03, 0, -0.691991942130751
1978-04, 0, -0.691991942130751
1978-05, 0, -0.691991942130751
1978-06, 10, 1.12970530954801
1978-07, 13, 1.67621448505164
1978-08, 13, 1.67621448505164
1978-09, 7, 0.583196134044381
1978-10, 0, -0.691991942130751
1978-11, 0, -0.691991942130751
1978-12, 0, -0.691991942130751
1979-01, 0, -0.691991942130751
1979-02, 0, -0.691991942130751
1979-03, 0, -0.691991942130751
1979-04, 0, -0.691991942130751
1979-05, 0, -0.691991942130751
1979-06, 7, 0.583196134044381
1979-07, 26, 4.04442091223402
1979-08, 11, 1.31187503471588
1979-09, 17, 2.40489338572314
1979-10, 3, -0.145482766627123
1979-11, 1, -0.509822216962875
1979-12, 0, -0.691991942130751
1980-01, 0, -0.691991942130751
1980-02, 0, -0.691991942130751
1980-03, 0, -0.691991942130751
1980-04, 0, -0.691991942130751
1980-05, 11, 1.31187503471588
1980-06, 10, 1.12970530954801
1980-07, 4, 0.0366869585407528
1980-08, 4, 0.0366869585407528
1980-09, 16, 2.22272366055526
1980-10, 0, -0.691991942130751
1980-11, 0, -0.691991942130751
1980-12, 0, -0.691991942130751
1981-01, 0, -0.691991942130751
1981-02, 0, -0.691991942130751
1981-03, 0, -0.691991942130751
1981-04, 1, -0.509822216962875
1981-05, 6, 0.401026408876505
1981-06, 15, 2.04055393538739
1981-07, 10, 1.12970530954801
1981-08, 9, 0.947535584380132
1981-09, 14, 1.85838421021951
1981-10, 1, -0.509822216962875
1981-11, 0, -0.691991942130751
1981-12, 0, -0.691991942130751
1982-01, 0, -0.691991942130751
1982-02, 0, -0.691991942130751
1982-03, 0, -0.691991942130751
1982-04, 0, -0.691991942130751
1982-05, 7, 0.583196134044381
1982-06, 7, 0.583196134044381
1982-07, 3, -0.145482766627123
1982-08, 9, 0.947535584380132
1982-09, 10, 1.12970530954801
1982-10, 0, -0.691991942130751
1982-11, 0, -0.691991942130751
1982-12, 0, -0.691991942130751
1983-01, 0, -0.691991942130751
1983-02, 0, -0.691991942130751
1983-03, 0, -0.691991942130751
1983-04, 7, 0.583196134044381
1983-05, 9, 0.947535584380132
1983-06, 4, 0.0366869585407528
1983-07, 0, -0.691991942130751
1983-08, 1, -0.509822216962875
1983-09, 11, 1.31187503471588
1983-10, 0, -0.691991942130751
1983-11, 0, -0.691991942130751
1983-12, 0, -0.691991942130751
1984-01, 0, -0.691991942130751
1984-02, 0, -0.691991942130751
1984-03, 0, -0.691991942130751
1984-04, 0, -0.691991942130751
1984-05, 1, -0.509822216962875
1984-06, 11, 1.31187503471588
1984-07, 0, -0.691991942130751
1984-08, 2, -0.327652491794999
1984-09, 11, 1.31187503471588
1984-10, 1, -0.509822216962875
1984-11, 0, -0.691991942130751
1984-12, 0, -0.691991942130751
1985-01, 0, -0.691991942130751
1985-02, 0, -0.691991942130751
1985-03, 0, -0.691991942130751
1985-04, 0, -0.691991942130751
1985-05, 0, -0.691991942130751
1985-06, 3, -0.145482766627123
1985-07, 2, -0.327652491794999
1985-08, 5, 0.218856683708629
1985-09, 7, 0.583196134044381
1985-10, 5, 0.218856683708629
1985-11, 0, -0.691991942130751
1985-12, 0, -0.691991942130751
1986-01, 0, -0.691991942130751
1986-02, 0, -0.691991942130751
1986-03, 0, -0.691991942130751
1986-04, 0, -0.691991942130751
1986-05, 0, -0.691991942130751
1986-06, 8, 0.765365859212257
1986-07, 2, -0.327652491794999
1986-08, 10, 1.12970530954801
1986-09, 17, 2.40489338572314
1986-10, 2, -0.327652491794999
1986-11, 0, -0.691991942130751
1986-12, 0, -0.691991942130751
1987-01, 0, -0.691991942130751
1987-02, 0, -0.691991942130751
1987-03, 0, -0.691991942130751
1987-04, 0, -0.691991942130751
1987-05, 8, 0.765365859212257
1987-06, 6, 0.401026408876505
1987-07, 5, 0.218856683708629
1987-08, 2, -0.327652491794999
1987-09, 9, 0.947535584380132
1987-10, 1, -0.509822216962875
1987-11, 0, -0.691991942130751
1987-12, 0, -0.691991942130751
1988-01, 0, -0.691991942130751
1988-02, 0, -0.691991942130751
1988-03, 0, -0.691991942130751
1988-04, 0, -0.691991942130751
1988-05, 11, 1.31187503471588
1988-06, 5, 0.218856683708629
1988-07, 7, 0.583196134044381
1988-08, 5, 0.218856683708629
1988-09, 6, 0.401026408876505
1988-10, 2, -0.327652491794999
1988-11, 0, -0.691991942130751
1988-12, 0, -0.691991942130751
1989-01, 0, -0.691991942130751
1989-02, 0, -0.691991942130751
1989-03, 0, -0.691991942130751
1989-04, 0, -0.691991942130751
1989-05, 20, 2.95140256122677
1989-06, 24, 3.68008146189827
1989-07, 2, -0.327652491794999
1989-08, 5, 0.218856683708629
1989-09, 13, 1.67621448505164
1989-10, 6, 0.401026408876505
1989-11, 0, -0.691991942130751
1989-12, 0, -0.691991942130751
1990-01, 0, -0.691991942130751
1990-02, 0, -0.691991942130751
1990-03, 0, -0.691991942130751
1990-04, 0, -0.691991942130751
1990-05, 0, -0.691991942130751
1990-06, 14, 1.85838421021951
1990-07, 10, 1.12970530954801
1990-08, 8, 0.765365859212257
1990-09, 14, 1.85838421021951
1990-10, 2, -0.327652491794999
1990-11, 0, -0.691991942130751
1990-12, 0, -0.691991942130751
1991-01, 0, -0.691991942130751
1991-02, 0, -0.691991942130751
1991-03, 0, -0.691991942130751
1991-04, 0, -0.691991942130751
1991-05, 12, 1.49404475988376
1991-06, 11, 1.31187503471588
1991-07, 18, 2.58706311089102
1991-08, 25, 3.86225118706615
1991-09, 11, 1.31187503471588
1991-10, 2, -0.327652491794999
1991-11, 0, -0.691991942130751
1991-12, 0, -0.691991942130751
1992-01, 0, -0.691991942130751
1992-02, 0, -0.691991942130751
1992-03, 0, -0.691991942130751
1992-04, 0, -0.691991942130751
1992-05, 7, 0.583196134044381
1992-06, 8, 0.765365859212257
1992-07, 1, -0.509822216962875
1992-08, 12, 1.49404475988376
1992-09, 7, 0.583196134044381
1992-10, 4, 0.0366869585407528
1992-11, 0, -0.691991942130751
1992-12, 0, -0.691991942130751
1993-01, 0, -0.691991942130751
1993-02, 0, -0.691991942130751
1993-03, 0, -0.691991942130751
1993-04, 0, -0.691991942130751
1993-05, 10, 1.12970530954801
1993-06, 6, 0.401026408876505
1993-07, 1, -0.509822216962875
1993-08, 3, -0.145482766627123
1993-09, 13, 1.67621448505164
1993-10, 3, -0.145482766627123
1993-11, 0, -0.691991942130751
1993-12, 0, -0.691991942130751
1994-01, 0, -0.691991942130751
1994-02, 0, -0.691991942130751
1994-03, 0, -0.691991942130751
1994-04, 1, -0.509822216962875
1994-05, 5, 0.218856683708629
1994-06, 6, 0.401026408876505
1994-07, 14, 1.85838421021951
1994-08, 7, 0.583196134044381
1994-09, 17, 2.40489338572314
1994-10, 5, 0.218856683708629
1994-11, 0, -0.691991942130751
1994-12, 0, -0.691991942130751
1995-01, 0, -0.691991942130751
1995-02, 0, -0.691991942130751
1995-03, 0, -0.691991942130751
1995-04, 1, -0.509822216962875
1995-05, 5, 0.218856683708629
1995-06, 2, -0.327652491794999
1995-07, 3, -0.145482766627123
1995-08, 5, 0.218856683708629
1995-09, 9, 0.947535584380132
1995-10, 4, 0.0366869585407528
1995-11, 0, -0.691991942130751
1995-12, 0, -0.691991942130751
1996-01, 0, -0.691991942130751
1996-02, 0, -0.691991942130751
1996-03, 0, -0.691991942130751
1996-04, 0, -0.691991942130751
1996-05, 13, 1.67621448505164
1996-06, 6, 0.401026408876505
1996-07, 3, -0.145482766627123
1996-08, 13, 1.67621448505164
1996-09, 13, 1.67621448505164
1996-10, 0, -0.691991942130751
1996-11, 0, -0.691991942130751
1996-12, 0, -0.691991942130751
1997-01, 0, -0.691991942130751
1997-02, 0, -0.691991942130751
1997-03, 0, -0.691991942130751
1997-04, 3, -0.145482766627123
1997-05, 0, -0.691991942130751
1997-06, 16, 2.22272366055526
1997-07, 11, 1.31187503471588
1997-08, 10, 1.12970530954801
1997-09, 11, 1.31187503471588
1997-10, 2, -0.327652491794999
1997-11, 0, -0.691991942130751
1997-12, 0, -0.691991942130751
1998-01, 0, -0.691991942130751
1998-02, 0, -0.691991942130751
1998-03, 0, -0.691991942130751
1998-04, 1, -0.509822216962875
1998-05, 12, 1.49404475988376
1998-06, 3, -0.145482766627123
1998-07, 3, -0.145482766627123
1998-08, 10, 1.12970530954801
1998-09, 12, 1.49404475988376
1998-10, 6, 0.401026408876505
1998-11, 0, -0.691991942130751
1998-12, 0, -0.691991942130751
1999-01, 0, -0.691991942130751
1999-02, 0, -0.691991942130751
1999-03, 0, -0.691991942130751
1999-04, 1, -0.509822216962875
1999-05, 12, 1.49404475988376
1999-06, 3, -0.145482766627123
1999-07, 1, -0.509822216962875
1999-08, 0, -0.691991942130751
1999-09, 4, 0.0366869585407528
1999-10, 0, -0.691991942130751
1999-11, 1, -0.509822216962875
1999-12, 0, -0.691991942130751
2000-01, 0, -0.691991942130751
2000-02, 0, -0.691991942130751
2000-03, 0, -0.691991942130751
2000-04, 0, -0.691991942130751
2000-05, 7, 0.583196134044381
2000-06, 9, 0.947535584380132
2000-07, 13, 1.67621448505164
2000-08, 10, 1.12970530954801
2000-09, 13, 1.67621448505164
2000-10, 0, -0.691991942130751
2000-11, 0, -0.691991942130751
2000-12, 0, -0.691991942130751
2001-01, 0, -0.691991942130751
2001-02, 0, -0.691991942130751
2001-03, 0, -0.691991942130751
2001-04, 1, -0.509822216962875
2001-05, 8, 0.765365859212257
2001-06, 5, 0.218856683708629
2001-07, 16, 2.22272366055526
2001-08, 23, 3.4979117367304
2001-09, 10, 1.12970530954801
2001-10, 0, -0.691991942130751
2001-11, 0, -0.691991942130751
2001-12, 0, -0.691991942130751
2002-01, 0, -0.691991942130751
2002-02, 0, -0.691991942130751
2002-03, 0, -0.691991942130751
2002-04, 0, -0.691991942130751
2002-05, 3, -0.145482766627123
2002-06, 10, 1.12970530954801
2002-07, 13, 1.67621448505164
2002-08, 10, 1.12970530954801
2002-09, 23, 3.4979117367304
2002-10, 4, 0.0366869585407528
2002-11, 0, -0.691991942130751
2002-12, 0, -0.691991942130751
2003-01, 0, -0.691991942130751
2003-02, 0, -0.691991942130751
2003-03, 0, -0.691991942130751
2003-04, 1, -0.509822216962875
2003-05, 14, 1.85838421021951
2003-06, 21, 3.13357228639464
2003-07, 12, 1.49404475988376
2003-08, 12, 1.49404475988376
2003-09, 13, 1.67621448505164
2003-10, 2, -0.327652491794999
2003-11, 0, -0.691991942130751
2003-12, 0, -0.691991942130751
2004-01, 0, -0.691991942130751
2004-02, 0, -0.691991942130751
2004-03, 0, -0.691991942130751
2004-04, 3, -0.145482766627123
2004-05, 6, 0.401026408876505
2004-06, 15, 2.04055393538739
2004-07, 11, 1.31187503471588
2004-08, 25, 3.86225118706615
2004-09, 10, 1.12970530954801
2004-10, 3, -0.145482766627123
2004-11, 0, -0.691991942130751
2004-12, 0, -0.691991942130751
2005-01, 0, -0.691991942130751
2005-02, 0, -0.691991942130751
2005-03, 0, -0.691991942130751
2005-04, 0, -0.691991942130751
2005-05, 7, 0.583196134044381
2005-06, 9, 0.947535584380132
2005-07, 10, 1.12970530954801
2005-08, 11, 1.31187503471588
2005-09, 17, 2.40489338572314
2005-10, 10, 1.12970530954801
2005-11, 0, -0.691991942130751
2005-12, 0, -0.691991942130751
