"Description: ","Annual sum of 18 - TM"
"Station: ","model"
"Latitude: ","1"
"Longitude: ","1"
"ClimPACT2_version: ","1.2.7"
"Date_of_calculation: ","2020-01-30"
time, hddheat18, normalised (all years)
1970, 21.6944999999996, -1.26553936414005
1971, 34.8600499999992, -0.979489630092298
1972, 86.015099999999, 0.131963248648041
1973, 91.0875999999986, 0.242174160912029
1974, 73.0877499999994, -0.148911080904633
1975, 64.7420499999991, -0.330239264341139
1976, 22.0226499999994, -1.25840960349749
1977, 149.466749999999, 1.5105860640558
1978, 52.8944499999995, -0.587653715625297
1979, 71.4508499999993, -0.184476234632568
1980, 55.2091999999996, -0.537360820768106
1981, 96.3763999999989, 0.357084653328365
1982, 111.279999999999, 0.680897241207659
1983, 258.500499999999, 3.87957749925829
1984, 73.8609999999992, -0.132110570720678
1985, 108.648299999999, 0.62371792966401
1986, 73.6907999999989, -0.135808529767966
1987, 119.654349999999, 0.862847907174737
1988, 49.7200999999993, -0.656623259113762
1989, 98.4205999999987, 0.40149927074582
1990, 36.8022499999995, -0.937291180846528
1991, 67.0335999999993, -0.280450439107313
1992, 40.2382999999992, -0.862635645097948
1993, 10.7912999999996, -1.50243470541099
1994, 88.0685499999993, 0.176578842100685
1995, 43.4060999999996, -0.793808414369523
1996, 150.964849999999, 1.54313549089911
1997, 81.7393499999993, 0.0390634343330575
1998, 88.0151499999991, 0.175418612881381
1999, 61.0429499999991, -0.410610123987418
2000, 121.114549999999, 0.894573875452291
2001, 27.4970999999996, -1.13946546773728
2002, 57.9518999999993, -0.477769796802324
2003, 107.522399999999, 0.599255343933495
2004, 108.719649999999, 0.62526816102725
2005, 74.3008499999992, -0.122553888658713
