"Description: ","Annual total precipitation divided by the number of wet days (when total precipitation >= 1.0 mm)"
"Station: ","observed"
"Latitude: ","1"
"Longitude: ","1"
"ClimPACT2_version: ","1.2.7"
"Date_of_calculation: ","2020-01-30"
time, sdii, normalised (all years)
1970, 14.1227272727273, 0.749871921896532
1971, 13.7447619047619, 0.540674047893338
1972, 12.5694117647059, -0.109863729767763
1973, 12.4592233009709, -0.170851307749114
1974, 12.8032967032967, 0.0195878974486286
1975, 13.8848214285714, 0.618194786823919
1976, 13.2346153846154, 0.258315989483752
1977, 12.5227722772277, -0.135677950995383
1978, 13.859793814433, 0.604342396862084
1979, 12.4922077922078, -0.152594911722724
1980, 14.8109756097561, 1.13080652886253
1981, 12.3214285714286, -0.247118518748544
1982, 11.3191780821918, -0.80184836792931
1983, 10.3908163265306, -1.31568196764677
1984, 9.3289156626506, -1.9034272483377
1985, 13.0720430107527, 0.168334742876939
1986, -99.9, -99.9
1987, 12.4307692307692, -0.186600187137127
1988, 13.4203883495146, 0.361138397561467
1989, 13.7590909090909, 0.548604925947975
1990, 13.2238636363636, 0.252365066286206
1991, 9.1639175257732, -1.99475111654036
1992, 11.7943181818182, -0.538865811536451
1993, 13.6940298507463, 0.512594655590787
1994, 19.0086956521739, 3.45417841148112
1995, 13.5831460674157, 0.451222229172301
1996, 12.634, -0.074115159516795
1997, 10.7392857142857, -1.12280965379966
1998, -99.9, -99.9
1999, -99.9, -99.9
2000, -99.9, -99.9
2001, -99.9, -99.9
2002, -99.9, -99.9
2003, 11.9439024390244, -0.456073282791467
2004, 11.9368932038835, -0.459952783968408
2005, -99.9, -99.9
