"Description: ","Heatwave definitions and aspects"
"Station: ","observed"
"Latitude: ","1"
"Longitude: ","1"
"ClimPACT2_version: ","1.2.7"
"Date_of_calculation: ","2020-01-30"
time, CWM, CWA, CWN, CWD, CWF
1970, NA, NA, 0, NA, 0
1971, -9.6776036075036, -26.6489166666666, 3, 15, 33
1972, -1.78922321428571, -8.28533333333333, 2, 14, 17
1973, -6.2968258377425, -39.4864166666667, 4, 21, 44
1974, -4.7692719017094, -39.4864166666667, 4, 13, 27
1975, -9.19334999999999, -23.5114444444444, 1, 25, 25
1976, -3.19119503449528, -23.5114444444444, 4, 17, 35
1977, -2.82909108796296, -10.4305555555556, 4, 15, 31
1978, -3.00905504115226, -7.34033333333333, 3, 9, 16
1979, NA, NA, 0, NA, 0
1980, NA, NA, 0, NA, 0
1981, NA, NA, 0, NA, 0
1982, NA, NA, 0, NA, 0
1983, NA, NA, 0, NA, 0
1984, NA, NA, 0, NA, 0
1985, NA, NA, 0, NA, 0
1986, NA, NA, 0, NA, 0
1987, NA, NA, 0, NA, 0
1988, NA, NA, 0, NA, 0
1989, NA, NA, 0, NA, 0
1990, NA, NA, 0, NA, 0
1991, NA, NA, 0, NA, 0
1992, NA, NA, 0, NA, 0
1993, NA, NA, 0, NA, 0
1994, NA, NA, 0, NA, 0
1995, NA, NA, 0, NA, 0
1996, NA, NA, 0, NA, 0
1997, NA, NA, 0, NA, 0
1998, NA, NA, 0, NA, 0
1999, NA, NA, 0, NA, 0
2000, NA, NA, 0, NA, 0
2001, NA, NA, 0, NA, 0
2002, NA, NA, 0, NA, 0
2003, NA, NA, 0, NA, 0
2004, NA, NA, 0, NA, 0
2005, NA, NA, 0, NA, 0
