"Description: ","Heatwave definitions and aspects"
"Station: ","model_biascorrected"
"Latitude: ","1"
"Longitude: ","1"
"ClimPACT2_version: ","1.2.7"
"Date_of_calculation: ","2020-01-30"
time, HWM, HWA, HWN, HWD, HWF
1970, 0.458728245109196, 1.59877498750003, 7, 9, 40
1971, 0.473853356698267, 1.4686378776417, 5, 5, 20
1972, NA, NA, 0, NA, 0
1973, NA, NA, 0, NA, 0
1974, 0.509209464600337, 1.14777512204998, 2, 4, 7
1975, NA, NA, 0, NA, 0
1976, 0.534714200851831, 1.10231396898332, 2, 3, 6
1977, 0.89473621066088, 1.67264893380278, 2, 4, 7
1978, NA, NA, 0, NA, 0
1979, 0.885782026841712, 2.7964851640917, 3, 7, 16
1980, 0.697226801995198, 1.71638437530277, 3, 10, 18
1981, 0.57736070586678, 2.45877696292216, 3, 5, 11
1982, 0.530368881395535, 1.10783338773334, 1, 5, 5
1983, NA, NA, 0, NA, 0
1984, 0.881802584399072, 1.40193861609998, 1, 3, 3
1985, 0.908079068516104, 1.87339246174995, 1, 5, 5
1986, 0.526223380582276, 1.94599151739997, 3, 5, 11
1987, NA, NA, 0, NA, 0
1988, 0.600832389990625, 1.06357333333331, 2, 4, 8
1989, NA, NA, 0, NA, 0
1990, 0.29770299443651, 0.684808260405517, 2, 7, 10
1991, 1.02067557609791, 2.02698265739447, 1, 12, 12
1992, 0.738129507202146, 2.84103450069439, 3, 6, 15
1993, 0.23989942297176, 0.597362055675032, 4, 3, 12
1994, 0.351298507267129, 0.992246723083339, 3, 4, 10
1995, 0.28112112021162, 1.02776547856106, 4, 5, 17
1996, 0.601407945746472, 1.17508568736109, 2, 5, 8
1997, 0.425543908448171, 0.975018067575007, 4, 8, 17
1998, 0.208436485754933, 0.363568274208333, 3, 3, 9
1999, 0.663300975689116, 1.54628887837775, 3, 8, 15
2000, NA, NA, 0, NA, 0
2001, NA, NA, 0, NA, 0
2002, 0.795833508166089, 4.06374523994995, 9, 10, 47
2003, 0.325980493335068, 0.61516213371109, 2, 4, 7
2004, 0.501369525992061, 1.15559983529163, 1, 7, 7
2005, 1.10994895042584, 3.86517751234993, 6, 15, 40
