"Description: ","Number of 2 consecutive days where both TX < 5th percentile and TN < 5th percentile"
"Station: ","model_biascorrected"
"Latitude: ","1"
"Longitude: ","1"
"ClimPACT2_version: ","1.2.7"
"Date_of_calculation: ","2020-01-30"
time, txb2tnb2, normalised (all years)
1970, 0, -0.23914335132648
1971, 0, -0.23914335132648
1972, 0, -0.23914335132648
1973, 0, -0.23914335132648
1974, 0, -0.23914335132648
1975, 0, -0.23914335132648
1976, 0, -0.23914335132648
1977, 0, -0.23914335132648
1978, 0, -0.23914335132648
1979, 0, -0.23914335132648
1980, 0, -0.23914335132648
1981, 0, -0.23914335132648
1982, 0, -0.23914335132648
1983, 1, 4.06543697255016
1984, 0, -0.23914335132648
1985, 0, -0.23914335132648
1986, 0, -0.23914335132648
1987, 0, -0.23914335132648
1988, 0, -0.23914335132648
1989, 0, -0.23914335132648
1990, 0, -0.23914335132648
1991, 0, -0.23914335132648
1992, 0, -0.23914335132648
1993, 0, -0.23914335132648
1994, 0, -0.23914335132648
1995, 0, -0.23914335132648
1996, 0, -0.23914335132648
1997, 0, -0.23914335132648
1998, 0, -0.23914335132648
1999, 0, -0.23914335132648
2000, 0, -0.23914335132648
2001, 0, -0.23914335132648
2002, 0, -0.23914335132648
2003, 0, -0.23914335132648
2004, 1, 4.06543697255016
2005, 0, -0.23914335132648
