"Description: ","Annual number of days when precipitation >= 20 mm"
"Station: ","model"
"Latitude: ","1"
"Longitude: ","1"
"ClimPACT2_version: ","1.2.7"
"Date_of_calculation: ","2020-01-30"
time, r20mm, normalised (all years)
1970, 0, -1.197464455626
1971, 1, -0.413669539216255
1972, 1, -0.413669539216255
1973, 0, -1.197464455626
1974, 3, 1.15392029360324
1975, 1, -0.413669539216255
1976, 2, 0.370125377193491
1977, 3, 1.15392029360324
1978, 1, -0.413669539216255
1979, 3, 1.15392029360324
1980, 2, 0.370125377193491
1981, 0, -1.197464455626
1982, 1, -0.413669539216255
1983, 4, 1.93771521001298
1984, 1, -0.413669539216255
1985, 0, -1.197464455626
1986, 1, -0.413669539216255
1987, 3, 1.15392029360324
1988, 1, -0.413669539216255
1989, 2, 0.370125377193491
1990, 0, -1.197464455626
1991, 0, -1.197464455626
1992, 1, -0.413669539216255
1993, 3, 1.15392029360324
1994, 2, 0.370125377193491
1995, 0, -1.197464455626
1996, 3, 1.15392029360324
1997, 1, -0.413669539216255
1998, 0, -1.197464455626
1999, 2, 0.370125377193491
2000, 1, -0.413669539216255
2001, 0, -1.197464455626
2002, 2, 0.370125377193491
2003, 4, 1.93771521001298
2004, 4, 1.93771521001298
2005, 2, 0.370125377193491
