"Description: ","Annual number of days when TX >= 35 degrees_C"
"Station: ","observed"
"Latitude: ","1"
"Longitude: ","1"
"ClimPACT2_version: ","1.2.7"
"Date_of_calculation: ","2020-01-30"
time, txge35, normalised (all years)
1970, 52, -0.213817541374411
1971, 48, -0.403877578151665
1972, 51, -0.261332550568725
1973, 46, -0.498907596540292
1974, 42, -0.688967633317547
1975, 43, -0.641452624123233
1976, 43, -0.641452624123233
1977, 1, -2.6370830102844
1978, 70, 0.641452624123233
1979, 71, 0.688967633317547
1980, 74, 0.831512660900487
1981, 65, 0.403877578151665
1982, 57, 0.0237575045971568
1983, 94, 1.78181284478676
1984, 73, 0.783997651706174
1985, 74, 0.831512660900487
1986, -99.9, -99.9
1987, -99.9, -99.9
1988, -99.9, -99.9
1989, -99.9, -99.9
1990, -99.9, -99.9
1991, -99.9, -99.9
1992, -99.9, -99.9
1993, -99.9, -99.9
1994, -99.9, -99.9
1995, -99.9, -99.9
1996, -99.9, -99.9
1997, -99.9, -99.9
1998, -99.9, -99.9
1999, -99.9, -99.9
2000, -99.9, -99.9
2001, -99.9, -99.9
2002, -99.9, -99.9
2003, -99.9, -99.9
2004, -99.9, -99.9
2005, -99.9, -99.9
