%YAML 1.1
%TAG !u! tag:unity3d.com,2011:
--- !u!114 &11400000
MonoBehaviour:
  m_ObjectHideFlags: 0
  m_CorrespondingSourceObject: {fileID: 0}
  m_PrefabInstance: {fileID: 0}
  m_PrefabAsset: {fileID: 0}
  m_GameObject: {fileID: 0}
  m_Enabled: 1
  m_EditorHideFlags: 0
  m_Script: {fileID: 11500000, guid: d730d361d34ddbb4e8850bc35a67f02b, type: 3}
  m_Name: AlphaDialogue
  m_EditorClassIdentifier: 
  language: English
  phrases:
  - key: Story1
    actor: Alpha
    value: Ugh... Where am I?
    target: 1
    ekspresion: 4
  - key: Story2
    actor: Weird Noise
    value: Bzzzztt.... bzzzzt!!
    target: 2
    ekspresion: 0
  - key: Story3
    actor: Alpha
    value: What's that sound?
    target: 3
    ekspresion: 5
  - key: Story4
    actor: Teacher
    value: Alpha are you there?! Answer if you are alright!
    target: 4
    ekspresion: 0
  - key: Story5
    actor: Alpha
    value: "Yes, I am here sir! It seems I am lost in an island, thankfully I have
      no injuries so I\u2019m fine. "
    target: 5
    ekspresion: 4
  - key: Story6
    actor: Teacher
    value: "That\u2019s great to know! Listen now, we will save you in three days
      with a ship."
    target: 60
    ekspresion: 0
  - key: Story61
    actor: Teacher
    value: Until then please survive in that island. Find some food and make sure
      to avoid any danger!
    target: 6
    ekspresion: 0
  - key: Story7
    actor: Alpha
    value: Yes, sir! I'll do my best.
    target: 101
    ekspresion: 1
  - key: Story8
    actor: Alpha
    value: I guess I should collect some food now.
    target: 102
    ekspresion: 1
  - key: Story9
    actor: Alpha
    value: I should get some rest now.
    target: 103
    ekspresion: 3
  - key: Story10
    actor: Alpha
    value: Hmmmm... What's this, i didn't see it last night because it was so dark.
    target: 10
    ekspresion: 5
  - key: Story11
    actor: Alpha
    value: Wow, what a bunch of keyholes on a single chest! Are the keys scattered
      around here?
    target: 11
    ekspresion: 5
  - key: Story12
    actor: Alpha
    value: Don't have anything to do anyways, i'll just looking for the keys around
      here.
    target: 104
    ekspresion: 1
  - key: Story13
    actor: Alpha
    value: I think these are all the keys.. Let's open the treasure!
    target: 105
    ekspresion: 1
  - key: Story14
    actor: Alpha
    value: A mirror? Well, I guess this mirror will have some use later.
    target: 106
    ekspresion: 5
  - key: Story15
    actor: Alpha
    value: Hmmmmm.. When will they come and save me..
    target: 15
    ekspresion: 3
  - key: Story16
    actor: Alpha
    value: Huh?!
    target: 107
    ekspresion: 5
  - key: Story17
    actor: Monster
    value: Where are the keys to my precious treasure chest!!
    target: 17
    ekspresion: 0
  - key: Story18
    actor: Monster
    value: Find it!! NOW!!!
    target: 108
    ekspresion: 0
  - key: Story19
    actor: Alpha
    value: Wh.. what are those?? Monsters???
    target: 19
    ekspresion: 4
  - key: Story20
    actor: Teacher
    value: '....pha! ... Al.... Alpha, can you hear me?'
    target: 20
    ekspresion: 0
  - key: Story21
    actor: Alpha
    value: Yes, sir! I can hear you! Please save me, there are monsters around
    target: 21
    ekspresion: 4
  - key: Story22
    actor: Teacher
    value: What?! We are on our way, you should hide from them until we arrive!
    target: 22
    ekspresion: 0
  - key: Story23
    actor: Alpha
    value: Yes, sir!! Please hurry up!
    target: 109
    ekspresion: 4
  - key: Story24
    actor: Teacher
    value: Alpha, where are you? We are here.
    target: 24
    ekspresion: 0
  - key: Story25
    actor: Alpha
    value: (I should use the mirror now!)
    target: 25
    ekspresion: 1
  - key: Story26
    actor: Alpha
    value: I'm here!!
    target: 110
    ekspresion: 1
  - key: Poison
    actor: Alpha
    value: Ugh....! I think this is poisonous...
    target: -1
    ekspresion: 2
  - key: Enough
    actor: Alpha
    value: Hmmmm.. I think i have enough of this.
    target: -1
    ekspresion: 2
  - key: FindKey
    actor: Alpha
    value: I should look around for the keys.
    target: -1
    ekspresion: 1
