%YAML 1.1
%TAG !u! tag:unity3d.com,2011:
--- !u!21 &2100000
Material:
  serializedVersion: 6
  m_ObjectHideFlags: 0
  m_CorrespondingSourceObject: {fileID: 0}
  m_PrefabInstance: {fileID: 0}
  m_PrefabAsset: {fileID: 0}
  m_Name: Water-SphereBlue(Emissive)
  m_Shader: {fileID: 4800000, guid: 4a2d0ef71f180834aa9a4deb63f6e613, type: 3}
  m_ShaderKeywords: SECOND_ENABLED _CULL_NONE _SECONDARYENABLETHIS_ON _SECONDWAVEENABLETHIS_ON
  m_LightmapFlags: 4
  m_EnableInstancingVariants: 0
  m_DoubleSidedGI: 0
  m_CustomRenderQueue: -1
  stringTagMap: {}
  disabledShaderPasses: []
  m_SavedProperties:
    serializedVersion: 3
    m_TexEnvs:
    - _BaseTexture:
        m_Texture: {fileID: 0}
        m_Scale: {x: 1, y: 1}
        m_Offset: {x: 0, y: 0}
    - _BlendTexture:
        m_Texture: {fileID: 2800000, guid: 6c2ef88e523281d44b493a3326dbedf8, type: 3}
        m_Scale: {x: 50, y: 50}
        m_Offset: {x: 0, y: 0}
    - _BumpMap:
        m_Texture: {fileID: 0}
        m_Scale: {x: 1, y: 1}
        m_Offset: {x: 0, y: 0}
    - _CubemapCustomCubemap:
        m_Texture: {fileID: 0}
        m_Scale: {x: 1, y: 1}
        m_Offset: {x: 0, y: 0}
    - _DetailAlbedoMap:
        m_Texture: {fileID: 0}
        m_Scale: {x: 1, y: 1}
        m_Offset: {x: 0, y: 0}
    - _DetailMask:
        m_Texture: {fileID: 0}
        m_Scale: {x: 1, y: 1}
        m_Offset: {x: 0, y: 0}
    - _DetailNormalMap:
        m_Texture: {fileID: 0}
        m_Scale: {x: 1, y: 1}
        m_Offset: {x: 0, y: 0}
    - _EmissionMap:
        m_Texture: {fileID: 0}
        m_Scale: {x: 1, y: 1}
        m_Offset: {x: 0, y: 0}
    - _EmissionTexture:
        m_Texture: {fileID: 0}
        m_Scale: {x: 1, y: 1}
        m_Offset: {x: 0, y: 0}
    - _FirstWaveHeightmap:
        m_Texture: {fileID: 2800000, guid: d594323606034b0488f0240719eb5964, type: 3}
        m_Scale: {x: -0.89, y: 1}
        m_Offset: {x: 0, y: 0}
    - _FirstWaveNormalmap:
        m_Texture: {fileID: 2800000, guid: e301598b44ff05645941635071beb282, type: 3}
        m_Scale: {x: 1, y: 1}
        m_Offset: {x: 0, y: 0}
    - _FourthWaveHeightmap:
        m_Texture: {fileID: 0}
        m_Scale: {x: 1, y: 1}
        m_Offset: {x: 0, y: 0}
    - _FourthWaveNormalmap:
        m_Texture: {fileID: 0}
        m_Scale: {x: 1, y: 1}
        m_Offset: {x: 0, y: 0}
    - _MainTex:
        m_Texture: {fileID: 0}
        m_Scale: {x: 1, y: 1}
        m_Offset: {x: 0, y: 0}
    - _MetallicGlossMap:
        m_Texture: {fileID: 0}
        m_Scale: {x: 1, y: 1}
        m_Offset: {x: 0, y: 0}
    - _OcclusionMap:
        m_Texture: {fileID: 0}
        m_Scale: {x: 1, y: 1}
        m_Offset: {x: 0, y: 0}
    - _OverallGlossMask:
        m_Texture: {fileID: 0}
        m_Scale: {x: 1, y: 1}
        m_Offset: {x: 0, y: 0}
    - _OverallMetallicMask:
        m_Texture: {fileID: 0}
        m_Scale: {x: 1, y: 1}
        m_Offset: {x: 0, y: 0}
    - _OverallNormalStrengthMask:
        m_Texture: {fileID: 0}
        m_Scale: {x: 1, y: 1}
        m_Offset: {x: 0, y: 0}
    - _OverallWaveHeightMask:
        m_Texture: {fileID: 0}
        m_Scale: {x: 1, y: 1}
        m_Offset: {x: 0, y: 0}
    - _ParallaxMap:
        m_Texture: {fileID: 0}
        m_Scale: {x: 1, y: 1}
        m_Offset: {x: 0, y: 0}
    - _PrimaryHeightmap:
        m_Texture: {fileID: 2800000, guid: 228b2c301ad35c9449ab45f3112f090e, type: 3}
        m_Scale: {x: 1, y: 1}
        m_Offset: {x: 0, y: 0}
    - _PrimaryNormalmap:
        m_Texture: {fileID: 2800000, guid: 6ed99089d8d6dbf4bbeb2ecef32d71c1, type: 3}
        m_Scale: {x: 1, y: 1}
        m_Offset: {x: 0, y: 0}
    - _SSRefractionStrengthMask:
        m_Texture: {fileID: 0}
        m_Scale: {x: 1, y: 1}
        m_Offset: {x: 0, y: 0}
    - _SecondWaveHeightmap:
        m_Texture: {fileID: 2800000, guid: d594323606034b0488f0240719eb5964, type: 3}
        m_Scale: {x: 1, y: 1}
        m_Offset: {x: 0, y: 0}
    - _SecondWaveNormalmap:
        m_Texture: {fileID: 2800000, guid: e301598b44ff05645941635071beb282, type: 3}
        m_Scale: {x: 1, y: 1}
        m_Offset: {x: 0, y: 0}
    - _SecondaryHeightmap:
        m_Texture: {fileID: 2800000, guid: 228b2c301ad35c9449ab45f3112f090e, type: 3}
        m_Scale: {x: 1, y: 1}
        m_Offset: {x: 0, y: 0}
    - _SecondaryNormalmap:
        m_Texture: {fileID: 2800000, guid: 6ed99089d8d6dbf4bbeb2ecef32d71c1, type: 3}
        m_Scale: {x: 1, y: 1}
        m_Offset: {x: 0, y: 0}
    - _ThirdWaveHeightmap:
        m_Texture: {fileID: 2800000, guid: 6d54b5c5d3ad7d943a96c0dfca899ad1, type: 3}
        m_Scale: {x: 1, y: 1}
        m_Offset: {x: 0, y: 0}
    - _ThirdWaveNormalmap:
        m_Texture: {fileID: 2800000, guid: cb571ffaeb9d1e4448a7c01d522c81ce, type: 3}
        m_Scale: {x: 1, y: 1}
        m_Offset: {x: 0, y: 0}
    m_Floats:
    - _BaseisasEmission: 0
    - _BlendBlendAlpha: 0
    - _BlendBlendDistance: 0
    - _BlendEmissionFactor: 0
    - _BlendEmissionValue: 0
    - _BlendEnableColor: 0
    - _BlendEnableThis: 0
    - _BlendIsAdditive: 0
    - _BumpScale: 1
    - _CubemapFresnel: 0
    - _CubemapGlossiness: 0
    - _CubemapStrength: 0
    - _CubemapUseCustomCubemap: 0
    - _Cull: 0
    - _Cutoff: 0.5
    - _DetailNormalMapScale: 1
    - _DstBlend: 0
    - _FirstWaveHeightStrength: 0.1
    - _FirstWaveNormalStrength: 0.5
    - _FourthWaveEnableThis: 0
    - _FourthWaveHeightStrength: -0.148
    - _FourthWaveNormalStrength: 0.5
    - _GlossMapScale: 1
    - _Glossiness: 0.5
    - _GlossyReflections: 1
    - _Metallic: 0
    - _Mode: 0
    - _OcclusionStrength: 1
    - _OverallGloss: 1
    - _OverallMetallic: 1
    - _OverallNormalStrength: 0.25
    - _OverallWaveHeight: 0
    - _Parallax: 0.02
    - _PrimaryHeightStrength: 0.5
    - _SSRefractionDecaydistance: 0
    - _SSRefractionRefractionFresnel: 3.02
    - _SSRefractionStrength: 0.201
    - _SecondWaveEnableThis: 1
    - _SecondWaveHeightStrength: 0.1
    - _SecondWaveNormalStrength: 0.5
    - _SecondaryEnableThis: 1
    - _SecondaryHeightStrength: 0.5
    - _ShadowOffset: 2.5
    - _ShadowOpacityRatio: 1
    - _ShadowWaveFactor: 2
    - _SmoothnessTextureChannel: 0
    - _SpecularHighlights: 1
    - _SrcBlend: 1
    - _TessellationFarCap: 500
    - _TessellationNearCap: 0
    - _TessellationStrength: 0
    - _ThirdWaveEnableThis: 0
    - _ThirdWaveHeightStrength: 0
    - _ThirdWaveNormalStrength: 0.382
    - _UVSec: 0
    - _ZWrite: 1
    m_Colors:
    - _BaseColor: {r: 0.034482475, g: 0, b: 1, a: 0.759}
    - _BlendColor: {r: 1, g: 0, b: 0, a: 1}
    - _BlendTextureUandVspeedZWNotused: {r: 0.01, g: 0.01, b: 0, a: 0}
    - _Color: {r: 0.8, g: 0.8, b: 0.8, a: 1}
    - _CubemapBaseColor: {r: 1, g: 1, b: 1, a: 1}
    - _EmissionColor: {r: 0.50735295, g: 1, b: 0.8776877, a: 1}
    - _FirstWaveUandVspeed: {r: 0.05, g: 0.123, b: 0, a: 0}
    - _FirstWaveUandVspeedZWNotused: {r: 0, g: 0, b: 0, a: 0}
    - _FourthWaveUandVspeed: {r: -0.05, g: -0.075, b: 0, a: 0}
    - _FourthWaveUandVspeedZWNotused: {r: -0.05, g: -0.075, b: 0, a: 0}
    - _PrimaryUandVspeedZWNotused: {r: 0.0001, g: 0.0001, b: 0, a: 0}
    - _SecondWaveUandVspeed: {r: -0.12, g: -0.082, b: 0, a: 0}
    - _SecondWaveUandVspeedZWNotused: {r: -0.05, g: -0.075, b: 0, a: 0}
    - _SecondaryUandVspeedZWNotused: {r: -0.05, g: -0.075, b: 0, a: 0}
    - _ThirdWaveUandVspeed: {r: -0.01, g: -0.1, b: 0, a: 0}
    - _ThirdWaveUandVspeedZWNotused: {r: -0.05, g: -0.075, b: 0, a: 0}
