%YAML 1.1
%TAG !u! tag:unity3d.com,2011:
--- !u!1 &100000
GameObject:
  m_ObjectHideFlags: 0
  m_CorrespondingSourceObject: {fileID: 0}
  m_PrefabInstance: {fileID: 0}
  m_PrefabAsset: {fileID: 0}
  serializedVersion: 6
  m_Component:
  - component: {fileID: 400000}
  - component: {fileID: 11400000}
  - component: {fileID: 7856616412041422457}
  m_Layer: 0
  m_Name: AudioController
  m_TagString: Untagged
  m_Icon: {fileID: 0}
  m_NavMeshLayer: 0
  m_StaticEditorFlags: 0
  m_IsActive: 1
--- !u!4 &400000
Transform:
  m_ObjectHideFlags: 0
  m_CorrespondingSourceObject: {fileID: 0}
  m_PrefabInstance: {fileID: 0}
  m_PrefabAsset: {fileID: 0}
  m_GameObject: {fileID: 100000}
  m_LocalRotation: {x: -0, y: -0, z: -0, w: 1}
  m_LocalPosition: {x: 784.04565, y: 489.8828, z: 0}
  m_LocalScale: {x: 1, y: 1, z: 1}
  m_Children: []
  m_Father: {fileID: 0}
  m_RootOrder: 0
  m_LocalEulerAnglesHint: {x: 0, y: 0, z: 0}
--- !u!114 &11400000
MonoBehaviour:
  m_ObjectHideFlags: 0
  m_CorrespondingSourceObject: {fileID: 0}
  m_PrefabInstance: {fileID: 0}
  m_PrefabAsset: {fileID: 0}
  m_GameObject: {fileID: 100000}
  m_Enabled: 1
  m_EditorHideFlags: 0
  m_Script: {fileID: 11500000, guid: 1669b0a062dc66842ab1bca41a93ebe4, type: 3}
  m_Name: 
  m_EditorClassIdentifier: 
  AudioObjectPrefab: {fileID: 100000, guid: 0c1c735ac5b98ad428f564386ebb50c9, type: 3}
  Persistent: 0
  UnloadAudioClipsOnDestroy: 0
  UsePooledAudioObjects: 1
  PlayWithZeroVolume: 0
  EqualPowerCrossfade: 0
  musicCrossFadeTime: 2
  specifyCrossFadeInAndOutSeperately: 0
  _musicCrossFadeTime_In: 0
  _musicCrossFadeTime_Out: 0
  AudioCategories:
  - Name: Music
    _parentCategoryName: 
    AudioObjectPrefab: {fileID: 0}
    AudioItems:
    - Name: Flute
      Loop: 0
      loopSequenceCount: 0
      loopSequenceOverlap: 0
      loopSequenceRandomDelay: 0
      loopSequenceRandomPitch: 0
      loopSequenceRandomVolume: 0
      DestroyOnLoad: 1
      Volume: 1
      SubItemPickMode: 2
      MinTimeBetweenPlayCalls: 0.1
      MaxInstanceCount: 0
      Delay: 0
      overrideAudioSourceSettings: 0
      audioSource_MinDistance: 1
      audioSource_MaxDistance: 500
      spatialBlend: 0
      subItems:
      - SubItemType: 0
        Probability: 1
        DisableOtherSubitems: 0
        ItemModeAudioID: 
        Clip: {fileID: 8300000, guid: 4f2f1da69e35f7a4cbf358815275ba9d, type: 3}
        Volume: 1
        PitchShift: 0
        Pan2D: 0
        Delay: 0
        RandomPitch: 0
        RandomVolume: 0
        RandomDelay: 0
        ClipStopTime: 0
        ClipStartTime: 0
        FadeIn: 0
        FadeOut: 0
        RandomStartPosition: 0
    - Name: Bassoon
      Loop: 0
      loopSequenceCount: 0
      loopSequenceOverlap: 0
      loopSequenceRandomDelay: 0
      loopSequenceRandomPitch: 0
      loopSequenceRandomVolume: 0
      DestroyOnLoad: 1
      Volume: 1
      SubItemPickMode: 2
      MinTimeBetweenPlayCalls: 0.1
      MaxInstanceCount: 0
      Delay: 0
      overrideAudioSourceSettings: 0
      audioSource_MinDistance: 1
      audioSource_MaxDistance: 500
      spatialBlend: 0
      subItems:
      - SubItemType: 0
        Probability: 1
        DisableOtherSubitems: 0
        ItemModeAudioID: 
        Clip: {fileID: 8300000, guid: 5395da06a60148748958db12d21e1521, type: 3}
        Volume: 1
        PitchShift: 0
        Pan2D: 0
        Delay: 0
        RandomPitch: 0
        RandomVolume: 0
        RandomDelay: 0
        ClipStopTime: 0
        ClipStartTime: 0
        FadeIn: 0
        FadeOut: 0
        RandomStartPosition: 0
    - Name: Oboe
      Loop: 0
      loopSequenceCount: 0
      loopSequenceOverlap: 0
      loopSequenceRandomDelay: 0
      loopSequenceRandomPitch: 0
      loopSequenceRandomVolume: 0
      DestroyOnLoad: 1
      Volume: 1
      SubItemPickMode: 2
      MinTimeBetweenPlayCalls: 0.1
      MaxInstanceCount: 0
      Delay: 0
      overrideAudioSourceSettings: 0
      audioSource_MinDistance: 1
      audioSource_MaxDistance: 500
      spatialBlend: 0
      subItems:
      - SubItemType: 0
        Probability: 1
        DisableOtherSubitems: 0
        ItemModeAudioID: 
        Clip: {fileID: 8300000, guid: ffdd954625c734c49a08b93cc822a2d7, type: 3}
        Volume: 1
        PitchShift: 0
        Pan2D: 0
        Delay: 0
        RandomPitch: 0
        RandomVolume: 0
        RandomDelay: 0
        ClipStopTime: 0
        ClipStartTime: 0
        FadeIn: 0
        FadeOut: 0
        RandomStartPosition: 0
    - Name: Windbells
      Loop: 0
      loopSequenceCount: 0
      loopSequenceOverlap: 0
      loopSequenceRandomDelay: 0
      loopSequenceRandomPitch: 0
      loopSequenceRandomVolume: 0
      DestroyOnLoad: 1
      Volume: 1
      SubItemPickMode: 2
      MinTimeBetweenPlayCalls: 0.1
      MaxInstanceCount: 0
      Delay: 0
      overrideAudioSourceSettings: 0
      audioSource_MinDistance: 1
      audioSource_MaxDistance: 500
      spatialBlend: 0
      subItems:
      - SubItemType: 0
        Probability: 1
        DisableOtherSubitems: 0
        ItemModeAudioID: 
        Clip: {fileID: 8300000, guid: b122a1f6f7f5c5e4a8fcd85d6c0f5b47, type: 3}
        Volume: 1
        PitchShift: 0
        Pan2D: 0
        Delay: 0
        RandomPitch: 0
        RandomVolume: 0
        RandomDelay: 0
        ClipStopTime: 0
        ClipStartTime: 0
        FadeIn: 0
        FadeOut: 0
        RandomStartPosition: 0
    _volume: 1
  - Name: SFX
    _parentCategoryName: 
    AudioObjectPrefab: {fileID: 0}
    AudioItems:
    - Name: Button_OK
      Loop: 0
      loopSequenceCount: 0
      loopSequenceOverlap: 0
      loopSequenceRandomDelay: 0
      loopSequenceRandomPitch: 0
      loopSequenceRandomVolume: 0
      DestroyOnLoad: 1
      Volume: 1
      SubItemPickMode: 2
      MinTimeBetweenPlayCalls: 0.1
      MaxInstanceCount: 0
      Delay: 0
      overrideAudioSourceSettings: 0
      audioSource_MinDistance: 1
      audioSource_MaxDistance: 500
      spatialBlend: 0
      subItems:
      - SubItemType: 0
        Probability: 1
        DisableOtherSubitems: 0
        ItemModeAudioID: 
        Clip: {fileID: 8300000, guid: c9d13e51c456dd042a610b16fd284540, type: 3}
        Volume: 1
        PitchShift: 0
        Pan2D: 0
        Delay: 0
        RandomPitch: 0
        RandomVolume: 0
        RandomDelay: 0
        ClipStopTime: 0
        ClipStartTime: 0
        FadeIn: 0
        FadeOut: 0
        RandomStartPosition: 0
    - Name: Button_Cancel
      Loop: 0
      loopSequenceCount: 0
      loopSequenceOverlap: 0
      loopSequenceRandomDelay: 0
      loopSequenceRandomPitch: 0
      loopSequenceRandomVolume: 0
      DestroyOnLoad: 1
      Volume: 1
      SubItemPickMode: 2
      MinTimeBetweenPlayCalls: 0.1
      MaxInstanceCount: 0
      Delay: 0
      overrideAudioSourceSettings: 0
      audioSource_MinDistance: 1
      audioSource_MaxDistance: 500
      spatialBlend: 0
      subItems:
      - SubItemType: 0
        Probability: 1
        DisableOtherSubitems: 0
        ItemModeAudioID: 
        Clip: {fileID: 8300000, guid: c86c9808c07b14044b528ab7614651d3, type: 3}
        Volume: 1
        PitchShift: 0
        Pan2D: 0
        Delay: 0
        RandomPitch: 0
        RandomVolume: 0
        RandomDelay: 0
        ClipStopTime: 0
        ClipStartTime: 0
        FadeIn: 0
        FadeOut: 0
        RandomStartPosition: 0
    - Name: Police_Peluit
      Loop: 0
      loopSequenceCount: 0
      loopSequenceOverlap: 0
      loopSequenceRandomDelay: 0
      loopSequenceRandomPitch: 0
      loopSequenceRandomVolume: 0
      DestroyOnLoad: 1
      Volume: 1
      SubItemPickMode: 2
      MinTimeBetweenPlayCalls: 0.1
      MaxInstanceCount: 0
      Delay: 0
      overrideAudioSourceSettings: 0
      audioSource_MinDistance: 1
      audioSource_MaxDistance: 500
      spatialBlend: 0
      subItems:
      - SubItemType: 0
        Probability: 1
        DisableOtherSubitems: 0
        ItemModeAudioID: 
        Clip: {fileID: 8300000, guid: 2acd4a8878a9bc54cb6b79ad353484a2, type: 3}
        Volume: 1
        PitchShift: 0
        Pan2D: 0
        Delay: 0
        RandomPitch: 0
        RandomVolume: 0
        RandomDelay: 0
        ClipStopTime: 6
        ClipStartTime: 4
        FadeIn: 0
        FadeOut: 0
        RandomStartPosition: 0
    - Name: Rain
      Loop: 1
      loopSequenceCount: 0
      loopSequenceOverlap: 0
      loopSequenceRandomDelay: 0
      loopSequenceRandomPitch: 0
      loopSequenceRandomVolume: 0
      DestroyOnLoad: 1
      Volume: 0.2
      SubItemPickMode: 2
      MinTimeBetweenPlayCalls: 0
      MaxInstanceCount: 0
      Delay: 0
      overrideAudioSourceSettings: 0
      audioSource_MinDistance: 1
      audioSource_MaxDistance: 500
      spatialBlend: 0
      subItems:
      - SubItemType: 0
        Probability: 1
        DisableOtherSubitems: 0
        ItemModeAudioID: 
        Clip: {fileID: 8300000, guid: 20a6fe9a2a9214645a253fe1e294b717, type: 3}
        Volume: 1
        PitchShift: 0
        Pan2D: 0
        Delay: 0
        RandomPitch: 0
        RandomVolume: 0
        RandomDelay: 0
        ClipStopTime: 4
        ClipStartTime: 0.5
        FadeIn: 2
        FadeOut: 2
        RandomStartPosition: 0
    - Name: Use_Money
      Loop: 0
      loopSequenceCount: 0
      loopSequenceOverlap: 0
      loopSequenceRandomDelay: 0
      loopSequenceRandomPitch: 0
      loopSequenceRandomVolume: 0
      DestroyOnLoad: 1
      Volume: 1
      SubItemPickMode: 2
      MinTimeBetweenPlayCalls: 0.1
      MaxInstanceCount: 0
      Delay: 0
      overrideAudioSourceSettings: 0
      audioSource_MinDistance: 1
      audioSource_MaxDistance: 500
      spatialBlend: 0
      subItems:
      - SubItemType: 0
        Probability: 1
        DisableOtherSubitems: 0
        ItemModeAudioID: 
        Clip: {fileID: 8300000, guid: 04badfc28075e7048b349ef382e73f8c, type: 3}
        Volume: 1
        PitchShift: 0
        Pan2D: 0
        Delay: 0
        RandomPitch: 0
        RandomVolume: 0
        RandomDelay: 0
        ClipStopTime: 0
        ClipStartTime: 0
        FadeIn: 0
        FadeOut: 0
        RandomStartPosition: 0
    - Name: Get_Money
      Loop: 0
      loopSequenceCount: 0
      loopSequenceOverlap: 0
      loopSequenceRandomDelay: 0
      loopSequenceRandomPitch: 0
      loopSequenceRandomVolume: 0
      DestroyOnLoad: 1
      Volume: 1
      SubItemPickMode: 2
      MinTimeBetweenPlayCalls: 0.1
      MaxInstanceCount: 0
      Delay: 0
      overrideAudioSourceSettings: 0
      audioSource_MinDistance: 1
      audioSource_MaxDistance: 500
      spatialBlend: 0
      subItems:
      - SubItemType: 0
        Probability: 1
        DisableOtherSubitems: 0
        ItemModeAudioID: 
        Clip: {fileID: 8300000, guid: 6c13443e86f3ff5438af2e0cd2b7717a, type: 3}
        Volume: 1
        PitchShift: 0
        Pan2D: 0
        Delay: 0
        RandomPitch: 0
        RandomVolume: 0
        RandomDelay: 0
        ClipStopTime: 0
        ClipStartTime: 0
        FadeIn: 0
        FadeOut: 0
        RandomStartPosition: 0
    - Name: Bus_Brake
      Loop: 0
      loopSequenceCount: 0
      loopSequenceOverlap: 0
      loopSequenceRandomDelay: 0
      loopSequenceRandomPitch: 0
      loopSequenceRandomVolume: 0
      DestroyOnLoad: 1
      Volume: 1
      SubItemPickMode: 2
      MinTimeBetweenPlayCalls: 0.1
      MaxInstanceCount: 0
      Delay: 0
      overrideAudioSourceSettings: 0
      audioSource_MinDistance: 1
      audioSource_MaxDistance: 500
      spatialBlend: 0
      subItems:
      - SubItemType: 0
        Probability: 1
        DisableOtherSubitems: 0
        ItemModeAudioID: 
        Clip: {fileID: 8300000, guid: 154468ba2796d2047bcfcc871a5b6acf, type: 3}
        Volume: 1
        PitchShift: 0
        Pan2D: 0
        Delay: 0
        RandomPitch: 0
        RandomVolume: 0
        RandomDelay: 0
        ClipStopTime: 0
        ClipStartTime: 0
        FadeIn: 0
        FadeOut: 0
        RandomStartPosition: 0
    - Name: Wiper_Up
      Loop: 0
      loopSequenceCount: 0
      loopSequenceOverlap: 0
      loopSequenceRandomDelay: 0
      loopSequenceRandomPitch: 0
      loopSequenceRandomVolume: 0
      DestroyOnLoad: 1
      Volume: 1
      SubItemPickMode: 2
      MinTimeBetweenPlayCalls: 0.1
      MaxInstanceCount: 0
      Delay: 0
      overrideAudioSourceSettings: 0
      audioSource_MinDistance: 1
      audioSource_MaxDistance: 500
      spatialBlend: 0
      subItems:
      - SubItemType: 0
        Probability: 1
        DisableOtherSubitems: 0
        ItemModeAudioID: 
        Clip: {fileID: 8300000, guid: 0ce3f359e17ea9c48829ae6cff175c40, type: 3}
        Volume: 1
        PitchShift: 0
        Pan2D: 0
        Delay: 0
        RandomPitch: 0
        RandomVolume: 0
        RandomDelay: 0
        ClipStopTime: 0
        ClipStartTime: 0
        FadeIn: 0
        FadeOut: 0
        RandomStartPosition: 0
    - Name: Wiper_Down
      Loop: 0
      loopSequenceCount: 0
      loopSequenceOverlap: 0
      loopSequenceRandomDelay: 0
      loopSequenceRandomPitch: 0
      loopSequenceRandomVolume: 0
      DestroyOnLoad: 1
      Volume: 1
      SubItemPickMode: 2
      MinTimeBetweenPlayCalls: 0.1
      MaxInstanceCount: 0
      Delay: 0
      overrideAudioSourceSettings: 0
      audioSource_MinDistance: 1
      audioSource_MaxDistance: 500
      spatialBlend: 0
      subItems:
      - SubItemType: 0
        Probability: 1
        DisableOtherSubitems: 0
        ItemModeAudioID: 
        Clip: {fileID: 8300000, guid: 86083938600a9f245a978b84804f0f02, type: 3}
        Volume: 1
        PitchShift: 0
        Pan2D: 0
        Delay: 0
        RandomPitch: 0
        RandomVolume: 0
        RandomDelay: 0
        ClipStopTime: 0
        ClipStartTime: 0
        FadeIn: 0
        FadeOut: 0
        RandomStartPosition: 0
    - Name: Winker_1
      Loop: 0
      loopSequenceCount: 0
      loopSequenceOverlap: 0
      loopSequenceRandomDelay: 0
      loopSequenceRandomPitch: 0
      loopSequenceRandomVolume: 0
      DestroyOnLoad: 1
      Volume: 0.7
      SubItemPickMode: 2
      MinTimeBetweenPlayCalls: 0.1
      MaxInstanceCount: 0
      Delay: 0
      overrideAudioSourceSettings: 0
      audioSource_MinDistance: 1
      audioSource_MaxDistance: 500
      spatialBlend: 0
      subItems:
      - SubItemType: 0
        Probability: 1
        DisableOtherSubitems: 0
        ItemModeAudioID: 
        Clip: {fileID: 8300000, guid: 2b9e8ecf1d81cf3429ddfd674469ab73, type: 3}
        Volume: 1
        PitchShift: -0.5
        Pan2D: 0
        Delay: 0
        RandomPitch: 0
        RandomVolume: 0
        RandomDelay: 0
        ClipStopTime: 0
        ClipStartTime: 0
        FadeIn: 0
        FadeOut: 0
        RandomStartPosition: 0
    - Name: Winker_2
      Loop: 0
      loopSequenceCount: 0
      loopSequenceOverlap: 0
      loopSequenceRandomDelay: 0
      loopSequenceRandomPitch: 0
      loopSequenceRandomVolume: 0
      DestroyOnLoad: 1
      Volume: 0.7
      SubItemPickMode: 2
      MinTimeBetweenPlayCalls: 0.1
      MaxInstanceCount: 0
      Delay: 0
      overrideAudioSourceSettings: 0
      audioSource_MinDistance: 1
      audioSource_MaxDistance: 500
      spatialBlend: 0
      subItems:
      - SubItemType: 0
        Probability: 1
        DisableOtherSubitems: 0
        ItemModeAudioID: 
        Clip: {fileID: 8300000, guid: b2a29a7694484ba489903aa3d95b3708, type: 3}
        Volume: 1
        PitchShift: -0.5
        Pan2D: 0
        Delay: 0
        RandomPitch: 0
        RandomVolume: 0
        RandomDelay: 0
        ClipStopTime: 0
        ClipStartTime: 0
        FadeIn: 0
        FadeOut: 0
        RandomStartPosition: 0
    - Name: Bus_Reverse
      Loop: 2
      loopSequenceCount: 0
      loopSequenceOverlap: 0
      loopSequenceRandomDelay: 0
      loopSequenceRandomPitch: 0
      loopSequenceRandomVolume: 0
      DestroyOnLoad: 1
      Volume: 1
      SubItemPickMode: 2
      MinTimeBetweenPlayCalls: 0.1
      MaxInstanceCount: 0
      Delay: 0
      overrideAudioSourceSettings: 0
      audioSource_MinDistance: 1
      audioSource_MaxDistance: 500
      spatialBlend: 0
      subItems:
      - SubItemType: 0
        Probability: 1
        DisableOtherSubitems: 0
        ItemModeAudioID: 
        Clip: {fileID: 8300000, guid: aa08163d1d7dd764bbafa9970e3543ea, type: 3}
        Volume: 1
        PitchShift: 0
        Pan2D: 0
        Delay: 0
        RandomPitch: 0
        RandomVolume: 0
        RandomDelay: 0
        ClipStopTime: 0
        ClipStartTime: 0
        FadeIn: 0
        FadeOut: 0
        RandomStartPosition: 0
    - Name: Engine_Off
      Loop: 0
      loopSequenceCount: 0
      loopSequenceOverlap: 0
      loopSequenceRandomDelay: 0
      loopSequenceRandomPitch: 0
      loopSequenceRandomVolume: 0
      DestroyOnLoad: 1
      Volume: 1
      SubItemPickMode: 2
      MinTimeBetweenPlayCalls: 0.1
      MaxInstanceCount: 0
      Delay: 0
      overrideAudioSourceSettings: 0
      audioSource_MinDistance: 1
      audioSource_MaxDistance: 500
      spatialBlend: 0
      subItems:
      - SubItemType: 0
        Probability: 1
        DisableOtherSubitems: 0
        ItemModeAudioID: 
        Clip: {fileID: 8300000, guid: c2a85e668fb0f4e489c6b815f00bbe08, type: 3}
        Volume: 1
        PitchShift: 0
        Pan2D: 0
        Delay: 0
        RandomPitch: 0
        RandomVolume: 0
        RandomDelay: 0
        ClipStopTime: 0
        ClipStartTime: 2
        FadeIn: 0
        FadeOut: 0
        RandomStartPosition: 0
    - Name: Empty_Fuel
      Loop: 0
      loopSequenceCount: 0
      loopSequenceOverlap: 0
      loopSequenceRandomDelay: 0
      loopSequenceRandomPitch: 0
      loopSequenceRandomVolume: 0
      DestroyOnLoad: 1
      Volume: 1
      SubItemPickMode: 2
      MinTimeBetweenPlayCalls: 0.1
      MaxInstanceCount: 0
      Delay: 0
      overrideAudioSourceSettings: 0
      audioSource_MinDistance: 1
      audioSource_MaxDistance: 500
      spatialBlend: 0
      subItems:
      - SubItemType: 0
        Probability: 1
        DisableOtherSubitems: 0
        ItemModeAudioID: 
        Clip: {fileID: 8300000, guid: f503b61d9d6e321429dd8cff7c9fc2f0, type: 3}
        Volume: 1
        PitchShift: 0
        Pan2D: 0
        Delay: 0
        RandomPitch: 0
        RandomVolume: 0
        RandomDelay: 0
        ClipStopTime: 0
        ClipStartTime: 0
        FadeIn: 0
        FadeOut: 0
        RandomStartPosition: 0
    - Name: Bus_Door
      Loop: 0
      loopSequenceCount: 0
      loopSequenceOverlap: 0
      loopSequenceRandomDelay: 0
      loopSequenceRandomPitch: 0
      loopSequenceRandomVolume: 0
      DestroyOnLoad: 1
      Volume: 1
      SubItemPickMode: 2
      MinTimeBetweenPlayCalls: 0.1
      MaxInstanceCount: 0
      Delay: 0
      overrideAudioSourceSettings: 0
      audioSource_MinDistance: 1
      audioSource_MaxDistance: 500
      spatialBlend: 0
      subItems:
      - SubItemType: 0
        Probability: 1
        DisableOtherSubitems: 0
        ItemModeAudioID: 
        Clip: {fileID: 8300000, guid: 735cc87302d66a44ba28da3af4077375, type: 3}
        Volume: 1
        PitchShift: 0
        Pan2D: 0
        Delay: 0
        RandomPitch: 0
        RandomVolume: 0
        RandomDelay: 0
        ClipStopTime: 0
        ClipStartTime: 0
        FadeIn: 0
        FadeOut: 0
        RandomStartPosition: 0
    - Name: Thunder
      Loop: 0
      loopSequenceCount: 0
      loopSequenceOverlap: 0
      loopSequenceRandomDelay: 0
      loopSequenceRandomPitch: 0
      loopSequenceRandomVolume: 0
      DestroyOnLoad: 1
      Volume: 1
      SubItemPickMode: 2
      MinTimeBetweenPlayCalls: 0
      MaxInstanceCount: 0
      Delay: 0
      overrideAudioSourceSettings: 0
      audioSource_MinDistance: 1
      audioSource_MaxDistance: 500
      spatialBlend: 0
      subItems:
      - SubItemType: 0
        Probability: 1
        DisableOtherSubitems: 0
        ItemModeAudioID: 
        Clip: {fileID: 8300000, guid: c15b8482d6f104c4a9ea58b4c555fd4b, type: 3}
        Volume: 1
        PitchShift: 0
        Pan2D: 0
        Delay: 0
        RandomPitch: 5
        RandomVolume: 0.5
        RandomDelay: 1
        ClipStopTime: 0
        ClipStartTime: 0
        FadeIn: 0
        FadeOut: 0
        RandomStartPosition: 0
    - Name: Bocah_Cheer
      Loop: 0
      loopSequenceCount: 0
      loopSequenceOverlap: 0
      loopSequenceRandomDelay: 0
      loopSequenceRandomPitch: 0
      loopSequenceRandomVolume: 0
      DestroyOnLoad: 1
      Volume: 1
      SubItemPickMode: 2
      MinTimeBetweenPlayCalls: 0.1
      MaxInstanceCount: 0
      Delay: 0
      overrideAudioSourceSettings: 0
      audioSource_MinDistance: 1
      audioSource_MaxDistance: 500
      spatialBlend: 0
      subItems:
      - SubItemType: 0
        Probability: 1
        DisableOtherSubitems: 0
        ItemModeAudioID: 
        Clip: {fileID: 8300000, guid: 4e3e80d14234b724f9fda683e01ee5a6, type: 3}
        Volume: 1
        PitchShift: 0
        Pan2D: 0
        Delay: 0
        RandomPitch: 0
        RandomVolume: 0
        RandomDelay: 0
        ClipStopTime: 0
        ClipStartTime: 0
        FadeIn: 0
        FadeOut: 0
        RandomStartPosition: 0
    - Name: Bocah_Boo
      Loop: 0
      loopSequenceCount: 0
      loopSequenceOverlap: 0
      loopSequenceRandomDelay: 0
      loopSequenceRandomPitch: 0
      loopSequenceRandomVolume: 0
      DestroyOnLoad: 1
      Volume: 1
      SubItemPickMode: 2
      MinTimeBetweenPlayCalls: 0.1
      MaxInstanceCount: 0
      Delay: 0
      overrideAudioSourceSettings: 0
      audioSource_MinDistance: 1
      audioSource_MaxDistance: 500
      spatialBlend: 0
      subItems:
      - SubItemType: 0
        Probability: 1
        DisableOtherSubitems: 0
        ItemModeAudioID: 
        Clip: {fileID: 8300000, guid: fd428e4efa72b8d47aa9f265e9c013e3, type: 3}
        Volume: 1
        PitchShift: 0
        Pan2D: 0
        Delay: 0
        RandomPitch: 0
        RandomVolume: 0
        RandomDelay: 0
        ClipStopTime: 0
        ClipStartTime: 0
        FadeIn: 0
        FadeOut: 0
        RandomStartPosition: 0
    - Name: Camera_Click
      Loop: 0
      loopSequenceCount: 0
      loopSequenceOverlap: 0
      loopSequenceRandomDelay: 0
      loopSequenceRandomPitch: 0
      loopSequenceRandomVolume: 0
      DestroyOnLoad: 1
      Volume: 1
      SubItemPickMode: 2
      MinTimeBetweenPlayCalls: 0.1
      MaxInstanceCount: 0
      Delay: 0
      overrideAudioSourceSettings: 0
      audioSource_MinDistance: 1
      audioSource_MaxDistance: 500
      spatialBlend: 0
      subItems:
      - SubItemType: 0
        Probability: 1
        DisableOtherSubitems: 0
        ItemModeAudioID: 
        Clip: {fileID: 8300000, guid: e4bda70418412014f80283bf94d2ef91, type: 3}
        Volume: 1
        PitchShift: 0
        Pan2D: 0
        Delay: 0
        RandomPitch: 0
        RandomVolume: 0
        RandomDelay: 0
        ClipStopTime: 0
        ClipStartTime: 0
        FadeIn: 0
        FadeOut: 0
        RandomStartPosition: 0
    - Name: Spok2
      Loop: 0
      loopSequenceCount: 0
      loopSequenceOverlap: 0
      loopSequenceRandomDelay: 0
      loopSequenceRandomPitch: 0
      loopSequenceRandomVolume: 0
      DestroyOnLoad: 1
      Volume: 1
      SubItemPickMode: 2
      MinTimeBetweenPlayCalls: 0.1
      MaxInstanceCount: 0
      Delay: 0
      overrideAudioSourceSettings: 0
      audioSource_MinDistance: 1
      audioSource_MaxDistance: 500
      spatialBlend: 0
      subItems:
      - SubItemType: 0
        Probability: 1
        DisableOtherSubitems: 0
        ItemModeAudioID: 
        Clip: {fileID: 8300000, guid: f32c37f0a1c574e48a42d59476037436, type: 3}
        Volume: 1
        PitchShift: 0
        Pan2D: 0
        Delay: 0
        RandomPitch: 0
        RandomVolume: 0
        RandomDelay: 0
        ClipStopTime: 0
        ClipStartTime: 0
        FadeIn: 0
        FadeOut: 0
        RandomStartPosition: 0
    _volume: 0.78
  - Name: Klakson
    _parentCategoryName: 
    AudioObjectPrefab: {fileID: 0}
    AudioItems:
    - Name: Klakson-1
      Loop: 0
      loopSequenceCount: 0
      loopSequenceOverlap: 0
      loopSequenceRandomDelay: 0
      loopSequenceRandomPitch: 0
      loopSequenceRandomVolume: 0
      DestroyOnLoad: 1
      Volume: 1
      SubItemPickMode: 2
      MinTimeBetweenPlayCalls: 0.1
      MaxInstanceCount: 0
      Delay: 0
      overrideAudioSourceSettings: 0
      audioSource_MinDistance: 1
      audioSource_MaxDistance: 500
      spatialBlend: 0
      subItems:
      - SubItemType: 0
        Probability: 1
        DisableOtherSubitems: 0
        ItemModeAudioID: 
        Clip: {fileID: 8300000, guid: 012ccbbc20e71ae40a837a65d2a12963, type: 3}
        Volume: 1
        PitchShift: 0
        Pan2D: 0
        Delay: 0
        RandomPitch: 0
        RandomVolume: 0
        RandomDelay: 0
        ClipStopTime: 0
        ClipStartTime: 0
        FadeIn: 0
        FadeOut: 0
        RandomStartPosition: 0
    - Name: Klakson-2
      Loop: 0
      loopSequenceCount: 0
      loopSequenceOverlap: 0
      loopSequenceRandomDelay: 0
      loopSequenceRandomPitch: 0
      loopSequenceRandomVolume: 0
      DestroyOnLoad: 1
      Volume: 1
      SubItemPickMode: 2
      MinTimeBetweenPlayCalls: 0.1
      MaxInstanceCount: 0
      Delay: 0
      overrideAudioSourceSettings: 0
      audioSource_MinDistance: 1
      audioSource_MaxDistance: 500
      spatialBlend: 0
      subItems:
      - SubItemType: 0
        Probability: 1
        DisableOtherSubitems: 0
        ItemModeAudioID: 
        Clip: {fileID: 8300000, guid: 3d9a07d52e662fe4d8de412203f260d7, type: 3}
        Volume: 1
        PitchShift: 0
        Pan2D: 0
        Delay: 0
        RandomPitch: 0
        RandomVolume: 0
        RandomDelay: 0
        ClipStopTime: 0
        ClipStartTime: 0
        FadeIn: 0
        FadeOut: 0
        RandomStartPosition: 0
    - Name: Klakson-3
      Loop: 0
      loopSequenceCount: 0
      loopSequenceOverlap: 0
      loopSequenceRandomDelay: 0
      loopSequenceRandomPitch: 0
      loopSequenceRandomVolume: 0
      DestroyOnLoad: 1
      Volume: 1
      SubItemPickMode: 2
      MinTimeBetweenPlayCalls: 0.1
      MaxInstanceCount: 0
      Delay: 0
      overrideAudioSourceSettings: 0
      audioSource_MinDistance: 1
      audioSource_MaxDistance: 500
      spatialBlend: 0
      subItems:
      - SubItemType: 0
        Probability: 1
        DisableOtherSubitems: 0
        ItemModeAudioID: 
        Clip: {fileID: 8300000, guid: 18e66d2a37767aa4f94e6ff0eb3533df, type: 3}
        Volume: 1
        PitchShift: 0
        Pan2D: 0
        Delay: 0
        RandomPitch: 0
        RandomVolume: 0
        RandomDelay: 0
        ClipStopTime: 0
        ClipStartTime: 0
        FadeIn: 0
        FadeOut: 0
        RandomStartPosition: 0
    - Name: Klakson-4
      Loop: 0
      loopSequenceCount: 0
      loopSequenceOverlap: 0
      loopSequenceRandomDelay: 0
      loopSequenceRandomPitch: 0
      loopSequenceRandomVolume: 0
      DestroyOnLoad: 1
      Volume: 1
      SubItemPickMode: 2
      MinTimeBetweenPlayCalls: 0.1
      MaxInstanceCount: 0
      Delay: 0
      overrideAudioSourceSettings: 0
      audioSource_MinDistance: 1
      audioSource_MaxDistance: 500
      spatialBlend: 0
      subItems:
      - SubItemType: 0
        Probability: 1
        DisableOtherSubitems: 0
        ItemModeAudioID: 
        Clip: {fileID: 8300000, guid: 9b07a49d94b1abc45999c2dd55adfc20, type: 3}
        Volume: 1
        PitchShift: 0
        Pan2D: 0
        Delay: 0
        RandomPitch: 0
        RandomVolume: 0
        RandomDelay: 0
        ClipStopTime: 0
        ClipStartTime: 0
        FadeIn: 0
        FadeOut: 0
        RandomStartPosition: 0
    - Name: Klakson-5
      Loop: 0
      loopSequenceCount: 0
      loopSequenceOverlap: 0
      loopSequenceRandomDelay: 0
      loopSequenceRandomPitch: 0
      loopSequenceRandomVolume: 0
      DestroyOnLoad: 1
      Volume: 1
      SubItemPickMode: 2
      MinTimeBetweenPlayCalls: 0.1
      MaxInstanceCount: 0
      Delay: 0
      overrideAudioSourceSettings: 0
      audioSource_MinDistance: 1
      audioSource_MaxDistance: 500
      spatialBlend: 0
      subItems:
      - SubItemType: 0
        Probability: 1
        DisableOtherSubitems: 0
        ItemModeAudioID: 
        Clip: {fileID: 8300000, guid: 13fa7fb9411eb0b4e9b97d0850b18eb2, type: 3}
        Volume: 1
        PitchShift: 0
        Pan2D: 0
        Delay: 0
        RandomPitch: 0
        RandomVolume: 0
        RandomDelay: 0
        ClipStopTime: 0
        ClipStartTime: 0
        FadeIn: 0
        FadeOut: 0
        RandomStartPosition: 0
    _volume: 1
  - Name: Telolet
    _parentCategoryName: 
    AudioObjectPrefab: {fileID: 0}
    AudioItems:
    - Name: Telolet-1
      Loop: 0
      loopSequenceCount: 0
      loopSequenceOverlap: 0
      loopSequenceRandomDelay: 0
      loopSequenceRandomPitch: 0
      loopSequenceRandomVolume: 0
      DestroyOnLoad: 1
      Volume: 1
      SubItemPickMode: 2
      MinTimeBetweenPlayCalls: 0.1
      MaxInstanceCount: 0
      Delay: 0
      overrideAudioSourceSettings: 0
      audioSource_MinDistance: 1
      audioSource_MaxDistance: 500
      spatialBlend: 0
      subItems:
      - SubItemType: 0
        Probability: 1
        DisableOtherSubitems: 0
        ItemModeAudioID: 
        Clip: {fileID: 8300000, guid: 4f47533dd3aec5646b61487e6bb229be, type: 3}
        Volume: 1
        PitchShift: 0
        Pan2D: 0
        Delay: 0
        RandomPitch: 0
        RandomVolume: 0
        RandomDelay: 0
        ClipStopTime: 0
        ClipStartTime: 0
        FadeIn: 0
        FadeOut: 0
        RandomStartPosition: 0
    - Name: Telolet-2
      Loop: 0
      loopSequenceCount: 0
      loopSequenceOverlap: 0
      loopSequenceRandomDelay: 0
      loopSequenceRandomPitch: 0
      loopSequenceRandomVolume: 0
      DestroyOnLoad: 1
      Volume: 1
      SubItemPickMode: 2
      MinTimeBetweenPlayCalls: 0.1
      MaxInstanceCount: 0
      Delay: 0
      overrideAudioSourceSettings: 0
      audioSource_MinDistance: 1
      audioSource_MaxDistance: 500
      spatialBlend: 0
      subItems:
      - SubItemType: 0
        Probability: 1
        DisableOtherSubitems: 0
        ItemModeAudioID: 
        Clip: {fileID: 8300000, guid: 86213e0fd81259e4aa36ec5ec2774fc8, type: 3}
        Volume: 1
        PitchShift: 0
        Pan2D: 0
        Delay: 0
        RandomPitch: 0
        RandomVolume: 0
        RandomDelay: 0
        ClipStopTime: 0
        ClipStartTime: 0
        FadeIn: 0
        FadeOut: 0
        RandomStartPosition: 0
    - Name: Telolet-3
      Loop: 0
      loopSequenceCount: 0
      loopSequenceOverlap: 0
      loopSequenceRandomDelay: 0
      loopSequenceRandomPitch: 0
      loopSequenceRandomVolume: 0
      DestroyOnLoad: 1
      Volume: 1
      SubItemPickMode: 2
      MinTimeBetweenPlayCalls: 0.1
      MaxInstanceCount: 0
      Delay: 0
      overrideAudioSourceSettings: 0
      audioSource_MinDistance: 1
      audioSource_MaxDistance: 500
      spatialBlend: 0
      subItems:
      - SubItemType: 0
        Probability: 1
        DisableOtherSubitems: 0
        ItemModeAudioID: 
        Clip: {fileID: 8300000, guid: 79bc5ab1a3dd9c340a23f4643c9b7f97, type: 3}
        Volume: 1
        PitchShift: 0
        Pan2D: 0
        Delay: 0
        RandomPitch: 0
        RandomVolume: 0
        RandomDelay: 0
        ClipStopTime: 0
        ClipStartTime: 0
        FadeIn: 0
        FadeOut: 0
        RandomStartPosition: 0
    - Name: Telolet-4
      Loop: 0
      loopSequenceCount: 0
      loopSequenceOverlap: 0
      loopSequenceRandomDelay: 0
      loopSequenceRandomPitch: 0
      loopSequenceRandomVolume: 0
      DestroyOnLoad: 1
      Volume: 1
      SubItemPickMode: 2
      MinTimeBetweenPlayCalls: 0.1
      MaxInstanceCount: 0
      Delay: 0
      overrideAudioSourceSettings: 0
      audioSource_MinDistance: 1
      audioSource_MaxDistance: 500
      spatialBlend: 0
      subItems:
      - SubItemType: 0
        Probability: 1
        DisableOtherSubitems: 0
        ItemModeAudioID: 
        Clip: {fileID: 8300000, guid: fe3ace2677a7f6543be7ab627682673d, type: 3}
        Volume: 1
        PitchShift: 0
        Pan2D: 0
        Delay: 0
        RandomPitch: 0
        RandomVolume: 0
        RandomDelay: 0
        ClipStopTime: 0
        ClipStartTime: 0
        FadeIn: 0
        FadeOut: 0
        RandomStartPosition: 0
    - Name: Telolet-5
      Loop: 0
      loopSequenceCount: 0
      loopSequenceOverlap: 0
      loopSequenceRandomDelay: 0
      loopSequenceRandomPitch: 0
      loopSequenceRandomVolume: 0
      DestroyOnLoad: 1
      Volume: 1
      SubItemPickMode: 2
      MinTimeBetweenPlayCalls: 0.1
      MaxInstanceCount: 0
      Delay: 0
      overrideAudioSourceSettings: 0
      audioSource_MinDistance: 1
      audioSource_MaxDistance: 500
      spatialBlend: 0
      subItems:
      - SubItemType: 0
        Probability: 1
        DisableOtherSubitems: 0
        ItemModeAudioID: 
        Clip: {fileID: 8300000, guid: d8b96f0b37bab6e4f9d2e8898b5a7a59, type: 3}
        Volume: 1
        PitchShift: 0
        Pan2D: 0
        Delay: 0
        RandomPitch: 0
        RandomVolume: 0
        RandomDelay: 0
        ClipStopTime: 0
        ClipStartTime: 0
        FadeIn: 0
        FadeOut: 0
        RandomStartPosition: 0
    - Name: Telolet-6
      Loop: 0
      loopSequenceCount: 0
      loopSequenceOverlap: 0
      loopSequenceRandomDelay: 0
      loopSequenceRandomPitch: 0
      loopSequenceRandomVolume: 0
      DestroyOnLoad: 1
      Volume: 1
      SubItemPickMode: 2
      MinTimeBetweenPlayCalls: 0.1
      MaxInstanceCount: 0
      Delay: 0
      overrideAudioSourceSettings: 0
      audioSource_MinDistance: 1
      audioSource_MaxDistance: 500
      spatialBlend: 0
      subItems:
      - SubItemType: 0
        Probability: 1
        DisableOtherSubitems: 0
        ItemModeAudioID: 
        Clip: {fileID: 8300000, guid: 680f9167fe08b12438e5a0eabe1b355d, type: 3}
        Volume: 1
        PitchShift: 0
        Pan2D: 0
        Delay: 0
        RandomPitch: 0
        RandomVolume: 0
        RandomDelay: 0
        ClipStopTime: 0
        ClipStartTime: 0
        FadeIn: 0
        FadeOut: 0
        RandomStartPosition: 0
    - Name: Telolet-7
      Loop: 0
      loopSequenceCount: 0
      loopSequenceOverlap: 0
      loopSequenceRandomDelay: 0
      loopSequenceRandomPitch: 0
      loopSequenceRandomVolume: 0
      DestroyOnLoad: 1
      Volume: 1
      SubItemPickMode: 2
      MinTimeBetweenPlayCalls: 0.1
      MaxInstanceCount: 0
      Delay: 0
      overrideAudioSourceSettings: 0
      audioSource_MinDistance: 1
      audioSource_MaxDistance: 500
      spatialBlend: 0
      subItems:
      - SubItemType: 0
        Probability: 1
        DisableOtherSubitems: 0
        ItemModeAudioID: 
        Clip: {fileID: 8300000, guid: 8c322a9c2312ae541ae689a0846470a7, type: 3}
        Volume: 1
        PitchShift: 0
        Pan2D: 0
        Delay: 0
        RandomPitch: 0
        RandomVolume: 0
        RandomDelay: 0
        ClipStopTime: 0
        ClipStartTime: 0
        FadeIn: 0
        FadeOut: 0
        RandomStartPosition: 0
    - Name: Telolet-8
      Loop: 0
      loopSequenceCount: 0
      loopSequenceOverlap: 0
      loopSequenceRandomDelay: 0
      loopSequenceRandomPitch: 0
      loopSequenceRandomVolume: 0
      DestroyOnLoad: 1
      Volume: 1
      SubItemPickMode: 2
      MinTimeBetweenPlayCalls: 0.1
      MaxInstanceCount: 0
      Delay: 0
      overrideAudioSourceSettings: 0
      audioSource_MinDistance: 1
      audioSource_MaxDistance: 500
      spatialBlend: 0
      subItems:
      - SubItemType: 0
        Probability: 1
        DisableOtherSubitems: 0
        ItemModeAudioID: 
        Clip: {fileID: 8300000, guid: 1f7667805dfce0e488d18479e2603d7d, type: 3}
        Volume: 1
        PitchShift: 0
        Pan2D: 0
        Delay: 0
        RandomPitch: 0
        RandomVolume: 0
        RandomDelay: 0
        ClipStopTime: 0
        ClipStartTime: 0
        FadeIn: 0
        FadeOut: 0
        RandomStartPosition: 0
    _volume: 1
  musicPlaylist:
  - Bassoon
  - Flute
  - Windbells
  - Oboe
  loopPlaylist: 1
  shufflePlaylist: 0
  crossfadePlaylist: 0
  delayBetweenPlaylistTracks: 1
  _isAdditionalAudioController: 0
  _audioDisabled: 0
  _volume: 1
  _currentInspectorSelection:
    currentCategoryIndex: 1
    currentItemIndex: 19
    currentSubitemIndex: 0
    currentPlaylistIndex: 0
--- !u!114 &7856616412041422457
MonoBehaviour:
  m_ObjectHideFlags: 0
  m_CorrespondingSourceObject: {fileID: 0}
  m_PrefabInstance: {fileID: 0}
  m_PrefabAsset: {fileID: 0}
  m_GameObject: {fileID: 100000}
  m_Enabled: 1
  m_EditorHideFlags: 0
  m_Script: {fileID: 11500000, guid: ff3fc3ad6b8d0c74db86e121f958add8, type: 3}
  m_Name: 
  m_EditorClassIdentifier: 
