# 3ds Max Wavefront OBJ Exporter v0.97b - (c)2007 guruware
# File Created: 07.10.2019 12:44:03

mtllib bukit.mtl

#
# object Plane002
#

v  -129.7589 34.8123 37.4106
v  -122.6078 37.1081 41.0136
v  -118.0575 47.9996 21.2698
v  -130.5744 38.5457 23.2702
v  -113.2569 43.4268 36.2105
v  -105.6959 55.9294 20.7734
v  -90.2377 80.5255 -5.7166
v  -113.3680 60.1629 -3.7775
v  -129.5385 43.5786 -1.5781
v  49.5758 43.4776 36.0583
v  58.8308 37.1895 40.8341
v  54.1742 48.0612 21.1517
v  41.9466 55.9581 20.6458
v  65.8291 34.8864 37.2841
v  66.5559 38.6216 23.1914
v  65.4902 43.6284 -1.5676
v  49.3773 60.1861 -3.8039
v  26.2835 80.5044 -5.7687
v  -111.2299 69.7397 -28.8863
v  -129.2205 47.6032 -27.5032
v  -86.9192 93.9443 -30.2194
v  -85.7287 99.9560 -54.8079
v  -110.4977 73.8501 -54.4846
v  -129.1282 49.3412 -54.0800
v  -60.6130 101.3825 -12.1264
v  -60.1034 110.3912 -30.6637
v  -32.0301 108.8335 -12.1266
v  -32.0259 116.6720 -30.6699
v  -32.0183 121.2058 -54.9351
v  -59.2915 115.8279 -54.9245
v  -3.4208 101.3638 -12.1500
v  -3.9301 110.3786 -30.6888
v  22.9059 93.9299 -30.2493
v  21.7021 99.9579 -54.8232
v  -4.7414 115.8297 -54.9402
v  47.2036 69.7447 -28.8806
v  65.1754 47.6262 -27.4637
v  65.1066 49.3369 -54.0364
v  46.4751 73.8487 -54.4679
v  -110.0260 69.6138 -81.0005
v  -128.7694 47.5140 -80.8834
v  -85.2599 93.6481 -81.0055
v  -85.1223 78.9493 -107.2177
v  -109.7295 60.2652 -107.1662
v  -128.3816 43.5144 -107.1080
v  -59.0067 109.6474 -81.0221
v  -32.0136 115.6435 -81.0314
v  -32.0172 99.0832 -107.3709
v  -58.9566 93.1201 -107.3154
v  -5.0282 109.6678 -81.0144
v  21.2231 93.6724 -80.9845
v  21.0765 78.9746 -107.1810
v  -5.0888 93.1440 -107.2961
v  46.0140 69.6095 -80.9553
v  64.7790 47.4825 -80.8253
v  64.4153 43.4576 -107.0559
v  45.7265 60.2469 -107.1159
v  -109.5230 49.0387 -131.7136
v  -128.2023 38.7352 -131.9486
v  -84.9255 59.7883 -131.8500
v  -84.8472 42.6611 -150.4229
v  -109.7822 38.7856 -150.2225
v  -123.9181 35.5016 -145.9209
v  -58.8491 67.5163 -132.1631
v  -32.0342 70.6233 -132.3656
v  -32.0471 43.6785 -151.1813
v  -58.7420 43.8012 -150.8800
v  -5.2211 67.5097 -132.1699
v  20.8699 59.7654 -131.8608
v  20.7896 42.5952 -150.4820
v  -5.3433 43.7654 -150.9141
v  45.5187 48.9806 -131.7231
v  64.2382 38.6565 -131.9538
v  59.9324 35.4230 -145.9629
v  45.7717 38.7014 -150.2886
v  -138.4239 26.6306 0.7710
v  -138.4496 23.6145 27.3638
v  -139.7068 25.5669 27.5043
v  -139.8443 28.5096 0.5374
v  -134.9394 21.8777 47.2850
v  -135.8556 23.9160 47.8406
v  -135.2725 26.8110 46.6188
v  -138.9516 28.5114 26.6610
v  -139.0897 31.4210 0.0380
v  -124.3392 23.5931 53.9046
v  -124.6658 25.7000 54.7120
v  -110.6552 32.1910 47.2267
v  -110.4252 34.3427 48.1337
v  -110.8619 36.7158 46.6630
v  -124.5654 28.3366 53.2994
v  -97.8933 51.1017 27.2557
v  -97.4217 53.2680 28.1210
v  -81.9704 72.8105 7.2822
v  -81.5052 74.9836 8.0941
v  -82.3272 77.3534 6.6741
v  -98.1933 55.5758 26.6700
v  -58.8035 89.8030 0.5969
v  -58.5256 91.9971 1.4732
v  -32.0147 97.1201 0.5761
v  -32.0137 99.3283 1.5146
v  -32.0165 101.8890 0.0439
v  -59.0308 94.4854 0.0293
v  -5.2263 89.8027 0.5960
v  -5.5002 91.9971 1.4748
v  18.0116 72.8098 7.2807
v  17.5512 74.9824 8.0965
v  18.3758 77.3479 6.6654
v  -4.9968 94.4818 0.0262
v  34.1490 51.1002 27.2546
v  33.6768 53.2633 28.1225
v  47.0544 32.1888 47.2263
v  46.8195 34.3341 48.1337
v  47.2529 36.7129 46.6338
v  34.4487 55.5712 26.6504
v  60.5965 23.5905 53.9045
v  60.9222 25.6891 54.7107
v  70.9829 21.8752 47.2852
v  71.9037 23.9053 47.8391
v  71.3188 26.8094 46.5938
v  60.8191 28.3341 53.2679
v  74.4215 23.6128 27.3644
v  75.6826 25.5598 27.5048
v  74.3952 26.6299 0.7715
v  75.8168 28.5068 0.5389
v  75.0570 31.4259 0.0437
v  74.9237 28.5135 26.6525
v  74.3871 28.7530 -25.8638
v  75.8642 30.6004 -26.2274
v  74.3875 29.5916 -52.5201
v  75.8657 31.4355 -52.8924
v  75.1669 34.3702 -53.3403
v  75.1421 33.5262 -26.6328
v  74.3865 28.7548 -79.1756
v  75.8619 30.6073 -79.5547
v  74.3913 26.6427 -105.8145
v  75.8139 28.4804 -106.3223
v  75.0157 31.3790 -106.7379
v  75.1190 33.5142 -80.0420
v  74.4088 23.6554 -132.4209
v  75.6826 25.4199 -133.3033
v  67.7846 21.9503 -152.3536
v  68.7764 23.6295 -153.6662
v  68.0776 26.6588 -153.4831
v  74.8743 28.3856 -133.4281
v  47.8640 23.6849 -158.9718
v  48.4038 25.3135 -160.5793
v  21.2736 25.5979 -158.9429
v  21.4100 27.1939 -160.7220
v  21.3130 30.1665 -160.4174
v  48.0084 28.3229 -160.2737
v  -5.3601 24.4281 -158.9344
v  -5.3602 25.9928 -160.7738
v  -32.0150 23.0726 -158.9352
v  -32.0167 24.6222 -160.7770
v  -32.0232 27.6279 -160.5802
v  -5.3620 28.9780 -160.5319
v  -58.6690 24.4284 -158.9343
v  -58.6692 25.9939 -160.7736
v  -85.3015 25.5984 -158.9428
v  -85.4347 27.1956 -160.7215
v  -85.3402 30.1810 -160.4054
v  -58.6769 28.9865 -160.5251
v  -111.8922 23.6852 -158.9716
v  -112.4297 25.3148 -160.5785
v  -131.8135 21.9504 -152.3536
v  -132.8053 23.6298 -153.6661
v  -132.0978 26.6730 -153.4733
v  -112.0304 28.3387 -160.2598
v  -138.4380 23.6552 -132.4215
v  -139.7123 25.4190 -133.3058
v  -138.4204 26.6423 -105.8154
v  -139.8434 28.4788 -106.3258
v  -139.0342 31.3870 -106.7509
v  -138.8927 28.3971 -133.4311
v  -138.4155 28.7544 -79.1755
v  -139.8912 30.6059 -79.5541
v  -138.4164 29.5915 -52.5190
v  -139.8947 31.4351 -52.8882
v  -139.1948 34.3705 -53.3421
v  -139.1416 33.5184 -80.0506
v  -138.4160 28.7532 -25.8634
v  -139.8930 30.6010 -26.2256
v  -139.1742 33.5227 -26.6378
v  -136.7233 32.4437 25.1584
v  -136.8834 35.2210 -0.4867
v  -133.5525 30.6213 44.0500
v  -124.3283 31.3466 50.2117
v  -112.1239 38.8742 43.4064
v  -100.0130 57.4588 23.3971
v  -83.9753 79.3625 3.4424
v  -59.9910 96.8472 -3.1996
v  -32.0245 104.4816 -3.1959
v  -4.0400 96.8344 -3.2135
v  20.0388 79.3482 3.4053
v  36.2884 57.4655 23.3184
v  48.5298 38.9063 43.2917
v  60.5838 31.3907 50.0909
v  69.5873 30.6678 43.9543
v  72.6769 32.4866 25.1198
v  72.8325 35.2541 -0.4718
v  73.0337 37.3774 -26.8797
v  73.1255 38.2574 -53.6911
v  72.9527 37.2950 -80.4932
v  72.6973 35.1032 -106.9562
v  72.5415 32.2947 -132.7502
v  66.0697 30.7378 -151.8735
v  46.8663 32.3005 -158.3245
v  21.0218 34.0146 -158.5024
v  -5.3733 32.9118 -158.8067
v  -32.0384 31.6633 -158.9839
v  -58.6928 32.9401 -158.7806
v  -85.0649 34.0641 -158.4570
v  -110.8830 32.3573 -158.2729
v  -130.0638 30.7932 -151.8350
v  -136.5241 32.3453 -132.7499
v  -136.6817 35.1436 -106.9906
v  -136.9544 37.3183 -80.5302
v  -137.1499 38.2603 -53.7193
v  -137.0760 37.3605 -26.9087
v  -85.0043 71.4823 -10.6322
v  -101.6693 47.0599 14.7198
v  -112.2538 39.2218 16.5637
v  -106.1554 51.7018 -6.8655
v  -110.3613 34.8718 29.4803
v  -118.3573 28.4766 34.8188
v  -123.7548 26.9513 32.0091
v  -123.3004 30.6783 19.4435
v  -120.8342 36.2043 -3.4214
v  57.0652 35.8319 -3.5274
v  59.5206 30.0667 20.0204
v  48.2016 38.6666 17.4754
v  42.0277 51.5133 -6.6848
v  59.8986 26.3144 32.9736
v  54.4275 27.7193 36.2272
v  46.3530 34.3501 30.6962
v  37.3918 46.7247 15.7368
v  20.4910 71.6241 -10.2544
v  -79.6775 90.3748 -54.7890
v  -80.9981 84.4683 -32.6221
v  -103.3244 61.3616 -30.4016
v  -102.4938 65.4397 -54.3258
v  -119.8517 40.5603 -28.1222
v  -119.7306 42.3303 -53.8048
v  -31.9882 110.1211 -54.7924
v  -31.9414 105.8220 -33.3520
v  -56.8713 99.9578 -33.3832
v  -56.0303 105.2230 -54.8748
v  -31.9175 98.8084 -17.3005
v  -57.6935 91.6720 -17.2713
v  15.5988 90.3569 -54.6695
v  16.7178 84.5795 -32.4035
v  -7.2058 100.0527 -33.1955
v  -7.9873 105.2058 -54.7507
v  -6.4237 91.8137 -17.1063
v  55.6443 42.3726 -54.1652
v  55.9694 40.3988 -28.4493
v  39.2115 61.3322 -30.4657
v  38.3968 65.4540 -54.4685
v  -80.0276 70.3002 -101.8431
v  -79.4070 84.4764 -78.1801
v  -102.3963 61.1745 -78.9197
v  -103.0436 51.7371 -103.2160
v  -119.8485 40.0985 -79.6151
v  -120.4148 35.5711 -104.5903
v  -31.9918 89.6701 -101.1652
v  -32.0212 105.1289 -77.7331
v  -55.8674 99.6307 -77.8098
v  -56.2283 84.0488 -101.2368
v  16.1380 70.0911 -102.1463
v  15.4429 84.2750 -78.3539
v  -8.1122 99.4626 -77.8740
v  -7.6647 83.8513 -101.3964
v  55.8680 36.0406 -105.0206
v  55.5010 40.3583 -80.0949
v  38.2275 61.2094 -79.2939
v  38.8009 51.8879 -103.6310
v  -82.8343 35.0480 -142.1095
v  -81.3805 51.3730 -124.8258
v  -104.4471 40.2984 -126.2478
v  -106.0572 30.6443 -143.3338
v  -121.6390 30.4546 -127.7677
v  -118.4645 27.8375 -140.0689
v  -31.7447 37.3744 -141.4053
v  -31.8513 62.5691 -124.0800
v  -56.9585 59.3450 -124.2045
v  -57.7390 36.9641 -141.5724
v  19.0420 35.5928 -141.6213
v  17.5718 51.5622 -124.7361
v  -6.7290 59.4002 -124.1485
v  -5.8246 37.2607 -141.2911
v  54.0778 28.4871 -139.7221
v  57.0737 31.1044 -127.7246
v  40.2143 40.7789 -126.1691
v  41.8760 31.3403 -142.7877
v  -128.2882 21.9516 39.9275
v  -128.5739 20.7097 40.6074
v  -129.7106 23.0037 23.4793
v  -129.3941 24.2089 22.8180
v  -129.4103 20.2353 41.6096
v  -130.8659 22.5164 24.2548
v  -129.8386 26.0088 -0.0348
v  -128.5743 26.4797 -0.5832
v  -128.2894 27.5631 -1.1702
v  -111.8427 30.6160 37.6328
v  -112.1867 30.0879 38.1854
v  -122.1576 21.9034 45.5514
v  -122.0513 22.8370 44.9585
v  -112.0871 29.9616 39.3788
v  -122.3100 21.5666 46.6598
v  -81.4490 70.5056 -2.1015
v  -83.8925 70.3303 -1.3019
v  -100.3862 48.7663 18.3830
v  -98.8218 49.0393 17.6722
v  -85.6548 70.6057 0.1434
v  -101.2635 48.8713 19.7397
v  -32.0028 94.7355 -8.9922
v  -32.0206 94.4115 -8.6581
v  -59.8424 87.1715 -8.3157
v  -58.1848 87.4140 -8.8668
v  -32.0210 94.6922 -7.4796
v  -61.0769 87.4748 -7.0092
v  17.4074 70.5447 -2.0364
v  19.9115 70.3400 -1.3216
v  -4.2119 87.1715 -8.3288
v  -5.8767 87.4411 -8.8461
v  21.6599 70.6027 0.1134
v  -2.9782 87.4713 -7.0289
v  48.3014 30.6170 37.8706
v  48.6608 30.1592 38.1850
v  36.6773 48.8052 18.3701
v  35.0634 49.0603 17.8293
v  48.4889 29.9782 39.3730
v  37.5022 48.8770 19.7182
v  64.3030 21.9630 40.1163
v  64.5753 20.7982 40.6191
v  58.4374 21.9938 45.5619
v  58.3315 22.8437 45.2069
v  65.4331 20.2589 41.6193
v  58.5606 21.5899 46.6654
v  64.3016 27.5304 -1.2190
v  64.5337 26.5022 -0.5951
v  65.6428 23.0617 23.4749
v  65.3649 24.1975 22.8767
v  65.8054 26.0147 -0.0366
v  66.8221 22.5320 24.2586
v  63.8556 30.9016 -53.3358
v  64.1296 29.7145 -52.8715
v  64.1416 28.8374 -26.3151
v  63.8973 29.9450 -26.8779
v  65.4580 29.1613 -52.5149
v  65.4610 28.3123 -25.8858
v  64.2962 27.6338 -105.4052
v  64.5573 26.7202 -105.1599
v  64.1606 28.7805 -79.4509
v  63.8803 29.8605 -79.8286
v  65.7723 26.3087 -105.0360
v  65.4657 28.2981 -79.1497
v  60.8183 23.8002 -145.8380
v  60.9861 23.0767 -146.0135
v  65.6426 24.2183 -129.1049
v  65.4283 25.0337 -129.1144
v  61.7369 22.6079 -146.7804
v  66.6658 23.7794 -129.4194
v  20.1998 27.7312 -149.3709
v  20.3188 27.2077 -149.4339
v  44.1576 25.0974 -150.6133
v  44.0085 25.6738 -150.4578
v  20.4561 26.8221 -150.5067
v  44.5766 24.6922 -151.5992
v  -31.9423 26.0067 -148.9627
v  -31.9963 25.1502 -148.9792
v  -5.3686 26.3348 -149.0053
v  -5.4064 27.0497 -148.9743
v  -32.0099 24.4785 -150.1272
v  -5.3528 25.7875 -150.1337
v  -84.2430 27.6109 -149.4698
v  -84.3826 27.1933 -149.4379
v  -58.6558 26.3255 -149.0072
v  -58.5401 26.9797 -149.0305
v  -84.4938 26.8186 -150.5078
v  -58.6750 25.7852 -150.1342
v  -124.9196 23.6827 -145.9187
v  -125.0153 23.0742 -146.0145
v  -108.2118 25.0864 -150.6197
v  -108.0943 25.5427 -150.5724
v  -125.7659 22.6073 -146.7806
v  -108.6118 24.6895 -151.6009
v  -128.4111 27.5676 -105.2977
v  -128.5815 26.7340 -105.1308
v  -129.6647 24.2259 -129.0843
v  -129.5445 24.9387 -129.0892
v  -129.8000 26.3122 -105.0287
v  -130.6930 23.7813 -129.4143
v  -127.8914 30.8981 -53.3211
v  -128.1577 29.7174 -52.9062
v  -128.1867 28.7913 -79.4556
v  -127.9619 29.8260 -79.7581
v  -129.4867 29.1620 -52.5235
v  -129.4940 28.3008 -79.1509
v  -128.1718 28.8322 -26.3302
v  -127.8946 29.9684 -26.8376
v  -129.4902 28.3110 -25.8895
v  -127.1889 23.8515 37.9824
v  -128.1356 26.2206 21.5005
v  -126.9608 29.4814 -1.8197
v  -111.2059 31.0863 35.5838
v  -121.2038 24.0216 42.8323
v  -80.8761 71.0718 -3.8393
v  -98.2207 49.4014 15.7702
v  -31.9532 95.6570 -10.5268
v  -57.7999 88.2025 -10.4756
v  16.5965 71.1618 -3.5626
v  -6.2973 88.2991 -10.3809
v  47.4145 30.7297 36.5179
v  34.1570 49.2780 16.4032
v  63.2947 23.4597 38.7009
v  57.3995 23.5986 43.7832
v  63.1510 29.2390 -1.9509
v  64.2830 25.8881 21.7730
v  62.5789 32.9881 -53.7773
v  62.6856 31.8676 -27.4213
v  62.8831 29.3483 -105.4854
v  62.5229 31.8142 -80.1582
v  59.5839 25.2515 -144.9164
v  64.0252 26.5925 -128.6804
v  19.8461 29.0877 -148.2998
v  43.1943 27.0300 -149.3666
v  -31.8167 27.6342 -148.0688
v  -5.4711 28.5845 -147.9846
v  -83.7577 28.6782 -148.6756
v  -58.2503 28.3508 -148.2000
v  -123.9010 24.7939 -145.2344
v  -107.3245 26.5605 -149.7929
v  -127.2798 29.0139 -105.2009
v  -128.4370 26.1748 -128.6826
v  -126.6394 32.9595 -53.5452
v  -126.7764 31.6220 -79.8529
v  -126.5815 31.9868 -27.1845
v  -134.6408 22.6589 25.9152
v  -132.1615 20.6377 44.5217
v  -134.1052 25.9280 0.4985
v  -123.2956 22.1726 50.3324
v  -111.3929 30.6966 43.3505
v  -99.8032 49.6429 23.5796
v  -84.1839 71.3918 3.8184
v  -60.1923 88.3238 -3.1344
v  -32.0180 95.5849 -3.4117
v  -3.8510 88.3212 -3.1463
v  20.2039 71.3879 3.8003
v  36.0418 49.6400 23.5664
v  47.7822 30.6957 43.3464
v  59.5448 22.1731 50.3345
v  68.1975 20.6388 44.5267
v  70.6081 22.6596 25.9187
v  70.0753 25.9282 0.4993
v  69.8977 28.1373 -25.7427
v  69.8977 28.9769 -52.3960
v  69.8977 28.1373 -79.0493
v  70.0472 26.1009 -105.3200
v  70.4955 23.3502 -130.8255
v  64.7206 21.9211 -149.4760
v  46.2001 23.8496 -155.1819
v  20.8651 25.8798 -154.6071
v  -5.3538 24.7558 -154.4155
v  -32.0145 23.4053 -154.4155
v  -58.6752 24.7558 -154.4155
v  -84.8940 25.8798 -154.6071
v  -110.2291 23.8496 -155.1820
v  -128.7495 21.9211 -149.4760
v  -134.5245 23.3502 -130.8255
v  -134.0761 26.1009 -105.3200
v  -133.9267 28.1373 -79.0493
v  -133.9267 28.9769 -52.3960
v  -133.9267 28.1373 -25.7427
# 474 vertices

vn -0.4462 0.8549 0.2646
vn -0.3953 0.8212 0.4115
vn -0.5251 0.7954 0.3026
vn -0.6220 0.7621 0.1799
vn -0.2522 0.8068 0.5343
vn -0.4497 0.7782 0.4384
vn -0.5372 0.7592 0.3674
vn -0.6580 0.7193 0.2229
vn -0.7229 0.6833 0.1028
vn 0.2558 0.8075 0.5315
vn 0.3995 0.8205 0.4090
vn 0.5285 0.7946 0.2989
vn 0.4522 0.7789 0.4345
vn 0.4537 0.8516 0.2625
vn 0.6256 0.7597 0.1774
vn 0.7236 0.6826 0.1019
vn 0.6584 0.7195 0.2208
vn 0.5370 0.7601 0.3658
vn -0.7285 0.6705 0.1406
vn -0.7813 0.6211 0.0624
vn -0.5896 0.7685 0.2486
vn -0.6153 0.7881 -0.0177
vn -0.7591 0.6507 -0.0170
vn -0.8030 0.5960 -0.0077
vn -0.3546 0.8359 0.4190
vn -0.3552 0.8866 0.2964
vn 0.0003 0.9111 0.4122
vn 0.0002 0.9588 0.2841
vn -0.0000 0.9999 -0.0124
vn -0.3504 0.9365 -0.0129
vn 0.3546 0.8360 0.4188
vn 0.3553 0.8864 0.2968
vn 0.5894 0.7687 0.2485
vn 0.6152 0.7882 -0.0176
vn 0.3503 0.9365 -0.0124
vn 0.7284 0.6707 0.1400
vn 0.7813 0.6210 0.0622
vn 0.8030 0.5959 -0.0075
vn 0.7591 0.6507 -0.0169
vn -0.7169 0.6726 -0.1836
vn -0.7694 0.6337 -0.0809
vn -0.5798 0.7558 -0.3042
vn -0.4737 0.7325 -0.4889
vn -0.6068 0.7342 -0.3045
vn -0.6838 0.7177 -0.1313
vn -0.3450 0.8663 -0.3614
vn -0.0002 0.9298 -0.3680
vn -0.0001 0.7692 -0.6391
vn -0.2819 0.7481 -0.6007
vn 0.3448 0.8664 -0.3613
vn 0.5799 0.7557 -0.3043
vn 0.4740 0.7322 -0.4891
vn 0.2819 0.7480 -0.6009
vn 0.7170 0.6725 -0.1836
vn 0.7695 0.6336 -0.0807
vn 0.6839 0.7177 -0.1314
vn 0.6070 0.7339 -0.3047
vn -0.4016 0.8181 -0.4116
vn -0.5251 0.8138 -0.2489
vn -0.2736 0.7335 -0.6222
vn -0.0791 0.7083 -0.7015
vn -0.2326 0.8134 -0.5332
vn -0.3284 0.8854 -0.3291
vn -0.1414 0.6533 -0.7437
vn -0.0000 0.6195 -0.7850
vn -0.0002 0.5586 -0.8295
vn -0.0233 0.6039 -0.7967
vn 0.1415 0.6533 -0.7438
vn 0.2738 0.7333 -0.6223
vn 0.0792 0.7084 -0.7014
vn 0.0231 0.6039 -0.7967
vn 0.4018 0.8179 -0.4117
vn 0.5247 0.8141 -0.2491
vn 0.3276 0.8860 -0.3282
vn 0.2327 0.8137 -0.5327
vn -0.5165 -0.8522 -0.0835
vn -0.6037 -0.7969 -0.0226
vn -0.9856 -0.1436 0.0889
vn -0.9814 -0.1914 -0.0135
vn -0.5474 -0.7329 0.4040
vn -0.8114 -0.0672 0.5807
vn -0.7483 0.4661 0.4721
vn -0.9076 0.4017 0.1222
vn -0.9217 0.3857 0.0403
vn 0.1307 -0.6366 0.7601
vn -0.0766 0.0205 0.9968
vn 0.7562 -0.5241 0.3917
vn 0.5904 0.1132 0.7992
vn 0.0891 0.6726 0.7346
vn -0.2203 0.5593 0.7992
vn 0.8558 -0.5100 0.0869
vn 0.7282 0.1536 0.6679
vn 0.7634 -0.6205 0.1793
vn 0.4469 0.1183 0.8867
vn -0.1786 0.6554 0.7338
vn -0.0117 0.7026 0.7115
vn 0.4204 -0.6982 0.5795
vn 0.0491 0.1061 0.9931
vn -0.0000 -0.6843 0.7292
vn 0.0000 0.1348 0.9909
vn 0.0002 0.6682 0.7440
vn -0.2160 0.6348 0.7419
vn -0.4196 -0.6980 0.5803
vn -0.0487 0.1068 0.9931
vn -0.7618 -0.6208 0.1851
vn -0.4430 0.1198 0.8885
vn 0.1815 0.6576 0.7312
vn 0.2170 0.6366 0.7400
vn -0.8543 -0.5117 0.0914
vn -0.7234 0.1555 0.6727
vn -0.7569 -0.5242 0.3904
vn -0.5883 0.1161 0.8003
vn -0.0808 0.6765 0.7320
vn 0.0187 0.7049 0.7091
vn -0.1297 -0.6363 0.7604
vn 0.0795 0.0228 0.9966
vn 0.5480 -0.7346 0.4000
vn 0.8144 -0.0678 0.5764
vn 0.7510 0.4671 0.4667
vn 0.2256 0.5639 0.7944
vn 0.6022 -0.7980 -0.0241
vn 0.9856 -0.1448 0.0870
vn 0.5160 -0.8525 -0.0836
vn 0.9814 -0.1913 -0.0136
vn 0.9215 0.3863 0.0403
vn 0.9078 0.4016 0.1207
vn 0.4925 -0.8689 -0.0491
vn 0.9778 -0.2095 -0.0092
vn 0.4961 -0.8683 -0.0008
vn 0.9776 -0.2107 0.0014
vn 0.9356 0.3531 -0.0004
vn 0.9303 0.3662 0.0221
vn 0.4997 -0.8649 0.0474
vn 0.9795 -0.2013 0.0110
vn 0.5058 -0.8587 0.0825
vn 0.9827 -0.1847 0.0151
vn 0.9160 0.3988 -0.0427
vn 0.9268 0.3747 -0.0236
vn 0.5226 -0.8525 0.0100
vn 0.9686 -0.1963 -0.1525
vn 0.3480 -0.8812 -0.3200
vn 0.6853 -0.2682 -0.6771
vn 0.6506 0.3465 -0.6758
vn 0.9012 0.3873 -0.1944
vn -0.0098 -0.9120 -0.4100
vn 0.1464 -0.3140 -0.9381
vn -0.0145 -0.9430 -0.3324
vn -0.0014 -0.3455 -0.9384
vn 0.0087 0.2846 -0.9586
vn 0.1797 0.2990 -0.9372
vn 0.0450 -0.9493 -0.3110
vn 0.0193 -0.3814 -0.9242
vn 0.0000 -0.9525 -0.3044
vn -0.0000 -0.4045 -0.9145
vn -0.0001 0.2144 -0.9767
vn -0.0087 0.2448 -0.9695
vn -0.0450 -0.9493 -0.3112
vn -0.0192 -0.3803 -0.9247
vn 0.0145 -0.9429 -0.3327
vn 0.0013 -0.3436 -0.9391
vn -0.0088 0.2878 -0.9577
vn 0.0087 0.2469 -0.9690
vn 0.0097 -0.9119 -0.4103
vn -0.1466 -0.3119 -0.9387
vn -0.3480 -0.8812 -0.3200
vn -0.6854 -0.2668 -0.6775
vn -0.6499 0.3490 -0.6752
vn -0.1796 0.3023 -0.9361
vn -0.5224 -0.8526 0.0101
vn -0.9688 -0.1954 -0.1527
vn -0.5056 -0.8588 0.0825
vn -0.9829 -0.1837 0.0150
vn -0.9150 0.4011 -0.0429
vn -0.9003 0.3894 -0.1945
vn -0.4995 -0.8650 0.0474
vn -0.9796 -0.2007 0.0110
vn -0.4960 -0.8683 -0.0008
vn -0.9776 -0.2106 0.0014
vn -0.9354 0.3535 -0.0005
vn -0.9262 0.3763 -0.0238
vn -0.4926 -0.8689 -0.0491
vn -0.9777 -0.2098 -0.0092
vn -0.9305 0.3656 0.0221
vn -0.7705 0.6249 0.1257
vn -0.8061 0.5886 0.0612
vn -0.6018 0.7083 0.3689
vn -0.2681 0.7508 0.6037
vn -0.2045 0.7935 0.5731
vn -0.3546 0.7670 0.5347
vn -0.4133 0.7564 0.5070
vn -0.3224 0.7888 0.5234
vn 0.0002 0.8502 0.5265
vn 0.3228 0.7897 0.5217
vn 0.4138 0.7580 0.5042
vn 0.3572 0.7683 0.5311
vn 0.2088 0.7946 0.5701
vn 0.2736 0.7522 0.5994
vn 0.6060 0.7069 0.3647
vn 0.7723 0.6229 0.1243
vn 0.8064 0.5882 0.0610
vn 0.8358 0.5478 0.0356
vn 0.8493 0.5279 -0.0024
vn 0.8265 0.5615 -0.0403
vn 0.7834 0.6181 -0.0655
vn 0.7304 0.6592 -0.1787
vn 0.5065 0.6858 -0.5227
vn 0.1610 0.6307 -0.7591
vn 0.0143 0.5740 -0.8187
vn -0.0142 0.4978 -0.8672
vn -0.0002 0.4560 -0.8900
vn 0.0140 0.4989 -0.8666
vn -0.0145 0.5753 -0.8178
vn -0.1611 0.6316 -0.7583
vn -0.5063 0.6863 -0.5222
vn -0.7299 0.6597 -0.1787
vn -0.7826 0.6190 -0.0656
vn -0.8260 0.5622 -0.0405
vn -0.8492 0.5281 -0.0027
vn -0.8359 0.5477 0.0356
vn 0.5605 -0.7549 -0.3405
vn 0.5492 -0.7617 -0.3438
vn 0.5385 -0.7931 -0.2845
vn 0.6660 -0.7154 -0.2115
vn 0.3514 -0.8135 -0.4634
vn 0.4390 -0.8386 -0.3225
vn 0.3758 -0.8925 -0.2495
vn 0.6048 -0.7793 -0.1640
vn 0.7188 -0.6892 -0.0911
vn -0.7143 -0.6933 -0.0955
vn -0.5944 -0.7863 -0.1686
vn -0.5415 -0.7918 -0.2825
vn -0.6647 -0.7156 -0.2145
vn -0.3573 -0.9012 -0.2454
vn -0.4560 -0.8389 -0.2972
vn -0.3748 -0.8126 -0.4462
vn -0.5723 -0.7549 -0.3203
vn -0.5631 -0.7536 -0.3392
vn 0.6290 -0.7772 0.0158
vn 0.5999 -0.7592 -0.2524
vn 0.7360 -0.6631 -0.1364
vn 0.7678 -0.6404 0.0154
vn 0.7802 -0.6227 -0.0591
vn 0.8032 -0.5957 0.0053
vn -0.0005 -1.0000 0.0079
vn 0.0018 -0.9553 -0.2957
vn 0.3658 -0.8780 -0.3088
vn 0.3612 -0.9325 0.0075
vn 0.0019 -0.9119 -0.4104
vn 0.3677 -0.8329 -0.4136
vn -0.6295 -0.7768 0.0157
vn -0.6012 -0.7579 -0.2532
vn -0.3653 -0.8789 -0.3067
vn -0.3622 -0.9320 0.0109
vn -0.3661 -0.8321 -0.4167
vn -0.8027 -0.5964 0.0078
vn -0.7787 -0.6247 -0.0591
vn -0.7352 -0.6636 -0.1387
vn -0.7675 -0.6409 0.0151
vn 0.4784 -0.7269 0.4928
vn 0.5917 -0.7451 0.3078
vn 0.7256 -0.6646 0.1782
vn 0.6132 -0.7320 0.2969
vn 0.7689 -0.6350 0.0745
vn 0.6755 -0.7274 0.1207
vn -0.0006 -0.7570 0.6534
vn -0.0022 -0.9256 0.3786
vn 0.3544 -0.8584 0.3708
vn 0.2848 -0.7369 0.6130
vn -0.4764 -0.7295 0.4908
vn -0.5910 -0.7461 0.3067
vn -0.3562 -0.8574 0.3714
vn -0.2845 -0.7381 0.6118
vn -0.6757 -0.7275 0.1192
vn -0.7682 -0.6357 0.0764
vn -0.7247 -0.6657 0.1781
vn -0.6117 -0.7340 0.2950
vn 0.0707 -0.7246 0.6856
vn 0.2676 -0.7324 0.6261
vn 0.4014 -0.8216 0.4047
vn 0.2209 -0.8500 0.4783
vn 0.4836 -0.8447 0.2294
vn 0.2739 -0.9251 0.2628
vn -0.0013 -0.5656 0.8247
vn -0.0002 -0.6095 0.7928
vn 0.1352 -0.6457 0.7515
vn 0.0171 -0.6119 0.7908
vn -0.0694 -0.7234 0.6869
vn -0.2653 -0.7337 0.6255
vn -0.1347 -0.6461 0.7512
vn -0.0184 -0.6119 0.7907
vn -0.2836 -0.9196 0.2718
vn -0.4901 -0.8413 0.2278
vn -0.3999 -0.8229 0.4036
vn -0.2199 -0.8458 0.4861
vn 0.7682 -0.5298 -0.3595
vn 0.5318 -0.7946 -0.2929
vn 0.7033 -0.7019 -0.1127
vn 0.9032 -0.4246 -0.0634
vn 0.0389 -0.9979 -0.0527
vn 0.0970 -0.9852 -0.1416
vn 0.1588 -0.9810 -0.1116
vn 0.7349 -0.6763 -0.0515
vn 0.9039 -0.4270 -0.0239
vn 0.0953 -0.8413 -0.5321
vn 0.4974 -0.7773 -0.3852
vn 0.4513 -0.8008 -0.3939
vn 0.2298 -0.6789 -0.6974
vn 0.7177 -0.6926 -0.0721
vn 0.4464 -0.8888 0.1036
vn 0.6928 -0.3772 0.6145
vn 0.4614 0.0746 0.8840
vn 0.6094 0.2934 0.7366
vn 0.7560 0.0744 0.6503
vn 0.7939 -0.4201 0.4395
vn 0.9113 -0.3424 0.2286
vn 0.0012 -0.8001 -0.5999
vn 0.0029 -0.9569 -0.2906
vn 0.3614 -0.5345 0.7640
vn 0.3880 -0.9194 0.0643
vn 0.0000 -0.9749 0.2228
vn 0.4719 -0.8015 0.3672
vn -0.6633 -0.2472 0.7063
vn -0.4440 0.0890 0.8916
vn -0.3540 -0.5205 0.7770
vn -0.3839 -0.9228 0.0311
vn -0.7917 -0.4225 0.4411
vn -0.4711 -0.8015 0.3682
vn -0.0614 0.3109 0.9485
vn -0.1639 -0.6745 -0.7198
vn -0.5889 0.3078 0.7473
vn -0.5787 0.3190 0.7506
vn -0.6999 -0.7060 -0.1076
vn -0.9076 -0.3599 0.2162
vn -0.7754 -0.5190 -0.3598
vn -0.5756 -0.7625 -0.2955
vn -0.4530 -0.7577 -0.4698
vn -0.1714 -0.6289 -0.7584
vn -0.0566 -0.9965 -0.0610
vn -0.4551 -0.8866 0.0831
vn -0.9138 -0.4057 -0.0218
vn -0.7511 -0.6585 -0.0484
vn -0.7209 -0.6847 -0.1075
vn -0.9054 -0.4202 -0.0617
vn -0.1641 -0.9802 -0.1111
vn -0.1117 -0.9837 -0.1411
vn -0.9244 -0.3814 0.0006
vn -0.7691 -0.6391 0.0021
vn -0.7612 -0.6478 -0.0312
vn -0.9217 -0.3875 -0.0183
vn -0.2166 -0.9763 -0.0018
vn -0.1988 -0.9782 -0.0599
vn -0.8841 -0.4669 0.0170
vn -0.7300 -0.6822 0.0415
vn -0.7502 -0.6604 0.0331
vn -0.9088 -0.4169 0.0182
vn -0.1880 -0.9786 0.0833
vn -0.2003 -0.9784 0.0512
vn -0.6239 -0.4962 0.6038
vn -0.4777 -0.7581 0.4440
vn -0.7158 -0.6846 0.1379
vn -0.8708 -0.4704 0.1431
vn -0.1953 -0.9685 0.1543
vn -0.2052 -0.9724 0.1109
vn 0.0138 -0.3904 0.9205
vn 0.0138 -0.6053 0.7959
vn -0.1554 -0.7068 0.6901
vn -0.1429 -0.4871 0.8616
vn -0.0152 -0.9596 0.2811
vn -0.1278 -0.9612 0.2446
vn -0.0011 -0.2524 0.9676
vn 0.0002 -0.5158 0.8567
vn 0.0289 -0.5459 0.8374
vn 0.0176 -0.3038 0.9526
vn -0.0001 -0.9265 0.3762
vn 0.0444 -0.9402 0.3377
vn -0.0162 -0.2855 0.9582
vn -0.0201 -0.5218 0.8528
vn -0.0280 -0.5138 0.8574
vn -0.0170 -0.2502 0.9680
vn 0.0150 -0.9607 0.2770
vn -0.0444 -0.9410 0.3354
vn 0.6412 -0.4510 0.6208
vn 0.4991 -0.7313 0.4648
vn 0.1585 -0.6514 0.7420
vn 0.1428 -0.4155 0.8983
vn 0.1949 -0.9687 0.1540
vn 0.1274 -0.9616 0.2431
vn 0.9059 -0.4233 0.0120
vn 0.7573 -0.6519 0.0378
vn 0.7450 -0.6524 0.1391
vn 0.8909 -0.4315 0.1420
vn 0.1910 -0.9781 0.0832
vn 0.2059 -0.9722 0.1112
vn 0.9259 -0.3778 -0.0000
vn 0.7712 -0.6366 0.0023
vn 0.7647 -0.6435 0.0321
vn 0.9208 -0.3898 0.0157
vn 0.2172 -0.9761 -0.0021
vn 0.2030 -0.9778 0.0511
vn 0.7528 -0.6575 -0.0320
vn 0.9149 -0.4032 -0.0196
vn 0.1972 -0.9785 -0.0601
vn 0.5597 -0.7792 -0.2822
vn 0.7450 -0.6608 -0.0911
vn 0.7737 -0.6315 -0.0505
vn 0.6408 -0.7493 -0.1671
vn 0.3438 -0.8706 -0.3519
vn 0.5723 -0.7882 -0.2262
vn 0.7507 -0.6566 -0.0735
vn 0.0003 -0.8853 -0.4651
vn 0.3669 -0.8472 -0.3844
vn -0.5851 -0.7886 -0.1892
vn -0.3588 -0.8394 -0.4083
vn -0.7762 -0.6263 0.0726
vn -0.8363 -0.5318 0.1334
vn -0.5354 -0.7976 -0.2779
vn -0.4139 -0.8818 -0.2261
vn -0.7746 -0.6303 -0.0519
vn -0.7339 -0.6727 -0.0942
vn -0.8291 -0.5591 0.0040
vn -0.8130 -0.5813 -0.0330
vn -0.7305 -0.6811 0.0504
vn -0.7980 -0.6015 0.0382
vn -0.4130 -0.8043 0.4272
vn -0.6342 -0.7604 0.1396
vn -0.0010 -0.6709 0.7416
vn -0.1277 -0.7528 0.6458
vn -0.0008 -0.5229 0.8524
vn 0.0199 -0.5765 0.8169
vn -0.0003 -0.6605 0.7508
vn -0.0209 -0.5631 0.8261
vn 0.3996 -0.8129 0.4237
vn 0.1227 -0.7526 0.6470
vn 0.7377 -0.6733 0.0499
vn 0.6286 -0.7652 0.1392
vn 0.8301 -0.5576 0.0012
vn 0.8046 -0.5927 0.0357
vn 0.8100 -0.5854 -0.0345
vn -0.1875 -0.9764 -0.1067
vn -0.1996 -0.9726 0.1189
vn -0.0804 -0.9910 -0.1071
vn 0.3482 -0.8644 0.3628
vn 0.7431 -0.6669 0.0546
vn 0.7522 -0.6422 -0.1472
vn 0.6569 -0.7461 -0.1083
vn 0.4354 -0.8898 0.1367
vn 0.0000 -0.9568 0.2906
vn -0.4349 -0.8898 0.1383
vn -0.6563 -0.7473 -0.1039
vn -0.7504 -0.6450 -0.1443
vn -0.7430 -0.6672 0.0530
vn -0.3514 -0.8634 0.3619
vn 0.1976 -0.9733 0.1166
vn 0.1851 -0.9768 -0.1072
vn 0.0797 -0.9911 -0.1071
vn 0.0484 -0.9971 -0.0584
vn 0.0473 -0.9989 -0.0005
vn 0.0502 -0.9973 0.0542
vn 0.0455 -0.9947 0.0925
vn 0.0278 -0.9954 0.0912
vn -0.0495 -0.9984 0.0258
vn -0.1039 -0.9913 0.0813
vn -0.0163 -0.9894 0.1442
vn 0.0467 -0.9870 0.1538
vn -0.0000 -0.9874 0.1582
vn -0.0467 -0.9870 0.1536
vn 0.0163 -0.9895 0.1437
vn 0.1039 -0.9913 0.0810
vn 0.0495 -0.9984 0.0257
vn -0.0276 -0.9954 0.0912
vn -0.0452 -0.9947 0.0925
vn -0.0498 -0.9973 0.0542
vn -0.0472 -0.9989 -0.0006
vn -0.0486 -0.9971 -0.0584
# 474 vertex normals

vt 0.2807 0.6425 0.0000
vt 0.2898 0.6330 0.0000
vt 0.3137 0.6572 0.0000
vt 0.2889 0.6629 0.0000
vt 0.3089 0.6339 0.0000
vt 0.3368 0.6498 0.0000
vt 0.3881 0.6783 0.0000
vt 0.3391 0.6906 0.0000
vt 0.3034 0.6993 0.0000
vt 0.6573 0.5936 0.0000
vt 0.6751 0.5876 0.0000
vt 0.6593 0.6185 0.0000
vt 0.6362 0.6177 0.0000
vt 0.6859 0.5943 0.0000
vt 0.6833 0.6163 0.0000
vt 0.6782 0.6543 0.0000
vt 0.6427 0.6571 0.0000
vt 0.5941 0.6583 0.0000
vt 0.3591 0.7265 0.0000
vt 0.3176 0.7382 0.0000
vt 0.4092 0.7136 0.0000
vt 0.4248 0.7470 0.0000
vt 0.3754 0.7631 0.0000
vt 0.3325 0.7780 0.0000
vt 0.4462 0.6748 0.0000
vt 0.4549 0.7035 0.0000
vt 0.4927 0.6709 0.0000
vt 0.4959 0.6988 0.0000
vt 0.5020 0.7320 0.0000
vt 0.4659 0.7367 0.0000
vt 0.5387 0.6686 0.0000
vt 0.5369 0.6972 0.0000
vt 0.5824 0.6970 0.0000
vt 0.5797 0.7327 0.0000
vt 0.5380 0.7314 0.0000
vt 0.6330 0.6955 0.0000
vt 0.6760 0.6942 0.0000
vt 0.6764 0.7353 0.0000
vt 0.6311 0.7344 0.0000
vt 0.3865 0.8030 0.0000
vt 0.3467 0.8182 0.0000
vt 0.4330 0.7855 0.0000
vt 0.4379 0.8294 0.0000
vt 0.3951 0.8448 0.0000
vt 0.3599 0.8576 0.0000
vt 0.4735 0.7732 0.0000
vt 0.5093 0.7673 0.0000
vt 0.5166 0.8097 0.0000
vt 0.4787 0.8167 0.0000
vt 0.5454 0.7677 0.0000
vt 0.5872 0.7711 0.0000
vt 0.5976 0.8146 0.0000
vt 0.5552 0.8107 0.0000
vt 0.6364 0.7752 0.0000
vt 0.6788 0.7775 0.0000
vt 0.6803 0.8197 0.0000
vt 0.6430 0.8178 0.0000
vt 0.4019 0.8855 0.0000
vt 0.3712 0.8950 0.0000
vt 0.4415 0.8758 0.0000
vt 0.4439 0.9137 0.0000
vt 0.4051 0.9175 0.0000
vt 0.3818 0.9154 0.0000
vt 0.4823 0.8683 0.0000
vt 0.5233 0.8638 0.0000
vt 0.5277 0.9119 0.0000
vt 0.4851 0.9129 0.0000
vt 0.5645 0.8622 0.0000
vt 0.6061 0.8611 0.0000
vt 0.6115 0.8993 0.0000
vt 0.5702 0.9069 0.0000
vt 0.6474 0.8599 0.0000
vt 0.6799 0.8600 0.0000
vt 0.6738 0.8835 0.0000
vt 0.6511 0.8924 0.0000
vt 0.2724 0.7040 0.0000
vt 0.2609 0.6631 0.0000
vt 0.2645 0.6633 0.0000
vt 0.2762 0.7040 0.0000
vt 0.2580 0.6300 0.0000
vt 0.2605 0.6313 0.0000
vt 0.2641 0.6330 0.0000
vt 0.2692 0.6640 0.0000
vt 0.2809 0.7038 0.0000
vt 0.2704 0.6125 0.0000
vt 0.2720 0.6144 0.0000
vt 0.2977 0.6108 0.0000
vt 0.2997 0.6141 0.0000
vt 0.3015 0.6174 0.0000
vt 0.2747 0.6167 0.0000
vt 0.1082 0.1898 0.0000
vt 0.1442 0.2198 0.0000
vt 0.1431 0.2232 0.0000
vt 0.1071 0.1933 0.0000
vt 0.1820 0.2550 0.0000
vt 0.1808 0.2585 0.0000
vt 0.3975 0.6513 0.0000
vt 0.3456 0.6354 0.0000
vt 0.3455 0.6319 0.0000
vt 0.3993 0.6467 0.0000
vt 0.4004 0.6435 0.0000
vt 0.4480 0.6453 0.0000
vt 0.4477 0.6488 0.0000
vt 0.4939 0.6434 0.0000
vt 0.4930 0.6470 0.0000
vt 0.4924 0.6513 0.0000
vt 0.4466 0.6533 0.0000
vt 0.5384 0.6394 0.0000
vt 0.5371 0.6431 0.0000
vt 0.5826 0.6272 0.0000
vt 0.5818 0.6305 0.0000
vt 0.5820 0.6351 0.0000
vt 0.5371 0.6479 0.0000
vt 0.6826 0.3517 0.0000
vt 0.6642 0.4000 0.0000
vt 0.6618 0.3972 0.0000
vt 0.6802 0.3490 0.0000
vt 0.6443 0.4422 0.0000
vt 0.6418 0.4396 0.0000
vt 0.6603 0.5748 0.0000
vt 0.6255 0.6064 0.0000
vt 0.6261 0.6020 0.0000
vt 0.6615 0.5704 0.0000
vt 0.6629 0.5664 0.0000
vt 0.6899 0.5620 0.0000
vt 0.6884 0.5641 0.0000
vt 0.7054 0.5739 0.0000
vt 0.7039 0.5773 0.0000
vt 0.7003 0.5800 0.0000
vt 0.6859 0.5672 0.0000
vt 0.7078 0.5782 0.0000
vt 0.7111 0.6102 0.0000
vt 0.7076 0.6099 0.0000
vt 0.7113 0.6526 0.0000
vt 0.7077 0.6524 0.0000
vt 0.7030 0.6526 0.0000
vt 0.7033 0.6111 0.0000
vt 0.7119 0.6952 0.0000
vt 0.7082 0.6950 0.0000
vt 0.7127 0.7382 0.0000
vt 0.7090 0.7377 0.0000
vt 0.7044 0.7373 0.0000
vt 0.7035 0.6947 0.0000
vt 0.7130 0.7813 0.0000
vt 0.7094 0.7806 0.0000
vt 0.7115 0.8245 0.0000
vt 0.7080 0.8236 0.0000
vt 0.7036 0.8228 0.0000
vt 0.7049 0.7800 0.0000
vt 0.7058 0.8681 0.0000
vt 0.7029 0.8668 0.0000
vt 0.6905 0.8999 0.0000
vt 0.6886 0.8983 0.0000
vt 0.6868 0.8963 0.0000
vt 0.6994 0.8651 0.0000
vt 0.6606 0.9172 0.0000
vt 0.6580 0.9160 0.0000
vt 0.4520 0.3901 0.0000
vt 0.4469 0.3496 0.0000
vt 0.4506 0.3493 0.0000
vt 0.4556 0.3905 0.0000
vt 0.6148 0.9231 0.0000
vt 0.6566 0.9123 0.0000
vt 0.6154 0.9275 0.0000
vt 0.4422 0.3090 0.0000
vt 0.4458 0.3086 0.0000
vt 0.4375 0.2684 0.0000
vt 0.4411 0.2680 0.0000
vt 0.5292 0.9389 0.0000
vt 0.5723 0.9328 0.0000
vt 0.5718 0.9375 0.0000
vt 0.5287 0.9434 0.0000
vt 0.4324 0.2278 0.0000
vt 0.4361 0.2273 0.0000
vt 0.4271 0.1873 0.0000
vt 0.4307 0.1866 0.0000
vt 0.4438 0.9385 0.0000
vt 0.4862 0.9394 0.0000
vt 0.4857 0.9440 0.0000
vt 0.4428 0.9432 0.0000
vt 0.4219 0.1467 0.0000
vt 0.4253 0.1456 0.0000
vt 0.3971 0.9465 0.0000
vt 0.3644 0.9374 0.0000
vt 0.3655 0.9340 0.0000
vt 0.3990 0.9432 0.0000
vt 0.3689 0.9317 0.0000
vt 0.4015 0.9391 0.0000
vt 0.3608 0.9336 0.0000
vt 0.3427 0.9048 0.0000
vt 0.3465 0.9049 0.0000
vt 0.3267 0.8649 0.0000
vt 0.3306 0.8649 0.0000
vt 0.3354 0.8644 0.0000
vt 0.3506 0.9039 0.0000
vt 0.3119 0.8247 0.0000
vt 0.3157 0.8247 0.0000
vt 0.2978 0.7845 0.0000
vt 0.3016 0.7845 0.0000
vt 0.3063 0.7842 0.0000
vt 0.3205 0.8245 0.0000
vt 0.2847 0.7443 0.0000
vt 0.2885 0.7443 0.0000
vt 0.2931 0.7439 0.0000
vt 0.2760 0.6645 0.0000
vt 0.2873 0.7027 0.0000
vt 0.2701 0.6356 0.0000
vt 0.2788 0.6210 0.0000
vt 0.3030 0.6227 0.0000
vt 0.3451 0.6415 0.0000
vt 0.3952 0.6590 0.0000
vt 0.4449 0.6598 0.0000
vt 0.4921 0.6571 0.0000
vt 0.5384 0.6541 0.0000
vt 0.5842 0.6419 0.0000
vt 0.6266 0.6127 0.0000
vt 0.6599 0.5811 0.0000
vt 0.6828 0.5728 0.0000
vt 0.6947 0.5844 0.0000
vt 0.6966 0.6134 0.0000
vt 0.6960 0.6529 0.0000
vt 0.6966 0.6941 0.0000
vt 0.6977 0.7365 0.0000
vt 0.6984 0.7793 0.0000
vt 0.6974 0.8218 0.0000
vt 0.6942 0.8627 0.0000
vt 0.6833 0.8927 0.0000
vt 0.6543 0.9071 0.0000
vt 0.6139 0.9169 0.0000
vt 0.5722 0.9266 0.0000
vt 0.5292 0.9327 0.0000
vt 0.4862 0.9329 0.0000
vt 0.4444 0.9317 0.0000
vt 0.4041 0.9328 0.0000
vt 0.3733 0.9270 0.0000
vt 0.3563 0.9009 0.0000
vt 0.3422 0.8631 0.0000
vt 0.3273 0.8237 0.0000
vt 0.3128 0.7833 0.0000
vt 0.2993 0.7426 0.0000
vt 0.6904 0.1590 0.0000
vt 0.6539 0.1126 0.0000
vt 0.6540 0.0910 0.0000
vt 0.6894 0.1114 0.0000
vt 0.6343 0.0872 0.0000
vt 0.6281 0.0704 0.0000
vt 0.6340 0.0625 0.0000
vt 0.6529 0.0682 0.0000
vt 0.6883 0.0774 0.0000
vt 0.7252 0.4324 0.0000
vt 0.6918 0.4489 0.0000
vt 0.6899 0.4268 0.0000
vt 0.7217 0.3988 0.0000
vt 0.6731 0.4576 0.0000
vt 0.6655 0.4510 0.0000
vt 0.6695 0.4333 0.0000
vt 0.6867 0.4057 0.0000
vt 0.7143 0.3525 0.0000
vt 0.7581 0.1819 0.0000
vt 0.7252 0.1737 0.0000
vt 0.7262 0.1249 0.0000
vt 0.7630 0.1329 0.0000
vt 0.7276 0.0844 0.0000
vt 0.7685 0.0904 0.0000
vt 0.7588 0.2526 0.0000
vt 0.7287 0.2542 0.0000
vt 0.7249 0.2171 0.0000
vt 0.7562 0.2205 0.0000
vt 0.7042 0.2574 0.0000
vt 0.6984 0.2143 0.0000
vt 0.7758 0.3204 0.0000
vt 0.7449 0.3312 0.0000
vt 0.7356 0.2905 0.0000
vt 0.7655 0.2838 0.0000
vt 0.7116 0.2991 0.0000
vt 0.8002 0.4086 0.0000
vt 0.7616 0.4189 0.0000
vt 0.7543 0.3787 0.0000
vt 0.7892 0.3672 0.0000
vt 0.8338 0.1754 0.0000
vt 0.7934 0.1813 0.0000
vt 0.8019 0.1346 0.0000
vt 0.8422 0.1322 0.0000
vt 0.8096 0.0947 0.0000
vt 0.8496 0.0973 0.0000
vt 0.8297 0.2499 0.0000
vt 0.7907 0.2519 0.0000
vt 0.7892 0.2199 0.0000
vt 0.8288 0.2149 0.0000
vt 0.8533 0.3210 0.0000
vt 0.8118 0.3192 0.0000
vt 0.7987 0.2830 0.0000
vt 0.8392 0.2839 0.0000
vt 0.8804 0.3943 0.0000
vt 0.8406 0.4012 0.0000
vt 0.8279 0.3632 0.0000
vt 0.8686 0.3613 0.0000
vt 0.9125 0.1586 0.0000
vt 0.8774 0.1664 0.0000
vt 0.8815 0.1274 0.0000
vt 0.9111 0.1220 0.0000
vt 0.8864 0.0976 0.0000
vt 0.9060 0.1023 0.0000
vt 0.9256 0.2386 0.0000
vt 0.8808 0.2447 0.0000
vt 0.8771 0.2059 0.0000
vt 0.9184 0.1978 0.0000
vt 0.9335 0.3202 0.0000
vt 0.8979 0.3213 0.0000
vt 0.8886 0.2829 0.0000
vt 0.9306 0.2799 0.0000
vt 0.9357 0.3782 0.0000
vt 0.9170 0.3873 0.0000
vt 0.9081 0.3588 0.0000
vt 0.9378 0.3573 0.0000
vt 0.6232 0.0513 0.0000
vt 0.6219 0.0496 0.0000
vt 0.6485 0.0531 0.0000
vt 0.6496 0.0548 0.0000
vt 0.1141 0.1564 0.0000
vt 0.1124 0.1551 0.0000
vt 0.1388 0.1507 0.0000
vt 0.1403 0.1524 0.0000
vt 0.1763 0.1476 0.0000
vt 0.1774 0.1495 0.0000
vt 0.6857 0.0587 0.0000
vt 0.6867 0.0605 0.0000
vt 0.1223 0.1848 0.0000
vt 0.1211 0.1840 0.0000
vt 0.1069 0.1665 0.0000
vt 0.1085 0.1669 0.0000
vt 0.1194 0.1843 0.0000
vt 0.1053 0.1662 0.0000
vt 0.6136 0.0593 0.0000
vt 0.6124 0.0580 0.0000
vt 0.1988 0.2439 0.0000
vt 0.1960 0.2456 0.0000
vt 0.1567 0.2119 0.0000
vt 0.1592 0.2116 0.0000
vt 0.1937 0.2471 0.0000
vt 0.1548 0.2124 0.0000
vt 0.1222 0.1848 0.0000
vt 0.6913 0.2617 0.0000
vt 0.6906 0.2626 0.0000
vt 0.6841 0.2181 0.0000
vt 0.6848 0.2176 0.0000
vt 0.6886 0.2630 0.0000
vt 0.6817 0.2173 0.0000
vt 0.2219 0.2073 0.0000
vt 0.2201 0.2083 0.0000
vt 0.2226 0.2049 0.0000
vt 0.7000 0.3507 0.0000
vt 0.6974 0.3532 0.0000
vt 0.6978 0.3067 0.0000
vt 0.6986 0.3044 0.0000
vt 0.6948 0.3550 0.0000
vt 0.6957 0.3084 0.0000
vt 0.6595 0.4415 0.0000
vt 0.6589 0.4424 0.0000
vt 0.6794 0.4016 0.0000
vt 0.6819 0.4005 0.0000
vt 0.6570 0.4430 0.0000
vt 0.6771 0.4026 0.0000
vt 0.1517 0.4526 0.0000
vt 0.1506 0.4543 0.0000
vt 0.1412 0.4463 0.0000
vt 0.1421 0.4452 0.0000
vt 0.1494 0.4561 0.0000
vt 0.1396 0.4472 0.0000
vt 0.1414 0.4244 0.0000
vt 0.1431 0.4237 0.0000
vt 0.6544 0.4635 0.0000
vt 0.6533 0.4643 0.0000
vt 0.7268 0.4499 0.0000
vt 0.7267 0.4515 0.0000
vt 0.6908 0.4641 0.0000
vt 0.6911 0.4622 0.0000
vt 0.2141 0.4468 0.0000
vt 0.2134 0.4489 0.0000
vt 0.1763 0.4550 0.0000
vt 0.1773 0.4530 0.0000
vt 0.6650 0.4715 0.0000
vt 0.6651 0.4696 0.0000
vt 0.8067 0.4297 0.0000
vt 0.8073 0.4315 0.0000
vt 0.7661 0.4410 0.0000
vt 0.7658 0.4392 0.0000
vt 0.2936 0.4360 0.0000
vt 0.2933 0.4383 0.0000
vt 0.2528 0.4434 0.0000
vt 0.2532 0.4412 0.0000
vt 0.8877 0.4105 0.0000
vt 0.8884 0.4118 0.0000
vt 0.8487 0.4220 0.0000
vt 0.8480 0.4204 0.0000
vt 0.3732 0.4263 0.0000
vt 0.3733 0.4283 0.0000
vt 0.3338 0.4330 0.0000
vt 0.3339 0.4309 0.0000
vt 0.9473 0.3851 0.0000
vt 0.9482 0.3847 0.0000
vt 0.9250 0.4007 0.0000
vt 0.9240 0.4000 0.0000
vt 0.4347 0.4126 0.0000
vt 0.4362 0.4137 0.0000
vt 0.4107 0.4247 0.0000
vt 0.4099 0.4231 0.0000
vt 0.9496 0.3185 0.0000
vt 0.9501 0.3176 0.0000
vt 0.9526 0.3563 0.0000
vt 0.9518 0.3571 0.0000
vt 0.4319 0.3499 0.0000
vt 0.4337 0.3499 0.0000
vt 0.4400 0.3865 0.0000
vt 0.4384 0.3860 0.0000
vt 0.9451 0.2348 0.0000
vt 0.9462 0.2340 0.0000
vt 0.9511 0.2762 0.0000
vt 0.9500 0.2771 0.0000
vt 0.4219 0.2703 0.0000
vt 0.4239 0.2701 0.0000
vt 0.4286 0.3107 0.0000
vt 0.4267 0.3109 0.0000
vt 0.9280 0.1542 0.0000
vt 0.9286 0.1536 0.0000
vt 0.9374 0.1929 0.0000
vt 0.9365 0.1935 0.0000
vt 0.4125 0.1906 0.0000
vt 0.4142 0.1902 0.0000
vt 0.4188 0.2295 0.0000
vt 0.4169 0.2297 0.0000
vt 0.9149 0.0914 0.0000
vt 0.9150 0.0906 0.0000
vt 0.9242 0.1166 0.0000
vt 0.9237 0.1172 0.0000
vt 0.3998 0.1291 0.0000
vt 0.4009 0.1277 0.0000
vt 0.4113 0.1532 0.0000
vt 0.4098 0.1540 0.0000
vt 0.8511 0.0794 0.0000
vt 0.8503 0.0779 0.0000
vt 0.8884 0.0818 0.0000
vt 0.8888 0.0829 0.0000
vt 0.3367 0.1310 0.0000
vt 0.3364 0.1290 0.0000
vt 0.3735 0.1233 0.0000
vt 0.3732 0.1251 0.0000
vt 0.7686 0.0693 0.0000
vt 0.7676 0.0673 0.0000
vt 0.8095 0.0726 0.0000
vt 0.8105 0.0743 0.0000
vt 0.2572 0.1409 0.0000
vt 0.2564 0.1387 0.0000
vt 0.2969 0.1340 0.0000
vt 0.2976 0.1361 0.0000
vt 0.7258 0.0627 0.0000
vt 0.7268 0.0647 0.0000
vt 0.2158 0.1434 0.0000
vt 0.2168 0.1455 0.0000
vt 0.6259 0.0545 0.0000
vt 0.6513 0.0582 0.0000
vt 0.6873 0.0639 0.0000
vt 0.6250 0.0819 0.0000
vt 0.6165 0.0617 0.0000
vt 0.6224 0.0809 0.0000
vt 0.6780 0.1670 0.0000
vt 0.6514 0.1200 0.0000
vt 0.6756 0.1681 0.0000
vt 0.6491 0.1198 0.0000
vt 0.6938 0.2601 0.0000
vt 0.6870 0.2154 0.0000
vt 0.7020 0.3492 0.0000
vt 0.7011 0.3030 0.0000
vt 0.6615 0.4400 0.0000
vt 0.6842 0.3992 0.0000
vt 0.6666 0.4665 0.0000
vt 0.6559 0.4611 0.0000
vt 0.7265 0.4467 0.0000
vt 0.6917 0.4590 0.0000
vt 0.8054 0.4261 0.0000
vt 0.7649 0.4358 0.0000
vt 0.8863 0.4075 0.0000
vt 0.8466 0.4170 0.0000
vt 0.9455 0.3843 0.0000
vt 0.9222 0.3979 0.0000
vt 0.9475 0.3193 0.0000
vt 0.9497 0.3572 0.0000
vt 0.9427 0.2357 0.0000
vt 0.9472 0.2781 0.0000
vt 0.9261 0.1552 0.0000
vt 0.9342 0.1944 0.0000
vt 0.9140 0.0933 0.0000
vt 0.9222 0.1187 0.0000
vt 0.8516 0.0823 0.0000
vt 0.8885 0.0853 0.0000
vt 0.7692 0.0729 0.0000
vt 0.8112 0.0777 0.0000
vt 0.7272 0.0684 0.0000
vt 0.1027 0.1478 0.0000
vt 0.1328 0.1394 0.0000
vt 0.1356 0.1452 0.0000
vt 0.1075 0.1516 0.0000
vt 0.1735 0.1345 0.0000
vt 0.1747 0.1412 0.0000
vt 0.0941 0.1659 0.0000
vt 0.0999 0.1660 0.0000
vt 0.1138 0.1867 0.0000
vt 0.1493 0.2155 0.0000
vt 0.1872 0.2502 0.0000
vt 0.6756 0.2650 0.0000
vt 0.6704 0.2229 0.0000
vt 0.6760 0.2196 0.0000
vt 0.6821 0.2639 0.0000
vt 0.6571 0.1798 0.0000
vt 0.6621 0.1754 0.0000
vt 0.6675 0.1724 0.0000
vt 0.6833 0.3064 0.0000
vt 0.6895 0.3079 0.0000
vt 0.6888 0.3541 0.0000
vt 0.6706 0.4020 0.0000
vt 0.6507 0.4431 0.0000
vt 0.1421 0.4663 0.0000
vt 0.1288 0.4524 0.0000
vt 0.1343 0.4500 0.0000
vt 0.1457 0.4611 0.0000
vt 0.6619 0.5600 0.0000
vt 0.6870 0.5569 0.0000
vt 0.1351 0.4254 0.0000
vt 0.2140 0.4622 0.0000
vt 0.1733 0.4674 0.0000
vt 0.1745 0.4611 0.0000
vt 0.2134 0.4555 0.0000
vt 0.2951 0.4519 0.0000
vt 0.2546 0.4571 0.0000
vt 0.2534 0.4502 0.0000
vt 0.2940 0.4451 0.0000
vt 0.3762 0.4413 0.0000
vt 0.3356 0.4467 0.0000
vt 0.3345 0.4398 0.0000
vt 0.3746 0.4347 0.0000
vt 0.4459 0.4218 0.0000
vt 0.4168 0.4359 0.0000
vt 0.4136 0.4302 0.0000
vt 0.4409 0.4178 0.0000
vt 0.4459 0.3883 0.0000
vt 0.4402 0.3498 0.0000
vt 0.4353 0.3098 0.0000
vt 0.4306 0.2692 0.0000
vt 0.4255 0.2287 0.0000
vt 0.4205 0.1887 0.0000
vt 0.4084 0.1174 0.0000
vt 0.4165 0.1499 0.0000
vt 0.4045 0.1226 0.0000
vt 0.3360 0.1157 0.0000
vt 0.3767 0.1109 0.0000
vt 0.3750 0.1172 0.0000
vt 0.3361 0.1224 0.0000
vt 0.2547 0.1251 0.0000
vt 0.2953 0.1204 0.0000
vt 0.2960 0.1273 0.0000
vt 0.2554 0.1320 0.0000
vt 0.2142 0.1298 0.0000
vt 0.2148 0.1367 0.0000
# 563 texture coords

o Plane002
g Plane002
usemtl 07___Default
s 4
f 1/1/1 2/2/2 3/3/3 4/4/4 
f 2/2/2 5/5/5 6/6/6 3/3/3 
f 7/7/7 8/8/8 3/3/3 6/6/6 
f 8/8/8 9/9/9 4/4/4 3/3/3 
f 10/10/10 11/11/11 12/12/12 13/13/13 
f 11/11/11 14/14/14 15/15/15 12/12/12 
f 16/16/16 17/17/17 12/12/12 15/15/15 
f 17/17/17 18/18/18 13/13/13 12/12/12 
f 9/9/9 8/8/8 19/19/19 20/20/20 
f 8/8/8 7/7/7 21/21/21 19/19/19 
f 22/22/22 23/23/23 19/19/19 21/21/21 
f 23/23/23 24/24/24 20/20/20 19/19/19 
f 7/7/7 25/25/25 26/26/26 21/21/21 
f 25/25/25 27/27/27 28/28/28 26/26/26 
f 29/29/29 30/30/30 26/26/26 28/28/28 
f 30/30/30 22/22/22 21/21/21 26/26/26 
f 27/27/27 31/31/31 32/32/32 28/28/28 
f 31/31/31 18/18/18 33/33/33 32/32/32 
f 34/34/34 35/35/35 32/32/32 33/33/33 
f 35/35/35 29/29/29 28/28/28 32/32/32 
f 18/18/18 17/17/17 36/36/36 33/33/33 
f 17/17/17 16/16/16 37/37/37 36/36/36 
f 38/38/38 39/39/39 36/36/36 37/37/37 
f 39/39/39 34/34/34 33/33/33 36/36/36 
f 24/24/24 23/23/23 40/40/40 41/41/41 
f 23/23/23 22/22/22 42/42/42 40/40/40 
f 43/43/43 44/44/44 40/40/40 42/42/42 
f 44/44/44 45/45/45 41/41/41 40/40/40 
f 22/22/22 30/30/30 46/46/46 42/42/42 
f 30/30/30 29/29/29 47/47/47 46/46/46 
f 48/48/48 49/49/49 46/46/46 47/47/47 
f 49/49/49 43/43/43 42/42/42 46/46/46 
f 29/29/29 35/35/35 50/50/50 47/47/47 
f 35/35/35 34/34/34 51/51/51 50/50/50 
f 52/52/52 53/53/53 50/50/50 51/51/51 
f 53/53/53 48/48/48 47/47/47 50/50/50 
f 34/34/34 39/39/39 54/54/54 51/51/51 
f 39/39/39 38/38/38 55/55/55 54/54/54 
f 56/56/56 57/57/57 54/54/54 55/55/55 
f 57/57/57 52/52/52 51/51/51 54/54/54 
f 45/45/45 44/44/44 58/58/58 59/59/59 
f 44/44/44 43/43/43 60/60/60 58/58/58 
f 61/61/61 62/62/62 58/58/58 60/60/60 
f 62/62/62 63/63/63 59/59/59 58/58/58 
f 43/43/43 49/49/49 64/64/64 60/60/60 
f 49/49/49 48/48/48 65/65/65 64/64/64 
f 66/66/66 67/67/67 64/64/64 65/65/65 
f 67/67/67 61/61/61 60/60/60 64/64/64 
f 48/48/48 53/53/53 68/68/68 65/65/65 
f 53/53/53 52/52/52 69/69/69 68/68/68 
f 70/70/70 71/71/71 68/68/68 69/69/69 
f 71/71/71 66/66/66 65/65/65 68/68/68 
f 52/52/52 57/57/57 72/72/72 69/69/69 
f 57/57/57 56/56/56 73/73/73 72/72/72 
f 74/74/74 75/75/75 72/72/72 73/73/73 
f 75/75/75 70/70/70 69/69/69 72/72/72 
f 76/76/76 77/77/77 78/78/78 79/79/79 
f 77/77/77 80/80/80 81/81/81 78/78/78 
f 82/82/82 83/83/83 78/78/78 81/81/81 
f 83/83/83 84/84/84 79/79/79 78/78/78 
f 80/80/80 85/85/85 86/86/86 81/81/81 
f 85/85/85 87/87/87 88/88/88 86/86/86 
f 89/89/89 90/90/90 86/86/86 88/88/88 
f 90/90/90 82/82/82 81/81/81 86/86/86 
f 87/91/87 91/92/91 92/93/92 88/94/88 
f 91/92/91 93/95/93 94/96/94 92/93/92 
f 95/97/95 96/98/96 92/99/92 94/100/94 
f 96/98/96 89/89/89 88/88/88 92/99/92 
f 93/101/93 97/102/97 98/103/98 94/100/94 
f 97/102/97 99/104/99 100/105/100 98/103/98 
f 101/106/101 102/107/102 98/103/98 100/105/100 
f 102/107/102 95/97/95 94/100/94 98/103/98 
f 99/104/99 103/108/103 104/109/104 100/105/100 
f 103/108/103 105/110/105 106/111/106 104/109/104 
f 107/112/107 108/113/108 104/109/104 106/111/106 
f 108/113/108 101/106/101 100/105/100 104/109/104 
f 105/114/105 109/115/109 110/116/110 106/117/106 
f 109/115/109 111/118/111 112/119/112 110/116/110 
f 113/120/113 114/121/114 110/122/110 112/123/112 
f 114/121/114 107/112/107 106/111/106 110/122/110 
f 111/124/111 115/125/115 116/126/116 112/123/112 
f 115/125/115 117/127/117 118/128/118 116/126/116 
f 119/129/119 120/130/120 116/126/116 118/128/118 
f 120/130/120 113/120/113 112/123/112 116/126/116 
f 117/131/117 121/132/121 122/133/122 118/128/118 
f 121/132/121 123/134/123 124/135/124 122/133/122 
f 125/136/125 126/137/126 122/133/122 124/135/124 
f 126/137/126 119/129/119 118/128/118 122/133/122 
f 123/134/123 127/138/127 128/139/128 124/135/124 
f 127/138/127 129/140/129 130/141/130 128/139/128 
f 131/142/131 132/143/132 128/139/128 130/141/130 
f 132/143/132 125/136/125 124/135/124 128/139/128 
f 129/140/129 133/144/133 134/145/134 130/141/130 
f 133/144/133 135/146/135 136/147/136 134/145/134 
f 137/148/137 138/149/138 134/145/134 136/147/136 
f 138/149/138 131/142/131 130/141/130 134/145/134 
f 135/146/135 139/150/139 140/151/140 136/147/136 
f 139/150/139 141/152/141 142/153/142 140/151/140 
f 143/154/143 144/155/144 140/151/140 142/153/142 
f 144/155/144 137/148/137 136/147/136 140/151/140 
f 141/152/141 145/156/145 146/157/146 142/153/142 
f 145/158/145 147/159/147 148/160/148 146/161/146 
f 149/162/149 150/163/150 146/157/146 148/164/148 
f 150/163/150 143/154/143 142/153/142 146/157/146 
f 147/159/147 151/165/151 152/166/152 148/160/148 
f 151/165/151 153/167/153 154/168/154 152/166/152 
f 155/169/155 156/170/156 152/171/152 154/172/154 
f 156/170/156 149/162/149 148/164/148 152/171/152 
f 153/167/153 157/173/157 158/174/158 154/168/154 
f 157/173/157 159/175/159 160/176/160 158/174/158 
f 161/177/161 162/178/162 158/179/158 160/180/160 
f 162/178/162 155/169/155 154/172/154 158/179/158 
f 159/175/159 163/181/163 164/182/164 160/176/160 
f 163/183/163 165/184/165 166/185/166 164/186/164 
f 167/187/167 168/188/168 164/186/164 166/185/166 
f 168/188/168 161/177/161 160/180/160 164/186/164 
f 165/189/165 169/190/169 170/191/170 166/185/166 
f 169/190/169 171/192/171 172/193/172 170/191/170 
f 173/194/173 174/195/174 170/191/170 172/193/172 
f 174/195/174 167/187/167 166/185/166 170/191/170 
f 171/192/171 175/196/175 176/197/176 172/193/172 
f 175/196/175 177/198/177 178/199/178 176/197/176 
f 179/200/179 180/201/180 176/197/176 178/199/178 
f 180/201/180 173/194/173 172/193/172 176/197/176 
f 177/198/177 181/202/181 182/203/182 178/199/178 
f 181/202/181 76/76/76 79/79/79 182/203/182 
f 84/84/84 183/204/183 182/203/182 79/79/79 
f 183/204/183 179/200/179 178/199/178 182/203/182 
f 84/84/84 83/83/83 184/205/184 185/206/185 
f 83/83/83 82/82/82 186/207/186 184/205/184 
f 1/1/1 4/4/4 184/205/184 186/207/186 
f 4/4/4 9/9/9 185/206/185 184/205/184 
f 82/82/82 90/90/90 187/208/187 186/207/186 
f 90/90/90 89/89/89 188/209/188 187/208/187 
f 5/5/5 2/2/2 187/208/187 188/209/188 
f 2/2/2 1/1/1 186/207/186 187/208/187 
f 89/89/89 96/98/96 189/210/189 188/209/188 
f 96/98/96 95/97/95 190/211/190 189/210/189 
f 7/7/7 6/6/6 189/210/189 190/211/190 
f 6/6/6 5/5/5 188/209/188 189/210/189 
f 95/97/95 102/107/102 191/212/191 190/211/190 
f 102/107/102 101/106/101 192/213/192 191/212/191 
f 27/27/27 25/25/25 191/212/191 192/213/192 
f 25/25/25 7/7/7 190/211/190 191/212/191 
f 101/106/101 108/113/108 193/214/193 192/213/192 
f 108/113/108 107/112/107 194/215/194 193/214/193 
f 18/18/18 31/31/31 193/214/193 194/215/194 
f 31/31/31 27/27/27 192/213/192 193/214/193 
f 107/112/107 114/121/114 195/216/195 194/215/194 
f 114/121/114 113/120/113 196/217/196 195/216/195 
f 10/10/10 13/13/13 195/216/195 196/217/196 
f 13/13/13 18/18/18 194/215/194 195/216/195 
f 113/120/113 120/130/120 197/218/197 196/217/196 
f 120/130/120 119/129/119 198/219/198 197/218/197 
f 14/14/14 11/11/11 197/218/197 198/219/198 
f 11/11/11 10/10/10 196/217/196 197/218/197 
f 119/129/119 126/137/126 199/220/199 198/219/198 
f 126/137/126 125/136/125 200/221/200 199/220/199 
f 16/16/16 15/15/15 199/220/199 200/221/200 
f 15/15/15 14/14/14 198/219/198 199/220/199 
f 125/136/125 132/143/132 201/222/201 200/221/200 
f 132/143/132 131/142/131 202/223/202 201/222/201 
f 38/38/38 37/37/37 201/222/201 202/223/202 
f 37/37/37 16/16/16 200/221/200 201/222/201 
f 131/142/131 138/149/138 203/224/203 202/223/202 
f 138/149/138 137/148/137 204/225/204 203/224/203 
f 56/56/56 55/55/55 203/224/203 204/225/204 
f 55/55/55 38/38/38 202/223/202 203/224/203 
f 137/148/137 144/155/144 205/226/205 204/225/204 
f 144/155/144 143/154/143 206/227/206 205/226/205 
f 74/74/74 73/73/73 205/226/205 206/227/206 
f 73/73/73 56/56/56 204/225/204 205/226/205 
f 143/154/143 150/163/150 207/228/207 206/227/206 
f 150/163/150 149/162/149 208/229/208 207/228/207 
f 70/70/70 75/75/75 207/228/207 208/229/208 
f 75/75/75 74/74/74 206/227/206 207/228/207 
f 149/162/149 156/170/156 209/230/209 208/229/208 
f 156/170/156 155/169/155 210/231/210 209/230/209 
f 66/66/66 71/71/71 209/230/209 210/231/210 
f 71/71/71 70/70/70 208/229/208 209/230/209 
f 155/169/155 162/178/162 211/232/211 210/231/210 
f 162/178/162 161/177/161 212/233/212 211/232/211 
f 61/61/61 67/67/67 211/232/211 212/233/212 
f 67/67/67 66/66/66 210/231/210 211/232/211 
f 161/177/161 168/188/168 213/234/213 212/233/212 
f 168/188/168 167/187/167 214/235/214 213/234/213 
f 63/63/63 62/62/62 213/234/213 214/235/214 
f 62/62/62 61/61/61 212/233/212 213/234/213 
f 167/187/167 174/195/174 215/236/215 214/235/214 
f 174/195/174 173/194/173 216/237/216 215/236/215 
f 45/45/45 59/59/59 215/236/215 216/237/216 
f 59/59/59 63/63/63 214/235/214 215/236/215 
f 173/194/173 180/201/180 217/238/217 216/237/216 
f 180/201/180 179/200/179 218/239/218 217/238/217 
f 24/24/24 41/41/41 217/238/217 218/239/218 
f 41/41/41 45/45/45 216/237/216 217/238/217 
f 179/200/179 183/204/183 219/240/219 218/239/218 
f 183/204/183 84/84/84 185/206/185 219/240/219 
f 9/9/9 20/20/20 219/240/219 185/206/185 
f 20/20/20 24/24/24 218/239/218 219/240/219 
f 220/241/220 221/242/221 222/243/222 223/244/223 
f 221/242/221 224/245/224 225/246/225 222/243/222 
f 226/247/226 227/248/227 222/243/222 225/246/225 
f 227/248/227 228/249/228 223/244/223 222/243/222 
f 229/250/229 230/251/230 231/252/231 232/253/232 
f 230/251/230 233/254/233 234/255/234 231/252/231 
f 235/256/235 236/257/236 231/252/231 234/255/234 
f 236/257/236 237/258/237 232/253/232 231/252/231 
f 238/259/238 239/260/239 240/261/240 241/262/241 
f 239/260/239 220/241/220 223/244/223 240/261/240 
f 228/249/228 242/263/242 240/261/240 223/244/223 
f 242/263/242 243/264/243 241/262/241 240/261/240 
f 244/265/244 245/266/245 246/267/246 247/268/247 
f 245/266/245 248/269/248 249/270/249 246/267/246 
f 220/241/220 239/260/239 246/267/246 249/270/249 
f 239/260/239 238/259/238 247/268/247 246/267/246 
f 250/271/250 251/272/251 252/273/252 253/274/253 
f 251/272/251 237/258/237 254/275/254 252/273/252 
f 248/269/248 245/266/245 252/273/252 254/275/254 
f 245/266/245 244/265/244 253/274/253 252/273/252 
f 255/276/255 256/277/256 257/278/257 258/279/258 
f 256/277/256 229/250/229 232/253/232 257/278/257 
f 237/258/237 251/272/251 257/278/257 232/253/232 
f 251/272/251 250/271/250 258/279/258 257/278/257 
f 259/280/259 260/281/260 261/282/261 262/283/262 
f 260/281/260 238/259/238 241/262/241 261/282/261 
f 243/264/243 263/284/263 261/282/261 241/262/241 
f 263/284/263 264/285/264 262/283/262 261/282/261 
f 265/286/265 266/287/266 267/288/267 268/289/268 
f 266/287/266 244/265/244 247/268/247 267/288/267 
f 238/259/238 260/281/260 267/288/267 247/268/247 
f 260/281/260 259/280/259 268/289/268 267/288/267 
f 269/290/269 270/291/270 271/292/271 272/293/272 
f 270/291/270 250/271/250 253/274/253 271/292/271 
f 244/265/244 266/287/266 271/292/271 253/274/253 
f 266/287/266 265/286/265 272/293/272 271/292/271 
f 273/294/273 274/295/274 275/296/275 276/297/276 
f 274/295/274 255/276/255 258/279/258 275/296/275 
f 250/271/250 270/291/270 275/296/275 258/279/258 
f 270/291/270 269/290/269 276/297/276 275/296/275 
f 277/298/277 278/299/278 279/300/279 280/301/280 
f 278/299/278 259/280/259 262/283/262 279/300/279 
f 264/285/264 281/302/281 279/300/279 262/283/262 
f 281/302/281 282/303/282 280/301/280 279/300/279 
f 283/304/283 284/305/284 285/306/285 286/307/286 
f 284/305/284 265/286/265 268/289/268 285/306/285 
f 259/280/259 278/299/278 285/306/285 268/289/268 
f 278/299/278 277/298/277 286/307/286 285/306/285 
f 287/308/287 288/309/288 289/310/289 290/311/290 
f 288/309/288 269/290/269 272/293/272 289/310/289 
f 265/286/265 284/305/284 289/310/289 272/293/272 
f 284/305/284 283/304/283 290/311/290 289/310/289 
f 291/312/291 292/313/292 293/314/293 294/315/294 
f 292/313/292 273/294/273 276/297/276 293/314/293 
f 269/290/269 288/309/288 293/314/293 276/297/276 
f 288/309/288 287/308/287 294/315/294 293/314/293 
f 295/316/295 296/317/296 297/318/297 298/319/298 
f 296/320/296 299/321/299 300/322/300 297/323/297 
f 301/324/301 302/325/302 297/323/297 300/322/300 
f 302/326/302 303/327/303 298/319/298 297/318/297 
f 304/328/304 305/329/305 306/330/306 307/331/307 
f 305/329/305 308/332/308 309/333/309 306/330/306 
f 299/321/299 296/320/296 306/330/306 309/333/309 
f 296/317/296 295/316/295 307/334/307 306/335/306 
f 310/336/310 311/337/311 312/338/312 313/339/313 
f 311/337/311 314/340/314 315/341/315 312/338/312 
f 308/332/308 305/329/305 312/338/312 315/341/315 
f 305/329/305 304/342/304 313/339/313 312/338/312 
f 316/343/316 317/344/317 318/345/318 319/346/319 
f 317/344/317 320/347/320 321/348/321 318/345/318 
f 314/340/314 311/337/311 318/349/318 321/350/321 
f 311/337/311 310/336/310 319/351/319 318/349/318 
f 322/352/322 323/353/323 324/354/324 325/355/325 
f 323/353/323 326/356/326 327/357/327 324/354/324 
f 320/347/320 317/344/317 324/354/324 327/357/327 
f 317/344/317 316/343/316 325/355/325 324/354/324 
f 328/358/328 329/359/329 330/360/330 331/361/331 
f 329/359/329 332/362/332 333/363/333 330/360/330 
f 326/356/326 323/353/323 330/360/330 333/363/333 
f 323/353/323 322/352/322 331/361/331 330/360/330 
f 334/364/334 335/365/335 336/366/336 337/367/337 
f 335/365/335 338/368/338 339/369/339 336/366/336 
f 332/370/332 329/371/329 336/366/336 339/369/339 
f 329/359/329 328/358/328 337/372/337 336/373/336 
f 340/374/340 341/375/341 342/376/342 343/377/343 
f 341/378/341 344/379/344 345/380/345 342/381/342 
f 338/368/338 335/365/335 342/381/342 345/380/345 
f 335/382/335 334/383/334 343/377/343 342/376/342 
f 346/384/346 347/385/347 348/386/348 349/387/349 
f 347/388/347 350/389/350 351/390/351 348/391/348 
f 344/379/344 341/378/341 348/391/348 351/390/351 
f 341/375/341 340/374/340 349/387/349 348/386/348 
f 352/392/352 353/393/353 354/394/354 355/395/355 
f 353/396/353 356/397/356 357/398/357 354/399/354 
f 350/389/350 347/388/347 354/399/354 357/398/357 
f 347/385/347 346/384/346 355/395/355 354/394/354 
f 358/400/358 359/401/359 360/402/360 361/403/361 
f 359/404/359 362/405/362 363/406/363 360/407/360 
f 356/397/356 353/396/353 360/407/360 363/406/363 
f 353/393/353 352/392/352 361/403/361 360/402/360 
f 364/408/364 365/409/365 366/410/366 367/411/367 
f 365/412/365 368/413/368 369/414/369 366/415/366 
f 362/405/362 359/404/359 366/415/366 369/414/369 
f 359/401/359 358/400/358 367/411/367 366/410/366 
f 370/416/370 371/417/371 372/418/372 373/419/373 
f 371/420/371 374/421/374 375/422/375 372/423/372 
f 368/413/368 365/412/365 372/423/372 375/422/375 
f 365/409/365 364/408/364 373/419/373 372/418/372 
f 376/424/376 377/425/377 378/426/378 379/427/379 
f 377/428/377 380/429/380 381/430/381 378/431/378 
f 374/421/374 371/420/371 378/431/378 381/430/381 
f 371/417/371 370/416/370 379/427/379 378/426/378 
f 382/432/382 383/433/383 384/434/384 385/435/385 
f 383/436/383 386/437/386 387/438/387 384/439/384 
f 380/429/380 377/428/377 384/439/384 387/438/387 
f 377/425/377 376/424/376 385/435/385 384/434/384 
f 388/440/388 389/441/389 390/442/390 391/443/391 
f 389/444/389 392/445/392 393/446/393 390/447/390 
f 386/437/386 383/436/383 390/447/390 393/446/393 
f 383/433/383 382/432/382 391/443/391 390/442/390 
f 394/448/394 395/449/395 396/450/396 397/451/397 
f 395/452/395 398/453/398 399/454/399 396/455/396 
f 392/445/392 389/444/389 396/455/396 399/454/399 
f 389/441/389 388/440/388 397/451/397 396/450/396 
f 303/327/303 302/326/302 400/456/400 401/457/401 
f 302/325/302 301/324/301 402/458/402 400/459/400 
f 398/453/398 395/452/395 400/459/400 402/458/402 
f 395/449/395 394/448/394 401/457/401 400/456/400 
f 226/247/226 403/460/403 404/461/404 227/248/227 
f 403/460/403 295/316/295 298/319/298 404/461/404 
f 303/327/303 405/462/405 404/461/404 298/319/298 
f 405/462/405 228/249/228 227/248/227 404/461/404 
f 224/245/224 406/463/406 407/464/407 225/246/225 
f 406/463/406 304/465/304 307/334/307 407/464/407 
f 295/316/295 403/460/403 407/464/407 307/334/307 
f 403/460/403 226/247/226 225/246/225 407/464/407 
f 220/241/220 408/466/408 409/467/409 221/242/221 
f 408/466/408 310/468/310 313/469/313 409/467/409 
f 304/465/304 406/463/406 409/467/409 313/469/313 
f 406/463/406 224/245/224 221/242/221 409/467/409 
f 248/269/248 410/470/410 411/471/411 249/270/249 
f 410/470/410 316/343/316 319/346/319 411/471/411 
f 310/468/310 408/466/408 411/471/411 319/346/319 
f 408/466/408 220/241/220 249/270/249 411/471/411 
f 237/258/237 412/472/412 413/473/413 254/275/254 
f 412/472/412 322/352/322 325/355/325 413/473/413 
f 316/343/316 410/470/410 413/473/413 325/355/325 
f 410/470/410 248/269/248 254/275/254 413/473/413 
f 235/256/235 414/474/414 415/475/415 236/257/236 
f 414/474/414 328/358/328 331/361/331 415/475/415 
f 322/352/322 412/472/412 415/475/415 331/361/331 
f 412/472/412 237/258/237 236/257/236 415/475/415 
f 233/254/233 416/476/416 417/477/417 234/255/234 
f 416/476/416 334/383/334 337/372/337 417/477/417 
f 328/358/328 414/474/414 417/477/417 337/372/337 
f 414/474/414 235/256/235 234/255/234 417/477/417 
f 229/250/229 418/478/418 419/479/419 230/251/230 
f 418/478/418 340/374/340 343/377/343 419/479/419 
f 334/383/334 416/476/416 419/479/419 343/377/343 
f 416/476/416 233/254/233 230/251/230 419/479/419 
f 255/276/255 420/480/420 421/481/421 256/277/256 
f 420/480/420 346/384/346 349/387/349 421/481/421 
f 340/374/340 418/478/418 421/481/421 349/387/349 
f 418/478/418 229/250/229 256/277/256 421/481/421 
f 273/294/273 422/482/422 423/483/423 274/295/274 
f 422/482/422 352/392/352 355/395/355 423/483/423 
f 346/384/346 420/480/420 423/483/423 355/395/355 
f 420/480/420 255/276/255 274/295/274 423/483/423 
f 291/312/291 424/484/424 425/485/425 292/313/292 
f 424/484/424 358/400/358 361/403/361 425/485/425 
f 352/392/352 422/482/422 425/485/425 361/403/361 
f 422/482/422 273/294/273 292/313/292 425/485/425 
f 287/308/287 426/486/426 427/487/427 294/315/294 
f 426/486/426 364/408/364 367/411/367 427/487/427 
f 358/400/358 424/484/424 427/487/427 367/411/367 
f 424/484/424 291/312/291 294/315/294 427/487/427 
f 283/304/283 428/488/428 429/489/429 290/311/290 
f 428/488/428 370/416/370 373/419/373 429/489/429 
f 364/408/364 426/486/426 429/489/429 373/419/373 
f 426/486/426 287/308/287 290/311/290 429/489/429 
f 277/298/277 430/490/430 431/491/431 286/307/286 
f 430/490/430 376/424/376 379/427/379 431/491/431 
f 370/416/370 428/488/428 431/491/431 379/427/379 
f 428/488/428 283/304/283 286/307/286 431/491/431 
f 282/303/282 432/492/432 433/493/433 280/301/280 
f 432/492/432 382/432/382 385/435/385 433/493/433 
f 376/424/376 430/490/430 433/493/433 385/435/385 
f 430/490/430 277/298/277 280/301/280 433/493/433 
f 264/285/264 434/494/434 435/495/435 281/302/281 
f 434/494/434 388/440/388 391/443/391 435/495/435 
f 382/432/382 432/492/432 435/495/435 391/443/391 
f 432/492/432 282/303/282 281/302/281 435/495/435 
f 243/264/243 436/496/436 437/497/437 263/284/263 
f 436/496/436 394/448/394 397/451/397 437/497/437 
f 388/440/388 434/494/434 437/497/437 397/451/397 
f 434/494/434 264/285/264 263/284/263 437/497/437 
f 228/249/228 405/462/405 438/498/438 242/263/242 
f 405/462/405 303/327/303 401/457/401 438/498/438 
f 394/448/394 436/496/436 438/498/438 401/457/401 
f 436/496/436 243/264/243 242/263/242 438/498/438 
f 80/499/80 77/500/77 439/501/439 440/502/440 
f 77/500/77 76/503/76 441/504/441 439/501/439 
f 301/324/301 300/322/300 439/501/439 441/504/441 
f 300/322/300 299/321/299 440/502/440 439/501/439 
f 87/91/87 85/505/85 442/506/442 443/507/443 
f 85/505/85 80/499/80 440/502/440 442/506/442 
f 299/321/299 309/333/309 442/506/442 440/502/440 
f 309/333/309 308/332/308 443/507/443 442/506/442 
f 93/95/93 91/92/91 444/508/444 445/509/445 
f 91/92/91 87/91/87 443/507/443 444/508/444 
f 308/332/308 315/341/315 444/508/444 443/507/443 
f 315/341/315 314/340/314 445/509/445 444/508/444 
f 99/510/99 97/511/97 446/512/446 447/513/447 
f 97/511/97 93/514/93 445/515/445 446/512/446 
f 314/516/314 321/348/321 446/512/446 445/515/445 
f 321/348/321 320/347/320 447/513/447 446/512/446 
f 105/114/105 103/517/103 448/518/448 449/519/449 
f 103/517/103 99/510/99 447/513/447 448/518/448 
f 320/347/320 327/357/327 448/518/448 447/513/447 
f 327/357/327 326/356/326 449/519/449 448/518/448 
f 111/118/111 109/115/109 450/520/450 451/521/451 
f 109/115/109 105/114/105 449/519/449 450/520/450 
f 326/356/326 333/363/333 450/520/450 449/519/449 
f 333/363/333 332/362/332 451/521/451 450/520/450 
f 117/522/117 115/523/115 452/524/452 453/525/453 
f 115/125/115 111/124/111 451/526/451 452/527/452 
f 332/370/332 339/369/339 452/524/452 451/528/451 
f 339/369/339 338/368/338 453/525/453 452/524/452 
f 123/529/123 121/530/121 454/531/454 455/532/455 
f 121/530/121 117/522/117 453/525/453 454/531/454 
f 338/368/338 345/380/345 454/531/454 453/525/453 
f 345/380/345 344/379/344 455/532/455 454/531/454 
f 129/533/129 127/534/127 456/535/456 457/536/457 
f 127/534/127 123/529/123 455/532/455 456/535/456 
f 344/379/344 351/390/351 456/535/456 455/532/455 
f 351/390/351 350/389/350 457/536/457 456/535/456 
f 135/537/135 133/538/133 458/539/458 459/540/459 
f 133/538/133 129/533/129 457/536/457 458/539/458 
f 350/389/350 357/398/357 458/539/458 457/536/457 
f 357/398/357 356/397/356 459/540/459 458/539/458 
f 141/541/141 139/542/139 460/543/460 461/544/461 
f 139/542/139 135/537/135 459/540/459 460/543/460 
f 356/397/356 363/406/363 460/543/460 459/540/459 
f 363/406/363 362/405/362 461/544/461 460/543/460 
f 147/159/147 145/158/145 462/545/462 463/546/463 
f 145/158/145 141/541/141 461/544/461 462/545/462 
f 362/405/362 369/414/369 462/545/462 461/544/461 
f 369/414/369 368/413/368 463/546/463 462/545/462 
f 153/167/153 151/165/151 464/547/464 465/548/465 
f 151/165/151 147/159/147 463/546/463 464/547/464 
f 368/413/368 375/422/375 464/547/464 463/546/463 
f 375/422/375 374/421/374 465/548/465 464/547/464 
f 159/175/159 157/173/157 466/549/466 467/550/467 
f 157/173/157 153/167/153 465/548/465 466/549/466 
f 374/421/374 381/430/381 466/549/466 465/548/465 
f 381/430/381 380/429/380 467/550/467 466/549/466 
f 165/551/165 163/181/163 468/552/468 469/553/469 
f 163/181/163 159/175/159 467/550/467 468/552/468 
f 380/429/380 387/438/387 468/552/468 467/550/467 
f 387/438/387 386/437/386 469/553/469 468/552/468 
f 171/554/171 169/555/169 470/556/470 471/557/471 
f 169/555/169 165/551/165 469/553/469 470/556/470 
f 386/437/386 393/446/393 470/556/470 469/553/469 
f 393/446/393 392/445/392 471/557/471 470/556/470 
f 177/558/177 175/559/175 472/560/472 473/561/473 
f 175/559/175 171/554/171 471/557/471 472/560/472 
f 392/445/392 399/454/399 472/560/472 471/557/471 
f 399/454/399 398/453/398 473/561/473 472/560/472 
f 76/503/76 181/562/181 474/563/474 441/504/441 
f 181/562/181 177/558/177 473/561/473 474/563/474 
f 398/453/398 402/458/402 474/563/474 473/561/473 
f 402/458/402 301/324/301 441/504/441 474/563/474 
# 472 polygons

