[
	{
		"from_version": "1.0.0", 
		"to_version": "latest",
		"library_name": "cutility",
		"library_id": 44734882
	},
	{
		"from_version": "1.0.0", 
		"to_version": "latest",
		"library_name": "envvar",
		"library_id": 44734823 
	}
]