nom,pays,ville
Gigashots,China,Golf Course
Centimia,Latvia,Leroy
Skyba,Indonesia,Hollow Ridge
Tagchat,Russia,4th
Riffpedia,Bulgaria,Algoma
Wikivu,China,Truax
Gigazoom,Thailand,Lighthouse Bay
Realcube,Indonesia,Straubel
Npath,Indonesia,Pleasure
Divanoodle,Peru,Summer Ridge
