epoch,train_loss_ae,train_loss_classif,train_correct,train_total,val_loss_ae,val_loss_classif,val_correct,val_total
1,0.0,2.014374401503668,14050,40035,0.0,1.8528842367231846,3999,9965
2,0.0,1.7811223023984666,16786,40035,0.0,1.7243719752877953,4334,9965
3,0.0,1.6932427188375603,17792,40035,0.0,1.6605481039732695,4552,9965
4,0.0,1.6444315474789841,18244,40035,0.0,1.6203860566020012,4688,9965
5,0.0,1.6112875120458416,18631,40035,0.0,1.5940972790122032,4766,9965
6,0.0,1.587700268057303,19003,40035,0.0,1.5732966968789694,4850,9965
7,0.0,1.5740393754689934,19260,40035,0.0,1.5606871386989951,4893,9965
8,0.0,1.5609716883482645,19369,40035,0.0,1.5505198016762733,4942,9965
9,0.0,1.5539700654856028,19503,40035,0.0,1.5433439472690225,4957,9965
10,0.0,1.5464397110104464,19545,40035,0.0,1.5360377123579383,5001,9965
11,0.0,1.5428209924302734,19578,40035,0.0,1.5317564643919468,5011,9965
12,0.0,1.5356244189075579,19685,40035,0.0,1.527532902546227,5018,9965
13,0.0,1.5325438679038241,19805,40035,0.0,1.5237458189949393,5030,9965
14,0.0,1.5301005740742237,19823,40035,0.0,1.522515956312418,5045,9965
15,0.0,1.5297051316823442,19766,40035,0.0,1.521456059999764,5057,9965
16,0.0,1.5267599690943574,19896,40035,0.0,1.52076561935246,5055,9965
17,0.0,1.5274697986130898,19882,40035,0.0,1.5189193561673164,5106,9965
18,0.0,1.525438061436287,19896,40035,0.0,1.517168446443975,5081,9965
19,0.0,1.523788926450494,19897,40035,0.0,1.519094998948276,5084,9965
20,0.0,1.522925614673918,19991,40035,0.0,1.5159701136872172,5104,9965
21,0.0,1.5204681581951465,19973,40035,0.0,1.51707595679909,5108,9965
22,0.0,1.5223421044826222,19892,40035,0.0,1.5143760247156024,5094,9965
23,0.0,1.5224954701019837,19904,40035,0.0,1.5157352900132537,5118,9965
24,0.0,1.5211731714669603,19960,40035,0.0,1.5137675311416388,5109,9965
25,0.0,1.5202222859112027,19887,40035,0.0,1.5147696388885379,5100,9965
26,0.0,1.5205936759305647,19898,40035,0.0,1.513299630023539,5117,9965
27,0.0,1.5201352303103801,19965,40035,0.0,1.5120884031057358,5107,9965
28,0.0,1.5199008635795725,19954,40035,0.0,1.5123609127476811,5103,9965
29,0.0,1.5200938071353367,19951,40035,0.0,1.513710101135075,5096,9965
30,0.0,1.5206106261501964,19963,40035,0.0,1.5128514496609569,5112,9965
31,0.0,1.5202705199404742,19896,40035,0.0,1.5139307640492916,5123,9965
32,0.0,1.5183501522809553,19952,40035,0.0,1.5130478935316205,5118,9965
33,0.0,1.5201018807796625,19891,40035,0.0,1.5110837761312723,5115,9965
34,0.0,1.5195865755359206,19964,40035,0.0,1.5133453905582428,5120,9965
35,0.0,1.5204635466606662,20047,40035,0.0,1.5119729470461607,5109,9965
36,0.0,1.5198103469103192,19976,40035,0.0,1.5131133003160357,5116,9965
37,0.0,1.5208994474309607,19998,40035,0.0,1.5111076179891825,5116,9965
38,0.0,1.5188450590311624,20011,40035,0.0,1.5125874057412148,5101,9965
39,0.0,1.5185752575592206,19945,40035,0.0,1.510750325396657,5111,9965
40,0.0,1.5196007506820721,20082,40035,0.0,1.5119480062276125,5100,9965
41,0.0,1.5196882320728642,19943,40035,0.0,1.51199905667454,5117,9965
42,0.0,1.5197320262523601,19970,40035,0.0,1.5104139596223831,5107,9965
43,0.0,1.5194888803929376,19999,40035,0.0,1.513025457970798,5105,9965
44,0.0,1.519814284946829,20040,40035,0.0,1.5124173555523157,5092,9965
45,0.0,1.518621482847693,19895,40035,0.0,1.5110952453687787,5101,9965
46,0.0,1.5195952717976544,19933,40035,0.0,1.5128787839785218,5124,9965
47,0.0,1.5181812947205366,20084,40035,0.0,1.5114814136177301,5125,9965
48,0.0,1.5204348338071625,19935,40035,0.0,1.512100463733077,5119,9965
49,0.0,1.5188802569247661,20065,40035,0.0,1.512308670207858,5105,9965
50,0.0,1.5181901568648057,19985,40035,0.0,1.5116793010383844,5089,9965
