epoch,train_loss_ae,train_loss_classif,train_correct,train_total,val_loss_ae,val_loss_classif,val_correct,val_total
1,0.0,2.0100679212808608,13787,39960,0.0,1.8502072803676126,3970,10040
2,0.0,1.785457769036293,16345,39960,0.0,1.7266282904893162,4304,10040
3,0.0,1.70396255210042,17162,39960,0.0,1.664997832849622,4524,10040
4,0.0,1.6563221397995949,17697,39960,0.0,1.6276773530989885,4615,10040
5,0.0,1.6235519060492514,18116,39960,0.0,1.6006074892356992,4683,10040
6,0.0,1.6042924062907697,18483,39960,0.0,1.5800576051697137,4757,10040
7,0.0,1.588376351594925,18670,39960,0.0,1.5693094301968813,4793,10040
8,0.0,1.580197914838791,18781,39960,0.0,1.557097234763205,4855,10040
9,0.0,1.5708358490467071,18908,39960,0.0,1.550297518260777,4857,10040
10,0.0,1.5630656695365908,18986,39960,0.0,1.5459054801613092,4875,10040
11,0.0,1.5596644327044487,18975,39960,0.0,1.5399652207270265,4895,10040
12,0.0,1.5543678367137908,19257,39960,0.0,1.5364310564473271,4922,10040
13,0.0,1.551960131973028,19182,39960,0.0,1.534434286877513,4897,10040
14,0.0,1.5492721554636955,19240,39960,0.0,1.5322337299585342,4902,10040
15,0.0,1.5474233740568162,19165,39960,0.0,1.5297848032787442,4921,10040
16,0.0,1.546359717696905,19332,39960,0.0,1.5288420394062996,4936,10040
17,0.0,1.5441272573173046,19376,39960,0.0,1.5296536358073354,4929,10040
18,0.0,1.5437519593536853,19329,39960,0.0,1.5290641831234097,4906,10040
19,0.0,1.5440085522830487,19332,39960,0.0,1.5254685282707214,4939,10040
20,0.0,1.5398235653340817,19329,39960,0.0,1.525354920886457,4916,10040
21,0.0,1.5399952468276024,19441,39960,0.0,1.526112831197679,4938,10040
22,0.0,1.5410967214405535,19421,39960,0.0,1.5236545260995626,4928,10040
23,0.0,1.537918785214424,19395,39960,0.0,1.523898825980723,4940,10040
24,0.0,1.5395671840012073,19376,39960,0.0,1.524555222131312,4934,10040
25,0.0,1.5414554746448994,19359,39960,0.0,1.5238807955756783,4948,10040
26,0.0,1.537074548602104,19467,39960,0.0,1.5231883991509676,4961,10040
27,0.0,1.538226466923952,19546,39960,0.0,1.5215942217037082,4945,10040
28,0.0,1.5379112374782562,19422,39960,0.0,1.5208545653149486,4948,10040
29,0.0,1.537756122648716,19486,39960,0.0,1.520501272752881,4956,10040
30,0.0,1.538491279631853,19380,39960,0.0,1.5203084331005812,4951,10040
31,0.0,1.5369191813468934,19541,39960,0.0,1.5238467045128345,4952,10040
32,0.0,1.5395846824347974,19407,39960,0.0,1.517933700233698,4964,10040
33,0.0,1.535812785178423,19573,39960,0.0,1.5205507399514318,4940,10040
34,0.0,1.5364829868078234,19460,39960,0.0,1.5211515640839934,4938,10040
35,0.0,1.5359550397098065,19425,39960,0.0,1.5203013271093369,4952,10040
36,0.0,1.5369360855221748,19371,39960,0.0,1.5220212191343307,4956,10040
37,0.0,1.5369131779670715,19458,39960,0.0,1.5214916318655014,4964,10040
38,0.0,1.5349591878056525,19466,39960,0.0,1.5220496663823724,4964,10040
39,0.0,1.5391021409630774,19474,39960,0.0,1.5211421996355057,4961,10040
40,0.0,1.5368752832710744,19528,39960,0.0,1.5202537458389997,4964,10040
41,0.0,1.5350455132126808,19527,39960,0.0,1.522166389040649,4980,10040
42,0.0,1.5374467520415782,19462,39960,0.0,1.5204563038423657,4971,10040
43,0.0,1.536819826066494,19535,39960,0.0,1.5214095916599035,4971,10040
44,0.0,1.5406752952933311,19424,39960,0.0,1.519336816854775,4983,10040
45,0.0,1.5362715382874013,19489,39960,0.0,1.518614273518324,4963,10040
46,0.0,1.533911031037569,19484,39960,0.0,1.5182179305702448,4984,10040
47,0.0,1.534724288135767,19490,39960,0.0,1.5213906206190586,4960,10040
48,0.0,1.537319084405899,19343,39960,0.0,1.5214829379692674,4953,10040
49,0.0,1.5383569839596747,19515,39960,0.0,1.5199031261727214,4967,10040
50,0.0,1.5373770247399807,19462,39960,0.0,1.521437126211822,4962,10040
51,0.0,1.5341117125749588,19527,39960,0.0,1.5180579107254744,4969,10040
52,0.0,1.5368592840433122,19508,39960,0.0,1.5184543654322624,4946,10040
53,0.0,1.5344687455892563,19495,39960,0.0,1.5186595544219017,4938,10040
54,0.0,1.537862104475498,19431,39960,0.0,1.5197165496647358,4962,10040
55,0.0,1.5360372944176197,19503,39960,0.0,1.51976999361068,4971,10040
56,0.0,1.5370311206579208,19515,39960,0.0,1.5214943094179034,4945,10040
57,0.0,1.536832716166973,19429,39960,0.0,1.5194372786208987,4972,10040
58,0.0,1.5349164149165153,19451,39960,0.0,1.5192568162456155,4956,10040
59,0.0,1.535873858332634,19446,39960,0.0,1.5181783307343721,4971,10040
60,0.0,1.5352813518047332,19490,39960,0.0,1.5178769966587424,4974,10040
61,0.0,1.5357528318464757,19468,39960,0.0,1.519407737068832,4974,10040
62,0.0,1.536543648093939,19402,39960,0.0,1.519871847704053,4971,10040
63,0.0,1.5382696935534477,19429,39960,0.0,1.5231414092704654,4962,10040
64,0.0,1.5359779711067676,19539,39960,0.0,1.520518478937447,4981,10040
65,0.0,1.538142919689417,19486,39960,0.0,1.5178442979231477,4981,10040
66,0.0,1.5362710949778555,19503,39960,0.0,1.5216512186452746,4960,10040
67,0.0,1.5368150101602078,19447,39960,0.0,1.5222476935014129,4958,10040
68,0.0,1.5365238729119302,19503,39960,0.0,1.520720962435007,4973,10040
69,0.0,1.5371623443067073,19426,39960,0.0,1.5200419863685966,4964,10040
70,0.0,1.5388640400767326,19480,39960,0.0,1.5203464031219482,4983,10040
71,0.0,1.5358144737780095,19406,39960,0.0,1.519917012192309,4973,10040
72,0.0,1.5369687554240226,19455,39960,0.0,1.5185496862977743,4980,10040
73,0.0,1.5359956443309783,19577,39960,0.0,1.5195589512586594,4955,10040
74,0.0,1.5377708095312117,19526,39960,0.0,1.520386221818626,4952,10040
75,0.0,1.5370163494348525,19526,39960,0.0,1.5197655465453863,4964,10040
76,0.0,1.5360759231448173,19528,39960,0.0,1.5177731961011887,4981,10040
77,0.0,1.537430275529623,19384,39960,0.0,1.5198618965223432,4969,10040
78,0.0,1.535886718481779,19404,39960,0.0,1.5178604982793331,4967,10040
79,0.0,1.5340131828188897,19596,39960,0.0,1.5220357151702046,4960,10040
80,0.0,1.5361417773365975,19424,39960,0.0,1.519568464718759,4958,10040
81,0.0,1.5361223883926867,19545,39960,0.0,1.5214599762111902,4960,10040
82,0.0,1.5354180990159512,19474,39960,0.0,1.5199168073013425,4972,10040
83,0.0,1.5386867216229438,19525,39960,0.0,1.5193043276667595,4936,10040
84,0.0,1.5368206003308298,19483,39960,0.0,1.5195220801979303,4963,10040
85,0.0,1.5376539801061153,19358,39960,0.0,1.5188695536926389,4953,10040
86,0.0,1.5346890822052957,19526,39960,0.0,1.5216853702440858,4961,10040
87,0.0,1.536135283112526,19404,39960,0.0,1.5182105638086796,4967,10040
88,0.0,1.538649638146162,19349,39960,0.0,1.5204581525176764,4956,10040
89,0.0,1.5378816315531731,19495,39960,0.0,1.5204812353476882,4961,10040
90,0.0,1.5345684078335762,19397,39960,0.0,1.5203573368489742,4961,10040
91,0.0,1.5356397329270841,19484,39960,0.0,1.5241868793964386,4964,10040
92,0.0,1.5358278346061707,19464,39960,0.0,1.518981265835464,4975,10040
93,0.0,1.5374903574585914,19460,39960,0.0,1.5204012859612703,4961,10040
94,0.0,1.5370514373481274,19444,39960,0.0,1.5216963132843375,4963,10040
95,0.0,1.5352539342641829,19521,39960,0.0,1.5191540215164423,4968,10040
96,0.0,1.5365006257593632,19408,39960,0.0,1.518638632260263,4980,10040
97,0.0,1.5351065734028815,19513,39960,0.0,1.5185224311426282,4960,10040
98,0.0,1.5369994620978833,19500,39960,0.0,1.5198592562228441,4968,10040
99,0.0,1.5364339250326158,19488,39960,0.0,1.519739399664104,4952,10040
100,0.0,1.539032999277115,19386,39960,0.0,1.5190841583535075,4966,10040
