epoch,train_loss_ae,train_loss_classif,train_correct,train_total,val_loss_ae,val_loss_classif,val_correct,val_total
1,0.0,2.053509555019129,13373,40030,0.0,1.8930777162313461,3936,9970
2,0.0,1.8373050378820004,16070,40030,0.0,1.7678134702146056,4238,9970
3,0.0,1.755659672143027,16939,40030,0.0,1.7012331541627643,4408,9970
4,0.0,1.7086886537496369,17441,40030,0.0,1.6647067386657,4511,9970
5,0.0,1.6786796417230139,17709,40030,0.0,1.6378285922110083,4595,9970
6,0.0,1.6601729467094613,18064,40030,0.0,1.621234742924571,4659,9970
7,0.0,1.646554898381376,18227,40030,0.0,1.608388014137745,4697,9970
8,0.0,1.6367892565104527,18372,40030,0.0,1.59910190384835,4745,9970
9,0.0,1.628297708851223,18483,40030,0.0,1.593252089805901,4762,9970
10,0.0,1.624537037965208,18569,40030,0.0,1.5876252157613635,4765,9970
11,0.0,1.6210296328146807,18624,40030,0.0,1.5850078687071798,4786,9970
12,0.0,1.6141812215907314,18801,40030,0.0,1.5823651431128385,4786,9970
13,0.0,1.612365869180368,18814,40030,0.0,1.5780548891052606,4779,9970
14,0.0,1.611154516206715,18797,40030,0.0,1.579254469834268,4781,9970
15,0.0,1.6093556641246947,18847,40030,0.0,1.5743247233331203,4774,9970
16,0.0,1.6084858155348145,18801,40030,0.0,1.574466871097684,4788,9970
17,0.0,1.608834100423006,18928,40030,0.0,1.574760037474334,4797,9970
18,0.0,1.6069748010426856,18944,40030,0.0,1.5755285462364554,4799,9970
19,0.0,1.6066484892675383,18844,40030,0.0,1.5730598662048578,4807,9970
20,0.0,1.6060349439232113,18872,40030,0.0,1.5742195863276722,4820,9970
21,0.0,1.6056335721605313,18938,40030,0.0,1.5714512811973689,4820,9970
22,0.0,1.6057781265161861,18922,40030,0.0,1.5722331451252105,4825,9970
23,0.0,1.6059770837973675,18880,40030,0.0,1.5710208937525747,4833,9970
24,0.0,1.604732192945652,18908,40030,0.0,1.5708853537216783,4819,9970
25,0.0,1.6038808889817981,18933,40030,0.0,1.571984514594078,4821,9970
26,0.0,1.6046771003058353,18839,40030,0.0,1.5721570560708644,4846,9970
27,0.0,1.605870220929194,18824,40030,0.0,1.5711095230653882,4827,9970
28,0.0,1.6032746615120397,18911,40030,0.0,1.5703254379332066,4817,9970
29,0.0,1.6034902155268402,18914,40030,0.0,1.5692038135603068,4841,9970
30,0.0,1.6046380972305236,18833,40030,0.0,1.5692347940057516,4835,9970
31,0.0,1.6048947673517104,18852,40030,0.0,1.570536713115871,4825,9970
32,0.0,1.6021809836748404,18860,40030,0.0,1.5731392242014408,4850,9970
33,0.0,1.6033636147198014,18993,40030,0.0,1.5721383783966303,4833,9970
34,0.0,1.6036279681034553,19001,40030,0.0,1.5702423779293893,4833,9970
35,0.0,1.6055371732817003,18923,40030,0.0,1.571515970863402,4832,9970
36,0.0,1.6050285985544563,18949,40030,0.0,1.5698788734152913,4837,9970
37,0.0,1.6016590644043094,18945,40030,0.0,1.5676178410649297,4855,9970
38,0.0,1.6029600814258613,18910,40030,0.0,1.570043545216322,4842,9970
39,0.0,1.6027414256308121,19003,40030,0.0,1.5714483661577108,4826,9970
40,0.0,1.6022914066946452,18895,40030,0.0,1.5703141270205379,4835,9970
41,0.0,1.6020235691826565,18989,40030,0.0,1.5710446890443561,4833,9970
42,0.0,1.6025551898291888,19041,40030,0.0,1.5725819999352095,4804,9970
43,0.0,1.6022003227517532,19047,40030,0.0,1.5679967030882833,4823,9970
44,0.0,1.6022196963441353,18859,40030,0.0,1.5689128544181585,4827,9970
45,0.0,1.6033563999453198,19015,40030,0.0,1.5693024545907974,4821,9970
46,0.0,1.6036494460980446,18972,40030,0.0,1.570092109031975,4831,9970
47,0.0,1.6043149779875057,18907,40030,0.0,1.5709998598322272,4817,9970
48,0.0,1.603320063190005,19004,40030,0.0,1.5699673909693956,4821,9970
49,0.0,1.6033260017847673,18901,40030,0.0,1.569265890866518,4842,9970
50,0.0,1.6038299997905476,18953,40030,0.0,1.5687691234052181,4839,9970
