epoch,train_loss_ae,train_loss_classif,train_correct,train_total,val_loss_ae,val_loss_classif,val_correct,val_total
1,0.0,2.2333041589242963,10187,40030,0.0,2.1602037828415632,3531,9970
2,0.0,2.1346683256899395,14072,40030,0.0,2.080118926241994,3715,9970
3,0.0,2.0755057586148715,14738,40030,0.0,2.0309129264205694,3814,9970
4,0.0,2.038140722904533,14916,40030,0.0,1.9978288747370243,3852,9970
5,0.0,2.012034049168372,15096,40030,0.0,1.9753621891140938,3856,9970
6,0.0,1.9930959268571278,15130,40030,0.0,1.958647705614567,3882,9970
7,0.0,1.9785824059226071,15301,40030,0.0,1.9450216833502054,3894,9970
8,0.0,1.9672025718128145,15412,40030,0.0,1.9356845505535605,3905,9970
9,0.0,1.9588583788742273,15410,40030,0.0,1.9268229696899655,3915,9970
10,0.0,1.9525008924757712,15473,40030,0.0,1.9216142408549786,3929,9970
11,0.0,1.9464784230406103,15553,40030,0.0,1.9158432167023418,3933,9970
12,0.0,1.9414807405001437,15562,40030,0.0,1.9114223774522543,3946,9970
13,0.0,1.9380219039706568,15657,40030,0.0,1.907867630943656,3954,9970
14,0.0,1.9359822634952708,15495,40030,0.0,1.9052066933363678,3965,9970
15,0.0,1.9317656666183243,15700,40030,0.0,1.9025387521833181,3969,9970
16,0.0,1.9305662269861745,15705,40030,0.0,1.9007497746497393,3987,9970
17,0.0,1.9275667053608658,15697,40030,0.0,1.8975297361612318,3979,9970
18,0.0,1.925427998942784,15763,40030,0.0,1.8961085844784973,3980,9970
19,0.0,1.9247119231655385,15765,40030,0.0,1.8941723462194204,3967,9970
20,0.0,1.9238353766405734,15726,40030,0.0,1.894089998677373,3978,9970
21,0.0,1.9223186743859286,15674,40030,0.0,1.8931490276008842,3987,9970
22,0.0,1.9216107600294172,15721,40030,0.0,1.8925720360130072,3984,9970
23,0.0,1.9197856581891877,15756,40030,0.0,1.8908638041466475,3979,9970
24,0.0,1.919170290219803,15802,40030,0.0,1.8871835339814422,3983,9970
25,0.0,1.9188978450414471,15799,40030,0.0,1.8878092244267464,3977,9970
26,0.0,1.9173126751051162,15831,40030,0.0,1.8887396156787872,3981,9970
27,0.0,1.9163787844010627,15839,40030,0.0,1.8868363555520775,3981,9970
28,0.0,1.9173020437455026,15782,40030,0.0,1.8883565906435251,3989,9970
29,0.0,1.915819176172201,15795,40030,0.0,1.8872056622058153,3990,9970
30,0.0,1.9160641964298848,15787,40030,0.0,1.8860311061143875,3993,9970
31,0.0,1.9154181007664806,15805,40030,0.0,1.887329127639532,3993,9970
32,0.0,1.9145199606498589,15754,40030,0.0,1.8845692742615938,3987,9970
33,0.0,1.914189533053781,15718,40030,0.0,1.8837224598973987,3987,9970
34,0.0,1.9142793089794083,15847,40030,0.0,1.8852220755070446,3995,9970
35,0.0,1.9138892425206333,15823,40030,0.0,1.8849140033125877,3998,9970
36,0.0,1.9139975958024733,15796,40030,0.0,1.8839470762759447,3981,9970
37,0.0,1.9135386638414746,15846,40030,0.0,1.8833351694047449,3990,9970
38,0.0,1.9131530882618109,15826,40030,0.0,1.8836729135364292,3987,9970
39,0.0,1.913387064164439,15816,40030,0.0,1.8830354046076536,3991,9970
40,0.0,1.9127633363103715,15901,40030,0.0,1.883704336360097,3977,9970
41,0.0,1.913467963961081,15780,40030,0.0,1.8832653481513262,3991,9970
42,0.0,1.9126945907196486,15825,40030,0.0,1.883968887850642,3982,9970
43,0.0,1.9125947237800294,15927,40030,0.0,1.882274020463228,3988,9970
44,0.0,1.912828772581709,15817,40030,0.0,1.8837998062372205,3992,9970
45,0.0,1.9127516382442304,15848,40030,0.0,1.8827406968921423,3988,9970
46,0.0,1.911678984642219,15877,40030,0.0,1.8836989346891642,3975,9970
47,0.0,1.9123451706890862,15894,40030,0.0,1.8826224841177464,3975,9970
48,0.0,1.9113566690740496,15912,40030,0.0,1.882456159219146,3995,9970
49,0.0,1.9108874491228462,15858,40030,0.0,1.8822563625872135,3997,9970
50,0.0,1.9125131280206074,15882,40030,0.0,1.8825223203748465,3981,9970
