epoch,train_loss_ae,train_loss_classif,train_correct,train_total,val_loss_ae,val_loss_classif,val_correct,val_total
1,0.0,1.7823839822411536,14451,39960,0.0,1.4473046781495214,4846,10040
2,0.0,1.4968785762786865,18537,39960,0.0,1.2971061281859875,5342,10040
3,0.0,1.3621856866776945,20515,39960,0.0,1.1973741045221686,5760,10040
4,0.0,1.2575365589559078,21967,39960,0.0,1.1285419017076492,5977,10040
5,0.0,1.1678446774184705,23434,39960,0.0,1.0543137975037098,6269,10040
6,0.0,1.1002887983620167,24491,39960,0.0,0.9886936889961362,6492,10040
7,0.0,1.0357965303957462,25480,39960,0.0,0.9491283912211657,6703,10040
8,0.0,0.9770509565621613,26362,39960,0.0,0.8986854227259755,6914,10040
9,0.0,0.9309662488847971,27043,39960,0.0,0.8681831136345862,6964,10040
10,0.0,0.8892191176861525,27514,39960,0.0,0.8267444069497287,7134,10040
11,0.0,0.8526824136823417,28195,39960,0.0,0.7973892427980901,7225,10040
12,0.0,0.8172840117663146,28685,39960,0.0,0.7721808832138777,7358,10040
13,0.0,0.7867080184072256,29102,39960,0.0,0.7542077940888703,7407,10040
14,0.0,0.7576896708458662,29585,39960,0.0,0.7561956578865647,7413,10040
15,0.0,0.7329165340960027,29919,39960,0.0,0.7211685250513256,7497,10040
16,0.0,0.7188084299862385,30122,39960,0.0,0.7181961322203279,7581,10040
17,0.0,0.69886837631464,30344,39960,0.0,0.695901233702898,7595,10040
18,0.0,0.6801194828748703,30692,39960,0.0,0.7002637628465891,7604,10040
19,0.0,0.6643274646624923,30805,39960,0.0,0.6780801713466644,7636,10040
20,0.0,0.6489015407860279,31142,39960,0.0,0.664755143225193,7712,10040
21,0.0,0.6350750078260898,31248,39960,0.0,0.6777281756512821,7700,10040
22,0.0,0.6235389545932413,31450,39960,0.0,0.6574045307934284,7810,10040
23,0.0,0.6110211732238531,31647,39960,0.0,0.6429998204112053,7849,10040
24,0.0,0.6063226848095655,31753,39960,0.0,0.6387275853194296,7799,10040
25,0.0,0.5932643100619316,31854,39960,0.0,0.6352805253118277,7829,10040
26,0.0,0.5797033511847257,32070,39960,0.0,0.6222451431676745,7873,10040
27,0.0,0.5746709525957704,32255,39960,0.0,0.6136368541046977,7887,10040
28,0.0,0.5649419070780277,32365,39960,0.0,0.6267383857630193,7884,10040
29,0.0,0.5547312972322106,32444,39960,0.0,0.6006790278479457,7927,10040
30,0.0,0.5512477106973529,32484,39960,0.0,0.5951626249589026,7965,10040
31,0.0,0.5460374831408262,32579,39960,0.0,0.6091661960817873,7941,10040
32,0.0,0.5357575291767717,32875,39960,0.0,0.5969654000364244,7993,10040
33,0.0,0.5314119279757142,32715,39960,0.0,0.5952691938728094,7955,10040
34,0.0,0.5216845367848874,32868,39960,0.0,0.5868730903603137,7988,10040
35,0.0,0.5149296105280519,32981,39960,0.0,0.5571536207571626,8099,10040
36,0.0,0.5128659526258708,33042,39960,0.0,0.5720964632928371,8076,10040
37,0.0,0.5066610981151461,33083,39960,0.0,0.5771965091116726,8059,10040
38,0.0,0.49635800503194333,33303,39960,0.0,0.5535600427538157,8170,10040
39,0.0,0.4997122874483466,33277,39960,0.0,0.5572303757071495,8115,10040
40,0.0,0.4894857953488827,33380,39960,0.0,0.5714867287315428,8069,10040
41,0.0,0.4865339564159512,33379,39960,0.0,0.5407087737694383,8182,10040
42,0.0,0.4877071665227413,33373,39960,0.0,0.5646486137993634,8066,10040
43,0.0,0.48121663566678763,33518,39960,0.0,0.554460808634758,8126,10040
44,0.0,0.47290708605200055,33542,39960,0.0,0.5444248742423952,8174,10040
45,0.0,0.4748825112357736,33564,39960,0.0,0.5463273217901587,8155,10040
46,0.0,0.47018824499100453,33577,39960,0.0,0.5357574578374624,8183,10040
47,0.0,0.46525460481643677,33673,39960,0.0,0.5306576401926577,8196,10040
48,0.0,0.46107550673186776,33763,39960,0.0,0.5264417571015656,8185,10040
49,0.0,0.46180266864597797,33731,39960,0.0,0.5417954875156283,8173,10040
50,0.0,0.45373205173760656,33850,39960,0.0,0.5196473048999906,8243,10040
51,0.0,0.452589415833354,33843,39960,0.0,0.5215138732455671,8208,10040
52,0.0,0.45236527256667614,33837,39960,0.0,0.524869910441339,8246,10040
53,0.0,0.4457391618192196,34012,39960,0.0,0.5147814238443971,8264,10040
54,0.0,0.44496643356978893,34025,39960,0.0,0.5088187428191304,8306,10040
55,0.0,0.4424200183525681,33985,39960,0.0,0.5092254839837551,8298,10040
56,0.0,0.4406052111461759,33991,39960,0.0,0.516512612812221,8278,10040
57,0.0,0.44058158533647657,34028,39960,0.0,0.5049030925147235,8315,10040
58,0.0,0.4343802092224359,34126,39960,0.0,0.5029140319675207,8246,10040
59,0.0,0.4374240538105369,34027,39960,0.0,0.5127716762945056,8238,10040
60,0.0,0.4314253848418594,34202,39960,0.0,0.5103043280541897,8259,10040
61,0.0,0.4268605086952448,34196,39960,0.0,0.5123949213884771,8273,10040
62,0.0,0.4291633075103164,34189,39960,0.0,0.5046400614082813,8317,10040
63,0.0,0.43183343909680844,34174,39960,0.0,0.4909096192568541,8331,10040
64,0.0,0.4212429342791438,34382,39960,0.0,0.49677041126415133,8276,10040
65,0.0,0.4247561257705092,34270,39960,0.0,0.5109529802575707,8274,10040
66,0.0,0.4201184871979058,34395,39960,0.0,0.47779265558347106,8414,10040
67,0.0,0.4145210378989577,34359,39960,0.0,0.4972344590350985,8310,10040
68,0.0,0.41758906763046977,34367,39960,0.0,0.4875813680700958,8348,10040
69,0.0,0.41679502578452227,34347,39960,0.0,0.49593306612223387,8345,10040
70,0.0,0.4138004457578063,34470,39960,0.0,0.48565277596935624,8387,10040
71,0.0,0.4117228167690337,34539,39960,0.0,0.4900924442335963,8369,10040
72,0.0,0.40938326757401233,34539,39960,0.0,0.5016293935477734,8359,10040
73,0.0,0.417468742672354,34403,39960,0.0,0.499471826478839,8345,10040
74,0.0,0.41183196527883414,34542,39960,0.0,0.47690046951174736,8401,10040
75,0.0,0.40791455117985603,34530,39960,0.0,0.507227040361613,8304,10040
76,0.0,0.4075836613960564,34562,39960,0.0,0.5008525820448995,8348,10040
77,0.0,0.4040354887396097,34516,39960,0.0,0.5055543477647007,8309,10040
78,0.0,0.4070847117900849,34489,39960,0.0,0.48003647476434713,8414,10040
79,0.0,0.40228628544136885,34628,39960,0.0,0.48006762051954865,8428,10040
80,0.0,0.4018560656346381,34604,39960,0.0,0.48310639802366495,8395,10040
81,0.0,0.4032911545038223,34531,39960,0.0,0.49952315399423247,8334,10040
82,0.0,0.4007027757540345,34506,39960,0.0,0.4793112096376717,8401,10040
83,0.0,0.39705560287460684,34716,39960,0.0,0.48049560748040676,8406,10040
84,0.0,0.3966911984793842,34622,39960,0.0,0.4575992096215486,8474,10040
85,0.0,0.3931182181090116,34697,39960,0.0,0.47133058425970376,8421,10040
86,0.0,0.3918402264453471,34809,39960,0.0,0.4693504504393787,8445,10040
87,0.0,0.3911013341322541,34684,39960,0.0,0.4631991568021476,8440,10040
88,0.0,0.39109494799748057,34750,39960,0.0,0.4765440756455064,8430,10040
89,0.0,0.3914901172928512,34732,39960,0.0,0.46470543602481484,8462,10040
90,0.0,0.3885707494802773,34801,39960,0.0,0.4764414834789931,8437,10040
91,0.0,0.3933237111009657,34683,39960,0.0,0.4846213408745826,8394,10040
92,0.0,0.3872758857347071,34825,39960,0.0,0.4632017144467681,8473,10040
93,0.0,0.3877804247289896,34771,39960,0.0,0.46977310557849705,8446,10040
94,0.0,0.3828546545282006,34843,39960,0.0,0.4688707739114761,8474,10040
95,0.0,0.38942610953003165,34809,39960,0.0,0.46470118919387465,8468,10040
96,0.0,0.3850800210796297,34857,39960,0.0,0.4520817915908993,8488,10040
97,0.0,0.3875137470476329,34787,39960,0.0,0.4646498919464647,8489,10040
98,0.0,0.38446843542158604,34836,39960,0.0,0.45432081213220954,8509,10040
99,0.0,0.3797211126051843,34968,39960,0.0,0.47302988125011325,8455,10040
100,0.0,0.3766819341108203,35014,39960,0.0,0.4648141609504819,8463,10040
