epoch,train_loss_ae,train_loss_classif,train_correct,train_total,val_loss_ae,val_loss_classif,val_correct,val_total
1,0.017963817413151263,0.0,0,39974,0.013017166685312987,0.0,0,10026
2,0.010808623233437538,0.0,0,39974,0.01086318250745535,0.0,0,10026
3,0.009012729642540216,0.0,0,39974,0.00955512053333223,0.0,0,10026
4,0.007796004562824964,0.0,0,39974,0.008349510887637735,0.0,0,10026
5,0.006988773544877767,0.0,0,39974,0.007519209617748856,0.0,0,10026
6,0.006431241626292467,0.0,0,39974,0.007053644303232432,0.0,0,10026
7,0.006027755842357874,0.0,0,39974,0.006924366764724255,0.0,0,10026
8,0.005727211072295904,0.0,0,39974,0.006585534568876028,0.0,0,10026
9,0.005501541397720576,0.0,0,39974,0.0065828036749735475,0.0,0,10026
10,0.005277458207309246,0.0,0,39974,0.006176886451430619,0.0,0,10026
11,0.005123424109816551,0.0,0,39974,0.00607740746345371,0.0,0,10026
12,0.004979450654238463,0.0,0,39974,0.0060009704902768135,0.0,0,10026
13,0.004855024574697018,0.0,0,39974,0.005915506021119654,0.0,0,10026
14,0.004764379966631532,0.0,0,39974,0.006041932897642255,0.0,0,10026
15,0.004672067955881357,0.0,0,39974,0.005912524345330894,0.0,0,10026
16,0.004579813532903791,0.0,0,39974,0.005761278164573014,0.0,0,10026
17,0.004502815078571439,0.0,0,39974,0.005659379647113383,0.0,0,10026
18,0.004422255027666688,0.0,0,39974,0.0057669008616358045,0.0,0,10026
19,0.00435734529606998,0.0,0,39974,0.0058614506619051095,0.0,0,10026
20,0.0043106780376285314,0.0,0,39974,0.0058006758103147146,0.0,0,10026
21,0.004249757735803723,0.0,0,39974,0.005941655882634222,0.0,0,10026
22,0.004192398470640182,0.0,0,39974,0.006312174955382943,0.0,0,10026
23,0.004140352883562445,0.0,0,39974,0.005700289970263839,0.0,0,10026
24,0.004087197934091091,0.0,0,39974,0.006078192498534918,0.0,0,10026
25,0.004024323023110628,0.0,0,39974,0.005598091287538409,0.0,0,10026
26,0.003976730131730438,0.0,0,39974,0.006049031624570489,0.0,0,10026
27,0.003929222789034247,0.0,0,39974,0.006342126568779349,0.0,0,10026
28,0.003869675099104643,0.0,0,39974,0.006638881983235478,0.0,0,10026
29,0.003833880186080933,0.0,0,39974,0.0065328959375619885,0.0,0,10026
30,0.0037981714062392713,0.0,0,39974,0.006798417633399367,0.0,0,10026
31,0.0037305174697190523,0.0,0,39974,0.006846654484979809,0.0,0,10026
32,0.003725301955267787,0.0,0,39974,0.0073856804985553024,0.0,0,10026
33,0.0036624328251928092,0.0,0,39974,0.006918019056320191,0.0,0,10026
34,0.00365747682787478,0.0,0,39974,0.007486865273676813,0.0,0,10026
35,0.003608860120922327,0.0,0,39974,0.007489708485081792,0.0,0,10026
36,0.003580906865745783,0.0,0,39974,0.007492865575477481,0.0,0,10026
37,0.003550359097495675,0.0,0,39974,0.007976169511675835,0.0,0,10026
38,0.003530631050467491,0.0,0,39974,0.007553086755797267,0.0,0,10026
39,0.0034978239588439462,0.0,0,39974,0.008825610298663378,0.0,0,10026
40,0.0034677308302372696,0.0,0,39974,0.00802602714393288,0.0,0,10026
