epoch,train_loss_ae,train_loss_classif,train_correct,train_total,val_loss_ae,val_loss_classif,val_correct,val_total
1,0.0,2.1891314209031223,11985,40033,0.0,2.1232036035507917,3371,9967
2,0.0,2.062378537219268,14229,40033,0.0,2.0501745212823153,3549,9967
3,0.0,2.005130589341584,14775,40033,0.0,2.011839747428894,3622,9967
4,0.0,1.9763437864450981,15023,40033,0.0,1.9924944266676903,3659,9967
5,0.0,1.9591991819393713,15228,40033,0.0,1.9794625230133533,3680,9967
6,0.0,1.9502312025299278,15424,40033,0.0,1.9730783067643642,3718,9967
7,0.0,1.9444922232232726,15480,40033,0.0,1.969948997721076,3750,9967
8,0.0,1.94058256408277,15558,40033,0.0,1.9663655292242768,3757,9967
9,0.0,1.9377417939777573,15593,40033,0.0,1.9646197743713856,3756,9967
10,0.0,1.9363158947814956,15593,40033,0.0,1.9649904035031796,3779,9967
11,0.0,1.9346219213744895,15663,40033,0.0,1.9637273531407116,3791,9967
12,0.0,1.9345277813248358,15707,40033,0.0,1.961926054209471,3783,9967
13,0.0,1.9341958064835865,15690,40033,0.0,1.961005199700594,3780,9967
14,0.0,1.9334808964960684,15612,40033,0.0,1.9617015868425367,3767,9967
15,0.0,1.9325173822954629,15712,40033,0.0,1.9597626570612192,3781,9967
16,0.0,1.9330700445836915,15641,40033,0.0,1.9611096195876598,3773,9967
17,0.0,1.93273477887098,15638,40033,0.0,1.9607464130967855,3773,9967
18,0.0,1.9324386789918708,15729,40033,0.0,1.9600289408117533,3776,9967
19,0.0,1.9318153510411706,15715,40033,0.0,1.9604903366416693,3789,9967
20,0.0,1.9324857970705618,15769,40033,0.0,1.9590108375996351,3799,9967
21,0.0,1.9319803305208303,15639,40033,0.0,1.9601375050842762,3792,9967
22,0.0,1.9324733607899456,15714,40033,0.0,1.9605862256139517,3799,9967
23,0.0,1.9322653937811098,15623,40033,0.0,1.959288977086544,3792,9967
24,0.0,1.9319156098503845,15688,40033,0.0,1.9615516904741523,3815,9967
25,0.0,1.9325141848538059,15669,40033,0.0,1.9609750248491764,3821,9967
26,0.0,1.9309640296708093,15752,40033,0.0,1.9602524302899837,3802,9967
27,0.0,1.9317652717732583,15708,40033,0.0,1.9614552892744541,3784,9967
28,0.0,1.9314893705847733,15704,40033,0.0,1.9607839453965425,3797,9967
29,0.0,1.931692607784138,15686,40033,0.0,1.9609107822179794,3796,9967
30,0.0,1.9318843932864003,15735,40033,0.0,1.9584927894175053,3778,9967
31,0.0,1.931497295455525,15682,40033,0.0,1.961007323116064,3785,9967
32,0.0,1.9322325722478069,15675,40033,0.0,1.9585267826914787,3790,9967
33,0.0,1.9320908407219493,15629,40033,0.0,1.9599153473973274,3805,9967
34,0.0,1.9312374710370177,15706,40033,0.0,1.9603816419839861,3788,9967
35,0.0,1.9310455320004267,15729,40033,0.0,1.9582715071737766,3780,9967
36,0.0,1.9313053468974253,15726,40033,0.0,1.9578192383050919,3794,9967
37,0.0,1.9309114236325122,15679,40033,0.0,1.958757247775793,3777,9967
38,0.0,1.932148960904001,15695,40033,0.0,1.9597355090081692,3795,9967
39,0.0,1.9312429634598307,15726,40033,0.0,1.959825912490487,3799,9967
40,0.0,1.9325609592655404,15707,40033,0.0,1.95957962423563,3784,9967
41,0.0,1.9318725354374406,15678,40033,0.0,1.9589490443468094,3771,9967
42,0.0,1.931373755664776,15702,40033,0.0,1.9588823057711127,3781,9967
43,0.0,1.9316457679120307,15682,40033,0.0,1.9596806913614273,3784,9967
44,0.0,1.9314768977058583,15665,40033,0.0,1.9590506888926031,3784,9967
45,0.0,1.9319929090289834,15673,40033,0.0,1.9586154911667109,3769,9967
46,0.0,1.931716726063349,15672,40033,0.0,1.9604045990854504,3767,9967
47,0.0,1.932312971570145,15770,40033,0.0,1.9596059806644917,3787,9967
48,0.0,1.9311088054015424,15724,40033,0.0,1.959482580423355,3796,9967
49,0.0,1.930190752834653,15731,40033,0.0,1.9606376718729734,3795,9967
50,0.0,1.9310123483522443,15678,40033,0.0,1.9584415946155787,3794,9967
