epoch,train_loss_ae,train_loss_classif,train_correct,train_total,val_loss_ae,val_loss_classif,val_correct,val_total
1,0.018231551583111287,0.0,0,39974,0.013239029003307224,0.0,0,10026
2,0.011359798841178418,0.0,0,39974,0.011219691671431064,0.0,0,10026
3,0.009721238482743502,0.0,0,39974,0.009820572007447482,0.0,0,10026
4,0.008612095592170953,0.0,0,39974,0.0087402718141675,0.0,0,10026
5,0.007918221656233073,0.0,0,39974,0.008278966136276721,0.0,0,10026
6,0.007424639232456684,0.0,0,39974,0.007832897501066327,0.0,0,10026
7,0.007093871012330055,0.0,0,39974,0.007549568591639399,0.0,0,10026
8,0.006797147825360298,0.0,0,39974,0.007389401621185243,0.0,0,10026
9,0.006605560977011919,0.0,0,39974,0.007428068178705871,0.0,0,10026
10,0.0064325341813266275,0.0,0,39974,0.00719804703257978,0.0,0,10026
11,0.006300419790297746,0.0,0,39974,0.006869981437921524,0.0,0,10026
12,0.006185180113464594,0.0,0,39974,0.006996825919486582,0.0,0,10026
13,0.0060972322560846805,0.0,0,39974,0.006883070850744843,0.0,0,10026
14,0.005994839822500944,0.0,0,39974,0.006939174863509834,0.0,0,10026
15,0.00589896474853158,0.0,0,39974,0.006828696001321077,0.0,0,10026
16,0.005814494340866804,0.0,0,39974,0.006794402794912458,0.0,0,10026
17,0.005771353085339069,0.0,0,39974,0.006877472228370607,0.0,0,10026
18,0.005721047934889793,0.0,0,39974,0.006928884703665972,0.0,0,10026
19,0.005643808550387621,0.0,0,39974,0.007079878239892423,0.0,0,10026
20,0.005607071723043919,0.0,0,39974,0.007266750582493842,0.0,0,10026
21,0.005558757102489471,0.0,0,39974,0.007253456581383944,0.0,0,10026
22,0.0055201061025261875,0.0,0,39974,0.0072081935126334425,0.0,0,10026
23,0.005480919694155454,0.0,0,39974,0.007195491832681001,0.0,0,10026
24,0.005458573886752129,0.0,0,39974,0.006979916477575898,0.0,0,10026
25,0.0054273547090590004,0.0,0,39974,0.0074080157093703745,0.0,0,10026
26,0.0054010470166802405,0.0,0,39974,0.007278021750971675,0.0,0,10026
27,0.005372184818983078,0.0,0,39974,0.007779089035466313,0.0,0,10026
28,0.005347980654984713,0.0,0,39974,0.0074777171248570085,0.0,0,10026
29,0.0053300181612372394,0.0,0,39974,0.007667533960193396,0.0,0,10026
30,0.005289875739812851,0.0,0,39974,0.007157009816728533,0.0,0,10026
31,0.00528377151787281,0.0,0,39974,0.0076267797034233805,0.0,0,10026
32,0.005285674612224102,0.0,0,39974,0.008007736597210168,0.0,0,10026
33,0.005265953745692969,0.0,0,39974,0.0077272091759368776,0.0,0,10026
34,0.005238893659412861,0.0,0,39974,0.007972484664060175,0.0,0,10026
35,0.005221161427348852,0.0,0,39974,0.007652766490355134,0.0,0,10026
36,0.005223682475090027,0.0,0,39974,0.007753871288150549,0.0,0,10026
37,0.005197211406379938,0.0,0,39974,0.007954993844032287,0.0,0,10026
38,0.00519094473272562,0.0,0,39974,0.008019895618781447,0.0,0,10026
39,0.005183159314841032,0.0,0,39974,0.00826108488254249,0.0,0,10026
40,0.005147379830479622,0.0,0,39974,0.008126226486638188,0.0,0,10026
41,0.005159626772254705,0.0,0,39974,0.0081250841030851,0.0,0,10026
42,0.0051459440626204014,0.0,0,39974,0.008248493913561106,0.0,0,10026
43,0.005129180593788624,0.0,0,39974,0.00808111410588026,0.0,0,10026
44,0.005111039319634437,0.0,0,39974,0.008762442134320736,0.0,0,10026
45,0.005108762861788273,0.0,0,39974,0.008183613512665033,0.0,0,10026
46,0.005093866445869208,0.0,0,39974,0.00820367382839322,0.0,0,10026
47,0.005088970462977886,0.0,0,39974,0.008424930134788155,0.0,0,10026
48,0.005049794120714069,0.0,0,39974,0.008440089784562588,0.0,0,10026
49,0.005062224040180445,0.0,0,39974,0.0083366469014436,0.0,0,10026
50,0.00505290272757411,0.0,0,39974,0.008681587222963572,0.0,0,10026
