epoch,train_loss_ae,train_loss_classif,train_correct,train_total,val_loss_ae,val_loss_classif,val_correct,val_total
1,0.0,1.9344560569896103,13803,40030,0.0,1.7717837542295456,3976,9970
2,0.0,1.7038709126984157,17111,40030,0.0,1.6521231457591057,4372,9970
3,0.0,1.6187413504864936,18263,40030,0.0,1.5869352594017985,4608,9970
4,0.0,1.5707856408668497,18898,40030,0.0,1.5489932335913181,4748,9970
5,0.0,1.533556638059382,19381,40030,0.0,1.5199119225144386,4838,9970
6,0.0,1.5106957588797085,19597,40030,0.0,1.49526528082788,4940,9970
7,0.0,1.4912200617059446,19890,40030,0.0,1.4796731108799577,5004,9970
8,0.0,1.477535127308041,19997,40030,0.0,1.4699321798980236,5043,9970
9,0.0,1.468130242014036,20093,40030,0.0,1.4603046607226133,5092,9970
10,0.0,1.4602915401728198,20281,40030,0.0,1.450361730530858,5109,9970
11,0.0,1.4508183437069289,20388,40030,0.0,1.4467647904530168,5125,9970
12,0.0,1.4440883087892882,20427,40030,0.0,1.4385832007974386,5141,9970
13,0.0,1.4383685487968187,20564,40030,0.0,1.4358591195195913,5150,9970
14,0.0,1.4328075760303023,20722,40030,0.0,1.4314194675534964,5194,9970
15,0.0,1.4320674315154456,20828,40030,0.0,1.4279785379767418,5176,9970
16,0.0,1.426053122608378,20699,40030,0.0,1.4252020604908466,5193,9970
17,0.0,1.424707911652736,20724,40030,0.0,1.422131727449596,5221,9970
18,0.0,1.422338602028954,20786,40030,0.0,1.418126248754561,5239,9970
19,0.0,1.418100032038963,20939,40030,0.0,1.4173714257776737,5223,9970
20,0.0,1.419361575116841,20752,40030,0.0,1.4156606420874596,5235,9970
21,0.0,1.417055360365885,20834,40030,0.0,1.4170775469392538,5219,9970
22,0.0,1.4159724812585706,20902,40030,0.0,1.4143545692786574,5250,9970
23,0.0,1.41597522717243,20877,40030,0.0,1.4125051256269217,5250,9970
24,0.0,1.4119849638483777,20897,40030,0.0,1.412571845576167,5277,9970
25,0.0,1.411760245083858,20846,40030,0.0,1.409781789407134,5270,9970
26,0.0,1.4102666925924559,20910,40030,0.0,1.412007799372077,5245,9970
27,0.0,1.4092384660527253,21018,40030,0.0,1.410092473961413,5260,9970
28,0.0,1.409040417926856,20980,40030,0.0,1.4083811780437827,5281,9970
29,0.0,1.407732681695598,21066,40030,0.0,1.4066835725679994,5279,9970
30,0.0,1.4077098367694088,20931,40030,0.0,1.408144487068057,5278,9970
31,0.0,1.408513703684028,20936,40030,0.0,1.4088252559304237,5246,9970
32,0.0,1.404275671510508,21074,40030,0.0,1.4072441728785634,5260,9970
33,0.0,1.4043559872220974,20959,40030,0.0,1.406888421624899,5262,9970
34,0.0,1.4086512133133964,20994,40030,0.0,1.406967774964869,5276,9970
35,0.0,1.4037501005925976,21046,40030,0.0,1.4073930913582444,5266,9970
36,0.0,1.4043029129933624,21160,40030,0.0,1.4043686259537935,5276,9970
37,0.0,1.4051580852189194,21016,40030,0.0,1.4049093332141638,5276,9970
38,0.0,1.4038865293819491,21067,40030,0.0,1.4042494166642427,5291,9970
39,0.0,1.4034995782418183,21073,40030,0.0,1.4050005748867989,5276,9970
40,0.0,1.4041628011654075,21145,40030,0.0,1.4038489433005452,5286,9970
41,0.0,1.4036562002171724,21099,40030,0.0,1.4022521022707224,5293,9970
42,0.0,1.4049840141861394,21128,40030,0.0,1.404753578826785,5283,9970
43,0.0,1.4050760028211358,21029,40030,0.0,1.4063707925379276,5293,9970
44,0.0,1.4016711346495645,21143,40030,0.0,1.4059656439349055,5272,9970
45,0.0,1.4011153027403374,21122,40030,0.0,1.4052935875952244,5289,9970
46,0.0,1.4020968634730424,21076,40030,0.0,1.404596483334899,5292,9970
47,0.0,1.4012405636925667,21063,40030,0.0,1.4043315686285496,5295,9970
48,0.0,1.4040431181807964,21116,40030,0.0,1.4014309737831354,5311,9970
49,0.0,1.4033359695618717,21042,40030,0.0,1.399118541739881,5300,9970
50,0.0,1.4003072535029997,21123,40030,0.0,1.4040521997958422,5289,9970
