epoch,train_loss_ae,train_loss_classif,train_correct,train_total,val_loss_ae,val_loss_classif,val_correct,val_total
1,0.0,1.9385035075366306,14282,40033,0.0,1.7728833202272654,4070,9967
2,0.0,1.7050166391193295,17191,40033,0.0,1.6553424205631015,4442,9967
3,0.0,1.621381171529714,18337,40033,0.0,1.5963059570640326,4583,9967
4,0.0,1.5720760198339772,18853,40033,0.0,1.5578017057850957,4733,9967
5,0.0,1.5393821277117101,19316,40033,0.0,1.5314324432983994,4842,9967
6,0.0,1.519821628559226,19503,40033,0.0,1.5114874532446265,4915,9967
7,0.0,1.4989253129072178,19790,40033,0.0,1.4985706005245447,4964,9967
8,0.0,1.4878952585624905,19910,40033,0.0,1.486450033262372,4997,9967
9,0.0,1.4774537628915267,20037,40033,0.0,1.4781087962910533,5000,9967
10,0.0,1.4689177848969974,20300,40033,0.0,1.4714611181989312,5018,9967
11,0.0,1.4627439679560093,20296,40033,0.0,1.465393714606762,5040,9967
12,0.0,1.4570714471439203,20419,40033,0.0,1.4575885888189077,5057,9967
13,0.0,1.4517868348299123,20436,40033,0.0,1.4524019183591008,5069,9967
14,0.0,1.4489776367089524,20526,40033,0.0,1.451765880919993,5090,9967
15,0.0,1.4441497576312898,20615,40033,0.0,1.448930292390287,5101,9967
16,0.0,1.4410971846883767,20563,40033,0.0,1.4470212580636144,5103,9967
17,0.0,1.4411395234159958,20592,40033,0.0,1.4428027113899589,5145,9967
18,0.0,1.4389854162550582,20647,40033,0.0,1.4420081628486514,5159,9967
19,0.0,1.438228010881347,20664,40033,0.0,1.4414415648207068,5181,9967
20,0.0,1.4336600076978483,20735,40033,0.0,1.4386015152558684,5157,9967
21,0.0,1.4348672734150967,20756,40033,0.0,1.437953608110547,5143,9967
22,0.0,1.4318990860336696,20699,40033,0.0,1.4375388296321034,5169,9967
23,0.0,1.4317302162738177,20717,40033,0.0,1.436781738884747,5156,9967
24,0.0,1.430155936116799,20792,40033,0.0,1.4367477362975478,5180,9967
25,0.0,1.430933810205172,20772,40033,0.0,1.4340136852115393,5177,9967
26,0.0,1.427451697008583,20833,40033,0.0,1.4343392010778189,5195,9967
27,0.0,1.4298321808667513,20779,40033,0.0,1.4329790091142058,5187,9967
28,0.0,1.4266160144187963,20940,40033,0.0,1.4343850268051028,5182,9967
29,0.0,1.4292968234743555,20792,40033,0.0,1.433430309407413,5195,9967
30,0.0,1.4282148713751819,20784,40033,0.0,1.431412692181766,5195,9967
31,0.0,1.4265067567423986,20956,40033,0.0,1.432068571448326,5180,9967
32,0.0,1.427217929984053,20887,40033,0.0,1.432509645819664,5163,9967
33,0.0,1.4257147183683447,20819,40033,0.0,1.4313285471871495,5189,9967
34,0.0,1.4265291947728624,20840,40033,0.0,1.4314041379839182,5200,9967
35,0.0,1.4278171996112925,20789,40033,0.0,1.431718091480434,5199,9967
36,0.0,1.426405020165272,20811,40033,0.0,1.4311860036104918,5213,9967
37,0.0,1.4248428820147396,20776,40033,0.0,1.4302739780396223,5206,9967
38,0.0,1.425333893426453,20874,40033,0.0,1.4303628960624337,5201,9967
39,0.0,1.424323729932689,20881,40033,0.0,1.4281382877379656,5212,9967
40,0.0,1.4241248274001832,20901,40033,0.0,1.43170605879277,5188,9967
41,0.0,1.424796599894762,20907,40033,0.0,1.432269001379609,5215,9967
42,0.0,1.4238615637829604,20853,40033,0.0,1.431215275079012,5186,9967
43,0.0,1.4250276413874123,20881,40033,0.0,1.431971089914441,5215,9967
44,0.0,1.4252766868629203,20871,40033,0.0,1.4309232542291284,5196,9967
45,0.0,1.4230526476420058,20939,40033,0.0,1.4314053673297167,5228,9967
46,0.0,1.4243402876876319,20967,40033,0.0,1.430934900417924,5217,9967
47,0.0,1.4222529054747317,20932,40033,0.0,1.4288653805851936,5235,9967
48,0.0,1.4205700506607946,20970,40033,0.0,1.4288415107876062,5203,9967
49,0.0,1.4226785563408566,20842,40033,0.0,1.4308930514380336,5217,9967
50,0.0,1.425668748672873,20884,40033,0.0,1.4297974202781916,5218,9967
