epoch,train_loss_ae,train_loss_classif,train_correct,train_total,val_loss_ae,val_loss_classif,val_correct,val_total
1,0.0,2.137855646280816,11380,40030,0.0,2.0132844150066376,3433,9970
2,0.0,1.9811441220295507,13582,40030,0.0,1.9133382104337218,3707,9970
3,0.0,1.923295343145966,14276,40030,0.0,1.866857334971428,3831,9970
4,0.0,1.890325146956375,14648,40030,0.0,1.8369111604988573,3937,9970
5,0.0,1.8728972028809996,14832,40030,0.0,1.8172705080360174,3980,9970
6,0.0,1.8598243002050792,15129,40030,0.0,1.802418092265725,4038,9970
7,0.0,1.8488350526664774,15379,40030,0.0,1.7968668136745691,4084,9970
8,0.0,1.843523850944191,15353,40030,0.0,1.7873231228440998,4125,9970
9,0.0,1.8393723526225685,15439,40030,0.0,1.7801813315600157,4121,9970
10,0.0,1.8350885942959176,15433,40030,0.0,1.779133826494217,4139,9970
11,0.0,1.830206472224321,15585,40030,0.0,1.7775421775877476,4151,9970
12,0.0,1.8275514411659668,15601,40030,0.0,1.7721080873161554,4162,9970
13,0.0,1.8281396683722066,15590,40030,0.0,1.7714092787355185,4176,9970
14,0.0,1.8267549041765758,15694,40030,0.0,1.7712075635790823,4172,9970
15,0.0,1.8264678425896475,15603,40030,0.0,1.7682313825935123,4176,9970
16,0.0,1.8243907266460098,15640,40030,0.0,1.7683865688741207,4185,9970
17,0.0,1.8231419995189093,15670,40030,0.0,1.7677271366119387,4192,9970
18,0.0,1.8240723595284996,15708,40030,0.0,1.7682470288127659,4185,9970
19,0.0,1.82440750324688,15771,40030,0.0,1.7668697889894245,4212,9970
20,0.0,1.8225312054442901,15644,40030,0.0,1.7655587289482355,4220,9970
