{
  "steps": [
    {
      "id" : "1",
      "filter": "read.js",
      "params": [
        "test.txt"
      ],
      "next": "2"
    },
    {
      "id" : "2",
      "filter": "capitalize.js",
      "next": "3"
    },
    {
      "id" :"3",
      "filter": "reverse.js",
      "next": "4"
    },
    {
      "id": "4",
      "filter": "write.js",
      "params": [
        "output.txt"
      ],
      "next": ""
    }
  ]
}
