<svg version="1.1" class="clearos-svg clearfoundation app-vendor-clearcenter app-paid app-category-system app-sub-category-messaging" viewBox="0 0 400 400" preserveAspectRatio="xMinYMin" xmlns="http://www.w3.org/2000/svg" xmlns:xlink= "http://www.w3.org/1999/xlink">
<path fill="#AA0707" d="M91.666,184.647"/>
<path fill="#AA0707" d="M123.245,247.805"/>
<path fill="#AA0707" d="M91.666,184.647"/>
<path fill="#AA0707" d="M123.245,247.805"/>
<g>
	<polygon fill="#686868" points="198.812,315.088 142.916,270.686 2.701,387.105 397.299,387.73 255.014,270.545 	"/>
	<polygon fill="#686868" points="2.701,151.156 2.701,369.632 131.647,261.605 	"/>
	<polygon fill="#686868" points="397.299,369.632 397.299,151.156 268.329,261.605 	"/>
	<path fill="#686868" d="M198.812,300.037l198.487-163.494l-87.115,0.266l-1-124.461L84.964,12.27l0.242,124.859l-82.505,0.242
		L198.812,300.037z M160.74,64.846l79.207,0.047l0.531,74.049l21.475,0.674l-62.851,49.597l-61.82-50.161l23.592-0.625
		L160.74,64.846z"/>
</g>
</svg>
