<svg version="1.1" class="clearos-svg clearfoundation app-vendor-clearcenter app-paid app-category-cloud app-sub-category-services" viewBox="0 0 400 400" preserveAspectRatio="xMinYMin" xmlns="http://www.w3.org/2000/svg" xmlns:xlink= "http://www.w3.org/1999/xlink">
<path fill="#AA0707" d="M441.666,184.647"/>
<path fill="#AA0707" d="M473.245,247.805"/>
<path fill="#AA0707" d="M441.666,184.647"/>
<path fill="#AA0707" d="M473.245,247.805"/>
<g>
	<path fill="#686868" d="M309.695,172.444H36.414c-11.212,0-20.292,9.09-20.292,20.301v61.774c0,11.188,9.08,20.271,20.292,20.271
		h273.281c11.229,0,20.31-9.117,20.31-20.271v-61.774C330.023,181.534,320.926,172.444,309.695,172.444z M288.568,250.738
		c-14.975,0-27.094-12.156-27.094-27.094c0-14.977,12.118-27.104,27.094-27.104c14.937,0,27.071,12.128,27.071,27.104
		C315.643,238.582,303.504,250.738,288.568,250.738z"/>
	<path fill="#686868" d="M309.695,293.434H36.414c-11.212,0-20.292,9.08-20.292,20.313v61.748c0,11.229,9.08,20.309,20.292,20.309
		h273.281c11.229,0,20.31-9.098,20.31-20.309v-61.748C330.023,302.514,320.926,293.434,309.695,293.434z M288.568,371.672
		c-14.975,0-27.094-12.082-27.094-27.055c0-14.977,12.118-27.094,27.094-27.094c14.937,0,27.071,12.117,27.071,27.094
		C315.643,359.59,303.504,371.672,288.568,371.672z"/>
	<g>
		<path fill="#686868" d="M204.418,19.229h-0.261l-15.011,8.106l-2.262-8.904L205.771,8.34h9.949v86.375h-11.305L204.418,19.229
			L204.418,19.229z"/>
		<path fill="#686868" d="M305.057,90.73c-5.17,1.862-15.418,4.911-27.5,4.911c-13.563,0-24.719-3.447-33.506-11.823
			c-7.707-7.433-12.487-19.395-12.487-33.356c0.13-26.723,18.477-46.263,48.518-46.263c10.377,0,18.494,2.261,22.349,4.123
			l-2.814,9.442c-4.78-2.122-10.747-3.846-19.791-3.846c-21.793,0-36.008,13.547-36.008,36.016
			c0,22.729,13.693,36.146,34.543,36.146c7.563,0,12.75-1.057,15.438-2.392V56.966h-18.219v-9.293h29.502v43.059L305.057,90.73
			L305.057,90.73z"/>
		<path fill="#686868" d="M327.396,6.319c5.059-1.057,13.022-1.854,21.12-1.854c11.55,0,19.019,1.993,24.595,6.504
			c4.649,3.457,7.446,8.767,7.446,15.808c0,8.654-5.725,16.206-15.155,19.68v0.271c8.506,2.12,18.478,9.164,18.478,22.469
			c0,7.7-3.039,13.545-7.562,17.928c-6.244,5.709-16.349,8.367-30.968,8.367c-7.969,0-14.084-0.527-17.938-1.064V6.32L327.396,6.319
			L327.396,6.319z M338.977,43.003h10.511c12.213,0,19.385-6.375,19.385-15.029c0-10.488-7.987-14.612-19.68-14.612
			c-5.304,0-8.357,0.398-10.216,0.797V43.003L338.977,43.003z M338.977,85.95c2.242,0.396,5.58,0.528,9.711,0.528
			c11.953,0,22.979-4.384,22.979-17.402c0-12.24-10.488-17.289-23.125-17.289h-9.563L338.977,85.95L338.977,85.95z"/>
	</g>
	<path fill="#686868" d="M309.082,118.415c-4.965,5.848-12.247,9.619-20.514,9.619c-8.266,0-15.565-3.771-20.553-9.619h-94.953
		c-10.473,0-18.979-8.506-18.979-18.976V49.757H36.432c-11.23,0-20.312,9.088-20.312,20.311v61.747
		c0,11.211,9.08,20.301,20.292,20.301h273.281c11.229,0,20.31-9.09,20.31-20.301v-13.398h-20.921V118.415z"/>
</g>
</svg>
