<svg version="1.1" class="clearos-svg clearfoundation app-vendor-clearcenter app-paid app-category-server app-sub-category-file app-no-rpm" viewBox="0 0 400 400" preserveAspectRatio="xMinYMin" xmlns="http://www.w3.org/2000/svg" xmlns:xlink= "http://www.w3.org/1999/xlink">
<path fill="#AA0707" d="M441.666,184.647"/>
<path fill="#AA0707" d="M473.245,247.805"/>
<path fill="#AA0707" d="M441.666,184.647"/>
<path fill="#AA0707" d="M473.245,247.805"/>
<g>
	<path fill="#686868" d="M160.524,175.589c15.149-17.398,37.443-28.408,62.328-28.408c8.195,0,16.104,1.22,23.579,3.446
		c-1.22,0.648-2.408,1.333-3.574,2.063c30.551,2.963,56.222,22.571,67.857,49.634c6.239-4.485,13.456-7.693,21.271-9.24
		c-4.527-27.96-28.772-49.312-58.015-49.312c-5.553,0-10.922,0.787-16.012,2.229c0.992-4.274,1.527-8.725,1.527-13.304
		c0-32.464-26.32-58.784-58.783-58.784c-32.467,0-58.783,26.319-58.783,58.784C141.919,149.62,149.078,164.862,160.524,175.589z"/>
	<path fill="#686868" d="M98.941,260.184c5.07-8.463,12.755-15.179,21.94-19.031c-0.411-3.049-0.633-6.158-0.633-9.32
		c0-23.115,11.313-43.576,28.695-56.185c-6.329-2.953-13.384-4.609-20.829-4.609c-27.256,0-49.354,22.095-49.354,49.351
		C78.763,236.727,86.711,251.203,98.941,260.184z"/>
	<path fill="#686868" d="M129.149,145.041c0-0.139-0.013-0.276-0.013-0.417c0-10.32,1.907-20.188,5.364-29.297
		c-4.227-1.954-8.917-3.077-13.882-3.077c-18.352,0-33.228,14.876-33.228,33.226c0,6.034,1.64,11.675,4.445,16.552
		C102.438,153.49,115.19,147.511,129.149,145.041z"/>
	<circle fill="#686868" cx="222.851" cy="243.448" r="82.639"/>
	<path fill="#686868" d="M154.913,309.305c-13.981-12.896-23.48-30.557-25.961-50.4c-0.787-0.057-1.57-0.117-2.37-0.117
		c-18.352,0-33.227,14.875-33.227,33.227c0,0.473,0.051,0.926,0.069,1.391c-16.298-12.357-28.082-30.715-31.63-52.498
		c-1.969-12.082-1.187-23.977,1.852-35.059c-2.742,0.032-5.516,0.268-8.307,0.721c-30.188,4.914-50.671,33.369-45.754,63.552
		c4.917,30.188,33.371,50.67,63.556,45.756c8.757-1.425,16.675-4.854,23.41-9.712c5.321,11.265,16.75,19.072,30.029,19.072
		C138.588,325.234,149.071,318.846,154.913,309.305z"/>
	<path fill="#686868" d="M313.943,208.816c1.896,5.275,3.416,10.77,4.504,16.453c5.335,27.867-0.521,55.279-14.404,77.616
		c11.836,8.666,27.094,12.595,42.639,9.616c29.694-5.684,49.157-34.359,43.476-64.059c-5.688-29.692-34.363-49.154-64.06-43.473
		C321.815,205.795,317.755,207.107,313.943,208.816z"/>
</g>
</svg>
