<svg version="1.1" class="clearos-svg clearfoundation" viewBox="0 0 400 400" preserveAspectRatio="xMinYMin" xmlns="http://www.w3.org/2000/svg" xmlns:xlink= "http://www.w3.org/1999/xlink">
<path fill="#AA0707" d="M91.666,184.647"/>
<path fill="#AA0707" d="M123.245,247.805"/>
<path fill="#AA0707" d="M91.666,184.647"/>
<path fill="#AA0707" d="M123.245,247.805"/>
<g>
	<path fill="#686868" d="M364.063,242.908V42.334C320.932,16.035,248.138,3.898,200.659,4.974
		C83.891,7.62,35.851,42.51,35.851,42.51l0.175,198.295c5.961,66.273,41.943,90.787,44.708,93.273
		c24.162,21.722,119.223,61.014,119.223,61.014c57.857-25.247,85.498-36.205,111.38-54.074
		C368.621,301.468,364.063,242.908,364.063,242.908z M339.283,273.299c-7.014,21.975-21.975,39.273-34.131,49.559
		c-12.154,10.285-105.195,53.183-105.195,53.183c-58.779-26.633-102.041-46.521-122.152-71.468
		c-21.445-26.6-23.486-56.052-23.486-56.052l-0.234-123.666c91.52-96.021,255.51-85.444,291.51-75.274
		c0.467,36.584,0.145,162.558,0.145,162.558S346.295,251.324,339.283,273.299z"/>
	<path fill="#686868" d="M152.043,149.699h-18.76v63.317c0,3.41-0.64,6.822-1.706,9.593c-3.411,8.314-12.152,17.055-24.729,17.055
		c-17.055,0-23.024-13.216-23.024-32.829v-57.135h-18.76v60.332c0,36.242,19.4,45.196,35.603,45.196
		c18.334,0,29.206-10.873,34.11-19.188h0.426l1.066,16.843h16.629c-0.64-8.101-0.854-17.482-0.854-28.142V149.699z"/>
	<path fill="#686868" d="M225.384,147.354c-16.841,0-28.994,7.461-36.668,20.039h-0.426l-0.853-17.694h-16.843
		c0.427,9.807,0.854,20.466,0.854,33.683v111.711h18.547v-56.069h0.427c6.183,10.233,18.122,16.203,31.765,16.203
		c24.304,0,46.901-18.334,46.901-55.43C269.088,168.459,250.327,147.354,225.384,147.354z M218.988,240.517
		c-13.43,0-24.73-8.954-28.14-21.958c-0.427-2.345-0.854-4.903-0.854-7.675v-17.695c0-2.558,0.64-5.33,1.279-7.675
		c3.624-14.07,15.564-23.238,28.354-23.238c19.827,0,30.699,17.695,30.699,38.375C250.327,224.314,238.815,240.517,218.988,240.517z
		"/>
	<path fill="#686868" d="M314.285,192.976c-13.432-5.117-19.613-8.954-19.613-17.481c0-7.675,6.182-14.071,17.268-14.071
		c9.592,0,17.055,3.412,21.105,5.969l4.689-13.644c-5.756-3.411-14.924-6.396-25.369-6.396c-22.172,0-35.602,13.644-35.602,30.272
		c0,12.365,8.74,22.598,27.287,29.208c13.859,5.115,19.188,10.02,19.188,18.974c0,8.526-6.396,15.349-20.041,15.349
		c-9.379,0-19.186-3.838-24.729-7.462l-4.689,14.283c7.248,4.265,17.693,7.035,28.992,7.035c24.518,0,38.588-12.791,38.588-30.911
		C341.359,208.751,332.193,199.796,314.285,192.976z"/>
</g>
</svg>
