<svg version="1.1" class="clearos-svg clearfoundation" viewBox="0 0 400 400" preserveAspectRatio="xMinYMin" xmlns="http://www.w3.org/2000/svg" xmlns:xlink= "http://www.w3.org/1999/xlink">
<path fill="#AA0707" d="M91.666,184.647"/>
<path fill="#AA0707" d="M123.245,247.805"/>
<path fill="#AA0707" d="M91.666,184.647"/>
<path fill="#AA0707" d="M123.245,247.805"/>
<g>
	<g>
		<path fill="#686868" d="M144.042,228.588l26.965-2.621c1.662,9.025,4.938,15.672,9.859,19.938
			c4.983,4.275,11.661,6.334,20.093,6.334c8.963,0,15.641-1.871,20.195-5.646c4.51-3.734,6.803-8.197,6.803-13.229
			c0-3.242-0.998-6.021-2.871-8.307c-1.902-2.285-5.211-4.283-9.953-5.92c-3.244-1.123-10.639-3.121-22.223-5.992
			c-14.859-3.684-25.272-8.229-31.264-13.595c-8.4-7.558-12.636-16.778-12.636-27.621c0-6.997,1.965-13.533,5.928-19.618
			c3.963-6.107,9.665-10.741,17.122-13.9c7.465-3.183,16.474-4.774,27.02-4.774c17.176,0,30.172,3.752,38.877,11.326
			c8.721,7.55,13.291,17.636,13.729,30.242l-27.705,1.209c-1.172-7.044-3.729-12.122-7.646-15.21
			c-3.916-3.082-9.734-4.626-17.574-4.626c-8.058,0-14.313,1.654-18.916,4.961c-2.972,2.146-4.392,4.984-4.392,8.518
			c0,3.245,1.373,6.022,4.119,8.323c3.533,2.941,11.98,5.991,25.5,9.173c13.479,3.158,23.432,6.449,29.844,9.85
			c6.459,3.398,11.561,8.053,15.164,13.965c3.666,5.895,5.539,13.166,5.539,21.84c0,7.854-2.232,15.227-6.555,22.092
			c-4.353,6.895-10.545,11.979-18.533,15.318c-7.986,3.34-17.939,4.99-29.857,4.99c-17.348,0-30.671-3.99-39.969-12.012
			C151.404,255.574,145.867,243.924,144.042,228.588z"/>
	</g>
	<polygon fill="#686868" points="199.829,320.85 128.674,267.871 3.496,361.084 396.178,361.084 270.998,267.871 	"/>
	<polygon fill="#686868" points="110.5,257.246 3.496,335.67 3.496,178.82 	"/>
	<polygon fill="#686868" points="289.174,257.246 396.178,335.67 396.178,178.82 	"/>
	<path fill="#686868" d="M83.706,141.458c0-7.605,6.201-13.736,13.752-13.736h209.781c7.598,0,13.744,6.162,13.744,13.736v28.198
		h75.521L202.355,38.917L8.175,169.657h75.529L83.706,141.458L83.706,141.458z"/>
</g>
</svg>
