<svg version="1.1" class="clearos-svg clearfoundation app-vendor-clearcenter app-paid app-category-cloud app-sub-category-services" viewBox="0 0 400 400" preserveAspectRatio="xMinYMin" xmlns="http://www.w3.org/2000/svg" xmlns:xlink= "http://www.w3.org/1999/xlink">
<path fill="#AA0707" d="M441.666,184.647"/>
<path fill="#AA0707" d="M473.245,247.805"/>
<path fill="#AA0707" d="M441.666,184.647"/>
<path fill="#AA0707" d="M473.245,247.805"/>
<g>
	<path fill="#686868" d="M266.653,175.498H23.751c-9.965,0-18.036,8.088-18.036,18.052v54.9c0,9.947,8.071,18.02,18.036,18.02
		h242.902c9.979,0,18.052-8.088,18.052-18.02v-54.9C284.721,183.586,276.634,175.498,266.653,175.498z M247.877,245.106
		c-13.311,0-24.082-10.822-24.082-24.1c0-13.293,10.771-24.082,24.082-24.082c13.274,0,24.064,10.789,24.064,24.082
		C271.941,234.284,261.151,245.106,247.877,245.106z"/>
	<path fill="#686868" d="M266.653,283.056H23.751c-9.965,0-18.036,8.071-18.036,18.035v54.884c0,9.997,8.071,18.054,18.036,18.054
		h242.902c9.979,0,18.052-8.087,18.052-18.054v-54.884C284.721,291.11,276.634,283.056,266.653,283.056z M247.877,352.581
		c-13.311,0-24.082-10.739-24.082-24.048c0-13.312,10.771-24.081,24.082-24.081c13.274,0,24.064,10.771,24.064,24.081
		C271.941,341.842,261.151,352.581,247.877,352.581z"/>
	<g>
		<path fill="#686868" d="M109.484,39.313h-0.23l-13.342,7.214l-2.01-7.905l16.782-8.978h8.861v76.772h-10.063V39.313H109.484z"/>
		<path fill="#686868" d="M192.631,67.199c0,26.106-9.685,40.52-26.699,40.52c-15.006,0-25.169-14.05-25.397-39.449
			c0-25.761,11.103-39.927,26.699-39.927C183.424,28.343,192.631,42.739,192.631,67.199z M150.909,68.385
			c0,19.98,6.145,31.313,15.599,31.313c10.624,0,15.714-12.403,15.714-32.021c0-18.909-4.843-31.295-15.599-31.295
			C157.53,36.381,150.909,47.466,150.909,68.385z"/>
		<path fill="#686868" d="M247.3,67.199c0,26.106-9.685,40.52-26.701,40.52c-15.021,0-25.148-14.05-25.414-39.449
			c0-25.761,11.104-39.927,26.7-39.927C238.076,28.343,247.3,42.739,247.3,67.199z M205.577,68.385
			c0,19.98,6.144,31.313,15.599,31.313c10.623,0,15.73-12.403,15.73-32.021c0-18.909-4.842-31.295-15.601-31.295
			C212.216,36.381,205.577,47.466,205.577,68.385z"/>
		<path fill="#686868" d="M334.301,102.876c-4.579,1.664-13.705,4.365-24.428,4.365c-12.073,0-21.987-3.064-29.796-10.51
			c-6.854-6.604-11.104-17.229-11.104-29.647c0.131-23.751,16.438-41.112,43.142-41.112c9.205,0,16.421,2.01,19.846,3.657
			l-2.503,8.399c-4.249-1.895-9.553-3.426-17.591-3.426c-19.371,0-32.004,12.041-32.004,32.021
			c0,20.193,12.172,32.119,30.719,32.119c6.705,0,11.333-0.939,13.704-2.125V72.865h-16.191v-8.252h26.224v38.263H334.301z"/>
		<path fill="#686868" d="M344.067,27.849c4.515-0.938,11.597-1.646,18.777-1.646c10.277,0,16.897,1.778,21.855,5.78
			c4.134,3.08,6.623,7.791,6.623,14.051c0,7.691-5.091,14.396-13.477,17.491v0.231c7.563,1.894,16.438,8.153,16.438,19.979
			c0,6.837-2.719,12.041-6.736,15.929c-5.551,5.072-14.527,7.444-27.521,7.444c-7.084,0-12.521-0.461-15.943-0.956V27.849H344.067z
			 M354.348,60.462h9.339c10.87,0,17.245-5.666,17.245-13.375c0-9.323-7.1-12.979-17.492-12.979c-4.729,0-7.443,0.362-9.092,0.708
			V60.462L354.348,60.462z M354.348,98.626c2.008,0.346,4.956,0.478,8.63,0.478c10.623,0,20.426-3.903,20.426-15.482
			c0-10.871-9.321-15.353-20.557-15.353h-8.499V98.626L354.348,98.626z"/>
	</g>
	<path fill="#686868" d="M266.109,127.483c-4.414,5.188-10.89,8.549-18.232,8.549c-7.347,0-13.836-3.36-18.269-8.549H98.48
		c-9.307,0-16.865-7.561-16.865-16.866v-44.16H23.752c-9.965,0-18.036,8.07-18.036,18.052v54.882
		c0,9.966,8.071,18.053,18.036,18.053h242.902c9.979,0,18.052-8.087,18.052-18.053v-11.908L266.109,127.483L266.109,127.483z"/>
</g>
</svg>
