<svg version="1.1" class="clearos-svg clearfoundation app-vendor-clearcenter app-paid app-category-gateway app-sub-category-antimalware" viewBox="0 0 400 400" preserveAspectRatio="xMinYMin" xmlns="http://www.w3.org/2000/svg" xmlns:xlink= "http://www.w3.org/1999/xlink">
<path fill="#AA0707" d="M441.666,184.647"/>
<path fill="#AA0707" d="M473.245,247.805"/>
<path fill="#AA0707" d="M441.666,184.647"/>
<path fill="#AA0707" d="M473.245,247.805"/>
<g>
	<polygon fill="#686868" points="221.629,3.143 112.021,119.818 112.244,3.606 2.884,3.143 2.884,396.666 396.829,2.951 	"/>
	<polygon fill="#686868" points="397.116,397.049 396.957,236.925 358.914,277.491 259.575,178.152 177.094,259.73 279.154,359.965 
		243.157,396.891 	"/>
</g>
</svg>
