===== ClearOS 6 User Guide =====
This index contains documents related to ClearOS 6.x. To access other documents related to other ClearOS versions, [[..:|click here]]. To go to the master document list, [[:|click here]].

The documentation listed here is generally divided into the categories that are present within the ClearOS Webconfig interface.

To access this document library at the original location, [[http://www.clearcenter.com/support/documentation/user_guide/start|click here]].

===== Server =====
==== Database ====
  * [[MySQL Server]]

==== Directory ====
  * [[Active Directory Connector]]
  * [[Directory Server]]
  * [[Samba Directory]]

==== File and Print ====
  * [[Advanced Print Server]]
  * [[Antimalware File Scan]]
  * [[Dropbox]]
  * [[Flexshare]]
  * [[FTP Server]]
  * [[Owncloud]]
  * [[Owncloud Business]]
  * [[Photo Organizer]]
  * [[Plex Media Server]]
  * [[Transmission Bittorrent Client]]
  * [[Windows Networking]]

==== Mail ====
  * [[Antispam Updates]]
  * [[Greylisting]]
  * [[IMAP and POP Server]]
  * [[Mail Antimalware Premium powered by Kaspersky]]
  * [[Mail Antispam]]
  * [[Mail Antivirus]]
  * [[Mail Archive]]
  * [[Mail Retrieval]]
  * [[SMTP Server]]

==== Messaging and Collaboration ====
  * [[Google Apps Synchronization]]
  * [[Zarafa Community for ClearOS]]
  * [[Zarafa Professional for ClearOS]]
  * [[Zarafa Small Business for ClearOS]]

==== Web ====
  * [[Web Server]]

===== Network =====
==== Bandwidth and QoS ====
  * [[Bandwidth Manager]]
  * [[QoS]]
  * [[Remote Bandwidth Monitor]]

==== Firewall ====
  * [[1 to 1 NAT]]
  * [[Custom Firewall]]
  * [[DMZ Firewall]]
  * [[Egress Firewall]]
  * [[Incoming Firewall]]
  * [[Port Forwarding]]

==== Infrastructure ====
  * [[DHCP Server]]
  * [[DNS Server]]
  * [[Network Map]]
  * [[NTP Server]]
  * [[RADIUS Server]]
  * [[SSH Server]]

==== VPN ====
  * [[Dynamic VPN]]
  * [[ibVPN]]
  * [[OpenVPN]]
  * [[PPTP Server]]
  * [[Static IPsec VPN]]

==== Settings ====
  * [[Dynamic DNS]]
  * [[IP Settings]]
  * [[Multi-WAN]]
  * [[Upstream Proxy]]

===== Gateway =====
==== Antimalware ====
  * [[Antimalware Updates]]
  * [[Gateway Antimalware Premium powered by Kaspersky]]
  * [[Gateway Antiphishing]]
  * [[Gateway Antivirus]]

==== Content Filter and Proxy ====
  * [[Content Filter]]
  * [[Content Filter Updates]]
  * [[Web Access Control]]
  * [[Web Proxy]]

==== Intrusion Protection ====
  * [[Intrusion Detection]]
  * [[Intrusion Prevention]]
  * [[Intrusion Protection Updates]]

==== Protocol Filter ====
  * [[Protocol Filter]]

===== System =====
==== Accounts ====
  * [[Administrators]]
  * [[Groups]]
  * [[Users]]

==== Accounts Manager ====
  * [[Account Import]]
  * [[Account Manager]]
  * [[Account Synchronization]]
  * [[Password Policies]]

==== Backup ====
  * [[bmbackup|Baremetal Backup and Restore]]
  * [[Configuration Backup]]
  * [[Remote Server Backup]]

==== Developer ====
  * [[Developer Tools]]
  * [[Mobile Demo]]

==== Operating System ====
  * [[Amazon EC2 Support]]
  * [[Services Manager]]
  * [[Software Repository]]
  * [[Software Updates]]
  * [[System Registration]]
  * [[Verified Software Updates]]

==== Resources ====
  * [[Log Viewer]]
  * [[Process Viewer]]
  * [[Remote System Monitor]]

==== Security ====
  * [[Certificate Manager]]
  * [[Remote Security Audit]]

==== Storage ====
  * [[Disk Usage]]
  * [[SMART Monitor]]
  * [[Storage Manager]]
  * [[RAID Manager]]

==== Settings ====
  * [[Date and Time]]
  * [[Mail Notification]]
  * [[Mail Settings]]

===== Reports =====
==== Gateway ====
  * [[Filter and Proxy Report]]

==== Network ====
  * [[Network Detail Report]]
  * [[Network Report]]
  * [[Network Visualiser]]


==== System ====
  * [[Resource Report]]

===== Cloud =====
  * [[AppFirst]]

===== My Account =====
  * [[User Certificates]]
  * [[User Profile]]

===== Spotlight =====
  * [[Dashboard]]
  * [[Marketplace]]

{{keywords>clearos, clearos content, AppName, app_name, version6, userguide, xcategory, maintainer_dloper, maintainerreview_x, keywordfix}}
