<svg version="1.1" class="clearos-svg clearfoundation app-vendor-clearcenter app-paid app-category-cloud app-sub-category-services" viewBox="0 0 400 400" preserveAspectRatio="xMinYMin" xmlns="http://www.w3.org/2000/svg" xmlns:xlink= "http://www.w3.org/1999/xlink">
<path fill="#AA0707" d="M91.666,184.647"/>
<path fill="#AA0707" d="M123.245,247.805"/>
<path fill="#AA0707" d="M91.666,184.647"/>
<path fill="#AA0707" d="M123.245,247.805"/>
<g>
	<path fill="#686868" d="M379.629,27.313H136.626c-9.976,0-18.068,8.094-18.068,18.054v54.931c0,9.96,8.094,18.055,18.068,18.055
		h242.986c9.978,0,18.068-8.095,18.068-18.055V45.366C397.699,35.406,389.604,27.313,379.629,27.313z M360.838,96.925
		c-13.303,0-24.094-10.775-24.094-24.093c0-13.301,10.791-24.077,24.094-24.077c13.271,0,24.093,10.776,24.093,24.077
		C384.931,86.149,374.14,96.925,360.838,96.925z"/>
	<g>
		<g>
			<path fill="#686868" d="M254.521,365.88c0.281-0.394,0.974-1.679,1.566-2.729c0.564-1.129,2.699-8.233,4.221-13.691
				c0,0,5.631-19.969,5.631-36.973c0-69.988-59.039-126.754-131.829-126.754c-72.781,0-131.807,56.75-131.807,126.754
				c0,17.709,4.126,33.506,4.126,33.506c1.41,5.441,3.168,11.197,3.921,12.781c0.736,1.586,2.438,4.473,2.471,4.502
				c0.016,0,0.016,0.031,0.031,0.031c0,0,2.313,2.104,5.16,4.707c2.84,2.571,15.693,4.674,21.31,4.674h189.726
				c5.646,0,12.83-0.502,16-1.129C248.184,370.962,254.236,366.271,254.521,365.88z M134.093,206.631
				c60.79,0,110.106,47.395,110.106,105.887c0,10.069-3.074,26.432-3.074,26.432c-1.066,5.535-6.494,10.055-12.109,10.055
				L37.94,349.02c-5.67,0-10.901-4.563-11.678-10.134c0,0-2.274-16.36-2.274-26.431C23.987,254.025,73.295,206.631,134.093,206.631z
				"/>
		</g>
		<path fill="#686868" d="M379.629,136.406H136.626c-9.976,0-18.068,8.094-18.068,18.07v17.088
			c5.104-0.518,10.28-0.752,15.521-0.752c48.924,0,92.404,22.18,120.396,56.617h125.172c9.977,0,18.036-8.078,18.036-18.055v-54.899
			C397.699,144.5,389.604,136.406,379.629,136.406z M360.838,206.02c-13.303,0-24.094-10.774-24.094-24.078
			c0-13.316,10.791-24.092,24.094-24.092c13.271,0,24.093,10.775,24.093,24.092C384.931,195.243,374.14,206.02,360.838,206.02z"/>
		<path fill="#686868" d="M379.629,244.025H266.158c13.176,21.686,20.814,46.877,20.814,73.824c0,5.896-0.347,11.605-0.802,17.189
			h93.455c9.977,0,18.07-8.078,18.07-18.038V262.07C397.699,252.104,389.604,244.025,379.629,244.025z M360.838,313.583
			c-13.303,0-24.094-10.774-24.094-24.093c0-13.27,10.791-24.077,24.094-24.077c13.271,0,24.093,10.808,24.093,24.077
			C384.931,302.839,374.14,313.583,360.838,313.583z"/>
		<path fill="#686868" d="M110.964,301.757c-0.022,0-1.388,1.976-1.388,2.039c-2.086,3.718-3.404,7.937-3.404,12.485
			c0,15.074,12.949,27.277,28.862,27.277c11.168,0,20.705-6.086,25.544-14.854h0.125v-0.251c1.012-1.883,1.82-3.857,2.346-5.896
			h0.063c0,0,0.07-0.377,0.149-0.66c0.016-0.063,0.674-3.012,0.674-3.09c1.891-8.328,15.576-75.408,18.453-87.714
			C182.42,231.093,116.455,292.221,110.964,301.757z M134.093,330.055c-7.004,0-12.643-5.646-12.643-12.675
			c0-6.996,5.639-12.659,12.643-12.659c7.035,0,12.666,5.694,12.666,12.659C146.759,324.406,141.112,330.055,134.093,330.055z"/>
		<path fill="#686868" d="M53.847,301.727c7.004,0,12.689,5.678,12.689,12.674c0,7.012-5.687,12.705-12.689,12.705
			c-7.012,0-12.689-5.693-12.689-12.705C41.155,307.402,46.834,301.727,53.847,301.727z"/>
		<path fill="#686868" d="M213.949,301.727c7.012,0,12.689,5.678,12.689,12.674c0,7.012-5.681,12.705-12.689,12.705
			c-7.004,0-12.689-5.693-12.689-12.705C201.26,307.402,206.945,301.727,213.949,301.727z"/>
		<path fill="#686868" d="M134.093,218.372c7.005,0,12.683,5.678,12.683,12.688c0,7.004-5.678,12.688-12.683,12.688
			c-7.012,0-12.688-5.688-12.688-12.688C121.403,224.05,127.082,218.372,134.093,218.372z"/>
		<path fill="#686868" d="M96.087,231.029c7.012,0,12.689,5.679,12.689,12.688c0,7.005-5.679,12.689-12.689,12.689
			c-7.004,0-12.689-5.687-12.689-12.689C83.396,236.708,89.083,231.029,96.087,231.029z"/>
		<path fill="#686868" d="M66.503,259.907c6.996,0,12.667,5.678,12.667,12.674s-5.671,12.674-12.667,12.674
			c-7.003,0-12.674-5.678-12.674-12.674S59.5,259.907,66.503,259.907z"/>
		<path fill="#686868" d="M201.273,259.938c6.996,0,12.658,5.681,12.658,12.658c0,6.98-5.662,12.658-12.658,12.658
			c-6.987,0-12.649-5.678-12.649-12.658C188.625,265.617,194.287,259.938,201.273,259.938z"/>
	</g>
</g>
</svg>
