<svg version="1.1" class="clearos-svg clearfoundation" viewBox="0 0 400 400" preserveAspectRatio="xMinYMin" xmlns="http://www.w3.org/2000/svg" xmlns:xlink= "http://www.w3.org/1999/xlink">
<path fill="#AA0707" d="M91.666,184.647"/>
<path fill="#AA0707" d="M123.245,247.805"/>
<path fill="#AA0707" d="M91.666,184.647"/>
<path fill="#AA0707" d="M123.245,247.805"/>
<g>
	<g>
		<path fill="#686868" d="M280.252,159.721c9.534-15.666,15.335-33.942,15.335-53.673c0-56.804-45.675-102.933-102.146-102.933
			c-56.317,0-102.06,46.08-102.06,102.933c0,56.771,45.658,102.884,102.06,102.884c22.365,0,42.791-7.461,59.58-19.599
			l112.782,112.749l28.421-28.389L280.252,159.721z M193.521,191.366c-47.079,0-85.285-38.206-85.285-85.318
			c0-47.128,38.206-85.384,85.285-85.384c47.104,0,85.31,38.222,85.31,85.384C278.831,153.16,240.69,191.366,193.521,191.366z"/>
		<path fill="#686868" d="M86.002,105.502c0-16.276,3.894-31.554,10.37-45.394H66.743c-11.625,0-21.053,9.436-21.053,21.044v85.07
			c0,11.625,9.442,21.061,21.053,21.061h57.803C101.197,167.57,86.002,138.486,86.002,105.502z"/>
	</g>
	<path fill="#686868" d="M285.146,303.619h-44.783v-25.316c0-29.166-23.641-52.813-52.797-52.813h-23.151l0.019-17.104
		c-10.526-2.975-20.524-7.188-29.439-13.014l-0.256,29.688l-19.83,0.43c-29.191,0-52.813,23.629-52.813,52.813v25.301H16.253
		c-5.783,0-10.477,4.709-10.477,10.479v72.359c0,5.803,4.692,10.443,10.477,10.443h112.512c5.809,0,10.477-4.676,10.477-10.443
		v-72.346c-0.017-5.783-4.668-10.477-10.477-10.477h-46.57v-11.666c0-26.109,21.201-47.328,47.36-47.328h13.606h21.27h8.442
		c26.19,0,47.368,21.219,47.368,47.328v11.666h-47.6c-5.792,0-10.494,4.709-10.494,10.477v72.346
		c0,5.783,4.701,10.443,10.494,10.443h112.502c5.783,0,10.459-4.66,10.459-10.443v-72.346
		C295.603,308.313,290.896,303.619,285.146,303.619z"/>
</g>
</svg>
