<svg version="1.1" class="clearos-svg clearfoundation" viewBox="0 0 400 400" preserveAspectRatio="xMinYMin" xmlns="http://www.w3.org/2000/svg" xmlns:xlink= "http://www.w3.org/1999/xlink">
<path style="fill:#AA0707;" d="M91.666,184.647"/>
<path style="fill:#AA0707;" d="M123.245,247.805"/>
<path style="fill:#AA0707;" d="M91.666,184.647"/>
<path style="fill:#AA0707;" d="M123.245,247.805"/>
<g>
	<rect x="345.973" y="2.545" style="fill:#686868;" width="27.656" height="345.62"/>
	<rect x="275.753" y="2.545" style="fill:#686868;" width="27.656" height="345.62"/>
	<path style="fill:#686868;" d="M377.922,240.288v107.907h11.242C389.18,310.665,388.236,271.073,377.922,240.288z"/>
	<path style="fill:#686868;" d="M307.671,348.195h34.009V193.433c-9.322-4.842-20.645-7.547-34.009-8.05V348.195z"/>
	<path style="fill:#686868;" d="M307.671,48.465v91.164c11.102-11.981,17.987-27.948,17.987-45.598
		C325.658,76.421,318.755,60.493,307.671,48.465z"/>
	<path style="fill:#686868;" d="M237.467,30.131v226.194c-1.32-1.431-2.846-2.688-4.293-4.009V2.545h-27.656v234.913
		c-1.397-0.377-2.846-0.66-4.293-0.976V185.72c-5.512,0.487-10.472,1.501-15.134,2.79c10.882-11.949,17.61-27.759,17.61-45.212
		c0-5.975-1.016-11.659-2.479-17.162V58.174c-6.572,10.401-10.518,22.657-10.518,35.857c0,3.75,0.385,7.39,0.998,10.967
		c-7.146-10.354-17.102-18.601-28.768-23.64V2.545h-27.647v73.356c-36.792,0.535-66.511,30.464-66.511,67.414
		c0,22.798,11.385,42.846,28.655,55.015v36.045H89c-80.967,0-78.152,78.113-78.152,163.08h256.367
		c0-16.334-0.205-33.033-1.242-49.26h5.504V27.891c-4.275-0.873-8.711-1.336-13.238-1.336
		C250.926,26.539,244.021,28.001,237.467,30.131z"/>
</g>
</svg>
