<svg version="1.1" class="clearos-svg clearfoundation" viewBox="0 0 400 400" preserveAspectRatio="xMinYMin" xmlns="http://www.w3.org/2000/svg" xmlns:xlink= "http://www.w3.org/1999/xlink">
<path fill="#AA0707" d="M91.666,184.647"/>
<path fill="#AA0707" d="M123.245,247.805"/>
<path fill="#AA0707" d="M91.666,184.647"/>
<path fill="#AA0707" d="M123.245,247.805"/>
<g>
	<path fill="#686868" d="M260.885,176.023H23.102c-9.755,0-17.656,7.909-17.656,17.664v53.75c0,9.738,7.901,17.64,17.656,17.64
		h237.783c9.771,0,17.672-7.934,17.672-17.64v-53.75C278.573,183.933,270.656,176.023,260.885,176.023z M242.503,244.147
		c-13.028,0-23.573-10.577-23.573-23.573c0-13.028,10.545-23.581,23.573-23.581c12.996,0,23.558,10.553,23.558,23.581
		C266.061,233.57,255.499,244.147,242.503,244.147z"/>
	<path fill="#686868" d="M260.885,281.298H23.102c-9.755,0-17.656,7.9-17.656,17.672v53.726c0,9.771,7.901,17.672,17.656,17.672
		h237.783c9.771,0,17.672-7.917,17.672-17.672V298.97C278.573,289.198,270.656,281.298,260.885,281.298z M242.503,349.374
		c-13.028,0-23.573-10.513-23.573-23.541s10.545-23.574,23.573-23.574c12.996,0,23.558,10.546,23.558,23.574
		S255.499,349.374,242.503,349.374z"/>
	<g>
		<path fill="#686868" d="M169.284,42.709h-0.226l-13.061,7.055l-1.967-7.748l16.43-8.779h8.659v75.154h-9.835V42.709z"/>
		<path fill="#686868" d="M250.662,69.999c0,25.565-9.48,39.666-26.137,39.666c-14.674,0-24.638-13.754-24.864-38.626
			c0-25.21,10.884-39.076,26.138-39.076C241.648,31.963,250.662,46.063,250.662,69.999z M209.852,71.16
			c0,19.551,6.015,30.644,15.254,30.644c10.4,0,15.383-12.133,15.383-31.337c0-18.511-4.725-30.644-15.271-30.644
			C216.317,39.823,209.852,50.683,209.852,71.16z"/>
		<path fill="#686868" d="M335.846,104.924c-4.498,1.621-13.415,4.273-23.928,4.273c-11.803,0-21.51-2.999-29.152-10.287
			c-6.708-6.466-10.868-16.874-10.868-29.023c0.113-23.251,16.076-40.254,42.213-40.254c9.03,0,16.092,1.967,19.446,3.587
			l-2.451,8.216c-4.16-1.847-9.352-3.346-17.221-3.346c-18.962,0-31.329,11.786-31.329,31.337c0,19.776,11.916,31.45,30.056,31.45
			c6.578,0,11.093-0.919,13.432-2.08V75.546h-15.851V67.46h25.67v37.464H335.846z"/>
		<path fill="#686868" d="M345.407,31.479c4.402-0.919,11.336-1.612,18.382-1.612c10.046,0,16.543,1.733,21.396,5.66
			c4.048,3.007,6.482,7.626,6.482,13.753c0,7.53-4.982,14.101-13.189,17.124v0.234c7.4,1.846,16.075,7.973,16.075,19.55
			c0,6.7-2.645,11.787-6.578,15.601c-5.434,4.966-14.222,7.28-26.943,7.28c-6.934,0-12.255-0.46-15.608-0.928V31.479H345.407z
			 M355.485,63.396h9.143c10.625,0,16.865-5.547,16.865-13.077c0-9.126-6.949-12.714-17.124-12.714
			c-4.611,0-7.271,0.347-8.884,0.693V63.396z M355.485,100.764c1.951,0.347,4.854,0.46,8.449,0.46
			c10.399,0,19.993-3.813,19.993-15.141c0-10.649-9.126-15.044-20.122-15.044h-8.32V100.764z"/>
	</g>
	<path fill="#686868" d="M260.353,129.014c-4.321,5.087-10.658,8.368-17.85,8.368s-13.544-3.281-17.881-8.368h-82.621
		c-9.11,0-16.511-7.401-16.511-16.511V69.273H23.118c-9.771,0-17.672,7.909-17.672,17.672v53.727
		c0,9.755,7.901,17.663,17.656,17.663h237.783c9.771,0,17.672-7.908,17.672-17.663v-11.658H260.353z"/>
</g>
</svg>
