<svg version="1.1" class="clearos-svg clearfoundation app-vendor-clearcenter app-paid app-category-server app-sub-category-communication-and-collaboration app-no-rpm" viewBox="0 0 400 400" preserveAspectRatio="xMinYMin" xmlns="http://www.w3.org/2000/svg" xmlns:xlink= "http://www.w3.org/1999/xlink">
<path style="fill:#AA0707;" d="M91.666,184.647"/>
<path style="fill:#AA0707;" d="M123.245,247.805"/>
<path style="fill:#AA0707;" d="M91.666,184.647"/>
<path style="fill:#AA0707;" d="M123.245,247.805"/>
<g>
	<path style="fill:#686868;" d="M113.679,160.739c-1.808-2.763-3.437-5.258-4.912-7.518c-13.445-20.592-14.25-21.825-21.14-27.076
		l-0.251-0.191l-0.308-0.074c-2.7-0.649-10.695-0.965-24.441-0.965c-22.899,0-53.752,0.915-54.016,0.924
		c-2.963,0-5.373,2.424-5.373,5.403v113.487c0,2.973,2.41,5.391,5.373,5.391h99.957c2.962,0,5.372-2.418,5.372-5.391l-0.017-83.616
		L113.679,160.739z M108.568,247.12H47.471c4.7-5.496,3.124-11.35,3.124-11.35c-0.741-13.834-20.607-21.233-20.607-21.233
		c-14.324,3.306-13.35,12.024-13.112,15.896c0.236,3.873,4.171,8.281,5.384,10.295c0.524,0.839,3.224,3.804,6.782,6.393h-10.69
		c-1.585-2.146-3.999-6.546-4.641-14.07c-0.646-7.578-4.759-10.254-7.472-11.198v-5.425c1.484,2.645,3.414,3.116,4.497,3.116
		c2.094,0,4.676-1.008,7.099-3.416c2.425-2.426,3.399-10.674,3.399-10.674v-25.226c-8.607,6.229-12.886,11.088-14.995,14.562
		v-63.547c0-1.325,1.064-2.403,2.418-2.404c0.309-0.009,31.117-0.923,53.971-0.923c11.178,0,17.308,0.218,20.631,0.483
		c-6.214,2.995-10.769,11.249-10.769,11.249s1.165,18.261,2.125,19.74c0.96,1.448,7.034-1.228,13.08-6.312
		c5.506-4.609,8.488-6.087,10.252-10.843c0.637,0.947,1.32,1.973,2.069,3.106l-15.028,17.763l12.42,16.97l13.516-16.891v81.548
		l0.003,0.264C110.8,246.205,109.81,247.12,108.568,247.12z"/>
	<path style="fill:#686868;" d="M30.146,173.615c0,0-3.399,9.383-3.715,18.938c-0.313,9.531,0,18.253,0,18.253h14.859l-0.001-0.015
		c0,0,13.427-13.098,13.602-20.676C55.048,182.527,30.146,173.615,30.146,173.615z"/>
	<path style="fill:#686868;" d="M52.12,177.822c7.619-0.662,6.8-6.975,6.973-9.713c0.158-2.754-5.998-15.049-5.998-15.049
		l-18.764,16.813C34.332,169.888,44.518,178.467,52.12,177.822z"/>
	<path style="fill:#686868;" d="M77.685,166.188c-4.376-0.346-15.362-1.447-14.733,16.48c0.661,17.938,14.733,25.696,14.733,25.696
		s14.701-16.157,14.197-23.604C91.425,177.332,82.043,166.504,77.685,166.188z"/>
	<path style="fill:#686868;" d="M71.703,150.164c-0.188-3.244-2.771-7.115-4.691-7.115c-1.951,0-7.774,3.715-7.934,8.91
		c-0.157,5.179,6.785,14.104,6.785,14.104C69.261,163.812,71.858,153.406,71.703,150.164z"/>
	<path style="fill:#686868;" d="M59.078,194.555c-11.396,15.515-12.624,19.855-12.373,22.063c0.252,2.172,9.444,17.942,9.444,17.942
		c6.549-1.699,18.197-23.783,18.197-23.783C66.603,208.587,59.078,194.555,59.078,194.555z"/>
	<polygon style="fill:#686868;" points="147.072,240.603 185.654,184.055 185.654,178.561 138.461,178.561 138.461,186.133 
		173.943,186.133 173.943,186.432 135.14,243.171 135.139,248.476 186.188,248.476 186.188,240.903 147.072,240.903 	"/>
	<path style="fill:#686868;" d="M232.232,217.619c0-10.06-3.746-20.525-19.094-20.525c-6.313,0-12.355,1.765-16.48,4.453
		l2.047,6.015c3.543-2.252,8.422-3.696,13.082-3.696c10.277,0,11.41,7.461,11.41,11.614v1.011
		c-19.393-0.11-30.176,6.53-30.176,18.685c0,7.275,5.182,14.438,15.35,14.438c7.146,0,12.563-3.523,15.361-7.463h0.314l0.725,6.313
		v-0.02h8.313c-0.646-3.398-0.852-7.648-0.852-12.025V217.619z M223.414,231.556c0,0.943-0.205,1.967-0.504,2.912
		c-1.449,4.25-5.604,8.404-12.151,8.404c-4.659,0-8.608-2.803-8.608-8.721c0-9.728,11.318-11.521,21.264-11.286V231.556z"/>
	<path style="fill:#686868;" d="M255.293,208.115h-0.426l-0.313-9.854h-7.998c0.313,4.658,0.44,9.759,0.44,15.677h-0.004v34.521
		h9.021v-26.761c0-1.56,0.19-3.007,0.396-4.25c1.258-6.849,5.84-11.729,12.262-11.729c1.246,0,2.174,0.096,3.104,0.299v-8.593
		c-0.834-0.205-1.573-0.331-2.582-0.331C263.054,197.096,257.576,201.36,255.293,208.115z"/>
	<path style="fill:#686868;" d="M315.645,217.619c-0.001-10.06-3.748-20.525-19.095-20.525c-6.345,0-12.356,1.765-16.497,4.453
		l2.094,6.015c3.512-2.252,8.391-3.696,13.082-3.696c10.264,0,11.396,7.461,11.396,11.614v1.011
		c-19.396-0.11-30.192,6.53-30.192,18.685c0,7.275,5.194,14.438,15.362,14.438c7.148,0,12.547-3.523,15.35-7.463h0.33l0.726,6.313
		v-0.02h8.278c-0.629-3.398-0.834-7.648-0.834-12.025V217.619z M306.329,234.468c-1.466,4.25-5.622,8.406-12.14,8.406
		c-4.676,0-8.627-2.805-8.627-8.723c0-9.729,11.316-11.521,21.281-11.286l0.002,8.69
		C306.848,232.501,306.659,233.522,306.329,234.468z"/>
	<path style="fill:#686868;" d="M350.085,181.047c2.612,0,4.456,0.504,5.81,1.134l1.229-7.052c-1.746-0.725-4.566-1.448-7.762-1.448
		c-4.232,0-8.813,1.354-12.229,4.659c-4.25,4.062-5.824,10.482-5.824,17.537v2.385h-7.053v6.956h7.053v43.242l-0.002,0.016h9.034
		v-43.258h12.15v-6.956h-12.15v-2.686C340.341,187.896,342.325,181.047,350.085,181.047z"/>
	<path style="fill:#686868;" d="M395.945,236.415v-18.796c0-10.06-3.746-20.525-19.107-20.525c-6.297,0-12.313,1.765-16.468,4.453
		l2.077,6.015c3.495-2.252,8.392-3.696,13.065-3.696c10.262,0,11.396,7.461,11.396,11.614v1.011
		c-19.396-0.11-30.179,6.53-30.179,18.685c0,7.275,5.181,14.438,15.363,14.438c7.132,0,12.547-3.523,15.349-7.463h0.313l0.709,6.313
		h0.001v-0.02h8.297C396.166,245.042,395.945,240.792,395.945,236.415z M387.127,231.556c0,0.945-0.205,1.969-0.504,2.912
		c-1.466,4.25-5.604,8.406-12.152,8.406c-4.659,0-8.594-2.805-8.594-8.723c0-9.729,11.302-11.521,21.25-11.286V231.556z"/>
	<path style="fill:#686868;" d="M60.633,267.366c0,4.02-1.728,5.803-4.427,5.803c-2.429,0-4.237-1.729-4.237-5.803v-10.771h-2.376
		v10.717c0,5.641,2.809,7.771,6.532,7.771c3.94,0,6.884-2.293,6.884-7.881v-10.607h-2.376V267.366z"/>
	<path style="fill:#686868;" d="M71.057,267.204c-1.7-0.648-2.481-1.137-2.481-2.215c0-0.973,0.781-1.781,2.186-1.781
		c1.215,0,2.16,0.432,2.673,0.756l0.595-1.729c-0.729-0.432-1.891-0.811-3.213-0.811c-2.808,0-4.508,1.729-4.508,3.834
		c0,1.564,1.106,2.861,3.455,3.697c1.754,0.646,2.429,1.27,2.429,2.4c0,1.08-0.81,1.943-2.536,1.943
		c-1.188,0-2.431-0.486-3.132-0.945l-0.594,1.811c0.918,0.541,2.24,0.891,3.671,0.891c3.104,0,4.887-1.619,4.887-3.912
		C74.486,269.2,73.325,268.065,71.057,267.204z"/>
	<path style="fill:#686868;" d="M82.721,261.427c-3.806,0-6.127,3.105-6.127,7.045c0,3.941,2.402,6.586,6.424,6.586
		c2.078,0,3.51-0.432,4.347-0.809l-0.404-1.701c-0.892,0.379-1.917,0.676-3.617,0.676c-2.376,0-4.427-1.324-4.48-4.535h9.178
		c0.026-0.244,0.081-0.621,0.081-1.105C88.12,265.179,86.986,261.427,82.721,261.427z M78.888,266.985
		c0.189-1.646,1.242-3.857,3.646-3.857c2.672,0,3.318,2.348,3.293,3.857H78.888z"/>
	<path style="fill:#686868;" d="M93.224,264.288h-0.106l-0.081-2.564h-2.079c0.081,1.215,0.107,2.537,0.107,4.076v8.988h2.35v-6.963
		c0-0.406,0.054-0.783,0.106-1.107c0.324-1.781,1.513-3.051,3.187-3.051c0.324,0,0.565,0.025,0.81,0.082v-2.24
		c-0.216-0.055-0.403-0.082-0.675-0.082C95.248,261.427,93.818,262.534,93.224,264.288z"/>
	<path style="fill:#686868;" d="M104.104,267.204c-1.699-0.648-2.482-1.137-2.482-2.215c0-0.973,0.783-1.781,2.187-1.781
		c1.215,0,2.159,0.432,2.672,0.756l0.595-1.729c-0.729-0.432-1.89-0.811-3.212-0.811c-2.808,0-4.509,1.729-4.509,3.834
		c0,1.564,1.106,2.861,3.455,3.697c1.755,0.646,2.431,1.27,2.431,2.4c0,1.08-0.811,1.943-2.537,1.943
		c-1.188,0-2.431-0.486-3.132-0.945l-0.595,1.811c0.918,0.541,2.24,0.891,3.671,0.891c3.104,0,4.887-1.619,4.887-3.912
		C107.533,269.2,106.372,268.065,104.104,267.204z"/>
	<path style="fill:#686868;" d="M23.242,264.585c-1.08-0.648-2.43-0.945-3.779-0.945c-0.648,0-1.026,0.055-1.431,0.107l0.675-4.508
		h6.694v-1.996h-8.396l-1.134,8.42c0.647-0.08,1.431-0.188,2.43-0.188c3.509,0,5.021,1.619,5.047,3.887
		c0,2.35-1.917,3.807-4.157,3.807c-1.593,0-3.022-0.539-3.752-0.973l-0.594,1.809c0.837,0.541,2.456,1.08,4.373,1.08
		c3.806,0,6.532-2.564,6.532-5.992C25.752,266.878,24.619,265.366,23.242,264.585z"/>
	<path style="fill:#686868;" d="M34.636,256.944c-3.563,0-6.101,3.238-6.101,9.123c0.054,5.805,2.375,9.018,5.804,9.018
		c3.887,0,6.1-3.293,6.1-9.26C40.438,260.239,38.334,256.944,34.636,256.944z M34.474,273.249c-2.159,0-3.563-2.592-3.563-7.152
		c0-4.779,1.512-7.314,3.59-7.314c2.457,0,3.563,2.834,3.563,7.152C38.063,270.415,36.903,273.249,34.474,273.249z"/>
</g>
</svg>
