<svg version="1.1" class="clearos-svg clearfoundation app-vendor-clearfoundation app-free app-category-network app-sub-category-vpn" viewBox="0 0 400 400" preserveAspectRatio="xMinYMin" xmlns="http://www.w3.org/2000/svg" xmlns:xlink= "http://www.w3.org/1999/xlink">
<path fill="#AA0707" d="M91.666,184.647"/>
<path fill="#AA0707" d="M123.245,247.805"/>
<path fill="#AA0707" d="M91.666,184.647"/>
<path fill="#AA0707" d="M123.245,247.805"/>
<path fill="#686868" d="M199.992,3.188C91.284,3.188,3.188,91.3,3.188,199.992c0,108.708,88.112,196.82,196.806,196.82
	c108.725,0,196.819-88.112,196.819-196.82C396.813,91.3,308.667,3.188,199.992,3.188z M307.968,288.787
	c-7.713,3.756-28.688,15.061-31.778,15.924c-7.713,2.18-102.709,35.371-113.87,53.891c0,0-6.333,7.164-11.202,6.051
	c0,0-14.812,2.855-0.849-48.771c3.267-12.135,8.136-23.236,15.185-42.949c0,0,5.9-6.852,5.9-13.73c0,0,1.786-3.955-7.23-6.117
	c0,0-7.929,3.227-7.929-6.516s-6.508-7.547-6.149-7.547c0.357,0-5.552,0.434-4.58-6.283c0,0-6.499,0.699-6.499-6.965
	c0-7.695-2.892-7.23-2.892-7.23s-6.491,8.379-8.188,8.146c-4.33-0.467-8.171-18.783-8.171-18.783s-27.46,36.135-39.751,26.229
	c0,0-6.957-14.926,6.033-42.367l12.767-20.223c0,0-1.43-12.508-3.615-16.646C92.99,150.811,86,107.477,86,103.137
	c0-4.321,7.455-28.905,32.746-44.547c25.29-15.657,50.381-16.846,52.749-16.846c2.396,0,15.384-0.258,26.704,13.239
	c11.353,13.479,21.226,24.344,21.226,24.344s35.604-4.597,39.694-3.882c4.104,0.73,17.369,1.205,18.999,14.212
	c0,0,1.013,11.319-8.396,23.113c-6.033,7.32-23.338,29.652-23.338,29.652l3.871,11.521c0,0,17.354-13.256,21.893-13.256
	s6.75,4.098,4.819,24.559c-0.481,14.193-1.711,29.852-1.711,29.852l1.431,10.579c0,0,4.123,10.341,15.674,19.517
	c11.57,9.108,28.424,26.494,29.388,44.05C321.697,269.271,324.657,280.658,307.968,288.787z"/>
</svg>
