<svg version="1.1" class="clearos-svg clearfoundation app-vendor-clearfoundation app-free app-category-system app-sub-category-plugin" viewBox="0 0 400 400" preserveAspectRatio="xMinYMin" xmlns="http://www.w3.org/2000/svg" xmlns:xlink= "http://www.w3.org/1999/xlink">
<path fill="#AA0707" d="M91.666,184.647"/>
<path fill="#AA0707" d="M123.245,247.805"/>
<path fill="#AA0707" d="M91.666,184.647"/>
<path fill="#AA0707" d="M123.245,247.805"/>
<g>
	<path fill="#686868" d="M169.824,169.837H34.009c-16.665,0-30.176,13.52-30.176,30.168v70.415
		c0,16.684,13.527,30.201,30.176,30.201h135.814c16.665,0,30.168-13.52,30.168-30.201v-70.414
		C199.992,183.341,186.473,169.837,169.824,169.837z M181.137,263.662c0,13.486-10.914,24.379-24.395,24.379H47.051
		c-13.457,0-24.371-10.953-24.371-24.379v-56.879c0-13.475,10.914-24.389,24.371-24.389h109.69c13.48,0,24.395,10.914,24.395,24.389
		L181.137,263.662L181.137,263.662z"/>
	<path fill="#686868" d="M365.951,49.118H230.16c-16.648,0-30.168,13.52-30.168,30.168v70.422c0,16.665,13.52,30.176,30.184,30.176
		h135.808c16.68,0,30.184-13.527,30.184-30.176V79.286C396.15,62.637,382.631,49.118,365.951,49.118z M377.311,142.949
		c0,13.457-10.938,24.371-24.395,24.371H243.227c-13.473,0-24.379-10.93-24.379-24.371V86.084c0-13.48,10.906-24.387,24.379-24.387
		h109.689c13.473,0,24.395,10.907,24.395,24.387V142.949z"/>
	<rect x="231.441" y="76.773" fill="#686868" width="133.258" height="75.437"/>
	<rect x="35.276" y="197.489" fill="#686868" width="133.279" height="75.437"/>
	<path fill="#686868" d="M174.854,300.592H28.995c-13.895,0-25.161,11.266-25.161,25.16c0,13.879,11.266,25.131,25.161,25.131
		H174.87c13.872,0,25.138-11.252,25.138-25.131C200.007,311.855,188.726,300.592,174.854,300.592z M172.96,325.752h-46.528
		c-3.818,0-6.908-3.1-6.908-6.916c0-3.834,3.09-6.916,6.908-6.916h46.528c3.81,0,6.908,3.082,6.908,6.916
		C179.869,322.652,176.787,325.752,172.96,325.752z"/>
	<path fill="#686868" d="M371.006,179.898H225.123c-13.881,0-25.131,11.267-25.131,25.154c0,13.879,11.25,25.137,25.131,25.137
		h145.883c13.879,0,25.146-11.258,25.146-25.137C396.15,191.144,384.885,179.898,371.006,179.898z M371.631,206.916H325.11
		c-3.817,0-6.916-3.113-6.916-6.924c0-3.818,3.099-6.908,6.916-6.908h46.521c3.834,0,6.932,3.09,6.932,6.908
		C378.563,203.803,375.465,206.916,371.631,206.916z"/>
	<rect x="291.781" y="230.189" fill="#686868" width="28.915" height="15.086"/>
	<rect x="291.781" y="261.629" fill="#686868" width="28.915" height="15.084"/>
	<rect x="291.781" y="289.92" fill="#686868" width="28.915" height="15.084"/>
	<rect x="276.086" y="305.332" fill="#686868" width="15.07" height="28.916"/>
	<rect x="245.275" y="305.332" fill="#686868" width="15.084" height="28.916"/>
	<rect x="214.48" y="305.332" fill="#686868" width="15.084" height="28.916"/>
</g>
</svg>
