<svg version="1.1" class="clearos-svg clearfoundation app-vendor-clearcenter app-free app-category-cloud app-sub-category-services" viewBox="0 0 400 400" preserveAspectRatio="xMinYMin" xmlns="http://www.w3.org/2000/svg" xmlns:xlink= "http://www.w3.org/1999/xlink">
<path fill="#AA0707" d="M91.666,184.647"/>
<path fill="#AA0707" d="M123.245,247.805"/>
<path fill="#AA0707" d="M91.666,184.647"/>
<path fill="#AA0707" d="M123.245,247.805"/>
<g>
	<g>
		<path fill="#686868" d="M13.869,335.192c0-4.33,3.548-7.908,7.934-7.908h85.1c4.386,0,7.933,3.578,7.933,7.908v54.771
			c0,4.361-3.547,7.91-7.933,7.91H21.802c-4.386,0-7.934-3.518-7.934-7.877L13.869,335.192L13.869,335.192z"/>
		<path fill="#686868" d="M149.814,335.192c0-4.33,3.548-7.908,7.925-7.908h85.1c4.396,0,7.959,3.578,7.959,7.908v54.771
			c0,4.361-3.563,7.91-7.959,7.91h-85.115c-4.378,0-7.925-3.549-7.925-7.91v-54.771H149.814z"/>
		<path fill="#686868" d="M285.148,335.192c0-4.33,3.58-7.908,7.938-7.908h85.107c4.395,0,7.938,3.578,7.938,7.908v54.771
			c0,4.361-3.547,7.91-7.938,7.91h-85.107c-4.358,0-7.938-3.549-7.938-7.91V335.192z"/>
	</g>
	<path fill="#686868" d="M364.56,240.94v-15.916H29.548v15.916h159.637v15.328H88.204c-22.058,0-39.941,17.865-39.941,39.936v19.982
		h15.215v-9.668c0-19.771,16.029-35.801,35.824-35.801h89.9v50.479h16.095v-50.479h86.02c19.805,0,35.782,16.047,35.782,35.803
		v9.666h15.231v-19.982c0-22.064-17.867-39.936-39.934-39.936h-97.102V240.94H364.56L364.56,240.94z"/>
	<path fill="#686868" d="M125.73,193.838c0,8.78-7.127,15.956-15.931,15.956H45.48c-8.779,0-15.931-7.176-15.931-15.956V97.656
		c0-8.787,7.135-15.931,15.931-15.931h64.352c8.804,0,15.931,7.144,15.931,15.931L125.73,193.838L125.73,193.838z"/>
	<path fill="#686868" d="M364.56,193.838c0,8.78-7.128,15.956-15.945,15.956h-64.313c-8.785,0-15.93-7.176-15.93-15.956v-63.677
		c0-8.778,7.145-15.923,15.93-15.923h64.313c8.817,0,15.945,7.145,15.945,15.923V193.838L364.56,193.838z"/>
	<path fill="#686868" d="M245.148,193.838c0,8.78-7.129,15.956-15.947,15.956H164.89c-8.779,0-15.932-7.176-15.932-15.956V18.05
		c0-8.779,7.136-15.924,15.932-15.924h64.344c8.785,0,15.947,7.145,15.947,15.924v175.804h-0.033V193.838z"/>
</g>
</svg>
