<svg version="1.1" class="clearos-svg clearfoundation app-vendor-apeko app-paid app-category-server app-sub-category-file" viewBox="0 0 400 400" preserveAspectRatio="xMinYMin" xmlns="http://www.w3.org/2000/svg" xmlns:xlink= "http://www.w3.org/1999/xlink">
 <g id="Vrstva_x0020_1" transform="translate(18,14)">
  <g id="_2429955590704">
   <path class="fil0" d="M79 96c0,-12 0,-25 0,-37 0,-10 -3,-26 10,-28 8,-1 69,1 74,0l0 -13c-3,-1 -58,0 -66,0 -8,0 -12,-1 -19,3 -13,6 -13,19 -13,31l0 44 -35 0c6,-4 21,-13 25,-16 -2,-3 -4,-6 -6,-9 -2,1 -33,21 -37,24 -4,2 -8,5 -12,8 1,1 37,24 43,28 2,1 4,2 6,4 2,-2 4,-7 6,-9l-25 -16 35 0 0 64 -35 0c8,-6 17,-10 25,-16 -2,-2 -4,-7 -6,-9 -5,4 -47,30 -49,32 4,3 8,6 13,8 5,4 34,23 36,24 1,-3 4,-6 6,-9l-25 -16 35 0 0 65 -34 0c0,-1 -1,0 0,-1l23 -15 -5 -10c-2,1 -4,3 -6,5l-43 27 49 32c2,-3 4,-6 6,-9 -4,-3 -23,-14 -24,-16l34 0c0,15 0,30 0,44 0,8 0,14 3,20 2,5 6,9 10,11 7,4 11,3 19,3l66 0 0 -13c-6,0 -71,0 -74,0 -12,-2 -10,-16 -10,-28 0,-12 0,-24 0,-37l84 0 0 -92 -84 0 0 -64 84 0 0 -14c-3,-1 -74,0 -84,0z"/>
   <path class="fil0" d="M249 207c8,-2 15,3 16,10 2,8 -3,15 -9,17 -17,4 -25,-22 -7,-27zm79 -93c-2,1 -4,2 -6,4l-12 8c1,3 4,6 5,9l37 -24c3,-2 12,-7 12,-8l-49 -32c-1,3 -4,6 -5,9l24 16 -38 0c0,-15 0,-29 0,-44 0,-7 0,-13 -3,-20 -9,-18 -28,-14 -50,-14 -15,0 -29,0 -44,0l0 13c6,0 71,0 74,1 12,2 9,15 9,27 0,12 0,25 0,37l-83 0 0 14 83 0 0 64 -83 0 0 92 83 0c0,6 1,53 0,56 -1,4 -5,8 -9,9 -4,0 -69,0 -74,0l0 13 66 0c8,0 12,0 18,-3 13,-8 13,-19 13,-31 0,-15 0,-29 0,-44l38 0c-1,2 -15,10 -18,12 -2,2 -4,3 -6,4l5 9c2,0 48,-30 50,-32l-43 -28c-3,-1 -4,-3 -7,-3l-5 8c2,2 23,15 24,17l-38 -1 0 -64 38 0 -24 16c1,3 4,6 5,9 2,-1 22,-14 25,-16 4,-3 8,-5 12,-8 4,-2 9,-5 13,-8 -1,0 -45,-30 -50,-32 -1,3 -4,6 -5,9l24 16 -38 0 0 -64 38 0 -6 4z"/>
   <path class="fil0" d="M239 301c3,17 30,13 27,-5 -4,-18 -31,-13 -27,5z"/>
   <path class="fil0" d="M250 128c-18,3 -13,30 4,28 18,-3 14,-31 -4,-28z"/>
   <path class="fil0" d="M249 51c-7,1 -12,8 -10,16 5,17 31,11 26,-7 -1,-6 -8,-12 -16,-9z"/>
   <polygon class="fil0" points="174,362 187,362 187,348 176,348 174,348 "/>
   <polygon class="fil0" points="174,172 176,172 187,172 187,158 174,158 "/>
   <polygon class="fil0" points="174,90 176,90 187,90 187,77 174,77 "/>
   <polygon class="fil0" points="174,280 187,280 187,267 176,267 174,267 "/>
   <polygon class="fil0" points="174,253 187,253 187,241 187,240 174,240 "/>
   <polygon class="fil0" points="174,334 187,334 187,323 187,321 174,321 "/>
   <polygon class="fil0" points="174,36 187,36 187,34 187,23 174,23 "/>
   <polygon class="fil0" points="174,118 187,118 187,116 187,104 174,104 "/>
   <polygon class="fil0" points="174,199 176,199 187,199 187,185 174,185 "/>
   <polygon class="fil0" points="174,63 187,63 187,50 174,50 "/>
   <polygon class="fil0" points="174,307 187,307 187,294 174,294 "/>
   <polygon class="fil0" points="174,145 187,145 187,131 174,131 "/>
   <polygon class="fil0" points="174,226 187,226 187,212 174,212 "/>
   <polygon class="fil0" points="174,9 187,9 187,0 174,0 "/>
  </g>
 </g>
</svg>
