<svg version="1.1" class="clearos-svg clearfoundation app-vendor-clearcenter app-paid app-category-cloud app-sub-category-applications" viewBox="0 0 400 400" preserveAspectRatio="xMinYMin" xmlns="http://www.w3.org/2000/svg" xmlns:xlink= "http://www.w3.org/1999/xlink">
<path fill="#AA0707" d="M441.666,184.647"/>
<path fill="#AA0707" d="M473.245,247.805"/>
<path fill="#AA0707" d="M441.666,184.647"/>
<path fill="#AA0707" d="M473.245,247.805"/>
<g>
	<path fill="#686868" d="M54.22,218.917c0,0.347-0.18,0.595-0.516,0.753c-2.662,0.813-5.385,1.408-8.169,1.752
		c-2.794,0.36-5.611,0.563-8.452,0.563c-4.664,0-8.937-0.654-12.817-1.906c-3.883-1.283-7.217-3.1-10.002-5.542
		c-2.787-2.41-4.953-5.433-6.511-8.979c-1.549-3.537-2.323-7.617-2.323-12.188c0-4.697,0.822-8.828,2.473-12.388
		c1.65-3.554,3.912-6.535,6.809-8.953c2.904-2.38,6.316-4.204,10.26-5.424c3.943-1.212,8.241-1.823,12.875-1.823
		c2.659,0,5.155,0.156,7.51,0.462c2.356,0.305,4.649,0.72,6.91,1.221c0.338,0.062,0.596,0.203,0.722,0.384
		c0.142,0.227,0.226,0.416,0.259,0.642c0.032,0.43,0.062,1.009,0.11,1.683c0.047,0.673,0.076,1.424,0.106,2.247
		c0.031,0.782,0.07,1.611,0.117,2.433c0.047,0.814,0.078,1.605,0.109,2.294c0.029,0.72,0.046,1.315,0.062,1.808
		c0.017,0.501,0.017,0.822,0.017,0.947l-2.341,0.242c-0.258-1.972-0.858-3.638-1.853-4.985c-0.995-1.345-2.199-2.418-3.641-3.271
		c-1.446-0.813-3.028-1.408-4.795-1.776c-1.746-0.337-3.508-0.533-5.252-0.533c-3.451,0-6.48,0.533-9.095,1.636
		c-2.604,1.056-4.788,2.598-6.55,4.569c-1.762,1.974-3.061,4.344-3.945,7.083c-0.883,2.74-1.314,5.8-1.314,9.148
		c0,3.944,0.549,7.567,1.65,10.844c1.104,3.257,2.723,6.074,4.906,8.406c2.177,2.336,4.883,4.194,8.123,5.478
		c3.238,1.315,7.004,1.94,11.3,1.94c0.72,0,1.456,0,2.229-0.031c0.768-0.028,1.551-0.096,2.373-0.187v-14.76
		c0-0.909-0.069-1.646-0.195-2.198c-0.126-0.564-0.338-0.996-0.643-1.284c-0.306-0.29-0.672-0.501-1.149-0.627
		c-0.47-0.094-1.041-0.164-1.729-0.164c-0.228,0-0.455,0.023-0.674,0.039c-0.226,0.017-0.484,0.017-0.727,0.017l-0.236-2.629
		c1.684-0.133,3.248-0.227,4.68-0.306c1.425-0.077,2.677-0.156,3.748-0.195c1.073-0.063,1.975-0.078,2.678-0.095
		c0.703-0.015,1.166-0.03,1.376-0.03c1.01,0,1.511,0.494,1.511,1.511v22.177h0.016L54.22,218.917L54.22,218.917L54.22,218.917z"/>
	<path fill="#686868" d="M81.124,221.547c-2.598,0-4.954-0.468-7.066-1.376c-2.111-0.907-3.942-2.19-5.462-3.788
		c-1.524-1.58-2.708-3.475-3.545-5.666c-0.829-2.16-1.252-4.507-1.252-7.013c0-2.754,0.486-5.273,1.434-7.559
		c0.938-2.293,2.27-4.233,3.969-5.838c1.706-1.605,3.708-2.88,6.063-3.749c2.342-0.916,4.932-1.345,7.739-1.345
		c2.598,0,4.969,0.429,7.114,1.345c2.153,0.883,3.975,2.112,5.502,3.67c1.519,1.557,2.69,3.413,3.538,5.548
		c0.853,2.129,1.267,4.421,1.267,6.895c0,2.832-0.463,5.415-1.409,7.731c-0.945,2.346-2.26,4.318-3.974,5.947
		c-1.699,1.658-3.733,2.941-6.104,3.849C86.557,221.093,83.982,221.547,81.124,221.547z M83.34,217.417
		c1.686,0,3.075-0.347,4.18-1.099c1.098-0.719,1.955-1.688,2.582-2.846c0.629-1.176,1.059-2.443,1.302-3.886
		c0.241-1.44,0.353-2.849,0.353-4.226c0-1.689-0.182-3.475-0.549-5.36c-0.367-1.871-0.955-3.607-1.808-5.172
		c-0.854-1.573-1.956-2.905-3.333-3.929s-3.075-1.558-5.109-1.558c-1.684,0-3.084,0.368-4.188,1.095
		c-1.088,0.751-1.955,1.683-2.584,2.88c-0.616,1.159-1.056,2.472-1.313,3.882c-0.25,1.44-0.367,2.849-0.367,4.264
		c0,1.706,0.196,3.521,0.564,5.396c0.366,1.882,0.995,3.603,1.832,5.166c0.829,1.58,1.947,2.865,3.334,3.85
		C79.591,216.915,81.305,217.417,83.34,217.417z"/>
	<path fill="#686868" d="M123.854,221.547c-2.599,0-4.953-0.468-7.066-1.376c-2.114-0.907-3.945-2.19-5.463-3.788
		c-1.527-1.58-2.707-3.475-3.544-5.666c-0.831-2.16-1.253-4.507-1.253-7.013c0-2.754,0.484-5.273,1.432-7.559
		c0.939-2.293,2.271-4.233,3.968-5.838c1.706-1.605,3.71-2.88,6.065-3.749c2.341-0.916,4.931-1.345,7.741-1.345
		c2.597,0,4.969,0.429,7.111,1.345c2.153,0.883,3.978,2.112,5.501,3.67c1.521,1.557,2.693,3.413,3.537,5.548
		c0.854,2.129,1.27,4.421,1.27,6.895c0,2.832-0.461,5.415-1.408,7.731c-0.946,2.346-2.262,4.318-3.977,5.947
		c-1.697,1.658-3.732,2.941-6.104,3.849C129.284,221.093,126.71,221.547,123.854,221.547z M126.067,217.417
		c1.683,0,3.073-0.347,4.178-1.099c1.096-0.719,1.956-1.688,2.583-2.846c0.626-1.176,1.056-2.443,1.299-3.886
		c0.244-1.44,0.353-2.849,0.353-4.226c0-1.689-0.182-3.475-0.55-5.36c-0.366-1.871-0.962-3.607-1.808-5.172
		c-0.853-1.573-1.957-2.905-3.333-3.929c-1.377-1.025-3.076-1.558-5.11-1.558c-1.683,0-3.084,0.368-4.187,1.095
		c-1.086,0.751-1.956,1.683-2.582,2.88c-0.619,1.159-1.059,2.472-1.315,3.882c-0.251,1.44-0.366,2.849-0.366,4.264
		c0,1.706,0.193,3.521,0.563,5.396c0.368,1.882,0.995,3.603,1.824,5.166c0.837,1.58,1.956,2.865,3.333,3.85
		C122.32,216.915,124.033,217.417,126.067,217.417z"/>
	<path fill="#686868" d="M177.382,189.907c0.979,1.088,1.725,2.325,2.231,3.64c0.516,1.346,0.767,2.754,0.767,4.265
		c0,2.035-0.396,3.874-1.199,5.549c-0.805,1.658-1.923,3.068-3.379,4.271c-1.464,1.202-3.192,2.099-5.194,2.752
		c-2.003,0.658-4.21,1.021-6.62,1.021c-1.975,0-3.583-0.219-4.837-0.627c-0.47,0.595-0.932,1.188-1.376,1.783
		c-0.456,0.596-0.675,1.203-0.675,1.832c0,0.768,0.432,1.313,1.301,1.754c0.86,0.389,1.9,0.75,3.139,0.97
		c1.237,0.233,2.551,0.346,3.929,0.407c1.377,0.062,2.599,0.095,3.67,0.095c1.9,0,3.812,0.124,5.705,0.358
		c1.896,0.252,3.595,0.719,5.095,1.379c1.513,0.658,2.725,1.578,3.673,2.723c0.944,1.158,1.405,2.629,1.405,4.445
		c0,1.723-0.397,3.315-1.196,4.759c-0.81,1.471-1.85,2.786-3.134,3.974c-1.273,1.188-2.736,2.27-4.39,3.159
		c-1.65,0.94-3.333,1.688-5.047,2.315c-1.715,0.595-3.396,1.064-5.047,1.379c-1.652,0.328-3.108,0.469-4.36,0.469
		c-1.472,0-3.027-0.188-4.693-0.596c-1.668-0.39-3.194-1.016-4.586-1.83c-1.395-0.83-2.552-1.813-3.477-3.033
		c-0.931-1.174-1.378-2.586-1.378-4.227c0-0.986,0.157-1.908,0.493-2.832c0.337-0.875,0.752-1.735,1.299-2.615
		c0.533-0.859,1.151-1.688,1.878-2.535c0.721-0.86,1.473-1.706,2.255-2.598c-0.43-0.234-0.844-0.486-1.243-0.877
		c-0.406-0.391-0.729-0.83-1.009-1.25c-0.291-0.438-0.517-0.925-0.674-1.377c-0.164-0.471-0.258-0.955-0.258-1.377
		c0-0.986,0.429-2.053,1.313-3.257c0.875-1.188,2.325-2.753,4.329-4.633c-2.169-1.097-3.851-2.615-5.047-4.553
		c-1.206-1.94-1.814-4.103-1.814-6.474c0-1.973,0.396-3.765,1.204-5.438c0.799-1.628,1.927-3.02,3.382-4.194
		c1.455-1.175,3.169-2.052,5.156-2.692c1.987-0.642,4.188-0.978,6.605-0.978c1.877,0,3.624,0.242,5.211,0.704
		c1.582,0.462,3.013,1.103,4.227,1.925c3.028-0.791,5.425-1.378,7.139-1.776c1.713-0.407,2.801-0.61,3.23-0.61
		c0.885,0,1.316,0.462,1.316,1.409c0,0.595-0.033,1.205-0.095,1.823c-0.063,0.626-0.143,1.3-0.242,2.018L177.382,189.907z
		 M156.73,223.613c-0.821,1.126-1.448,2.13-1.877,3.006c-0.431,0.891-0.658,1.847-0.658,2.927c0,1.313,0.415,2.425,1.252,3.351
		c0.83,0.908,1.87,1.644,3.139,2.189c1.269,0.563,2.646,0.986,4.1,1.189c1.48,0.265,2.873,0.358,4.188,0.358
		c1.058,0,2.262-0.126,3.577-0.327c1.314-0.203,2.528-0.597,3.671-1.08c1.12-0.531,2.064-1.221,2.832-2.082
		c0.767-0.875,1.159-1.927,1.159-3.237c0-1.128-0.336-2.036-0.994-2.724c-0.658-0.658-1.511-1.19-2.567-1.552
		c-1.041-0.358-2.245-0.594-3.593-0.72c-1.345-0.096-2.691-0.172-4.038-0.172c-0.719,0-1.502,0-2.371-0.03s-1.746-0.097-2.661-0.188
		c-0.916-0.097-1.809-0.223-2.689-0.379C158.294,224.02,157.481,223.833,156.73,223.613z M165.127,207.523
		c1.213,0,2.279-0.219,3.17-0.657c0.901-0.438,1.62-1,2.185-1.771c0.555-0.72,0.993-1.599,1.268-2.552
		c0.281-1.019,0.416-2.042,0.416-3.131c0-1.25-0.149-2.488-0.455-3.726c-0.297-1.228-0.752-2.341-1.377-3.349
		c-0.625-0.978-1.423-1.762-2.417-2.355c-0.994-0.588-2.146-0.892-3.49-0.892c-1.221,0-2.275,0.234-3.146,0.689
		c-0.861,0.446-1.605,1.039-2.161,1.792c-0.563,0.751-0.979,1.636-1.251,2.628c-0.272,0.995-0.398,2.051-0.398,3.138
		c0,1.22,0.141,2.442,0.414,3.671c0.273,1.236,0.72,2.316,1.33,3.285c0.611,0.972,1.396,1.753,2.373,2.349
		C162.561,207.24,163.75,207.523,165.127,207.523z"/>
	<path fill="#686868" d="M187.704,160.003c3.451-0.947,6.285-1.604,8.5-1.988c2.207-0.391,3.552-0.594,3.991-0.594
		c1.009,0,1.502,0.556,1.502,1.683v60.251c0,0.752-0.369,1.188-1.12,1.316c-0.532,0.096-1.104,0.153-1.713,0.25
		c-0.611,0.063-1.204,0.124-1.761,0.188c-0.564,0.031-1.079,0.063-1.561,0.095c-0.468,0-0.836,0.028-1.072,0.028
		c-0.76,0-1.126-0.387-1.126-1.188v-53.6c0-1.666-0.271-2.793-0.798-3.42c-0.531-0.587-1.409-0.908-2.628-0.908
		c-0.594,0-1.237,0.047-1.926,0.142L187.704,160.003z"/>
	<path fill="#686868" d="M243.558,216.633c-1.52,0.719-3.099,1.378-4.757,1.975c-1.656,0.625-3.285,1.144-4.853,1.596
		c-1.601,0.438-3.07,0.754-4.415,1.002c-1.378,0.232-2.504,0.346-3.412,0.346c-2.536,0-4.789-0.469-6.73-1.439
		c-1.975-0.938-3.603-2.19-4.932-3.789c-1.33-1.563-2.347-3.41-3.036-5.478c-0.686-2.051-1.017-4.192-1.017-6.433
		c0-2.88,0.533-5.494,1.598-7.865c1.065-2.341,2.521-4.358,4.354-6.042c1.847-1.666,3.974-2.982,6.4-3.913
		c2.44-0.916,5.025-1.376,7.748-1.376c1.783,0,3.363,0.289,4.742,0.813c1.376,0.563,2.521,1.316,3.477,2.26
		c0.957,0.979,1.678,2.114,2.18,3.46c0.481,1.354,0.751,2.826,0.751,4.415c0,1.377-0.281,3.091-0.813,5.167l-22.067,1.155
		c0.126,1.977,0.517,3.772,1.173,5.416c0.659,1.627,1.612,3.035,2.788,4.228c1.22,1.188,2.689,2.099,4.396,2.754
		c1.753,0.658,3.757,1.001,6.011,1.001c1.503,0,3.1-0.187,4.805-0.563c1.706-0.329,3.241-0.783,4.588-1.313L243.558,216.633z
		 M233.104,198.595c0.107-0.429,0.174-0.869,0.201-1.267c0.03-0.4,0.051-0.83,0.051-1.261c0-0.884-0.127-1.706-0.406-2.488
		c-0.253-0.783-0.629-1.456-1.128-2.035c-0.5-0.58-1.125-1.025-1.878-1.378c-0.753-0.321-1.6-0.486-2.537-0.486
		c-1.501,0-2.801,0.289-3.853,0.837c-1.094,0.541-1.972,1.268-2.688,2.176c-0.688,0.917-1.221,1.973-1.582,3.178
		c-0.357,1.198-0.532,2.45-0.563,3.765L233.104,198.595z"/>
	<path fill="#686868" d="M304.006,220.607h-6.169l-4.76-12.506h-17.246l-4.571,12.506h-5.728l15.774-41.147h5.918L304.006,220.607z
		 M291.484,203.736l-7.266-19.06l-6.918,19.06H291.484z"/>
	<path fill="#686868" d="M313.177,194.345c2.363-2.833,5.229-4.257,8.517-4.257c1.976,0,3.69,0.367,5.212,1.103
		c1.55,0.735,2.834,1.762,3.886,3.091c1.045,1.33,1.83,2.952,2.362,4.861c0.563,1.901,0.813,4,0.813,6.314
		c0,2.382-0.313,4.604-0.938,6.543c-0.628,1.975-1.532,3.632-2.662,5.008c-1.125,1.377-2.473,2.442-4.038,3.195
		c-1.534,0.752-3.194,1.125-5.01,1.125c-3.271,0-5.993-1.018-8.169-3.021v13.729h-5.291v-41.213h5.291v3.521L313.177,194.345
		L313.177,194.345z M313.177,213.533c2.316,2.443,4.947,3.632,7.856,3.632c2.286,0,4.07-0.97,5.417-2.942
		c1.345-1.938,2.003-4.884,2.003-8.748c0-3.679-0.626-6.464-1.878-8.351c-1.282-1.894-3.034-2.856-5.319-2.856
		c-2.991,0-5.683,1.698-8.079,5.095V213.533L313.177,213.533z"/>
	<path fill="#686868" d="M345.2,194.345c2.362-2.833,5.228-4.257,8.515-4.257c1.956,0,3.692,0.367,5.212,1.103
		c1.55,0.735,2.831,1.762,3.882,3.091c1.051,1.33,1.831,2.952,2.364,4.861c0.563,1.901,0.813,4,0.813,6.314
		c0,2.382-0.313,4.604-0.939,6.543c-0.626,1.975-1.532,3.632-2.66,5.008c-1.127,1.377-2.474,2.442-4.038,3.195
		c-1.532,0.752-3.194,1.125-5.01,1.125c-3.271,0-6.011-1.018-8.169-3.021v13.729h-5.292v-41.213h5.292v3.521L345.2,194.345
		L345.2,194.345z M345.2,213.533c2.314,2.443,4.946,3.632,7.854,3.632c2.286,0,4.07-0.97,5.416-2.942
		c1.349-1.938,2.004-4.884,2.004-8.748c0-3.679-0.627-6.464-1.878-8.351c-1.281-1.894-3.034-2.856-5.32-2.856
		c-2.988,0-5.682,1.698-8.076,5.095V213.533L345.2,213.533z"/>
	<path fill="#686868" d="M382.576,221.329c-8.108,0-12.364-3.194-12.804-9.627h5.32c0.063,3.644,2.535,5.463,7.45,5.463
		c2.238,0,3.914-0.437,5.04-1.347c1.124-0.922,1.688-2.053,1.688-3.428c0-0.688-0.125-1.283-0.346-1.679
		c-0.221-0.437-0.656-0.813-1.283-1.157c-0.625-0.348-1.484-0.674-2.596-1.003c-1.128-0.31-2.6-0.688-4.416-1.188
		c-1.754-0.438-3.287-0.907-4.556-1.346c-1.27-0.425-2.332-0.971-3.13-1.6c-0.83-0.626-1.44-1.393-1.831-2.3
		c-0.391-0.925-0.593-2.052-0.593-3.437c0-1.228,0.265-2.371,0.781-3.427c0.532-1.04,1.282-1.956,2.255-2.723
		c0.971-0.766,2.133-1.362,3.478-1.792c1.361-0.438,2.91-0.657,4.602-0.657c7.813,0,11.771,2.77,11.928,8.326h-5.261
		c-0.155-2.77-2.256-4.164-6.292-4.164c-1.781,0-3.271,0.337-4.442,1.009c-1.16,0.673-1.753,1.667-1.753,2.966
		c0,0.563,0.095,1.025,0.22,1.425c0.143,0.384,0.469,0.735,1.034,1.025c0.549,0.308,1.376,0.618,2.44,0.962
		c1.097,0.344,2.567,0.734,4.413,1.188c1.803,0.408,3.382,0.859,4.729,1.33c1.347,0.453,2.427,1.019,3.316,1.705
		c0.875,0.658,1.532,1.474,1.976,2.428c0.404,0.955,0.625,2.142,0.625,3.553c0,1.35-0.278,2.6-0.83,3.727
		c-0.547,1.162-1.362,2.16-2.395,3.004c-1.033,0.892-2.314,1.549-3.787,2.006C386.051,221.109,384.391,221.329,382.576,221.329z"/>
</g>
</svg>
