<svg version="1.1" class="clearos-svg clearfoundation" viewBox="0 0 400 400" preserveAspectRatio="xMinYMin" xmlns="http://www.w3.org/2000/svg" xmlns:xlink= "http://www.w3.org/1999/xlink">
<path fill="#AA0707" d="M91.666,184.647"/>
<path fill="#AA0707" d="M123.245,247.805"/>
<path fill="#AA0707" d="M91.666,184.647"/>
<path fill="#AA0707" d="M123.245,247.805"/>
<g>
	<path fill="#686868" d="M165.486,87.299c5.24,0,9.482,4.251,9.482,9.483c0,5.239-4.242,9.482-9.482,9.482
		c-5.238,0-9.481-4.243-9.481-9.482C156.005,91.55,160.248,87.299,165.486,87.299z"/>
	<path fill="#686868" d="M200.004,1.75C90.503,1.75,1.754,90.523,1.754,200c0,109.509,88.766,198.25,198.25,198.25
		c109.532,0,198.242-88.741,198.242-198.25C398.246,90.523,309.536,1.75,200.004,1.75z M146.807,49.353
		c-0.822-1.153-0.545-2.75,0.616-3.58c1.17-0.822,2.806-0.529,3.644,0.569l15.844,22.577c8.691-3.5,18.855-5.848,30.764-6.669
		c17.448,0,29.775,2.916,38.91,6.669l15.915-23.114c0.791-1.193,2.401-1.486,3.541-0.68c1.169,0.814,1.501,2.426,0.694,3.627
		l-15.377,22.284c6.433,3.153,11,6.638,14.824,9.341c26.93,19.123,28.289,43.904,28.289,48.179v0.206H118.327
		c0.063-4.868,7.333-40.633,43.675-57.741L146.807,49.353z M106.055,235.732c0,9.988-8.123,18.145-18.119,18.145
		c-10.004,0-18.127-8.123-18.127-18.145v-76.816c0-10.02,8.124-18.127,18.127-18.127c9.996,0,18.119,8.092,18.119,18.088V235.732z
		 M274.119,291.713h-19.866v42.768c0,10.021-8.124,18.175-18.175,18.175c-9.989,0-18.112-8.122-18.112-18.175v-42.768h-31.862
		v42.768c0,10.021-8.093,18.175-18.127,18.175c-10.004,0-18.097-8.122-18.097-18.175v-42.768h-21.179
		c-5.729,0-10.391-4.679-10.391-10.431V142.291h166.207v138.991C284.502,287.034,279.824,291.713,274.119,291.713z M332.816,235.732
		c0,9.988-8.125,18.145-18.146,18.145c-10.004,0-18.146-8.123-18.146-18.145v-76.816c0-10.02,8.142-18.127,18.146-18.127
		c10.021,0,18.146,8.092,18.146,18.088V235.732z"/>
	<path fill="#686868" d="M237.736,87.268c5.248,0,9.481,4.251,9.481,9.498s-4.233,9.499-9.481,9.499
		c-5.246,0-9.514-4.251-9.514-9.499C228.223,91.519,232.49,87.268,237.736,87.268z"/>
</g>
</svg>
