<svg version="1.1" class="clearos-svg clearfoundation app-vendor-contentfilter app-free app-category-gateway app-sub-category-filtering" viewBox="0 0 400 400" preserveAspectRatio="xMinYMin" xmlns="http://www.w3.org/2000/svg" xmlns:xlink= "http://www.w3.org/1999/xlink">
<g
     style="fill:#686868;stroke:none"
     transform="matrix(0.0146536,0,0,-0.01653684,36.05277,393.60093)"
     id="g4-6"><path
       d="m 8954,23110 c -231,-60 -409,-229 -496,-470 l -23,-65 -3,-5455 c -2,-5391 -2,-5456 17,-5533 66,-258 258,-451 517,-517 76,-20 121,-20 2348,-20 2544,0 2339,-6 2506,76 79,39 109,62 180,133 92,92 139,169 182,296 l 23,70 3,5430 c 3,6083 10,5512 -73,5680 -24,50 -63,113 -87,142 -61,73 -161,151 -245,190 -146,67 38,63 -2488,62 -2205,0 -2293,-1 -2361,-19 z"
       id="path6-1" /><path
       d="m 16051,19464 c -210,-56 -373,-188 -465,-376 -83,-170 -76,170 -76,-3683 0,-3849 -7,-3511 75,-3681 80,-165 230,-297 410,-361 l 80,-28 2300,-3 c 2276,-2 2301,-2 2380,18 257,64 450,257 515,514 20,79 20,109 20,3541 0,3428 0,3463 -20,3541 -65,258 -267,459 -522,519 -94,22 -4614,21 -4697,-1 z"
       id="path8" /><path
       d="m 1747,17504 c -235,-51 -430,-214 -516,-431 -54,-138 -52,2 -49,-2688 l 3,-2480 23,-70 c 43,-127 90,-204 182,-296 69,-69 102,-94 177,-131 170,-85 -50,-79 2538,-76 l 2300,3 65,23 c 200,72 343,199 426,379 69,147 64,-61 62,2710 l -3,2508 -28,80 c -77,218 -244,380 -472,457 l -70,23 -2285,2 c -1980,1 -2294,0 -2353,-13 z"
       id="path10" /><path
       d="M 575,9525 C 423,9496 323,9443 210,9330 116,9236 72,9169 32,9058 L 5,8985 2,8515 c -3,-531 -1,-555 68,-693 97,-192 256,-319 465,-372 80,-20 89,-20 10810,-18 l 10730,3 84,29 c 206,72 375,241 447,447 l 29,84 3,456 c 4,525 1,544 -75,699 -38,78 -62,110 -128,175 -119,118 -236,179 -395,204 -45,8 -3326,11 -10730,10 -8777,-1 -10677,-3 -10735,-14 z"
       id="path12" /><path
       d="m 8010,5504 c -241,-35 -448,-125 -579,-253 -257,-251 -245,-666 32,-1089 56,-85 2585,-3399 2741,-3592 226,-278 506,-461 830,-541 117,-29 358,-36 491,-15 289,48 543,184 776,416 114,113 249,287 1460,1869 734,959 1360,1783 1393,1830 75,111 168,301 202,416 35,120 44,308 20,405 -63,253 -272,439 -581,519 -207,54 -24,51 -3485,50 -2664,-1 -3221,-3 -3300,-15 z m 5133,-1046 c 43,-23 268,-221 282,-248 22,-43 18,-92 -10,-135 -44,-64 -2045,-2487 -2095,-2538 -44,-43 -53,-47 -97,-47 -30,0 -59,7 -78,19 -37,23 -1211,1084 -1254,1133 -48,55 -64,101 -51,148 10,38 176,246 238,297 35,30 91,38 133,20 19,-8 230,-191 469,-406 239,-216 445,-398 458,-404 15,-7 31,-7 47,-1 14,5 385,447 890,1059 585,711 880,1060 911,1083 50,35 114,43 157,20 z"
       id="path14" /></g>
</svg>
