<svg version="1.1" class="clearos-svg clearfoundation" viewBox="0 0 400 400" preserveAspectRatio="xMinYMin" xmlns="http://www.w3.org/2000/svg" xmlns:xlink= "http://www.w3.org/1999/xlink">
<path style="fill:#AA0707;" d="M91.666,184.647"/>
<path style="fill:#AA0707;" d="M123.245,247.805"/>
<path style="fill:#AA0707;" d="M91.666,184.647"/>
<path style="fill:#AA0707;" d="M123.245,247.805"/>
<g>
	<path style="fill:#686868;" d="M258.023,44.154c4.271,3.133,7.742,7.028,10.584,11.354c10.146-1.178,20.465-1.932,30.938-1.932
		c9.597,0,19.052,0.565,28.396,1.547C298.07,25.967,258.307,6.894,214.034,3.8C230.479,15.242,245.334,28.748,258.023,44.154z"/>
	<path style="fill:#686868;" d="M61.274,118.964l11.661,20.181c1.217,0.212,2.441,0.361,3.667,0.581
		c8.426-9.313,20.456-15.297,33.993-15.297c2.56,0,5.033,0.361,7.46,0.762c20.085-18.657,42.991-34.244,68.079-46.031
		c-0.038-0.675-0.228-1.28-0.228-1.955c0-19.607,14.26-35.948,33.482-40.644C205.378,24.146,189.65,13.71,172.525,5.623
		C112.667,15.14,62.749,54.041,37.599,106.966c1.318-0.267,2.639-0.542,4.052-0.542C47.375,106.424,55.4,108.575,61.274,118.964z"/>
	<path style="fill:#686868;" d="M285.57,173.884c-1.414-25.921-7.633-50.577-18.125-72.933
		c-8.008,11.087-21.516,18.398-36.842,18.398c-13.742,0-25.836-5.96-34.049-15.147c-19.177,9.132-36.978,20.652-52.926,34.354
		c6.816,7.06,11.223,16.357,12.398,26.628c10.531,4.727,20.746,10.003,30.712,15.696c5.12-4.311,11.614-6.997,18.782-6.997
		L285.57,173.884L285.57,173.884z"/>
	<path style="fill:#686868;" d="M358.001,184.61v90.789c15.596-26.696,24.563-57.729,24.563-90.931
		c0-35.831-10.396-69.203-28.349-97.299c-17.558-4.115-35.822-6.51-54.669-6.51c-5.652,0-11.213,0.448-16.804,0.864
		c8.575,16.137,15.108,33.467,19.536,51.661l8.293-14.394c5.748-10.216,13.789-12.383,19.521-12.383
		c8.041,0,14.561,4.162,19.317,12.399l19.6,33.915c1.774,3.33,6.143,13.121,0.69,22.481
		C366.606,180.621,361.646,183.307,358.001,184.61z"/>
	<path style="fill:#686868;" d="M166.852,191.528H81.486c-6.753,0-12.265,5.481-12.265,12.234v177.396
		c0,6.722,5.496,12.218,12.265,12.218h85.348c6.784,0,12.273-5.496,12.273-12.218V203.764
		C179.123,196.994,173.618,191.528,166.852,191.528z"/>
	<path style="fill:#686868;" d="M47.493,128.151c-1.193-2.026-2.465-3.879-4.813-3.879c-2.474,0-3.597,2.151-4.838,4.295
		c-4.82,8.363-19.301,33.42-19.301,33.42s-1.86,3.502-0.754,5.434c0.95,1.625,3.879,2.253,3.879,2.253h10.129v218.234
		c0,4.57,3.699,8.292,8.284,8.292h5.851c4.569,0,8.269-3.706,8.269-8.292V169.675h9.973c0,0,2.646-0.84,3.565-2.434
		c1.131-1.963-0.864-5.497-0.864-5.497S52.33,136.562,47.493,128.151z"/>
	<path style="fill:#686868;" d="M291.381,191.528h-85.355c-6.77,0-12.258,5.481-12.258,12.234v177.396
		c0,6.722,5.488,12.218,12.258,12.218h85.354c6.784,0,12.281-5.496,12.281-12.218V203.764
		C303.631,196.994,298.165,191.528,291.381,191.528z"/>
	<path style="fill:#686868;" d="M335.04,128.567c-1.225-2.144-2.354-4.295-4.837-4.295c-2.371,0-3.659,1.853-4.821,3.879
		c-4.837,8.395-19.409,33.577-19.409,33.577s-1.965,3.533-0.816,5.497c0.879,1.61,3.533,2.434,3.533,2.434h9.973v218.219
		c0,4.586,3.722,8.308,8.275,8.308h5.856c4.586,0,8.276-3.705,8.276-8.308V169.659h10.113c0,0,2.921-0.628,3.862-2.253
		c1.115-1.932-0.723-5.442-0.723-5.442S339.847,136.915,335.04,128.567z"/>
</g>
</svg>
