<svg version="1.1" class="clearos-svg clearfoundation app-vendor-mercycorps app-free app-category-system app-sub-category-backup" viewBox="0 0 400 400" preserveAspectRatio="xMinYMin" xmlns="http://www.w3.org/2000/svg" xmlns:xlink= "http://www.w3.org/1999/xlink">
<g>
	<path fill="#686868" d="M20.505,133.194h260.617c8.458,0,15.353-6.874,15.353-15.359v-62.06c0-8.527-6.895-15.359-15.353-15.359
		v-0.027H20.505c-8.471,0-15.358,6.847-15.358,15.36v62.071C5.146,126.32,12.034,133.194,20.505,133.194z M41.25,70.463
		c9.01,0,16.333,7.301,16.333,16.318c0,9.023-7.309,16.316-16.333,16.316c-9.023,0-16.333-7.293-16.333-16.316
		C24.918,77.764,32.24,70.463,41.25,70.463z"/>
	<polygon fill="#686868" points="306.121,240.846 306.121,152.11 276.088,152.11 276.088,240.846 187.354,240.846 187.354,270.878 
		276.088,270.878 276.088,359.611 306.121,359.611 306.121,270.878 394.854,270.878 394.854,240.846 	"/>
	<path fill="#686868" d="M177.343,240.607H20.505c-8.471,0-15.358,6.848-15.358,15.359v62.072c0,8.5,6.888,15.374,15.358,15.374
		h245.572v-56.502h-88.734V240.607z M41.25,303.318c-9.023,0-16.333-7.293-16.333-16.317c0-9.017,7.322-16.317,16.333-16.317
		c9.01,0,16.333,7.301,16.333,16.317C57.583,296.025,50.275,303.318,41.25,303.318z"/>
	<path fill="#686868" d="M20.505,233.305h245.572V145.74h26.561c-2.815-3.196-6.931-5.215-11.516-5.215v-0.027H20.505
		c-8.471,0-15.358,6.847-15.358,15.359v62.074C5.146,226.432,12.034,233.305,20.505,233.305z M41.25,170.573
		c9.01,0,16.333,7.301,16.333,16.316c0,9.025-7.309,16.318-16.333,16.318c-9.023,0-16.333-7.294-16.333-16.318
		C24.918,177.874,32.24,170.573,41.25,170.573z"/>
</g>
</svg>
