@startuml


package init {
    class ResponseBuilder
}


package config {
    class _properties << (V,#FF7700) Variable >>
    class RESP_BUILDER << (V,#FF7700) Variable >>
    class NAME_FILE_CODES << (V,#FF7700) Variable >>
    class _name_file_codes << (V,#FF7700) Variable >>
    class _default_response << (V,#FF7700) Variable >>
    class _default_mimetype << (V,#FF7700) Variable >>
    class _default_status_code << (V,#FF7700) Variable >>
}


package inmutables {
    enum _Groups
    enum _Properties
}

package interfaces {
    interface ResponseBuilderInterface
}


RESP_BUILDER --> _Groups
NAME_FILE_CODES --> _Properties
_name_file_codes --> _properties
_name_file_codes --> RESP_BUILDER
_name_file_codes --> NAME_FILE_CODES


ResponseBuilder --> _name_file_codes
ResponseBuilder --> _default_mimetype
ResponseBuilder --> _default_response
ResponseBuilder --> _default_status_code
ResponseBuilder --|> ResponseBuilderInterface



@enduml