@startuml

package 'inmutables.py' {
    enum _Params
    enum _Config
    enum _NameClasses
    enum _DDLOptions
    enum _Properties
}

package 'config.py' {
    class _properties << (f,#FF7700) variable >>
    class _db_properties << (f,#FF7700) variable >>
    class _ddl_auto_options << (f,#FF7700) variable >>
    class _config << (f,#FF7700) variable >>
    class _url_connection << (f,#FF7700) variable >>
    class _engine << (f,#FF7700) variable >>
    class StandardSession
    class AutoCommitSession
}

package 'interfaces.py' {

    interface BasicQuery
    interface StandardQuery
    interface AdvanceQuery
}

package '__init.py__' {
    abstract _Querys
    class StandardQueryImpl
    class AdvanceQuerysImpl
    abstract Base << (f,#FF7700) variable >>
    abstract _Filter
    class Base.metadata << (f,#FF7700) variable >>
    class BasicQueryImpl

    abstract _AtributeLoader
    class load_declarative_models << (f,#FF7700) Function >>
}

Base.metadata -> Base

load_declarative_models ------> _Params
load_declarative_models ------> _Config
load_declarative_models ------> _NameClasses
load_declarative_models ------> _DDLOptions
load_declarative_models -> Base.metadata


_config <---- load_declarative_models
_engine <---- load_declarative_models
_ddl_auto_options <---- load_declarative_models
_db_properties <---- _Filter
_db_properties <---- BasicQueryImpl
_db_properties <---- AdvanceQuerysImpl
_url_connection <-- _engine

_AtributeLoader --> _Properties

_Filter --> _AtributeLoader

BasicQueryImpl --> _Querys
BasicQueryImpl -----> BasicQuery
BasicQueryImpl --> _Properties

StandardQueryImpl -> _Querys
StandardQueryImpl ---> _Filter
StandardQueryImpl -> StandardQuery

AdvanceQuerysImpl -> _Querys
AdvanceQuerysImpl --> _Filter
AdvanceQuerysImpl -> AdvanceQuery

@enduml