@startuml

package "__init__.py" {
    class ApiFactory
    class ResourceBuilder
}

package "inmutables.py" {
    enum _Params
    enum _Properties
    enum _ClassName
    enum _PropertiesGroups
}

package "config.py" {
    class _properties<< (v,#FF7700) variable >>
    class _properties_api_template << (v,#FF7700) variable >>
    class _jwt_secret_key << (v,#FF7700) variable >>
    class _path_resources_api << (v,#FF7700) variable >>
    class _debug << (v,#FF7700) variable >>
    class _app_name << (v,#FF7700) variable >>
    class _jwt_refresh_token_expires << (v,#FF7700) variable >>
    class _jwt_access_token_expires << (v,#FF7700) variable >>
    class _propagate_exceptions << (v,#FF7700) variable >>
}

ResourceBuilder ---> _Params
ResourceBuilder ---> _ClassName
ResourceBuilder ---> _Properties
_path_resources_api <--- ResourceBuilder

_jwt_secret_key <---  ApiFactory
_PropertiesGroups <--  ApiFactory
_propagate_exceptions <---  ApiFactory
_jwt_access_token_expires <---  ApiFactory
_jwt_refresh_token_expires <---  ApiFactory
_app_name <---  ApiFactory
_debug <-----  ApiFactory
ApiFactory ---> ResourceBuilder
_properties_api_template <-- _properties

@enduml

