@startuml

package "enums.py" {
    enum _PriorityProperties
    enum _EnvVars
    enum _DfValues
}

package "interfaces.py" {
    interface LoadConfig
    interface Properties
}

package "__init__.py" {
    class LoadConfigImpl
    class PropertiesImpl
    class PropertiesClassLoader
}

package "exceptions.py" {
    class PropertiesNotFoundError << (E,#FF0000) Exception >>
}

LoadConfigImpl --> _EnvVars
LoadConfigImpl --> _DfValues
LoadConfigImpl -> LoadConfig
LoadConfigImpl --> _PriorityProperties
LoadConfigImpl -> PropertiesNotFoundError

PropertiesImpl -> LoadConfigImpl
PropertiesImpl --> Properties
PropertiesClassLoader --> PropertiesImpl


@enduml