{
    "Mobile role is only used for remote opening rights.": "モバイルロールは、リモートオープニング権限にのみ使用されます。",
    "Delete tag": "タグを削除",
    "To delete this user please clean the Pod and delete the user from the People page.": "このユーザーを削除するには、Podをクリーンアップし、Peopleページからユーザーを削除してください。",
    "Your site has no entries to show": "あなたのサイトには、表示するエントリーがありません",
    "members won't have access to their apartment or office anymore.": "メンバーは、もう自分のアパートやオフィスにアクセスすることはできません。",
    "Site | Hardware": "サイト｜ハードウェア",
    "Members won't have access to their apartment or office anymore.": "メンバーはもう自分のアパートやオフィスにアクセスすることはできません。",
    "You will receive a notification when people on the list interact with selected locks within the defined timeframe.": "リストに登録された人が、決められた時間内に選択したロックを操作すると、通知を受け取ることができます。",
    "Something went wrong while updating your current site.": "現在のサイトを更新する際に、何か問題が発生しました。",
    "Assign a pin": "ピンの割り当て",
    "Device ID": "デバイス ID",
    "Expired": "期限切れ",
    "Export events": "イベントをエクスポート",
    "Events | Entries": "イベント｜エントリー",
    "Edit access group information": "アクセスグループ情報の編集",
    "No user found with the email or tag number you entered.": "入力されたメールアドレスまたはタグ番号のユーザーが見つかりませんでした。",
    "Attach": "付ける",
    "Dates": "日付",
    "Operation not completed": "操作が完了していません",
    "Legal information": "法律に関する情報",
    "easy_office_mode_start_by_tag": "easy_office_mode_start_by_tag",
    "Pod": "ポッド",
    "Unknown battery (offline)": "不明な電池（オフライン）",
    "Near detection mode successfully changed": "近接検出モードが正常に変更されました",
    "Already part of this site": "すでにこのサイトの一部",
    "Battery status": "電池の状態",
    "Make sure to give a clear and distinguishable name to the lock.": "ロックは明確で区別しやすい名称を付けるようにしてください。",
    "Users who are not in an access group can't unlock any door.": "アクセスグループに所属していないユーザーは、どのドアも解錠できません。",
    "Entries list shows all entry activities of users.": "エントリーリストには、ユーザーのすべてのエントリーアクティビティが表示されます。",
    "Assign a new pin": "新しいピンの割当",
    "You can add more people to the notification.": "通知先を増やすことができます。",
    "Page not found": "ページが見つかりません",
    "Site name": "サイト名",
    "if a person has forgotten the PIN, that PIN can be reset per IQ.": "暗証番号を忘れた場合、その暗証番号はIQごとに再設定することができます。",
    "Reset PIN": "ピンをリセット",
    "Reset Pin": "ピンをリセット",
    "Reset pin": "ピンをリセット",
    "Press confirm after the LED on the lock blinks green and unlocks.": "ロックのLEDが緑色に点滅してロックが解除された後、確認ボタンを押す。",
    "Present a construction card to verify that the lock was properly detached.": "メンテナンスカードをかざして、ロックが適切に取り外されたことを確認する。",
    "Report sent": "レポート送信",
    "Notification deleted": "お知らせの削除",
    "Activating this voucher will instantly replace the current one. The remaining period on the current voucher will automatically be settled.": "このバウチャーをアクティブにすると、現在のバウチャーが即座に置き換えられます。 現在のバウチャーの残りの期間は自動的に合算されます。",
    "Turn on/off Office Mode on a lock by simply turning on the 'Office mode' switch of a lock on SALTO KS apps.": "SALTO KSのアプリでキーの「オフィスモード」有効をオンにするだけで、鍵のオフィスモードをオン・オフできます。",
    "Activation code of the new IQ cannot be empty": "新しいIQのアクティベーションコードを空にすることはできません",
    "Your subscription will expire soon": "サブスクリプションはまもなく期限切れになります",
    "Notification type. Site owner will be notified for all unauthorized digital key or tag actions of selected people on selected locks.": "通知タイプ。サイト所有者は、選択された人が選択されたロックで行ったすべての不正なデジタルキーまたはタグの操作について通知されます。",
    "Access": "アクセス",
    "During multiple timeframes": "複数の時間帯で",
    "Option 2 - Invite a new member": "オプション2 - 新しいメンバーを招待",
    "Communication type": "通信方式",
    "Floor name & Number": "フロア名と番号",
    "Choose always if you want to grant access from now until you revoke it manually.": "今後、手動で取り消すまでアクセスを許可する場合は、[常に]を選択します。",
    "User deleted": "ユーザーを削除",
    "Site user": "サイトユーザー",
    "successfully added to the group": "グループに正常に追加されました",
    "Remove": "取り除く",
    "Select locks": "ロックを選択",
    "Are you sure you want to delete this time frame?": "この時間枠を削除してもよろしいですか？",
    "Pods matching your search": "検索に一致するポッド",
    "edit tag": "タグの編集",
    "Cancel creating a new access group? ": "新しいアクセスグループの作成をキャンセルしますか？ ",
    "Pod member role is for the users who are just part of a Pod. The main difference between a pod member and a site user is that Pod members can invite 'Pod guests'.": "ポッドメンバーのロール役割は、ポッドの一部であるユーザー向けです。 ポッドメンバーとサイトユーザーの主な違いは、ポッドメンバーが「ポッドゲスト」を招待できることです。",
    "This repeater will be linked to ": "このリピーターはにリンクされます ",
    "This repeater is currently attached to ": "現在、このリピーターは接続されています ",
    "Open time": "オープンタイム",
    "Download the app from the app store": "アプリストアからアプリをダウンロードします",
    "IQ name": "IQ 名",
    "It looks like you are unsubscribed from this site, and you can't make any changes as an unsubscribed user. Please get in touch with a site admin or the site owner.": "このサイトから退会しているようです。退会したユーザーとして変更を加えることはできません。 サイト管理者またはサイト所有者に連絡してください。",
    "Enable MOM by presenting a tag and holding down the inside handle or by presenting a tag for more than 5 seconds on any type of BLUEnet lock.": "MOMを有効にするには、タグをかざして内側のハンドルを押し続けるか、BLUEnetロックの種類に関わらずタグを5秒以上かざす必要があります。",
    "Subscription for this site has ended": "このサイトのサブスクリプションは終了しました",
    "Lock deleted successfully": "ロックの削除に成功しました",
    "MAC address": "MAC アドレス",
    "Successfully removed the lock from the notification": "通知からロックを正常に削除しました",
    "No users found.": "ユーザーが見つかりません。",
    "or": "又は",
    "Please don't forget to inform the user regarding their new PIN.": "新しいPINについてユーザーに通知することを忘れないでください。",
    "Offline": "オフライン",
    "Only Site owner and Site admins can give this permission to other users": "サイト所有者とサイト管理者のみが他のユーザーにこの権限を与えることができます",
    "Settings": "設定",
    "The user has not completed the registration yet. Digital key and remote opening can not be used before the registration is completed. You can resend the registration invitation if it has expired. (Invitation expires in 3 days after being sent)": "ユーザーはまだ登録を完了していない。登録が完了するまでは、デジタルキーやリモートオープンを使用することはできません。登録招待状が期限切れになった場合は再送信することができます。(招待状の有効期限は、送信後3日間です。）",
    "Are you sure that you want to delete this tag?": "このタグを本当に削除してよろしいですか？",
    "No valid access has been defined for this user, so no subscription is required.": "このユーザーには有効なアクセスが定義されていないため、サブスクリプションは必要ありません。",
    "Search for a person": "人物を検索する",
    "access group": "アクセスグループ",
    "Access Group": "アクセスグループ",
    "Set a limit for the amount of guests that can be invited.": "招待できるゲスト数に制限を設ける。",
    "IQ(s) matching your search criteria": "検索条件に一致するIQ",
    "Successfully removed the user from the notification": "通知先からのユーザーの削除に成功しました",
    "No access": "アクセス不可",
    "Search lock": "ロックを検索",
    "15 seconds": "１５秒",
    "Repeater name": "リピーター名",
    "All people in this site are included in this access group": "このサイト内のすべての人が、このアクセスグループに含まれます",
    "Site admins can't invite guests.": "サイト管理者はゲストを招待できません。",
    "Done": "完了",
    "Subscription expired": "サブスクリプションが有効切れです",
    "Enter the email or tag number for the user you want to invite to your site who is already part of another site.": "すでに他のサイトに所属しているユーザーを自分のサイトに招待したい場合は、そのユーザーの電子メールまたはタグ番号を入力してください。",
    "day(s)": "日（日々）",
    "This user is the Site Owner. Therefore you can't change the role of this user nor delete their profile.": "このユーザーはサイト所有者です。 このユーザーの役割を変更したり、プロファイルを削除したりすることはできません。",
    "total persons": "総人数",
    "Opening doors from any distance and letting tenants in is now more convenient than ever. SALTO KS lets you open doors from anywhere, anytime. Whether it's a visitor who arrived earlier than you or a new employee without a Tag. You can unlock doors for your guests via remote opening functionality from anywhere around the world.": "離れた場所からでもドアを開け入れることが、これまで以上に便利になりました。SALTO KSなら、いつでも、どこからでも開錠できます。自分より早く到着した訪問者でも、タグのない新入社員でも。世界中のどこからでも、リモートオープン機能でゲストのためにドアを開けることができます。",
    "Pin copied to clipboard": "ピンをクリップボードにコピー",
    "My customer UID": "マイカスタマーUID",
    "Deleting an access group might affect the access of users who are involved in the group.": "アクセスグループを削除すると、そのグループに含まれるユーザーのアクセスに影響を与える可能性があります。",
    "Door left open alarm": "ドア閉め忘れアラーム",
    "SU": "SU",
    "If it takes longer for some items to be connected, reset the repeater(s) or present a maintenance card to the lock(s).": "一部のアイテムの接続に時間がかかる場合は、リピーターをリセットするか、メンテナンスカードをロックにかざしてください。",
    "Wallreader pin": "ウォールリーダーピン",
    "Details": "詳細",
    "persons max": "最大人数",
    "Add Access Group": "アクセスグループの追加",
    "You can add more locks to the notification.": "多くのロックを通知に追加できます。",
    "This user is the site owner.": "このユーザーはサイト所有者です。",
    "Registered tag(s)": "登録されたタグ",
    "MO": "MO",
    "Access group name*": "アクセスグループ名*",
    "You are the owner of this Site. You can tranfer ownership if one of your users is an Administrator.": "あなたはこのサイトの所有者です。 ユーザーの1人が管理者である場合は、所有権を譲渡できます。",
    "Notifications will be sent only to Site owner.": "通知はサイト所有者にのみ送信されます。",
    "These incidents can be filtered and exported to a .csv file.": "これらのインシデントは、フィルタリングして.csvファイルにエクスポートできます。",
    "not in the group": "グループではありません",
    "Create a new pod": "新しいポッドを作成する",
    "Present maintenance card": "メンテナンスカードをかざす",
    "Pending registration": "登録待ち",
    "Here you can see all of your actions.": "ここでは、すべてのアクションを確認できます。",
    "access groups matching your search": "検索に一致するアクセスグループ",
    "Notification by. Site owner will be notified by mobile app push notification.": "通知による。サイト所有者は、モバイルアプリのプッシュ通報によって通知されます。",
    "Press reset on the back of the repeater until the LED blinks red-green-blue.": "LEDが赤、緑、青に点滅するまで、リピーターの背面にあるリセットを押します。",
    "Start": "スタート",
    "Are you sure to unassign the floor number?": "フロア番号の割り当てを解除してもよろしいですか？",
    "stop": "ストップ",
    "You can define the timeframe for notifications to be triggered.": "通知を発生させる時間帯を定義することができます。",
    "Master Key": "マスターキー",
    "enabled": "有効",
    "All locks in this site are included in this Pod": "このサイトのすべてのロックはこのポッドに含まれています",
    "Enabled": "有効",
    "Site owner blocked successfully": "サイト所有者は正常にブロックされました",
    "It is possible to set the lock to easy office mode if a door is supposed to offer free entry during certain time frames.": "ドアが特定の時間枠内に自由に入室できるようになっている場合、ロックをイージーオフィスモードに設定することができます。",
    "TU": "TU",
    "OFFLINE ACCESS": "オフライン　アクセス",
    "This user is part of": "このユーザーは一部の",
    "Invite guest": "ゲストを招待する",
    "App": "App",
    "Add timeframe": "時間枠の追加",
    "No": "いいえ",
    "Incidents": "インシデント",
    "NO": "いいえ",
    "Site admin is the highest role.": "サイト管理者は最上位のロールです。",
    "You are now being redirected to the login page.": "ログインページにリダイレクトされます。",
    "Cancel inviting a user?": "招待ユーザをキャンセルしますか？",
    "All": "すべて",
    "Audit trail": "監査証跡",
    "Edit lock": "ロックを編集する",
    "Go to keys": "キーへ移動",
    "You can choose users who are already part of this site to become a Pod member. Their current roles or access rights won't be affected.": "すでにこのサイトに参加しているユーザーを選択して、ポッドメンバーにすることができます。現在の役割やアクセス権の影響はありません。",
    "Rights & permissions": "権利と許可",
    "Hi": "高い",
    "Low battery": "バッテリー残量が少ない",
    "export to csv.": "csvにエクスポート。",
    "unlimited": "無制限",
    "Nothing assigned": "割当てなし",
    "This lock is part of": "このロックは一部の",
    "Unlimited": "無制限",
    "add": "追加",
    "Activate voucher": "バウチャーを有効化",
    "Activate Voucher": "バウチャーを有効化",
    "Add": "追加",
    "Override a lock in privacy mode with a tag or digital key.": "プライバシーモードのロックをタグまたはデジタルキーでオーバーライド（解除）します。",
    "The repeater name cannot be empty": "リピーター名を空にすることはできません",
    "Italian": "イタリアン",
    "Grant installer access": "インストーラーのアクセスを許可する",
    "Select locks that should be in your preferred floor.": "優先フロアに配置する必要があるロックを選択します。",
    "Check in - Check out": "チェックイン - チェックアウト",
    "during any time": "いつでも",
    "Timeframe added": "時間枠が追加されました",
    "Your site needs to be set up": "サイトを設定する必要があります",
    "Please select a lock to present tags to": "タグをかざすロックを選択してください",
    "Save changes": "変更内容を保存",
    "N/A": "該当なし",
    "A site with that name already exists": "その名前のサイトはすでに存在します",
    "Confirm": "確認",
    "Timeframe": "時間枠",
    "Do you need to manage the keys of the user like Tags, Digital Keys, Pin?": "タグ、デジタルキー、ピンなどのユーザーのキーを管理する必要がありますか？",
    "Mandatory with digital key, remote opening and remote office mode": "デジタルキー、リモートオープニング、リモートオフィスモードで必須",
    "Are you sure to delete this user?": "このユーザーを削除してもよろしいですか？",
    "Are you sure to delete the access group": "アクセスグループを削除してもよろしいですか",
    "User name & Tag": "ユーザー名とタグ",
    "No IQs found.": "IQが見つかりません。",
    "Maximum": "最大",
    "No results for": "結果が見つかりません",
    "When you unassign a floor number, elevator integration won't work with the locks attached to the this floor.": "フロア番号の割り当てを解除すると、エレベータの統合はこのフロアに取り付けられたロックでは機能しません。",
    "Event type": "イベント　タイプ",
    "Delete notification": "通知の削除",
    "Delete user": "ユーザーの削除",
    "Initialization": "初期化",
    "The alias is invalid": "エイリアスが無効です",
    "Floor updated successfully": "フロアは正常に更新されました",
    "Notification name": "通知名",
    "Generate a Code for": "コードの生成",
    "Escutcheon pin": "エスカション　ピン",
    "Lock name": "ロック名",
    "Invalid character": "無効な文字",
    "Timeframe saved successfully": "時間枠は正常に保存されました",
    "You are unsubscribed": "サブスクリプションを解約しました",
    "The Pod will be deleted": "ポッドは削除されます",
    "Step 2 / 3": "ステップ 2/3",
    "easy_office_mode_end_remote": "イージーオフィスモード　リモート終了",
    "unassigned successfully": "割り当て解除 成功",
    "Access schedules": "アクセス スケジュール",
    "No pod guest found": "Podゲストが見つかりません",
    "No roles found": "役割が見つかりません",
    "Locks not in the pod": "POD内に鍵がありません",
    "Search by IQ name or mac": "IQ名称またはMACにて検索",
    "Existing user": "既存ユーザ",
    "As the Site Owner of": "サイトオーナーとして",
    "Step 1/2": "Step 1/2",
    "Notification has been deleted": "通知が削除されました。",
    "Lock detached successfully": "ロックの割り当てが解除されました。",
    "month": "月",
    "Therefore, you can grant access to your guest from now until you revoke it manually.": "その結果、あなたは手動で取り消すまではゲストにアクセス権を付与できます。",
    "Enable the lock's Easy Office Mode schedule with a tag, Digital Key or Remote Opening.": "イージーオフィスモードをTag、デジタルキー、もしくはリモートオープンで有効にします。",
    "iq_connection_restored": "IQの接続回復",
    "Lock is required": "ロックが要求されます。",
    "Search IQ": "IQを探す",
    "Do you need to manage the keys of the user like Tags, Digital Keys, PIN?": "ユーザーキーをTag、デジタルキー、PINコードのように扱いたいですか？",
    "Are you sure you want to delete this timeframe?": "このタイムフレームを削除してもいいですか？",
    "Select the user(s)": "ユーザーを選択",
    "Mandatory with Digital Key, remote opening and remote office mode": "デジタルキー、リモートオープン、及びリモートオフィスモードに必須",
    "lock_connection_restored": "ロックコネクション回復"
}
