{
    " (IQ) from your phone ": " (IQ) 从您的手机 ",
    " (IQ).": " ..(IQ).",
    " (repeater).": " ..(中继器)。",
    " Reset PIN ": " 重置 PIN 码 ",
    " or ": " 或者 ",
    "(IQ)": "(IQ)",
    "(IQ) from your phone": "(IQ) 从您的手机",
    "(IQ) from your phone to open": "(IQ) 从您的手机开启",
    "(default)": "（默认）",
    "+ Add new timeframe": "+ 添加新时间表",
    "+ Add time frame": "+ 添加时间段",
    "+ Lock": "+ 门锁",
    "+ REPEATER": "+ 中继器",
    "+ Repeater": "+ 中继器",
    "+ Set notification": "+ 设置通知",
    "- Edit": "- 编辑",
    "- Replace": "- 替换",
    "- present maintenance card to all connected locks": "- 对所有连接的门锁刷维修卡",
    "- press reset on all connected repeaters": "- 按所有已连接的中继器的重置按钮",
    "1 second": "1 秒",
    "10 seconds": "10 秒",
    "120 seconds (2 minutes)": "120 秒（2 分钟）",
    "15 seconds": "15 秒",
    "2 seconds": "2 秒",
    "20 seconds": "20 秒",
    "24 hours": "24 小时",
    "240 seconds (4 minutes)": "240 秒（4 分钟）",
    "24H": "24小时",
    "3 seconds": "3 秒",
    "30 seconds": "30 秒",
    "4 seconds": "4 秒",
    "5 seconds": "5 秒",
    "6 seconds": "6 秒",
    "60 seconds (1 minute)": "60 秒（1 分钟）",
    "7 seconds (default)": "7 秒（默认值）",
    "A detached lock can be attached to a different IQ/Repeater. After detaching this item will be shown under \\'detached hardware\\'.": "已分离的门锁可被附加至另一个 IQ/中继器。此设备分离后将会在\\'已分离的硬件\\'下显示。",
    "A detached lock can be attached to a different IQ/Repeater. After detaching this item, it will be shown under 'detached hardware'.": "一个已分离的门锁可附加于另一个 IQ 或中继器。分离后此项目将会在 “已分离硬件” 下显示。",
    "A detached repeater can be attached to a different IQ/Repeater. After detaching this item will be shown under 'detached hardware'.": "一个已分离的中继器可附加于另一个 IQ 或中继器。分离后此项目将会在 “已分离硬件” 下显示。",
    "A detached repeater can be attached to a different IQ/Repeater. After detaching this item will be shown under \\'detached hardware\\'.": "已分离的中继器可被附加至另一个 IQ/中继器。此设备分离后将会在\\'已分离的硬件\\'下显示。",
    "A new version is available": "有新版本可更新",
    "A problem occurred while loading SALTO KS": "在装载 SALTO KS 时发生了问题",
    "A problem ocurred during the export. Please try again later.": "在导出时发生错误，请稍后重试。",
    "A profile with this email already exists.": "一个含有此电子邮箱的个人资料已存在。",
    "ADD SITE": "添加站点",
    "About blocking a site owner": "关于屏蔽一个站点业主",
    "Access": "访问",
    "Access Group": "访问组",
    "Access Group Name": "访问组名称",
    "Access Groups": "访问组",
    "Access Status": "访问状态",
    "Access code": "访问代码",
    "Access group created": "访问组已生成",
    "Access group deleted": "访问组已删除",
    "Access group name": "访问组名称",
    "Access group name*": "访问组名称*",
    "Access group overview": "访问组总览",
    "Access groups": "访问组",
    "Access groups are for defining who can access where and when. Basically, every  user should be in an access group to unlock. Same thing goes for the locks - locks should be in an access group for users to unlock them.": "访问组用于定义何人在何时能访问何处。基本上每一个用户应该属于一个访问组去开启门锁。同理门锁也应该属于一个访问组由用户来开启。",
    "Access groups are for defining who can access where and when. Basically, every user should be in an access group to unlock. Same thing goes for the locks - locks should be in an access group for users to unlock them.": "访问组是用于定义谁可在何时访问何处。基本上每个用户应该属于一个访问组。同理应用于门锁，门锁应该属于一个访问组以使用户可以开启。",
    "Access groups are used to set rules regarding who can access which locks and when. Give a unique name to the access group": "访问组被用于设置规则，何人何时可访问哪些门锁。请给访问组设置一个唯一的名称",
    "Access groups successfully added": "访问组已成功添加",
    "Access overview": "访问总览",
    "Access status": "访问状态",
    "Access tokens": "Access tokens",
    "Account": "账户",
    "Account | Company": "账户|公司",
    "Account | Rights": "账户 | 权利",
    "Account | Site": "账户|站点",
    "Account | Subscriptions": "账户|订阅",
    "Account | Tags": "账户|钥匙扣",
    "Action": "任务",
    "Actions": "任务",
    "Activate": "激活",
    "Activate Voucher": "激活订购券",
    "Activate voucher": "激活订购券",
    "Activating this voucher will instantly replace the current one. The remaining period on the current voucher will automatically be settled.": "此订购券激活后将立即替代当前的订购券。当前订购券的剩余有效期会自动叠加。",
    "Activation code": "激活码",
    "Activation code of the new IQ cannot be empty": "新 IQ 的激活码不能空白",
    "Active": "活动的",
    "Active user": "激活用户",
    "Add": "添加",
    "Add / Remove Locks": "添加/删除门锁",
    "Add / Remove people": "添加/删除人员",
    "Add Access Group": "添加访问组",
    "Add IQ": "添加 IQ",
    "Add Pod": "添加 Pod",
    "Add Tags": "添加钥匙扣",
    "Add a lock": "添加门锁",
    "Add a repeater": "添加一个中继器",
    "Add access group": "添加访问组",
    "Add an IQ": "添加一个 IQ",
    "Add another pod member": "添加其他 POD 成员",
    "Add members later": "稍后添加成员",
    "Add new members": "添加新成员",
    "Add new time frame": "添加新时间段",
    "Add new timeframe": "添加新的时间段",
    "Add people": "添加人员",
    "Add pod member": "添加 pod 成员",
    "Add site": "添加站点",
    "Add tags": "添加钥匙扣",
    "Add time frame": "添加时间段",
    "Add timeframe": "添加时间段",
    "Add user": "添加用户",
    "Add/remove locks.": "添加/移除 门锁。",
    "Add/remove people.": "添加/移除 人员。",
    "Adding an IQ will allow you to connect repeaters and locks.": "添加一个 IQ 后您可以连接中继器和门锁。",
    "Administrator": "管理员",
    "After that press Done.": "此后请按完成。",
    "Alias (optional)": "别名（可选项）",
    "All": "所有",
    "All days": "所有日",
    "All guests of this Pod": "此 Pod 中的所有客人",
    "All locks in this site are included in this Pod": "此站点里的所有门锁包含在此 Pod 中",
    "All locks in this site are included in this access group": "此站点的所有门锁属于此访问组",
    "All members of this Pod": "此 Pod 中的所有成员",
    "All people in this site are included in this access group": "此站点里的所有人属于这个访问组",
    "All the guests of this Pod": "此 Pod 中的所有客人",
    "All the members of this Pod": "此 Pod 中的所有成员",
    "Already part of this site": "已成为此站点的一部分",
    "Always": "总是",
    "An email will be sent to Pod members. They can register and download the SALTO KS app following the link in the email.": "一封电子邮件将会发送至 Pod 成员。他们可以通过邮件中的链接注册和下载 SALTO KS app 。",
    "Any unauthorized tag or mobile action performed on the selected locks(s).": "任何未授权的钥匙扣或手机对所选门锁执行的任务。",
    "App": "App",
    "App user": "App 用户",
    "Are you sure to delete": "确认需要删除",
    "Are you sure to delete the access group": "您确认要删除此访问组吗",
    "Are you sure to delete this user?": "您确实要删除此用户吗？",
    "Are you sure to remove this user from": "您确认要移除此用户从",
    "Are you sure to transfer ownership to another user?": "您确认要将业主关系转交至其他用户吗？",
    "Are you sure you want to delete this time frame?": "请您确认需要删除此时间段？",
    "Are you sure you want to delete:": "请您确认要删除：",
    "As being part of the BETA period, you will keep using your existing Pod structure for free but there will be several limitations regarding expanding it. Details regarding limitations will be communicated in a timely manner before the BETA period ends.": "作为 BETA 测试期的一部分，您将可以继续免费使用现有 Pod 结构，但是其扩展将会受到一些限制。有关限制的细节将会在临近 BETA 测试期结束前与您及时沟通。",
    "Assign Tags": "分配钥匙扣",
    "Assign a new pin": "分配一个新 PIN 码",
    "Assign a pin": "分配一个 PIN 码",
    "Assign tags": "分配钥匙扣",
    "At least one member should provide the email": "至少一位成员要提供电子邮箱",
    "At least one member should provide the email and only members with email can use mobile phone to unlock and invite visitors.": "至少一位成员要提供电子邮箱，只有含电子邮箱的成员才能使用手机开锁和邀请访客。",
    "Attach": "附加",
    "Attach this lock to an IQ or Repeater. To get an overview of repeaters, first select the IQ the repeater is attached to.": "附加此门锁至一个 IQ 或中继器。要了解中继器的概况，请先选择此中继器附加至的 IQ。",
    "Attach this repeater to an IQ or another Repeater. To get an overview of repeaters, first select the IQ the repeater is attached to.": "附加此中继器至一个 IQ 或者其他中继器。要获取中继器的概况，请先选择此中继器附加至的 IQ。",
    "Attached to": "附加于",
    "Audit trail": "记录追踪",
    "Audit trail successfully changed": "记录事件已成功变更",
    "Australia": "澳大利亚",
    "Austria": "奥地利",
    "BLOCKED": "已屏蔽的",
    "Back": "后退",
    "Back to access groups": "返回至访问组",
    "Back to all users": "返回至所有用户",
    "Back to locks": "返回至门锁",
    "Back to pods": "返回至 pods",
    "Basic user": "基本用户",
    "Battery": "电池",
    "Battery is low. Please change the batteries.": "电池低电，请更换电池。",
    "Battery is ok and fresh.": "电池状态正常电量足。",
    "Battery is really low. Please change the batteries as soon as possible.": "电量已经非常低了，请尽快更换电池。",
    "Battery status": "电池状态",
    "Belgium": "比利时",
    "Belize": "伯利兹",
    "Beta": "Beta 测试",
    "Block": "屏蔽",
    "Block a site owner": "屏蔽一个站点业主",
    "Blocked": "已屏蔽",
    "Can enable/disable the lock's EOM schedule with a tag.": "可使用钥匙扣启用/禁用门锁的简易办公室模式。",
    "Can enable/disable the lock\\'s EOM schedule with a tag.": "使用钥匙扣启用/禁用门锁的 EOM 简易办公室模式时间表。",
    "Can override a lock in privacy mode with a tag.": "使用钥匙扣是否可开启已进入反锁模式的门锁",
    "Canada": "加拿大",
    "Cancel": "取消",
    "Cancel adding new members?": "取消添加新成员？",
    "Cancel adding tags? ": "需要取消添加钥匙扣吗？ ",
    "Cancel adding the lock?": "要取消添加门锁？",
    "Cancel adding the repeater?": "要取消添加此中继器吗？",
    "Cancel creating a new Pod?": "要取消生成一个新的 Pod 吗？",
    "Cancel creating a new access group? ": "要取消生成一个新访问组吗？ ",
    "Cancel creating a user?": "取消生成一个用户？",
    "Cancel detaching the lock? ": "要取消分离门锁？ ",
    "Cancel inviting a user?": "取消邀请一个用户？",
    "Cancel setting a notification?": "要取消设置一个通知吗？",
    "Cancel updating notification?": "需要取消更新通知吗？",
    "Cannot be empty": "不能空白",
    "Change or unassign a tag": "变更或解除一个钥匙扣的分配",
    "Changes saved": "变更已保存",
    "Check in": "登记",
    "Check in - Check out": "登记 - 结账",
    "Check out": "结账",
    "Check your input or": "检查您的输入或者",
    "Chinese": "中文",
    "Choose a lock": "选择一把门锁",
    "Choose always if you want to grant access from now until you revoke it manually.": "如果您要从现在开始给予访问权限直至您手动取消，请选择总是。",
    "Choose duration": "选择持续时间",
    "Choose how you want to be notified": "请选择希望以哪种方式通知您",
    "Choose one notification type": "选择一个通知类型",
    "Choose period": "选择周期",
    "Clean": "清理",
    "Clean this Pod": "清理此 Pod",
    "Cleaning is ideal when a contract ends": "合同结束后使用清理较理想",
    "Cleaning is ideal when a contract ends.": "当合同结束后使用清理比较理想。",
    "Cleaning the Pod won\\'t delete the Pod.": "清理此 Pod 将不会删除此 Pod。",
    "Cleaning this Pod won't delete the Pod": "清理 Pod 将不会删除此 Pod",
    "Cleaning this Pod won\\'t delete the Pod": "清理此 Pod 将不会删除它",
    "Clear": "清理",
    "Clear all": "全部清理",
    "Click to go to the Pod.": "点击转至 Pod。",
    "Close": "关闭",
    "Closed": "关闭",
    "Code": "代码",
    "Communication type": "通讯类型",
    "Company ID": "公司 ID",
    "Complete all mandatory items.": "完成所有必须项。",
    "Confirm": "确认",
    "Connection": "连接",
    "Connectivity": "连接性",
    "Contact Your Business Unit": "请联系您当地的分公司",
    "Contact your installer and let them take care of it for you.": "联系您的安装商，请他们为您处理。",
    "Country": "国家",
    "Create": "生成",
    "Create User": "生成用户",
    "Create a new pin": "生成一个新 pin 码",
    "Create a new pod": "生成一个新 Pod",
    "Create a user": "生成一个用户",
    "Create custom schedules that you can manage access daily and hourly.": "生成自定义时间表您可按日和小时来管理门禁权限。",
    "Current user": "当前用户",
    "Currently You don't have any hardware. Please start with setting up your site by adding an IQ.": "当前您未添加任何硬件。请从添加一个 IQ 开始设置您的站点。",
    "Currently You don\\'t have any hardware. Please start with setting up your site by adding an IQ.": "目前您没有任何硬件。请从添加一个 IQ 开始建立您的站点。",
    "Currently you don’t have any hardware. Please start with setting up your site by adding an IQ.": "目前您没有任何硬件。请从添加IQ开始建立您的站点。",
    "Custom": "自定义",
    "Custom schedule": "自定义时间表",
    "Cylinder": "电子锁芯",
    "Czech": "捷克语",
    "Danish": "丹麦语",
    "Dashboard": "仪表盘",
    "Date": "日期",
    "Date / period": "日期 / 时期",
    "Date added": "添加日期",
    "Date and time": "日期和时间",
    "Date or period": "日期或时期",
    "Dates": "日期",
    "Day is not within the Start and End date": "日子不在启用和结束日期内",
    "Days": "天",
    "Define a Time frame": "定义一个时间段",
    "Define a time frame": "定义一个时间段",
    "Define a timeframe": "定义一个时间表",
    "Define the timeframe for notifications to be triggered.": "定义需要发送通知的时间段。",
    "Define when the selected people can access to the selected locks": "定义所选人员在何时可访问所选门锁",
    "Delete": "删除",
    "Delete MobileKey": "删除手机钥匙",
    "Delete Pod guest": "删除 Pod 客人",
    "Delete Pod member": "删除 Pod 成员",
    "Delete acces group": "删除访问组",
    "Delete access group": "删除访问组",
    "Delete notification": "删除通知",
    "Delete tag": "删除钥匙扣",
    "Delete this Pod": "删除此 Pod",
    "Delete time frame": "删除时间段",
    "Delete timeframe": "删除时间段",
    "Delete user": "删除用户",
    "Deleting an access group might affect the access of users who are involved in the group.": "删除一个访问组或许会影响此组中的用户的访问。",
    "Deleting this access group can not be undone.": "删除此访问组将无法撤销。",
    "Deleting this access group cannot be undone.": "删除此访问组将无法撤销。",
    "Deleting this lock will completely remove it form the system. This step cannot be undone.": "删除此门锁会将其从系统中彻底移除。此步骤无法撤销。",
    "Deleting this lock will completely remove it from the Site. This step cannot be undone.": "删除此门锁将会将其从此站点完全移除，此步骤将无法撤销。",
    "Deleting this lock will completely remove it from the system. This step cannot be undone.": "删除此门锁会彻底从系统中将它移除，并且不能被撤销。",
    "Deleting this notification cannot be undone.": "删除此通知将无法撤销。",
    "Deleting this repeater will completely remove it form the system. This step cannot be undone.": "删除此中继器会将其从系统中彻底移除。此步骤无法撤销。",
    "Deleting this repeater will completely remove it from the Site. This step cannot be undone.": "删除此中继器将会从此站点里将其完全移除。此步骤将无法撤销。",
    "Deleting this repeater will completely remove it from the system. This step cannot be undone.": "删除此中继器会从系统中彻底将它移除，此步骤将无法撤销。",
    "Deleting this time frame cannot be undone.": "删除此时间段不能被撤销。",
    "Deleting this timeframe cannot be undone.": "删除此时间段将无法撤回",
    "Deleting this user cannot be undone.": "删除此用户将无法撤销。",
    "Denmark": "丹麦",
    "Deny access": "不可访问",
    "Deny installer access": "不允许安装商访问",
    "Depending on the amount of events, this might take a while.": "根据事件的数量，这可能要花费一段时间。",
    "Description": "说明",
    "Detach": "分离",
    "Detach ": "分离.. ",
    "Detach lock": "分离门锁",
    "Detached locks": "已分离的门锁",
    "Detached repeaters": "已分离的中继器",
    "Details": "详情",
    "Device ID": "设备 ID",
    "Device ID is for BLUEnet hardware and it consists of 14 characters.": "设备 ID 用于 BLUEnet 硬件，由 14 个字符组成。",
    "Disable": "禁用",
    "Disabled": "禁用",
    "Disabled (default)": "禁用（默认）",
    "Display all event types": "显示所有事件类型",
    "Display all events": "显示所有事件",
    "Do you need to change remote opening and lock mode privileges?": "您需要变更远程开启和门锁模式的权限吗？",
    "Do you need to manage the keys of the user like Tags, Mobile Keys, Pin?": "您要管理用户的钥匙，例如：钥匙扣，手机钥匙，PIN 码？",
    "Do you really want to exit the access group creation? If you confirm this action, all data will be lost.": "您是需要退出生成门禁组吗？如果您确认此操作，所有数据将丢失。",
    "Do you really want to exit the notification creation? If you confirm this action, all data will be lost.": "您确认需要退出生成通知吗？如您确认，则所有数据将丢失。",
    "Done": "完成",
    "Door": "门",
    "Door activity notification": "门活动通知",
    "Door left open": "门未关",
    "Door left open alarm": "门未关报警",
    "DoorLeftOpenAlarm": "门未关报警",
    "Doors": "门",
    "Download": "下载",
    "Download excel": "下载excel",
    "Download the app from google play": "从谷歌商店下载此 App",
    "Download the app from the app store": "从苹果商店下载此 App",
    "Due to the global and unforeseen circumstances of the Covid-19 lockdown, we understand some of our customers might need some more time to test the Pod feature without having to worry about the expiration date. Therefore we have decided to extend the Pod BETA phase until late 2021 to enable you to fully experience the benefits of the Pod functionality which helps you to keep an overview of your buildings’ operations and facilitates you to outsource access control management to your tenants.": "由于全球未可预知的 Covid-19 封锁事态，我们认为客户或许需要更多的时间来测试 Pod 功能，而不用担心此功能的过期。因此，我们决定将 Pod BETA 测试延长至 2021年后期，使您可以完全体验 Pod 功能的益处，帮助您可以总览大厦的运营和对外分包对于租户的门禁控制管理。",
    "During multiple timeframes": "在多个时间段期间",
    "Dutch": "荷兰语",
    "E-mail": "电子邮箱",
    "E-mail address": "电子邮箱",
    "E-mail or tag": "电子邮件或钥匙扣",
    "EDIT": "编辑",
    "Easy Office Mode": "简易办公室模式",
    "Easy office Mode": "简易办公室模式",
    "Easy office mode": "简易办公室模式",
    "Easy office mode successfully changed": "简易办公室模式已成功变更",
    "EasyofficemodeFinishFailed": "结束简易办公室模式失败",
    "Edit": "编辑",
    "Edit IQ": "编辑 IQ",
    "Edit Pod information": "编辑 Pod 信息",
    "Edit Profile information": "编辑资料信息",
    "Edit access group": "编辑访问组",
    "Edit access group information": "编辑访问组信息",
    "Edit group info": "编辑组信息",
    "Edit lock": "编辑门锁",
    "Edit lock info": "编辑门锁信息",
    "Edit notification": "编辑通知",
    "Edit or Delete": "编辑或删除",
    "Edit pod info": "编辑 Pod 信息",
    "Edit profile": "编辑资料",
    "Edit profile info": "编辑资料信息",
    "Edit profile information": "编辑资料信息",
    "Edit profile picture": "编辑资料照片",
    "Edit profile settings": "编辑资料设置",
    "Edit site": "编辑站点",
    "Edit time frame": "编辑此时间段",
    "Edit time frame.": "编辑时间段。",
    "Edit timeframe": "编辑时间段",
    "Edit user": "编辑用户",
    "Email": "电子邮件",
    "Email address": "电子邮箱",
    "Email can't be changed after the registration is completed.": "在注册完成后电子邮箱将不能更改。",
    "Email is mandatory": "电子邮箱是必填项",
    "Email is mandatory with Mobile key, Remote opening and Override Privacy Mode": "若需手机钥匙，远程开锁和解开反锁等功能，电子邮箱是必填项",
    "Email notification": "邮件通知",
    "Email or tag belongs to": "电子邮箱或钥匙扣属于",
    "Empty": "空的",
    "Empty battery": "电量耗尽",
    "Enable": "启用",
    "Enable MOM by presenting a tag and holding down the inside handle or by presenting a tag for more than 5 seconds on any type of BLUEnet lock.": "启动 MOM 手动办公室模式，请按压门锁内侧把手，同时刷钥匙扣。若是 BLUEnet 门锁，则将钥匙扣置于门锁读卡器前大约 5 秒钟时间。",
    "Enable easy office mode": "启用简易办公室模式",
    "Enable near detection mode": "启用近距离检测模式",
    "Enabled": "启用",
    "Enabled (default)": "已启用（默认）",
    "End": "结束",
    "End date": "结束日期",
    "EndEasyOfficeMode": "结束简易办公室模式",
    "EndEasyOfficeModeByTag": "使用钥匙扣结束简易办公室模式",
    "EndEasyOfficeModeRemote": "结束简易办公室模式远程",
    "EndOfDoorLeftOpenAlarm": "结束门未关报警",
    "EndOfIntrusionAlarm": "结束入侵报警",
    "EndOfTamperAlarm": "结束防拆报警",
    "EndedOfficeModeByTag": "使用钥匙扣结束办公室模式",
    "EndedOfficeModeRemote": "结束办公室模式远程",
    "English": "英语",
    "Enter Claycode": "输入Claycode",
    "Enter Code": "输入代码",
    "Enter Code ": "输入代码 ",
    "Enter a name": "输入名称",
    "Enter code": "输入代码",
    "Enter the email or tag number for the user you want to invite to your site who is already part of another site.": "请您为希望邀请的已是其他站点的用户输入电子邮箱或钥匙扣号码。",
    "Enter the voucher code you received from your installer to validate it.": "请输入安装商提供的订购券代码并激活。",
    "Entries": "进入事件",
    "Entries list shows all entry activities of users.": "进入事件列表显示用户的所有进入活动。",
    "Entry Lock": "进入门锁",
    "Entry Notifications": "进入事件通知",
    "Entry event (authorized actions)": "进入事件（授权的任务）",
    "Error": "错误",
    "Escutcheon": "电子门锁",
    "Escutcheon pin": "电子门锁 pin 码",
    "Event": "事件",
    "Event details": "事件详情",
    "Event type": "事件类型",
    "Events": "事件",
    "Events will be exported with the filters and search terms that you applied.": "事件将会按照您应用的筛选和搜索条件导出。",
    "Events | Entries": "事件 | 进入",
    "Events | Incidents": "事件|意外事件",
    "Events | Time & Attendance": "事件 | 考勤",
    "Every subscribed user takes up a place in your subscription.": "每位已订购的用户在您的订购中占据一个位置。",
    "Exit Lock": "外出门锁",
    "Expiration Date": "失效日期",
    "Expired": "已失效",
    "Expired today": "今天已失效",
    "Expires in": "过期在",
    "Export": "导出",
    "Export Excel": "导出至Excel",
    "Export events": "导出事件",
    "FR": "五",
    "Filtered": "已筛选",
    "Filters and Search": "筛选和搜索",
    "Finnish": "芬兰语",
    "First name": "名字",
    "First name is mandatory": "名字是必填项",
    "For ClayIQ": "对于ClayIQ",
    "Free entry": "自由通行",
    "French": "法语",
    "Fresh": "新鲜",
    "Fresh battery": "新鲜电池",
    "Friday": "周五",
    "From": "从",
    "From the left column you can select locks that you want to remove from the Pod.": "您可在左侧栏里选择需要从 Pod 中移除的门锁。",
    "From the left column you can select locks that you want to remove from the access group": "在左侧栏选择您要从此访问组中删除的门锁",
    "From the left column you can select locks that you want to remove from the access group.": "您可在左侧栏里选择要从此访问组中移除的门锁。",
    "From the left column you can select users that you want to remove from the access group": "在左侧栏里您可选择要从此访问组中移除的用户",
    "From the right column you can select locks that you want to add to this Pod.": "您可从右侧栏里选择需要添加至此 Pod 的门锁。",
    "From the right column you can select locks that you want to add to this group": "在右侧栏您可以选择要添加至此组的门锁",
    "From the right column you can select locks that you want to add to this group.": "您可在右侧栏里选择要添加至此组中的门锁。",
    "From the right column you can select users that you want to add to this group": "在左侧栏里您可以选择要添加至此组的用户",
    "Generate a Code for": "生成一个代码为",
    "Generate a Code for ": "生成代码为 ",
    "Generating the pin": "正在生成 PIN 码",
    "German": "德语",
    "Germany": "德国",
    "Give a name to the Pod. Make sure that name is unique.": "请给此 Pod 设置一个名称，确保名称的唯一性。",
    "Give a name to the Pod. Make sure that name is unique. (e.g. No:120)": "设置 Pod 名称。请确保名称的唯一性（例如：No:120）",
    "Go to Lock options": "转至门锁选项",
    "Go to Pod": "转至 Pod",
    "Go to clean Pod": "转至清理 Pod",
    "Go to keys": "转至钥匙",
    "Go to login": "转至登录",
    "Good": "正常",
    "Good battery": "电量充足",
    "Grant Access": "获准访问",
    "Grant access": "获准访问",
    "Grant installer access": "授权安装商访问",
    "Grant your installer access to your account. You are still able to use your account while your installer has access.": "准许安装商访问您的账户。当安装商访问时您仍然可以使用您的账户。",
    "Granted": "已获准",
    "Granted Access": "获准的访问",
    "Green heartbeat": "绿色心跳",
    "Green heartbeat is a short green blink every 5 minutes to indicate that the IQ is online and working okay.": "绿色心跳是每 5 分钟一次的短暂绿色闪烁灯，以指示此 IQ 在线并工作正常。",
    "Grid View": "网格视图",
    "Grid view": "网格视图",
    "Guest limit": "客人限制",
    "Guests": "客人",
    "Hardware": "硬件",
    "Having an 'Always' time frame selected overrules all other time frames. To be more specific in timeframes, remove 'Always'.": "如果选择 “总是” 将会覆盖其他任何时间段。要设置特定的时间段，请移除 “总是”。",
    "Having an \\'Always\\' time frame selected overrules all other time frames. To be more specific in time frames, remove \\'Always\\'.": "选择“总是”将会废除其他任何的时间段规则。要设置特定的时间段，请移除“总是”。",
    "Having an \\'Always\\' time frame selected overrules all other time frames. To be more specific in timeframes, remove \\'Always\\'.": "选择“总是”将会废除其他所有的时间段规则，若要设置特定的时间段，请移除“总是”。",
    "Here you can see all the actions of": "此处您可查看所有任务",
    "Here you can see where and when Pod members and guest can access.": "您可在此查看 Pod 成员和客人在何时可访问何处。",
    "Hi": "Hi",
    "How to notify": "如何通知",
    "How to purchase the Pod functionality?": "如何订购 Pod 功能？",
    "IQ": "IQ",
    "IQ added successfully": "IQ 已成功添加",
    "IQ has been reset": "IQ 已被重置",
    "IQ name": "IQ 名称",
    "IQ successfully restored": "IQ 已成功恢复",
    "IQs": "IQs",
    "If": "如果",
    "If it takes longer for some items to be connected, reset the repeater(s) or present a maintenance card to the lock(s).": "如果一些设备需要花费较长时间才能连接，请重置中继器或者对门锁出示维修卡。",
    "If the lock can't connect with the IQ, it will check if a key had access to the lock in the selected amount of days.": "如果门锁无法与 IQ 连接，它将检查在选择的天数里钥匙是否曾经开过此门锁。",
    "If the lock can\\'t connect with the IQ, it will check if a key had access to the lock in the selected amount of days.": "如果门锁无法连接 IQ，会检查在所选的天数里钥匙是否开启过该门锁。",
    "If the user forgets this pin, you need to create a new one.": "如果用户忘记了此 PIN 码，您需要重新设置一个。",
    "If you cancel, the information that you provided so far will be lost": "如您取消，您之前提供的信息将会丢失",
    "If you decide you would like to purchase the Pod functionality you can contact your local KS dealer who will provide you with a new voucher that enables the Pod feature in your system.": "如果您要订购 Pod 功能，请联系您当地的 KS 经销商，他们将为您提供新的订购券，并在您的系统中启用 Pod 功能。",
    "If you delete this user they can't have access to any lock. After deleting users, if you wish you can invite them to your site again.": "如果您删除了用户，他们将无法开启任何门锁。在删除用户后，如果愿意可再次邀请他们加入您的站点。",
    "If you delete this user they can\\'t have access to any lock. After deleting users, if you wish you can invite them to your site again.": "如果您删除此用户，他将无法访问任何门锁。在删除用户后，若您愿意可以再次邀请他们加入您的站点。",
    "If you don't assign a tag, the user won't have a tag": "如果您不分配一个钥匙扣，此用户将无钥匙扣",
    "If you don\\'t assign a tag user won\\'t have a tag": "若您不分配一个钥匙扣用户将无钥匙扣",
    "If you want to reuse this Pod, consideer cleaning it instead of deleting.": "如您需要重新使用此 Pod，请选择清除来代替删除。",
    "If you want, you can invite this user to your site.": "如果愿意，您可以邀请此用户至您的站点。",
    "Important note": "重要提示",
    "In & Out": "进 & 出",
    "In the case you are already using the Pod feature, this extended BETA period is not going to affect you in any way.": "如果您已经在使用 Pod 功能，您将不受此延长 BETA 测试期的影响。",
    "Inactive user": "未激活用户",
    "Incident Notifications": "意外事件通知",
    "Incidents": "意外事件",
    "Incidents list shows all incidents activities of the locks.": "意外事件列表将显示门锁的所有意外事件活动。",
    "Indicate per alert how you want to be notified, and then select for which locks you would like to receive an alert": "指明如何告知您每个警报，然后选择您希望收到哪些门锁的警报",
    "Initialization": "初始化",
    "Inside handle": "室内把手",
    "InsideHandle": "内部把手",
    "Installer": "安装商",
    "Installer Access": "安装商访问",
    "Intrusion": "入侵",
    "Intrusion alarm": "入侵报警",
    "IntrusionAlarm": "入侵报警",
    "Invalid": "无效的",
    "Invalid Name": "无效名称",
    "Invalid character": "无效字符",
    "Invalid email address": "无效的电子邮箱地址",
    "Invalid name": "无效的名称",
    "Invalid phone number": "无效的电话号码",
    "Invite": "邀请",
    "Invite guest": "邀请客人",
    "Invite sent": "邀请已发送",
    "IqConnectionLost": "IQ连接已失去",
    "IqConnectionRestored": "IQ连接已恢复",
    "Ireland": "爱尔兰",
    "It is possible to set the lock to easy office mode if a door is supposed to offer free entry during certain time frames.": "若希望在某特定的时间段内人员可自由进出一道门，可将门锁设置为简易办公室模式。",
    "It looks like the page that you are looking for does not exist.": "您正在查找的页面似乎不存在。",
    "It looks like you are unsubscribed from this site, and you can't make any changes as an unsubscribed user. Please get in touch with a site admin or the site owner.": "您似乎未在此站点的订购中，作为未订购的用户，您不能做任何更改。请联系站点管理员或者站点业主。",
    "It looks like you don't have the permisson to view this page.": "您似乎无权查看此页面。",
    "It looks like you don\\'t have the permisson to view this page.": "您似乎无权查看此页面。",
    "It looks like you you don't have access to this feature.": "您似乎无权使用此功能。",
    "It looks like you you don\\'t have access to this feature.": "您似乎无权访问此功能。",
    "It might be disconnected from its IQ.": "它或许已从 IQ 掉线。",
    "It seems like the lock you are searching for is already in this Pod. Or this lock might not be part of this Site.": "您正在搜索的门锁似乎已经存在于此 Pod 中，或者此门锁并不是此站点中的一部分。",
    "It seems like the lock you are searching for is already in this group. Or this lock might not be part of this Site.": "您搜索的门锁似乎已不在此组中，或者此门锁已不是此站点的一部分。",
    "It seems like the lock you are searching for is already out of this Pod. Or this lock might not be part of this Site.": "您在搜索的门锁似乎已不在此 Pod 中，或此门锁已不是此站点的一部分。",
    "It seems like the lock you are searching for is already out of this group. Or this lock might not be part of this Site.": "您正在搜索的门锁似乎已不属于这个组，或者此门锁不属于此站点。",
    "It seems like the person you are searching for is already in this group. Or this person might not be in this Site.": "您在搜索的人员似乎已经在此组中了，或者此人可能已不在此站点。",
    "It seems like the person you are searching for is already out of this group. Or this person might not be in this Site.": "您正在搜索的人员似乎已不是此组中的成员，或者此人已不在此站点中。",
    "Italian": "意大利语",
    "Its IQ might be disconnected.": "它的 IQ 或许已掉线。",
    "Jamaica": "牙买加",
    "Keep in mind:": "请牢记：",
    "Keys": "钥匙",
    "Last name": "姓氏",
    "Last name is mandatory": "姓氏是必填项",
    "Learn more": "了解更多",
    "Learn more.": "了解更多。",
    "Left Open": "门未关",
    "Liechtenstein": "列支敦士登",
    "List View": "列表视图",
    "List view": "列表视图",
    "Load more": "载入更多",
    "Loading": "装载中",
    "Loading user...": "装载用户中...",
    "Lock": "门锁",
    "Lock Options": "门锁选项",
    "Lock activity notification": "门锁活动通知",
    "Lock added": "门锁已添加",
    "Lock attached successfully": "门锁已成功附加",
    "Lock deleted successfully": "门锁已成功删除",
    "Lock detached": "门锁已分离",
    "Lock information": "门锁信息",
    "Lock left open": "门锁未关闭",
    "Lock name": "门锁名称",
    "Lock name successfully changed": "门锁名称已被成功变更",
    "Lock opened": "门锁开启",
    "Lock options": "门锁选项",
    "Lock rejected": "门锁拒绝",
    "Lock state change": "门锁状态变更",
    "Lock type": "门锁类型",
    "Lock(s) from the group": "来自与此组的门锁",
    "Lock(s) to the group": "要划分至此组的门锁",
    "LockConnectionLost": "门锁连接失去",
    "LockConnectionRestored": "门锁连接已恢复",
    "LockTimeSet": "门锁时间设定",
    "Locked": "上锁",
    "Locker": "箱柜锁",
    "Locks": "门锁",
    "Locks Amount": "门锁数量",
    "Log out": "注销",
    "Login": "登录",
    "Logout": "退出",
    "Low": "低",
    "Low batteries": "电池低电",
    "Low battery": "电量不足",
    "LowBatteryWarning": "低电量报警",
    "MAC": "MAC",
    "MAC address": "MAC 地址",
    "MAC address is for RFnet hardware and it consists of 8 characters.": "MAC 地址用于 RFnet 硬件，由 8 个字符组成。",
    "MO": "一",
    "Make sure that you provide a clear name to the access group.": "确认您给此访问组起了一个清晰的名称。",
    "Make sure to give a clear and distinguishable name to the lock.": "请确保给门锁设置一个清晰和易于区分的名称。",
    "Make sure to give a clear and distinguishable name to the repeater.": "请确保给中继器设置一个清晰的易于区分的名称。",
    "Manage Tags, Mobile Keys and Offline access.": "管理钥匙扣，手机钥匙和离线访问",
    "Manage access tokens": "管理Access tokens",
    "Manage profile and settings": "管理资料和设置",
    "Manage users capability on opening locks remotly and changing the mode of the lock.": "管理用户远程开启门锁和更改门锁工作模式。",
    "Mandatory for": "必填项为",
    "Mandatory with mobile key and remote opening": "手机钥匙和远程开启必填项",
    "Manual Office Mode": "手动办公室模式",
    "Manual Office Mode (MOM) offers the ability to (dis)engage Office Mode on an escutcheon by simply presenting a valid SALTO KS Tag while holding the inside handle.": "手动办公室模式（MOM）可通过下压并按住门锁室内把手，同时刷有效的 SALTO KS 钥匙扣的方式来启用或禁用办公室模式。",
    "Manual office mode": "手动办公室模式",
    "Master Key": "总钥匙",
    "Maximum": "最多",
    "Member": "成员",
    "Member added": "成员已添加",
    "Members": "成员",
    "Members added": "已添加的成员",
    "Members won't have access to their apartment or office anymore.": "成员将无法访问他们的公寓或者办公室。",
    "Messages": "信息",
    "Mobile Key": "手机钥匙",
    "Mobile Key since": "手机钥匙开始自",
    "Mobile User": "手机用户",
    "Mobile app push notification": "手机 app 推送通知",
    "Mobile key": "手机钥匙",
    "Mobile key is mandatory when email is entered or remote opening is selected.": "手机钥匙是必选项当已输入电子邮箱或者已选择远程开启。",
    "Mobile role is only used for remote opening rights.": "手机角色仅用于远程开启的权限。",
    "Mobile user": "手机用户",
    "Mode": "模式",
    "Mode Status": "模式状态",
    "Monday": "周一",
    "Multiple pods": "多重 Pod",
    "My customer UID": "我的客户 UID",
    "My entries": "我的进入记录",
    "N/A": "不适用",
    "NO": "否",
    "Name": "名称",
    "Name your access group": "命名您的访问组",
    "Name your notification": "命名您的通知",
    "Near detection Mode": "近距离检测模式",
    "Near detection mode": "近距离检测模式",
    "Near detection mode is a setting specific for wall readers. When the near detection mode is off, wall readers can receive the mobile key signal without any contact from the phone.": "近距离检测模式是针对墙面读卡器的一个特别设置。当近距离检测模式关闭后，墙面读卡器可以接收到手机钥匙信号而无需任何手机触碰。",
    "Near detection mode successfully changed": "近距离检测模式已成功变更",
    "Netherlands": "荷兰",
    "Never (missing time schedules)": "永不（不在计划表里）",
    "New IQ activation code": "新 IQ 激活码",
    "New Zealand": "新西兰",
    "New member overview": "新成员总览",
    "New user": "新用户",
    "Next": "下一步",
    "No": "否",
    "No Groups": "无分组",
    "No IQ": "无 IQ",
    "No IQs found": "IQ 未找到",
    "No Repeater": "无中继器",
    "No Tag": "无钥匙扣",
    "No access": "无法访问",
    "No activated Mobile Key devices.": "无已激活的手机钥匙设备。",
    "No alias": "无别名",
    "No countries found": "未找到国家",
    "No data": "没有数据",
    "No email": "无电子邮箱",
    "No entries found for this user.": "未发现此用户的任何进入。",
    "No events have been found": "暂无事件可查询",
    "No filter applied": "未应用筛选",
    "No items found": "无项目发现",
    "No items to dispay": "无项目可显示",
    "No items to display": "无项目可显示",
    "No locks added": "无门锁被添加",
    "No locks found": "未发现任何门锁",
    "No members added": "无成员被添加",
    "No pin assigned yet for pin locks": "密码锁还未分配 PIN 码",
    "No repeaters found": "中继器未找到",
    "No results": "无结果",
    "No results for": "无结果",
    "No site": "无站点",
    "No tag": "无钥匙扣",
    "No tag assigned.": "无已分配的钥匙扣。",
    "No tags to show": "无钥匙扣可显示",
    "No time zones found": "未发现时区",
    "No user found": "未发现用户",
    "No user found with the email or tag number you entered.": "未找到含有此电子邮箱或钥匙扣号的用户。",
    "No user found, check your input": "未发现用户，请检查输入",
    "No users to show": "无用户可显示",
    "No valid access has been defined for this user, so no subscription is required.": "未给此用户定义有效的访问，所以无需订购。",
    "No warnings": "无警告",
    "None": "无",
    "Norwegian": "挪威语",
    "Not Commissioned": "未调试的",
    "Not Granted": "未获准",
    "Not attached": "未附加的",
    "Nothing assigned": "无任何已分配的",
    "Notification  name": "通知名称",
    "Notification created": "通知已生成",
    "Notification deleted": "通知已删除",
    "Notification name": "通知名称",
    "Notification overview": "通知总览",
    "Notification updated": "通知已更新",
    "Notifications": "通知",
    "Notifications will be sent only to Site owner.": "通知将仅发送至站点业主。",
    "Notify about": "通知关于",
    "Now if you wish you can add this user to any of the access groups.": "现在您可以将此用户添加至任何一个访问组。",
    "Now if you wish you can add this user to one of the access groups.": "现在如您愿意，可以将此用户添加至任何一个访问组中。",
    "Now the user can use the pin below to unlock pin locks.": "现在此用户可以使用下面的 pin 码开启密码锁。",
    "Now the user can use the pin below to unlock pin locks. This is the only time that you see this PIN, make sure that you share this pin with the related user. ": "现在用户可以使用以下 PIN 码来开启密码锁。这是您可以看见此 PIN 码的唯一机会，请确保您与相关用户分享这个 PIN 码。 ",
    "Number of sites you have access to:": "您可以访问的站点数量：",
    "OFFLINE ACCESS": "离线访问",
    "Office Mode": "办公室模式",
    "Office mode": "办公室模式",
    "Offline": "离线",
    "Offline access": "离线访问",
    "Ok": "Ok",
    "On": "在",
    "On any date on": "在任何日期",
    "Once you clean this Pod, the items below will be deleted:": "一旦您清理此 Pod，以下项目将被删除：",
    "Once you create a new PIN for the user, their current pin will be overwritten by the new PIN.": "一旦您为用户生成了一个新的 PIN 码，他们当前的 PIN 码会被新的 PIN 所替代。",
    "Once you delete a Pod guest they won't be able to access any lock.": "一旦您删除 Pod 客人，他们将无法访问任何门锁。",
    "Once you delete a Pod guest they won\\'t be able to access any lock.": "一旦您删除了一个 Pod 客人，他们将无法访问任何的门锁。",
    "Once you delete a Pod member they won't be able to access any lock.": "一旦您删除 Pod 成员，他们将无法开启任何门锁。",
    "Once you delete a Pod member they won\\'t be able to access any lock.": "一旦您删除一个 Pod 成员，他们将无法访问任何门锁。",
    "Once you delete this Pod, the items below will also be deleted:": "一旦您删除此 Pod，以下项目也将被删除：",
    "Online": "在线",
    "Only Site owner and Site admins can give this permission to other users": "只有站点业主和站点管理员可以将此权限授予给其他用户",
    "Only locks that are online and not in Office Mode can be used to add tags.": "只有当门锁在线并且未进入办公室模式的情况下才可用于添加钥匙扣。",
    "Only members with email can use mobile phone to unlock and invite visitors.": "只有含电子邮箱的成员可以使用手机开锁和邀请访客。",
    "Open now": "现在开启",
    "Open time": "开启时间",
    "Open time indicates the amount of time that the lock will stay unlocked until it is locked again.": "开启时间是指门锁从开启直至关闭所持续的时间。",
    "Open time successfully changed": "开启时间已被成功变更",
    "Opened by": "开启由",
    "OpenedByMasterKey": "使用总钥匙开启",
    "OpenedByTag": "使用钥匙扣开启",
    "OpenedRemote": "已开启远程",
    "Opening doors from any distance and letting tenants in is now more convenient than ever. SALTO KS lets you open doors from anywhere, anytime. Whether it's a visitor who arrived earlier than you or a new employee without a Tag. You can unlock doors for your guests via remote opening functionality from anywhere around the world.": "无论距离多远开启房门让租户进入，这比以往任何时候都方便。SALTO KS 让您可以在任何地点和时间开启房门。无论是先于您抵达的访客或是新入职的未分配钥匙扣的员工，您都可使用远程开启功能从世界的任何地方为您的客人打开房门。",
    "Opening doors from any distance and letting tenants in is now more convenient than ever. SALTO KS lets you open doors from anywhere, anytime. Whether it\\'s a visitor who arrived earlier than you or a new employee without a Tag. You can unlock doors for your guests via remote opening functionality from anywhere around the world.": "在任何地点开启门锁让租户进入，现在比之前任何时候都要方便。SALTO KS 使您能在任何地点和时间开启门锁。无论是比您提前抵达的访客或者是一个新的无钥匙扣的员工，在世界各地通过远程开启功能，您可为您的客人开启房门。",
    "Operation not completed": "操作未完成",
    "Override Privacy Mode": "开启反锁",
    "Override a lock in privacy mode with a tag or mobile key.": "使用钥匙扣或手机钥匙解开门锁的反锁模式。",
    "Override a lock in privacy mode with a tag.": "使用钥匙扣开启一把反锁的门锁",
    "Override privacy mode allows the user to unlock the lock when it is in privacy mode. It can be done only by Tags & Mobile Keys and not with remote opening.": "解开反锁模式允许用户在门锁被反锁时可开启门锁。只有使用钥匙扣或手机钥匙可以解开反锁，而远程开启则不可以。",
    "Overview": "总览",
    "Ownership transferred": "业主关系已转让",
    "PIN": "PIN码",
    "Page not found": "页面未找到",
    "Part of pods:": "Pod 的部分：",
    "Pending registration": "待注册",
    "People": "人员",
    "People Amount": "人员数量",
    "Per key you can set offline access or block.": "每把钥匙您可设置离线开锁或屏蔽",
    "Person(s) from the group": "来自于此组的人员",
    "Person(s) to the group": "要划分至此做的人员",
    "Philippines": "菲律宾",
    "Pin assigned for pin locks": "PIN码已分配给密码锁",
    "Pin copied to clipboard": "Pin 码已复制至剪贴板",
    "Pin copied to the clipboard": "Pin 码已复制至剪贴板",
    "Pin succefully reseted": "PIN码已被成功重置",
    "Pin was reset successfully": "Pin 码已成功重置",
    "Please choose locks that Pod members can access.": "请选择 Pod 成员可访问的门锁。",
    "Please complete the IQ replacement.": "请完成此 IQ 的替换。",
    "Please contact a Site Administrator to delete this user.": "请联系一位站点管理员以删除此用户。",
    "Please don't forget to inform the user regarding their new PIN.": "请勿忘记通知此用户新的 PIN 码。",
    "Please enter a valid name": "请输入一个有效名称",
    "Please enter a valid time frame": "请输入一个有效的时间段",
    "Please fill in the name": "请填写名称",
    "Please get in touch with the site admin.": "请联系站点管理员。",
    "Please go to the Pod to delete this user.": "请去此 Pod 删除此用户。",
    "Please make sure that all the fields are being filled correctly and try again.": "请确认所有栏目均正确填写，并再试。",
    "Please select a lock to present tags to": "请选择一把门锁刷钥匙扣",
    "Please select a period of maximum a month to export.": "请选择最长为一个月的周期导出。",
    "Please select a valid tag": "请选择一个有效的钥匙扣",
    "Please select at least one day": "请至少选择一日",
    "Please select locks": "请选择门锁",
    "Please select people": "请选择人员",
    "Please try again.": "请再试。",
    "Please wait while creating the new pin.": "请等待正在生成新的 pin 码。",
    "Please while creating the new pin.": "请同时生成新 pin 码。",
    "Please write the names of all members who will be a part of this Pod.": "请填写此 Pod 中所有成员的名称。",
    "Pod": "Pod",
    "Pod Guest": "Pod 客人",
    "Pod Member": "Pod 成员",
    "Pod Members": "Pod 成员",
    "Pod Members & Guests": "Pod 成员 & 客人",
    "Pod Name": "Pod 名称",
    "Pod beta information": "Pod 测试信息",
    "Pod created": "Pod 已生成",
    "Pod guest": "Pod 客人",
    "Pod guest role is only given to users invited by a Pod member. Pod guests can't invite other guests, and they can only use the mobile key.": "Pod 客人角色仅给予由 Pod 成员邀请的用户。Pod 客人无法邀请其他客人，并且他们仅可使用手机钥匙。",
    "Pod member": "Pod 成员",
    "Pod member role is for the users who are just part of a Pod. The main difference between a pod member and a site user is that Pod members can invite 'Pod guests'.": "Pod 成员角色仅限于其所属的 Pod，和站点用户之间的最大区别在于 Pod 成员可以邀请 “Pod 客人”。",
    "Pod members": "Pod 成员",
    "Pod name": "Pod 名称",
    "Pod name (e.g. No:120)": "Pod 名称（例如：No:120）",
    "Pod name cannot be empty": "Pod 名称不能空白",
    "Pod name is mandatory": "Pod 名称是必填项",
    "Pod name must be unique": "Pod 名称必须是唯一的",
    "Pod overview": "Pod 总览",
    "Pod successfully cleaned": "Pod 已被成功清理",
    "Pod successfully deleted": "Pod 已被成功删除",
    "Pod successfully saved": "Pod 已成功保存",
    "Pod's name": "Pod 名称",
    "Pod\\'s name": "Pod 名称",
    "Pods": "Pods",
    "Pods enable building managers (Site admins) to create a small independent group of members named 'Pod'.": "Pod 使大厦经理（站点管理员）可生成一个小而独立的成员组，称作 “Pod”。",
    "Pods enable building managers (Site admins) to create a small independent group of members named \\'Pod\\'.": "Pod 可使物业经理（站点管理员）生成一个小而独立的成员组，命名为 \\'Pod\\'。",
    "Pods feature is in Beta. Beta period ends in late 2021.": "Pod 功能正在 Beta 测试。Beta 测试期将会在 2021年后期结束。",
    "Pods matching your search": "符合搜索条件的 Pods",
    "Polish": "波兰语",
    "Portuguese": "葡萄牙语",
    "Powered": "电源供电",
    "Present a construction card": "刷工程卡",
    "Present a construction card to verify that the lock was properly detached.": "刷工程卡以确认此门锁已正确分离。",
    "Present a random tag or a construction card to verify that the lock was properly detached.": "请对门锁刷任意一个钥匙扣或者工程卡，以验证此门锁是否已正确分离。",
    "Present a tag": "刷钥匙扣",
    "Present a tag to the detached lock. If it blinks orange followed by red, the lock is properly detached.": "对分离的门锁出示钥匙扣。如果跳闪橙色灯随后变成红色灯，表示此门锁已被正确分离。",
    "Present maintenance card": "刷维修卡",
    "Present tags to the lock": "对门锁出示钥匙扣",
    "Present the card to the lock.": "对门锁刷卡。",
    "Present the maintenance card to the lock.": "对门锁刷维修卡。",
    "Present the tag to the lock.": "对门锁刷钥匙扣。",
    "Presenting the maintenance card will activate the lock and make sure that lock is connected properly.": "刷维修卡将会激活此门锁以确认门锁已正确连接。",
    "Press confirm after the LED on the lock blinks green and unlocks.": "在门锁的 LED 灯亮绿色并解锁时点击确认。",
    "Press confirm after the LED on the lock blinks orange and unlocks.": "当门锁的 LED 灯闪烁橙色并解锁后，请点击确认。",
    "Press done after the LED on the lock blinks orange several times followed by a green blink.": "在门锁 LED 灯闪烁几次橙色接着亮绿色灯后，请点击完成。",
    "Press reset": "按重置按钮",
    "Press reset on the back of the repeater until the LED blinks blue followed by green.": "按住中继器背面的重置按钮，直至LED跳闪蓝色灯随后变成绿色灯。",
    "Press reset on the back of the repeater until the LED blinks red-green-blue.": "按压中继器背面的重置按钮直到 LED 闪烁红-绿-蓝。",
    "Previous": "后退",
    "Privacy Mode": "反锁模式",
    "Privacy mode": "反锁模式",
    "Privacy override mode": "解开反锁模式",
    "Profile": "资料",
    "Profile & Settings": "资料 & 设置",
    "Profile info": "资料信息",
    "Profile information": "资料信息",
    "Redeeming this voucher it will instantly replace the current one. The remaining period on the current voucher will automatically be settled.": "启用此订购券将立即替代现有订购券，现有订购券上剩余的期限将会自动延续。",
    "Refresh": "刷新",
    "Registered mobile key devices": "已注册的手机钥匙设备",
    "Registered tag(s)": "已注册的钥匙扣",
    "Rejection event (unauthorized actions)": "被拒绝的事件（未经授权的任务）",
    "Rejections": "拒绝",
    "Reload Site": "重新装载站点",
    "Remote opening": "远程开启",
    "Remove": "移除",
    "Remove from access group": "从访问组中移除",
    "Repeater": "中继器",
    "Repeater added": "中继器已添加",
    "Repeater attached successfully": "中继器已成功附加",
    "Repeater deleted successfully": "中继器已成功删除",
    "Repeater name": "中继器名称",
    "Replace": "替换",
    "Replace IQ": "替换 IQ",
    "Report sent": "报告已发送",
    "Request a new voucher": "请求一张新的订购券",
    "Request to exit": "请求外出",
    "Required for remote opening": "远程开启所需的",
    "Required to enable remote opening and mobile key.": "需要此项以启用远程开启和手机钥匙。",
    "Required to enable remote opening.": "需要启用远程开启。",
    "Resend in": "重新发送在",
    "Resend invitation": "重新发送邀请",
    "Resend invite in": "重新发送邀请在",
    "Resend now": "现在重新发送",
    "Reset IQ pin": "重置 IQ pin 码",
    "Reset IQ to reset PIN": "重置 IQ 以重置 PIN 码",
    "Reset PIN": "重置 PIN 码",
    "Reset Pin": "重置 PIN 码",
    "Reset pin": "重置 pin",
    "Resetting the PIN will require the user to re-activate the IQ again.": "重置此 PIN 码后用户需要重新激活此 IQ。",
    "Restore": "恢复",
    "Restore IQ": "恢复 IQ",
    "Restoring the IQ": "正在恢复此 IQ",
    "Retry": "再试",
    "Revoke Access": "取消访问",
    "Rights": "权利",
    "Rights & permissions": "权利 & 权限",
    "Role": "角色",
    "Role & Email": "角色 & 电子邮箱",
    "Role & Rights": "角色 & 权利",
    "SA": "六",
    "SALTO KS is now loading your data.": "SALTO KS 正在载入您的数据。",
    "SU": "日",
    "Saturday": "周六",
    "Save": "保存",
    "Save changes": "保存更改",
    "Search": "搜索",
    "Search Pods": "搜索 Pods",
    "Search access groups": "搜索访问组",
    "Search for a lock": "搜索一把门锁",
    "Search for a person": "搜索一个人员",
    "Search for a site": "搜索一个站点",
    "Search for people or tags": "搜索人员或者钥匙扣",
    "Search lock": "搜索门锁",
    "Search locks": "搜索门锁",
    "Search people": "搜索人员",
    "Search tag or name": "搜索钥匙扣或用户姓名",
    "Select IQ": "选择 IQ",
    "Select Repeater": "选择中继器",
    "Select a BLUEnet repeater": "选择一个 BLUEnet 中继器",
    "Select a RF repeater": "选择一个 RF 中继器",
    "Select a lock": "选择一把门锁",
    "Select a maximum period of 3 months": "选择一个为期最长 3 个月的时期",
    "Select a period of maximum a month to export.": "选择最长为一个月的时期以导出。",
    "Select a person": "选择一个人员",
    "Select a tag": "选择一个钥匙扣",
    "Select an Access Group": "选择一个访问组",
    "Select an IQ": "选择一个 IQ",
    "Select country": "选择国家",
    "Select date(s)": "选择日期",
    "Select door": "选择门",
    "Select doors": "选择门",
    "Select lock": "选择门锁",
    "Select locks": "选择门锁",
    "Select new site\\'s owner": "选择新站点的业主",
    "Select one or more locks from the list.": "从列表里选择一把或多把门锁。",
    "Select people": "选择人员",
    "Select people who should be in this access group": "选择应在此访问组中的人员",
    "Select reporting period": "选择报告周期",
    "Select the locks that should be in this access group": "选择属于此访问组的门锁",
    "Select the new Site Owner": "选择站点的新业主",
    "Select the new site owner": "选择站点的新业主",
    "Select time frame": "选择时间段",
    "Select time zone": "选择时区",
    "Select timeframe": "选择时间表",
    "Select user": "选择用户",
    "Select users": "选择用户",
    "Select which IQs the installer should have access to. Enabling an IQ will require you to generate a code on your mobile device.": "选择安装商可访问的 IQ。请您使用手机应用生成一个代码以启用一个 IQ。",
    "Selected IQs": "已选择的 IQ",
    "Selected Locks": "选中的门锁",
    "Selected locks": "已选择的门锁",
    "Selected people": "已选择的人",
    "Send to E-mail": "发送至电子邮箱",
    "Set a basic check in - check out date & time.": "设置一个基本的 登记 - 结账 日期和时间。",
    "Set a limit for the amount of guests that can be invited.": "设置可邀请的客人数量的上限。",
    "Set notifications for entries and rejections, for selected users and locks.": "为所选的用户和门锁设置进入和拒绝的通知。",
    "Settings": "设置",
    "Simply enter the activation code of the new IQ and make sure to have a maintenance card ready for the next step.": "请输入新 IQ 的激活码，并确认已准备好维修卡进行下一步骤。",
    "Site": "站点",
    "Site ID": "站点 ID",
    "Site Owner": "站点业主",
    "Site admin": "站点管理员",
    "Site admin is the highest role.": "站点管理员是权限最高的角色。",
    "Site admins can't invite guests.": "站点管理员无法邀请客人。",
    "Site admins can\\'t edit email after users create their profile. Only users can change their own emails.": "用户资料生成后，站点管理员无法编辑他们的电子邮箱。只有用户可以变更自己的电子邮箱。",
    "Site details": "站点详情",
    "Site name": "站点名称",
    "Site notifications": "站点通知",
    "Site owner": "站点业主",
    "Site owner blocked successfully": "站点业主已被成功屏蔽",
    "Site super user": "站点超级用户",
    "Site user": "站点用户",
    "Site | Hardware": "站点 | 硬件",
    "Site | Installer Access": "站点 | 安装商访问",
    "Site | Overview": "站点 | 总览",
    "Site | Subscription": "站点 | 订购",
    "Site | Subscriptions": "站点|订阅",
    "Site | Tags": "站点 | 钥匙扣",
    "Slovenian": "斯洛文尼亚语",
    "Something went wrong": "发生错误",
    "Something went wrong, please try again.": "出错了，请再试。",
    "Something went wrong.": "发生了一些问题。",
    "South Africa": "南非",
    "Spanish": "西班牙语",
    "Start": "开始",
    "Start date": "开始日期",
    "Start with adding an IQ to create site": "从添加一个 IQ 开始建立站点",
    "StartEasyOfficeModeByTag": "使用钥匙扣启动简易办公室模式",
    "StartEasyOfficeModeRemote": "启动简易办公室模式远程",
    "StartOfficeMode": "启动办公室模式",
    "StartedOfficeModeByTag": "使用钥匙扣启动办公室模式",
    "StartedOfficeModeRemote": "远程启动办公室模式",
    "Status": "状态",
    "Stop": "停止",
    "Stop creating this access group?": "停止创建此访问组？",
    "Stop creating this notification?": "停止生成此通知？",
    "Stop editing this access group?": "停止编辑此访问组？",
    "Stop editing this notification?": "停止编辑此通知？",
    "Submit": "发送",
    "Subscribed": "已订购",
    "Subscription": "订购",
    "Subscription for this site has ended": "此站点的订购将要到期",
    "Subscription state": "订阅状态",
    "Success": "成功",
    "Successfully removed the user from access group": "已成功将此用户从访问组中删除",
    "Sunday": "周日",
    "Super user": "超级用户",
    "Support": "技术支持",
    "Surname": "姓氏",
    "Suspended": "已暂停",
    "Swedish": "瑞典语",
    "Switch site": "切换站点",
    "Switch to a different site": "切换至其他站点",
    "Switzerland": "瑞士",
    "System": "系统",
    "T": "T",
    "TH": "四",
    "TRANSFER OWNERSHIP": "转让业主关系",
    "TU": "二",
    "Tag": "钥匙扣",
    "Tag number": "钥匙扣号码",
    "TagBlocked": "已屏蔽的钥匙扣",
    "TagOutOfTime": "钥匙扣超出时间",
    "TagRejected": "钥匙扣被拒绝",
    "TagRejectedLowBatteries": "钥匙扣被拒绝低电量",
    "TagRejectedOffline": "钥匙扣被拒绝离线",
    "TagSuspended": "钥匙扣被暂停",
    "TagWithoutAccessGroup": "无访问组的钥匙扣",
    "Tags": "钥匙扣",
    "Tamper alarm": "防拆报警",
    "TamperAlarm": "防拆报警",
    "Tap and unlock With SALTO Bluetooth Low Energy Locks you can unlock doors with Mobile Keys. All you need to do is activate Mobile Key in your KS app and tap your phone on the reader of the Lock. Users can receive Mobile Keys anytime and anywhere, making issuing and receiving access rights much easier and more flexible.": "点击和开启 SALTO 蓝牙低功耗门锁，让您可以使用手机钥匙开启房门。只需在 KS app 里激活手机钥匙并将手机靠近门锁读卡器。用户可以在任何时间和地点接收手机钥匙，分配和接收门禁权限变得更简单和更灵活。",
    "The Claycode is incorrect, please try again": "此Claycode不正确，请再试",
    "The IQ": "此 IQ",
    "The IQ has been successfully added to your Site": "此 IQ 已被成功添加至您的站点",
    "The IQ has been successfully edited": "此 IQ 已被成功编辑",
    "The IQ has been successfully replaced.": "此 IQ 已被成功替换。",
    "The PIN of the site owner can only be reset manually by resetting the IQ.": "站点业主的 PIN 码只能通过重置此 IQ 来手动重置。",
    "The Pod will be deleted": "此 Pod 将被删除",
    "The Repeater has been successfully attached to IQ": "中继器已经成功附加至 IQ",
    "The Site has been successfully added": "此站点已成功添加",
    "The Subscribed column shows if a person falls within your subscription, or not. Use the yes/no toggle to let a person be part of the subscription, or not.": "已订购栏显示一个用户是否属于您的订购，使用是/否切换用户是否属于订购的一部分。",
    "The alias is invalid": "此别名无效",
    "The choice of this value must be based on IQ location": "必须根据 IQ 的位置来选择这个值",
    "The current voucher grants access to": "当前订购券获准访问给",
    "The exact reason for this extended BETA period, unfortunately, is Covid-19. We hope this allows you more time to fully experience the functionality and discover how the feature can be beneficial for your business.": "延长 BETA 测试期的确切原因是由于 Covid-19。我们希望能给您更多时间来完全体验此功能，并发现如何才能让其有助于您的业务。",
    "The last Pod member who has an email registered cannot be deleted.": "最后一个含有已注册的电子邮箱的 Pod 成员不能被删除。",
    "The lock has been successfully edited": "门锁已被成功编辑",
    "The lock is offline. The lock can be offline because:": "此门锁离线。门锁离线的原因:",
    "The lock is online and it is connected to its IQ.": "此门锁在线并与 IQ 连接。",
    "The lock name cannot be empty": "门锁名称不能空白",
    "The name is unique. You can continue": "此名称是唯一的，您可以继续",
    "The name must be unique.": "名称必须是唯一的。",
    "The new user selected will be the site owner and your new role will be 'Site Admin'. Please remember that you might need to update the payment data for the subscription if needed.": "选择的新用户将会成为站点业主，而您的新角色将是 \"站点管理员\"。如果需要的话，请勿忘记更新订购的付款信息。",
    "The notifications functionality is still in development. We are creating a brand-new interface for this, that will simplify setting notifications - no matter how large your site is.": "通知功能仍然在开发中。我们正在为此生成一个全新的界面，可以简化通知设置-无论您的站点有多大。",
    "The operation has been successfully completed": "此操作已成功完成",
    "The profile is owned by an another site": "此资料属于另一站点",
    "The profile is owned by this user": "此资料属于此用户",
    "The repeater has been successfully detached": "此中继器已被成功分离",
    "The repeater has been successfully edited": "此中继器已被成功编辑",
    "The repeater name cannot be empty": "中继器名称不能空白",
    "The report will be generated and sent to your email address": "此报告将会生成并发送至您的电子邮箱",
    "The site has been successfully edited": "此站点已被成功编辑",
    "The site will verify if a profile exists": "此站点将验证资料是否存在",
    "The table on left shows locks which are in the group and table on the right shows locks which are not in the group. Choose locks to add or remove.": "左侧列表显示的是在此组中的门锁，而右侧列表显示的是未在此组中的门锁。选择门锁添加或移除。",
    "The table on left shows people who are in the group and table on the right shows people who are not in the group. Choose users to add or remove.": "左侧列表显示的是在此组中的人员，而右侧列表显示的是未在此组中的人员。选择用户添加或移除。",
    "The table on the left shows locks that Pod members can access and table on the right shows the rest of the locks in your site.": "左侧列表显示的是 Pod 成员可访问的门锁，右侧列表显示的是您站点中其余的门锁。",
    "The timezone must be based on the IQs location": "时区必须基于 IQ 所在的位置",
    "The user has not completed the registration yet. Mobile key and remote opening can not be used before the registration is completed. You can resend the registration invitation if it has expired. (Invitaiton expires in 3 days after being sent)": "此用户尚未完成注册，手机钥匙和远程开启在注册尚未完成前不能使用。如果注册邀请已失效，您可以重新发送（注册邀请在发送 3 日后失效）。",
    "The user has not completed the registration yet. Mobile key and remote opening can not be used before the registration is completed. You can resend the registration invitation if it has expired. (Invitation expires in 3 days after being sent)": "此用户尚未完成注册。手机钥匙和远程开启在注册未完成前将无法使用。如果邀请已经过期的话，您可以再次发送注册邀请。（邀请将会在发送 3 天后过期）",
    "The user has not yet accepted the invitation.": "此用户尚未接受邀请。",
    "There are no guests invited yet.": "暂无客人被邀请。",
    "There are no locks assigned to this Pod. Please choose locks that Pod members can access.": "此 Pod 未分配任何门锁，请选择 Pod 成员可访问的门锁。",
    "There is no time frame set. Without a time frame, people in this access group can't have access.": "未设置时间段。若未设置时间段，此访问组中的人员将无法访问。",
    "There is no time frame set. Without a time frame, people in this access group can\\'t have access.": "未设置时间段。若无一个时间段，则此访问组中的人将无法访问。",
    "There is no timeframe set. Without a timeframe, people in this access group can’t have access.": "未设置时间表。如果无时间表，在此访问组中的人员将无法访问。",
    "There might be another problem with the lock, like empty batteries.": "此门锁可能存在其他问题，比如：门锁无电。",
    "Therefore you can\\'t change the role of this user": "因此您无法变更此用户角色",
    "These are all authorized actions performed on the selected locks(s).": "这些是所选门锁的所有已执行的授权任务。",
    "These entries can be filtered and exported to a .csv file.": "这些进入事件可被筛选，并导出至一个 .csv 文件。",
    "These entries can be filtered and exported to an Excel file.": "这些进入可被筛选和导出到一个Excel文件",
    "These incidents can be filtered and exported to a .csv file.": "这些意外事件可被筛选，并导出至一个.csv 文件。",
    "These incidents can be filtered and exported to an Excel file.": "这些事件可筛选并输出生成一个Excel文件",
    "This Pod is empty": "此 Pod 是空的",
    "This Pod is empty. There are no access groups to show.": "此 Pod 是空的，无访问组可显示。",
    "This Pod is empty. There are no members or guests in it.": "此 Pod 是空的，里面无任何成员或客人。",
    "This access group is empty": "此访问组是空的",
    "This is how": "这是如何",
    "This is how this person is able to access.": "这是此人员如何能够访问的方式。",
    "This is the only time that you see this PIN, make sure that you share this pin with the related user.": "这是您能看见此 PIN 码的唯一机会，请确保您将此 PIN 码与相关用户分享。",
    "This lock": "此门锁",
    "This lock is connected to power. It doesn't need batteries.": "此门锁使用电源供电，无需电池。",
    "This lock is currently attached to ": "此门锁目前附加于.. ",
    "This lock will be attached to": "此门锁将被附加于",
    "This lock will be attached to ": "此门锁将被附加至.. ",
    "This person has an account, so you will invite it to your site.": "此人员有一个账号，您可以邀请他加入您的站点。",
    "This repeater is currently attached to ": "此中继器目前被附加于.. ",
    "This repeater will be linked to ": "此中继器将会链接至 ",
    "This role is higher than site user role but lower than the site admin role.": "此角色的权限高于站点用户但低于站点管理员。",
    "This role is the most basic role.": "此角色是最基本的角色。",
    "This site is not compatible with the mobile key. Therefore, you can't enable it for users.": "此站点不兼容手机钥匙，因此您无法为用户启用。",
    "This site is not compatible with the mobile key. Therefore, you can\\'t enable it for users.": "此站点不兼容手机钥匙。因此您无法为用户启用它。",
    "This step will connect the lock to the IQ.": "此步骤会将门锁连接至 IQ。",
    "This step will connect the repeater to the IQ.": "此步骤会将中继器连接至 IQ。",
    "This timeframe is overwritten by the \"Always\" timeframe.": "此时间段会被 “总是” 时间段覆盖。",
    "This user is Site Owner, therefore this subscription cannot be changed.": "此用户是站点业主，因此此订购将不能变更。",
    "This user is a Pod User and Pod users can be only be deleted from the Pod page.": "此用户是一位 Pod 用户，Pod 用户只能进入 Pod 页面进行删除。",
    "This user is a Pod User and Pod users can be only be deleted from the Pod page. Please contact a Site Administrator to delete this user.": "此用户是一个 Pod 用户，只能从 Pod 页面进行删除。请联系站点管理员以删除此用户。",
    "This user is a Pod User and Pod users can be only be deleted from the Pod page. Please go to the Pod to delete this user.": "此用户是一个 Pod 用户，只能从 Pod 页面进行删除。请进入 Pod 删除此用户。",
    "This user is a part of the Pod(s)": "此用户是此 Pod 中的一部分",
    "This user is not a part of any access group.": "此用户不属于任何一个访问组。",
    "This user is part of": "此用户属于",
    "This user is part of the Pod(s):": "此用户是此 Pod 中的一部分：",
    "This user is part of this Pod.": "此用户是此 Pod 的一部分。",
    "This user is part of your site": "此用户是您站点的一部分",
    "This user is the Site Owner": "此用户是站点业主",
    "This user is the Site Owner and therefore cannot be deleted.": "此用户是站点业主，因此不能被删除。",
    "This user is the Site Owner. Therefore you can't change the role of this user nor delete their profile.": "此用户是站点业主，因此您不可更改此用户的角色或者删除其资料。",
    "This user is the Site Owner. Therefore you can\\'t change the role of this user nor delete their profile.": "此用户是站点业主，因此您无法改变此用户的角色也无法删除他的资料。",
    "This user is the site owner of this site, and this tag is the master tag for this site. Therefore, you can not block this tag.": "此用户是站点业主，此钥匙扣是此站点的主钥匙扣。因此，您无法屏蔽此钥匙扣。",
    "This user is the site owner.": "此用户是站点业主。",
    "This user won't be able to unlock the locks included in this access group.": "此用户将无法开启此访问组中的门锁。",
    "This will activate the lock and connect it to the IQ. After the LED has blinked orange followed by green, press Done.": "此将激活门锁并将其连接至 IQ。当 LED 由跳闪橙色灯变为绿色灯后，按完成按钮。",
    "Thursday": "周四",
    "Time": "时间",
    "Time & Attendance": "考勤",
    "Time frame": "时间段",
    "Time frame added": "时间段已添加",
    "Time frame deleted": "时间段已删除",
    "Time frame has been successfully added": "时间段已被成功添加",
    "Time frame has been successfully removed": "时间段已被成功移除",
    "Time frame has been successfully updated": "时间段已经成功更新",
    "Time frame overview": "时间段总览",
    "Time frames": "时间段",
    "Timeframe": "时间表",
    "Timeframe has been successfully added": "时间段已被成功添加",
    "Timeframe has been successfully removed": "时间表已被成功移除",
    "Timeframe has been successfully updated": "时间段已成功更新",
    "Timeframes": "时间段",
    "Timeslot": "时间槽",
    "Timezone": "时区",
    "To": "至",
    "To add tags, make sure you select a lock to present them to. Starting will give a two-minute window to register the tags.": "如需添加钥匙扣，请选择一把门锁对其刷钥匙扣。系统将给两分钟时间窗口注册钥匙扣。",
    "To add tags, please select a lock to present new tags to. Starting will give a two-minute window to register the tags.": "要添加钥匙扣，请选择一把门锁刷新钥匙扣。系统将给出两分钟的时间窗口注册钥匙扣。",
    "To attach this lock to another IQ or repeater, you have to detach it from the current IQ.": "要将此门锁附加至另一个 IQ 或 中继器，您必须要将它从当前的 IQ 分离。",
    "To attach to another IQ/Repeater, first detach it.": "要附加至其他 IQ/中继器，请先分离。",
    "To delete this user please clean the Pod and delete the user from the People page.": "要删除此用户请清理此 Pod，并从人员页面删除此用户。",
    "To delete this user please clean the pod and delete the user from the People page.": "要删除此用户请清理此 Pod，并在人员页面里删除此用户。",
    "Transfer": "转让",
    "Transfer ownership": "转让业主关系",
    "Trinidad and Tobago": "特立尼达和多巴哥",
    "Tuesday": "周二",
    "Type": "类型",
    "US": "美国",
    "Unauthorized access": "未授权的访问",
    "Unblock": "解除屏蔽",
    "Under repeater ": "在中继器下.. ",
    "United Kingdom": "英国",
    "Unknown": "未知",
    "Unknown (offline)": "未知（离线）",
    "Unknown battery (offline)": "未知电池状态（离线）",
    "Unlimited": "无限制",
    "Unlock or set a lock in Office Mode remotely.": "远程开启或将门锁置于办公室模式。",
    "Unsubscribed": "取消订购",
    "Until": "直至",
    "Update default installer": "更新默认安装商",
    "Use the option to": "应用此选项",
    "Use the option to Reset IQ PIN if a person forgets the IQ PIN or if they don't have access to their old phone. IQ PIN can be reset per IQ.": "如果一个人员忘记 IQ PIN 码，无法找到或访问原来的手机，可使用此选项重置 IQ PIN 码。IQ PIN 码可依据不同的 IQ 重置。",
    "User": "用户",
    "User Information": "用户信息",
    "User Profile": "用户资料",
    "User can enable and disable Easy Office Mode with their tag during the scheduled time slot.": "在计划时间表内用户可使用钥匙扣启用和停用简易办公室模式。",
    "User can enable and disable Manual Office Mode with their tag and the inside handle of a lock. For more information about Office Modes visit: my-clay.com/support.": "用户可以压住门锁内部把手并使用钥匙扣启用和停用手动办公室模式。关于办公室模式的详细信息请访问：my-clay.com/support。",
    "User created": "已生成的用户",
    "User deleted": "用户已删除",
    "User invited": "邀请的用户",
    "User is able to open locks and set office mode remotely using their mobile device.": "用户可以使用手机开启门锁和远程设置办公室模式。",
    "User name & Tag": "用户名称 & 钥匙扣",
    "User overview": "用户总览",
    "User successfully deleted.": "用户已被成功删除。",
    "User will have access to their locks in the event the site is offline. There are a maximum of 39 offline access rights available per site.": "当站点离线时用户将有权限开启他们的门锁。每个站点最多可以有39个离线访问权限。",
    "UserViaWeb": "用户通过网页",
    "Users": "用户",
    "Users can unlock locks in several ways; tags, mobile keys or pin for pin-locks. You can block any key if you need to.": "用户可以有几种方式开启门锁：钥匙扣，手机钥匙或者密码锁的 PIN 码。如果需要您可屏蔽任何钥匙。",
    "Users who are not in an access group can't unlock any door.": "不在访问组中的用户无法开启任何门锁。",
    "Users without email can't use mobile key or remote opening. You can still send an invite.": "无电子邮箱的用户不能使用手机钥匙或者远程开启。您仍然可以发送邀请。",
    "Validity": "有效性",
    "Verify that the lock has properly detached by presenting a construction card. The lock should open as normal.": "请用工程卡刷门锁以验证门锁已正确分离。门锁应能正常开启。",
    "Verify that the lock has properly detached by presenting a random tag. The lock should open with an orange LED.": "刷任意一个钥匙扣可检查门锁是否已被正确分离。门锁应被开启并显示橙色 LED。",
    "Voucher activated": "订购券已激活",
    "Voucher code": "订购券代码",
    "Voucher is not valid": "订购券无效",
    "Voucher is valid": "订购券有效",
    "WE": "三",
    "Wallreader": "读卡器",
    "Wallreader pin": "读卡器 PIN 码",
    "Warning": "警告",
    "Warnings": "警告",
    "Warnings will automatically disappear when the event is resolved or over, or you can discard them.": "当事件被解决或结束后警告会自动消失，或者您可不予理睬。",
    "Ways of opening": "开启方式",
    "We are happy to see that you started using SALTO KS. We need to mention; Web version of SALTO KS is for Admin purposes, and you are not an admin at the selected site. You can find all features that are available to you on our mobile app.": "很高兴您开始使用 SALTO KS 系统。我们需要提醒：SALTO KS 的网页程序是给管理员使用的，而您目前不是此站点的管理员。您可以在手机 App 上找到您可以使用的所有功能。",
    "We cannot find anyone": "未能找到任何人",
    "We expect to release this functionality early 2019. All previously created notifications will be saved and activated.": "我们预计在2019年初发布此功能。所有之前已生成的通知将会被保存和激活。",
    "We will send an email to site owner's email to notify you.": "我们会发送一封电子邮件至站点业主的邮箱来通知您。",
    "Wednesday": "周三",
    "Weekdays": "工作日",
    "What happens when you already make use of the Pod feature?": "当您已经在使用 Pod 功能会发生什么？",
    "What will happen to current Pods, Pod members and Pod guests after the BETA ends?": "在 BETA 测试期结束后，当前 Pods，Pod 成员和 Pod 客人将会发生什么？",
    "What's new?": "有啥新内容？",
    "What\\'s new?": "有啥新闻？",
    "When a repeater is successfully attached, it's LED will change from red or orange to blue.": "当中继器被成功附加后，LED 指示灯将由红色或橙色变成蓝色。",
    "When a repeater is successfully attached, it\\'s LED will change from red or orange to blue.": "当中继器被成功附加后，它的 LED 指示灯将从红色或橙色变成蓝色。",
    "When there is a Check-in / Check-out time frame set for the group you can't add a Custom schedule time frame. First, you should delete the Check-in / Check-out time frame.": "若此组已经有一个 登记 / 结账 时间段的设置，您将无法再添加一个定制的时间段。您需要先删除这个 登记 / 结账 时间段。",
    "When there is a Custom schedule set for the group you can't add a Check-in / Check-out time frame. First, you should delete the Custom schedule time frame.": "若此组已经有一个 登记 / 结账 时间段的设置，您将无法再添加一个定制的时间段。您需要先删除这个 登记 / 结账 时间段。",
    "When transferring ownership to another user, this will make you the administrator instead. Don\\'t forget to also change the payment data if needed.": "当转让业主关系给另一用户后，您将会转而成为管理员角色。如果需要，请勿忘记更改付款信息。",
    "When will we contact you when you are nearing the end of the BETA?": "当 BETA 测试期临近结束时，我们在何时联系您？",
    "When you are finished with adding tags click on stop.": "当您添加完钥匙扣后，点击停止。",
    "While the door is in office mode, anyone may enter without the need to present a tag. That is why it is referred to as “Free passage”. If you have a business and you want the doors to stay open to the public during certain hours, the easiest way to do so is to put access into Office Mode (free entry). Then, when your business day has ended, exit Office Mode.": "门锁处于办公室模式下，任何人进出无需刷钥匙扣，因此也被称作“自由通行”模式。如果您的业务需要在特定的时间段内对公众开放，最简单的方式就是将门锁设置成办公室模式（自由通行），当营业时间结束后，则将其退出办公室模式。",
    "Why is SALTO KS offering an extended BETA period for the Pod feature?": "为何 SALTO KS 要延长 Pod 功能 BETA 测试期？",
    "With the new Pod functionality building managers get the chance to outsource access control management to their tenants. This feature will help keep an overview of their buildings' operations and save them a lot of time.": "有了新的 Pod 功能，大厦经理可将对租户的门禁管理实行外包。此功能既可帮助他们总览大厦的运营又可节省大量的时间。",
    "With the new Pod functionality building managers get the chance to outsource access control management to their tenants. This feature will help keep an overview of their buildings\\' operations and save them a lot of time.": "Pod 功能使物业经理可将门禁管理权外包给他们的租户。此功能可有助于他们总览物业的运营并节省大量的时间。",
    "Would you like to renew or expand your subscription?": "您需要继续订购或延期吗？",
    "YES": "是",
    "Yes": "是",
    "You are about to block the Site Owner for this site. Tag of the site owner won't be blocked since it is the master key for this site. All other keys of this user (Pins, Mobile keys) will be blocked.": "您将要屏蔽的是此站点的业主。站点业主的钥匙扣是此站点的总钥匙，因此无法被屏蔽。而此用户的其他钥匙（Pin 码，手机钥匙）将会被屏蔽。",
    "You are about to block the Site Owner for this site. Tag of the site owner won\\'t be blocked since it is the master key for this site. All other keys of this user (Pins, Mobile keys) will be blocked.": "您将要屏蔽的是此站点业主。站点业主的钥匙扣是此站点的总钥匙，因此无法被屏蔽。此用户的其他钥匙（例如：Pin 码，手机钥匙）将会被屏蔽。",
    "You are about to block the Site Owner for this site. Tag of the site owner won’t be blocked since it is the master key for this site. All other keys of this user (Pins, Mobile keys) will be blocked.": "您将要屏蔽的是此站点的业主。由于业主的钥匙扣是这个站点的主钥匙将不会被屏蔽，而该用户的其他钥匙（PIN码，手机钥匙）将被屏蔽。",
    "You are about to clean Pod": "您将要清理 Pod",
    "You are about to clean the Pod": "您将要清理此 Pod",
    "You are about to delete Pod": "您将要删除 Pod",
    "You are about to delete the Pod": "您将要删除此 Pod",
    "You are about to delete the Pod guest": "您将要删除此 Pod 客人",
    "You are about to delete the Pod member": "您将要删除此 Pod 成员",
    "You are now being redirected to the login page.": "您正在被重新定向至登录页面。",
    "You are the owner of this Site. You can tranfer ownership if one of your users is an Administrator.": "您是此站点的业主。如果您的用户中有管理员用户，您可以转让业主关系。",
    "You are the owner of this site": "您是此站点的业主",
    "You are the owner of this system. You can tranfer ownership if one of your users is an Administrator.": "您是此系统的业主。您可以转让业主关系给系统中任意一个管理员用户。",
    "You are unsubscribed": "您未订购",
    "You can also do this later.": "您也可选择稍后添加。",
    "You can assign a different tag or you can unassign the current tag of the user.": "您可给用户分配一个不同的钥匙扣或者取消当前已分配的钥匙扣。",
    "You can assign a new tag for each Pod member. This can also be done later.": "您可为每个 Pod 成员分配一个钥匙扣。这也可以在以后完成。",
    "You can change the lock name. Make sure that the lock has a unique and easy to understand name.": "您可以更改门锁名称。请确保给门锁设置一个唯一的便于理解的名称。",
    "You can change the lock settings depending on your needs and preferences. Click on edit on each item to learn more.": "您可以根据需求和喜好更改门锁设置。点击每项的编辑以了解更多。",
    "You can create and receive on your e-mail an attendance report for your employees.": "您可生成并在邮箱里收到一份员工的出勤报告。",
    "You can define the maximum amount of guests Pod members can invite.": "您可指定 Pod 成员能邀请的客人的最多数量。",
    "You can define the maximum amount of guests that Pod members can invite.": "请您指定 Pod 可邀请的客人的最多数量。",
    "You can edit existing time frames or add new ones.": "您可编辑当前的或添加新的时间段。",
    "You can edit existing timeframes or add new ones.": "您可以编辑当前或添加一个新的时间段。",
    "You can edit the filter on the events page.": "您可在事件页面编辑筛选。",
    "You can edit the tag of this user from 'Keys' menu.": "您可以从“钥匙”菜单里编辑此用户的钥匙扣。",
    "You can edit the tag of this user from \\'Keys\\' menu.": "您可以在 \\'钥匙\\' 菜单里编辑此用户的钥匙扣。",
    "You can give an alias to the users to differentiate them better.": "您可以给用户设置一个别名以更好地区分他们。",
    "You can invite and manage Members. Guests can only be invited by Pod members.": "您可以邀请和管理成员。客人仅可由 Pod 成员邀请。",
    "You can limit the amount of guests that pod members can invite.": "您可以限制 Pod 成员可邀请的客人数量。",
    "You can set notifications for entries or rejections and you can receive notifications by email and from mobile app.": "您可以设置进入和被拒绝的事件通知，可通过手机 App 或者电子邮件接收通知。",
    "You can switch between them.": "您可以在它们之间切换。",
    "You can't change your own role nor delete your own profile.": "您不能变更自己的角色和删除自己的资料。",
    "You can\\'t change your own role nor delete your own profile.": "您无法变更自己的角色，也无法删除自己的资料。",
    "You don't have any Pods yet": "您尚未添加任何 Pod",
    "You don't have any access group yet": "您目前尚未有任何访问组",
    "You don't have any entry notifications yet.": "您目前尚未有任何进入通知。",
    "You don't have any locks to get notifications from.": "您未有任何门锁可获取通知。",
    "You don't have any locks yet": "您尚未添加任何门锁",
    "You don't have any locks yet.": "您目前没有添加任何门锁。",
    "You don't have any users yet": "您尚未添加任何用户",
    "You don\\'t have any Pods yet": "您尚未有任何 Pod",
    "You don\\'t have any access group yet": "您暂时无任何访问组",
    "You don\\'t have any entry notifications yet.": "您目前没有任何的进入通知。",
    "You don\\'t have any locks to get notifications from.": "您没有任何门锁可获取通知。",
    "You don\\'t have any locks yet": "您暂时没有任何门锁",
    "You don\\'t have any locks yet.": "您暂时没有任何门锁。",
    "You don\\'t have any users yet": "您暂时未有任何用户",
    "You don\\'t have any users yet.": "您暂时没有任何用户",
    "You may need make mention of your customer UID: ": "您可能需要提及您的客户 UID: ",
    "You will be notified before your BETA period ends, allowing you some time to decide whether you would like to purchase the Pod functionality or not.": "在 BETA 测试期结束前将会收到通知，让您有足够的时间决定是否订购 Pod 功能。",
    "You will be notified for all authorized openings performed on the selected locks.": "当对选中的门锁作任何授权开启的尝试时，您将会接收到通知。",
    "You will be notified for any unauthorized tag or mobile opening action performed on the selected locks.": "当对选中的门锁作任何未经授权的钥匙扣或者手机开启的尝试时，您将会接收到通知。",
    "You will receive a notification when selected people interact with the lock(s) you will define at the next step. Select one or more people from the list.": "当选中的人员在与您下一步要定义的门锁交互时，您将会收到通知。从此列表中选择一个或多个人员。",
    "You will receive a push notification from the SALTO KS mobile app. Don't forget to allow notification permissions on your mobile phone.": "您将会收到来自 SALTO KS 手机应用的推送通知。请务必在您的手机上开启允许通知权限。",
    "You will receive notification only if the events occur within the schedule you define.": "您将会收到在您定义的时间表内发生的事件的通知。",
    "You will receive notification whenever the events occur.": "事件发生时您将会收到通知。",
    "Your Site has no events to show": "您的站点无事件可查看",
    "Your Site has no hardware yet, start with adding an IQ first": "您的站点还未有任何硬件设备，请首先添加IQ",
    "Your filter(s) will be apllied to the export.": "你的筛选将被应用于导出",
    "Your filter(s) will be applied to the export.": "您的筛选将被应用于导出。",
    "Your installer is working on your site, therefore you cannot make any changes at this moment. Once the site is released, you will receive an email from your installer.": "安装商正在为您建立站点，因此您暂时无法做任何的系统更改。一旦站点建立完毕并移交，您将会收到安装商发送的一封电子邮件。",
    "Your site has no entries to show": "您的站点暂时没有进入可以显示",
    "Your site has no incidents to show": "您的站点暂无意外事件可显示",
    "Your site is not released yet.": "您的站点尚未移交。",
    "Your site needs to be set up": "您的站点需要被建立",
    "Your subscription will expire": "您的订购将过期",
    "Your subscription will expire soon": "您的订购很快将要过期",
    "Zimbabwe": "津巴布韦",
    "access group": "访问组",
    "access groups": "访问组",
    "access groups matching your search": "符合搜索的访问组",
    "add": "添加",
    "always": "总是",
    "any day": "任意一天",
    "assign a tag": "分配一个钥匙扣",
    "assigned on": "分配在",
    "battery": "电池",
    "can open": "可以开启",
    "can unlock doors.": "可开启门锁",
    "check in & check out": "登记 & 结账",
    "coming soon": "敬请期待",
    "connected": "已连接",
    "custom": "自定义",
    "day": "日",
    "day(s)": "日",
    "day(s) ago": "天前",
    "days": "日",
    "disabled": "禁用",
    "door_left_open_alarm_end": "结束门未关",
    "door_left_open_alarm_start": "门未关",
    "during any time": "在任何时间",
    "during multiple timeframes": "在多重时间表内",
    "easy_office_mode_end": "结束简易办公室模式",
    "easy_office_mode_end_by_mkey": "使用手机钥匙结束简易办公室模式",
    "easy_office_mode_end_by_tag": "使用钥匙扣结束简易办公室模式",
    "easy_office_mode_end_failed": "结束简易办公室模式失败",
    "easy_office_mode_end_remote": "远程结束简易办公室模式",
    "easy_office_mode_start_by_mkey": "使用手机钥匙启动简易办公室模式",
    "easy_office_mode_start_by_tag": "使用钥匙扣启动简易办公室模式",
    "easy_office_mode_start_remote": "远程启动简易办公室模式",
    "edit": "编辑",
    "edit tag": "编辑钥匙扣",
    "enabled": "启用",
    "export to csv.": "导出至 csv 文件。",
    "for the full day": "为此整天",
    "free entry": "自由通行",
    "from": "从",
    "from the group": "从此组中",
    "from your phone.": "从您的手机。",
    "groups": "分组",
    "guest": "客人",
    "guests": "客人",
    "has been successfully restored. All attached repeaters and locks will be connected in a minute.": "已经成功恢复。所有附加的中继器和门锁将会很快恢复连接。",
    "if a person has forgotten the PIN, that PIN can be reset per IQ.": "如果有人忘记 PIN 码，每个 IQ 可重置 PIN 码。",
    "in the group": "在此组中",
    "inside_handle": "内部把手",
    "interface": "界面",
    "intrusion_alarm_end": "结束入侵报警",
    "intrusion_alarm_start": "入侵报警",
    "iq_connection_lost": "IQ连接已失去",
    "iq_connection_restored": "IQ连接已恢复",
    "is already a part of your site": "已经是您站点中的一部分",
    "is currently attached to": "目前附加于",
    "is for BLUEnet locks and it consists of 14 characters.": "用于 BLUEnet 门锁，并由 14 个字符组成。",
    "is for RFnet locks and it consists of 8 characters.": "用于 RFnet 门锁，由 8 个字符组成。",
    "key(s)": "钥匙",
    "lock": "门锁",
    "lock(s) selected": "已选择的门锁",
    "lock(s) successfully added to the group.": "门锁已被成功加入这个组",
    "lock(s) successfully removed from the group.": "已成功从此组中移除的门锁",
    "lock_connection_lost": "门锁连接已失去",
    "lock_connection_restored": "门锁连接已恢复",
    "lock_time_set": "门锁时间设定",
    "locked": "已上锁",
    "locks": "门锁",
    "locks matching your search": "符合您搜索的门锁",
    "low_battery_warning": "低电量",
    "manage your subscription": "管理您的订购",
    "master key": "主钥匙",
    "member": "成员",
    "members": "成员",
    "members won't have access to their apartment or office anymore.": "成员将无法访问他们的公寓或办公室。",
    "members won\\'t have access to their apartment or office anymore.": "成员将无法继续访问其公寓或办公室。",
    "members won\\'t have access to their apartment or office anymore. Once you clean this Pod, the items below will be deleted.": "成员将不再有公寓或办公室的访问权。一旦您清理此 Pod，以下项目将会被删除。",
    "members won\\'t have access to their apartment or office anymore. Once you delete this Pod, the items below will also be deleted.": "成员将不再有访问公寓或办公室的权限。一旦您删除此 Pod，以下项目将会被删除。",
    "metallic_key": "机械钥匙",
    "mkey": "手机钥匙",
    "mkey_offline": "离线手机钥匙",
    "mkey_out_of_time": "手机钥匙超出时间",
    "mkey_rejected": "手机钥匙被拒绝",
    "mkey_rejected_blocked": "手机钥匙被拒绝已被屏蔽",
    "mkey_rejected_low_batteries": "手机钥匙被拒绝低电量",
    "mkey_rejected_no_access_group": "手机钥匙被拒绝无访问组",
    "mkey_rejected_offline": "手机钥匙被拒绝离线",
    "mkey_rejected_suspended": "手机钥匙被拒绝已暂停",
    "mobile key": "手机钥匙",
    "months": "月份",
    "name": "名称",
    "never (missing time schedules)": "永不（不符合时间表）",
    "next": "下一步",
    "no tag": "无钥匙扣",
    "no, cancel": "否，取消",
    "no, go back": "否，后退",
    "not connected": "未连接",
    "not in the group": "不在此组中",
    "office_mode_end_by_mkey": "使用手机钥匙结束办公室模式",
    "office_mode_end_by_tag": "使用钥匙扣结束办公室模式",
    "office_mode_end_remote": "远程结束办公室模式",
    "office_mode_end_remote_app": "使用App结束办公室模式",
    "office_mode_start_by_mkey": "使用手机钥匙启动办公室模式",
    "office_mode_start_by_tag": "使用钥匙扣启动办公室模式",
    "office_mode_start_remote": "远程启动办公室模式",
    "office_mode_start_remote_app": "用App启动办公室模式",
    "on": "在",
    "on any date on": "在任何日期",
    "open": "开启",
    "operation_not_completed": "操作未完成",
    "or": "或",
    "people": "人员",
    "person(s) successfully added to the group.": "已成功添加至此组的人员",
    "person(s) successfully removed from the group.": "已成功从此组中移除的人员",
    "persons": "人员",
    "persons max": "最多人数",
    "pin": "pin 码",
    "privacy_mode_end": "结束反锁模式",
    "privacy_mode_start": "开始反锁模式",
    "remote": "远程",
    "remote_app": "远程App",
    "repeater": "中继器",
    "request_to_exit": "外出请求",
    "restore iq": "恢复 iq",
    "retry": "再试",
    "roles": "角色",
    "save": "保存",
    "second": "秒",
    "seconds": "秒",
    "seconds to present your tags to the lock": "将钥匙扣置于门锁读卡器前的秒数",
    "selected": "已选择",
    "since": "自从",
    "step": "步骤",
    "step 1 / 1": "步骤 1 / 1",
    "stop": "停止",
    "subscribed persons": "已订购的人数",
    "successfully added to the group": "已成功添加至此组中",
    "successfully removed from the group": "已成功从此组中移除",
    "tag": "钥匙扣",
    "tag(s) successfully added to the site.": "钥匙扣已成功被添加至此站点。",
    "tag_offline": "离线钥匙扣",
    "tag_out_of_time": "钥匙扣超出时间",
    "tag_rejected": "钥匙扣被拒绝",
    "tag_rejected_blocked": "钥匙扣被拒绝，已屏蔽",
    "tag_rejected_low_batteries": "钥匙扣被拒绝低电量",
    "tag_rejected_no_access_group": "钥匙扣被拒绝，无访问组",
    "tag_rejected_offline": "钥匙扣被拒绝离线",
    "tag_rejected_suspended": "钥匙扣被拒绝，已暂停",
    "tamper_alarm_end": "结束防拆报警",
    "tamper_alarm_start": "防拆报警",
    "time frame": "时间段",
    "to": "至",
    "to open": "开启",
    "to the group": "至此组",
    "total persons": "总计人数",
    "unknown": "未知",
    "unlimited": "无限制",
    "user": "用户",
    "users": "用户",
    "users matching your search": "符合您的搜索的用户",
    "users, and expires on": "用户，和过期在",
    "will restore the connection with all attached hardware as it was.": "将会恢复与所有原附加的硬件的连接。",
    "yes, cancel": "是，取消",
    "your voucher expired. You can still manage access, but have no support.": "您的订购券已过期。您可继续管理门禁但将没有技术支持。"
}
