{
  "to": [
    {
      "email": "claudiu@harton.digital",
      "name": "Claudiu Harton",
      "phone": "0720543443"
    }
  ],
  "bcc": [],
  "selectedCamp": "https://www.pdf.ro/ro/tabere-si-evenimente/tabere-de-vara/supravietuire-montana-2023"
}
