<?xml version="1.0" encoding="utf-8"?>
<!-- Generator: Adobe Illustrator 22.1.0, SVG Export Plug-In . SVG Version: 6.00 Build 0)  -->
<svg version="1.1" id="Layer_1" xmlns="http://www.w3.org/2000/svg" xmlns:xlink="http://www.w3.org/1999/xlink" x="0px" y="0px"
	 viewBox="0 0 358.5 588.9" style="enable-background:new 0 0 358.5 588.9;" xml:space="preserve">
<style type="text/css">
	.st0{opacity:0.9;}
	.st1{fill:#B4B4B8;}
	.st2{fill:none;stroke:#902745;stroke-width:2.0612;stroke-miterlimit:10;}
	.st3{fill:#8F2443;}
	.st4{fill:url(#SVGID_1_);}
	.st5{fill:url(#SVGID_2_);}
	.st6{fill:url(#SVGID_3_);}
	.st7{fill:url(#SVGID_4_);}
	.st8{fill:url(#SVGID_5_);}
	.st9{fill:url(#SVGID_6_);}
	.st10{fill:url(#SVGID_7_);}
	.st11{fill:url(#SVGID_8_);}
	.st12{fill:url(#SVGID_9_);}
	.st13{fill:url(#SVGID_10_);}
	.st14{fill:url(#SVGID_11_);}
	.st15{fill:url(#SVGID_12_);}
	.st16{fill:url(#SVGID_13_);}
	.st17{fill:url(#SVGID_14_);}
	.st18{fill:url(#SVGID_15_);}
	.st19{fill:none;stroke:url(#SVGID_16_);stroke-width:2.0612;stroke-miterlimit:10;}
</style>

<g id="Lg_1_" class="st0">
	<g id="Fete_1_">
		<g id="Baiat_1_">
			<g>
				<g>
					<g>
						<g>
							<path class="st1" d="M70.2,261.1c-1.2,2.5-2.2,5.1-3,7.8c-0.8,2.6-1.1,5.4-1.3,8.1c-0.3,2.8-0.3,5.4-0.1,8.2
								c0.2,2.8,0.4,5.6,0.5,8.4c0.2,5.6,0.2,11.3,0,16.9c-0.1,2.8-0.3,5.7-0.6,8.5c-0.4,2.9-1,5.8-2.1,8.6
								c-2.4,5.5-6.1,10.1-9.7,14.3c-3.7,4.3-7.6,8.3-11.6,12.2c-2,2-4.1,3.9-6,5.9s-3.7,4.1-5.5,6.2c-1.9,2.1-3.7,4.2-5.6,6.2
								c-1.9,2-3.4,4.3-4.3,7c0.5-2.8,1.7-5.4,3.5-7.7c1.7-2.2,3.3-4.5,4.9-6.8c1.7-2.2,3.4-4.5,5.2-6.7c1.9-2.2,3.7-4.2,5.6-6.3
								c3.7-4.2,7.5-8.3,11-12.5s6.9-8.6,8.8-13.4c2-4.7,2.4-10.3,2.8-15.8c0.3-5.5,0.5-11.1,0.6-16.6c0.1-2.8,0-5.5,0-8.4
								c0-2.8,0.2-5.8,0.7-8.5c0.6-2.8,1.2-5.6,2.3-8.2C67.2,265.9,68.6,263.4,70.2,261.1z"/>
						</g>
					</g>
				</g>
			</g>
			<g>
				<g>
					<g>
						<g>
							<path class="st1" d="M20.9,378.8c-0.2,2.2-0.1,4.5,0.9,6.2c0.4,0.8,1,1.6,1.8,2c0.7,0.5,1.7,0.8,2.7,1c1,0.3,2.1,0.6,3.1,0.8
								c1,0.2,1.9,0.3,3,0.4s2.4,0.3,3.6,0.6c1.2,0.3,2.3,0.7,3.4,1.1c2.2,1,4.2,2.3,6,3.5c0.9,0.6,1.9,1.2,2.8,2.1
								c0.5,0.4,1,0.9,1.4,1.4c0.4,0.6,0.7,1.2,1,1.8c1,2.4,1.1,5,0.8,7.3c-0.2,1.2-0.5,2.2-0.9,3.3c-0.4,1.1-0.8,2.1-1.4,3.1
								c0.2-1.1,0.3-2.2,0.3-3.3c0-1.1,0.1-2.2-0.1-3.3c-0.1-2.1-0.5-4.1-1.6-5.7c-0.5-0.8-1-1.3-1.8-1.9c-0.8-0.5-1.7-1.1-2.7-1.7
								c-1.9-1.2-3.7-2.2-5.6-2.9c-0.9-0.4-1.9-0.8-2.9-1.1c-1-0.3-1.9-0.5-3-0.7c-1.1-0.1-2.4-0.4-3.5-0.7
								c-1.2-0.4-2.2-0.8-3.2-1.3c-1.1-0.5-2.2-1.1-3.2-2s-1.7-2.1-2.1-3.3C19.4,383.2,19.9,380.8,20.9,378.8z"/>
						</g>
					</g>
				</g>
			</g>
			<g>
				<g>
					<path class="st2" d="M49.2,413.4"/>
				</g>
			</g>
			<g>
				<g>
					<g>
						<g>
							<path class="st1" d="M51,413c-1.2,0.6-2.4,1.3-3.1,2.2c-0.4,0.4-0.8,0.9-1.1,1.4c-0.3,0.5-0.6,1-0.7,1.5
								c-0.3,1-0.3,1.7,0.1,2.4c0.3,0.6,1.1,1.3,2.1,1.7c1,0.7,1.8,1,3,1.2c1.1,0.2,2.6,0.3,4,0.6c1.4,0.4,2.7,0.8,4,1.3
								c1.3,0.7,2.5,1.3,3.6,2.1c-1.4,0-2.7-0.2-4.1-0.2c-1.3-0.1-2.6-0.2-3.9-0.1c-1.3,0-2.5,0.1-4,0c-0.8-0.1-1.6-0.2-2.4-0.4
								c-0.4-0.1-0.8-0.3-1.2-0.4c-0.4-0.2-0.7-0.3-1-0.5c-1.3-0.8-2.8-1.9-3.5-3.8c-0.4-0.9-0.5-1.9-0.4-2.9s0.5-1.8,0.9-2.5
								c0.5-0.7,1-1.3,1.6-1.8s1.2-1,1.9-1.3C48.1,413.1,49.6,412.8,51,413z"/>
						</g>
					</g>
				</g>
			</g>
			<g>
				<g>
					<g>
						<g>
							<path class="st1" d="M53.4,427.4c-1,0.5-1.9,0.9-2.6,1.5c-0.8,0.5-1.4,1.1-1.9,1.7c-0.2,0.3-0.4,0.6-0.6,0.9
								s-0.4,0.7-0.5,1.1c-0.3,0.7-0.4,1.4-0.3,1.7c0,0.3,0.1,0.6,0.6,0.9s1.3,0.6,2.2,0.8c0.2,0.1,0.5,0.1,0.7,0.2s0.4,0.1,0.6,0.2
								c0.4,0.1,0.9,0.1,1.3,0.2c0.9,0.2,1.9,0.1,3,0c-0.7,0.9-1.6,1.4-2.6,1.9c-0.5,0.2-1.1,0.3-1.6,0.4c-0.3,0.1-0.6,0.1-0.9,0.1
								s-0.5,0.1-0.8,0.1c-1.1,0-2.3-0.1-3.6-0.7c-0.6-0.3-1.3-0.7-1.8-1.4c-0.5-0.6-0.9-1.4-1.1-2.3c-0.1-1.7,0.4-3,1-4
								c0.3-0.5,0.7-1,1.1-1.5s0.9-0.9,1.4-1.2c1.1-0.6,2.2-1,3.3-1.2C51.3,426.9,52.3,426.9,53.4,427.4z"/>
						</g>
					</g>
				</g>
			</g>
			<g>
				<g>
					<g>
						<g>
							<path class="st1" d="M46.9,438.9c1.1,3.1,2.5,6,4.3,8.7c0.4,0.7,0.9,1.4,1.3,2.2c0.4,0.8,0.6,1.6,0.9,2.4
								c0.5,1.6,0.6,3.4,0.7,5c0,1.6,0,3.3-0.2,5c-0.3,1.7-0.6,3.2-0.6,4.7c-0.1,3,0.4,6.3,1.6,8.9c1.1,2.5,3.5,4.2,6.3,5.3
								s5.9,1.6,9,2.1c3.2,0.4,6.3,0.7,9.5,0.8s6.3,0,9.5-0.3c6.4-0.4,12.9-1.3,19.4-1.7c6.5-0.5,13.1-0.6,19.6-0.5
								c3.2,0.1,6.5,0.1,9.6-0.1c1.6-0.1,3.1-0.4,4.6-0.8c1.5-0.4,2.9-1,4.3-1.7c5.7-2.7,10.4-7.4,14-12.8
								c-2.8,5.9-7.3,11-13.1,14.5c-1.5,0.8-3,1.6-4.6,2.1s-3.3,0.9-5,1.1c-3.3,0.4-6.6,0.5-9.9,0.7c-6.5,0.2-12.9,0.5-19.3,1.1
								c-6.4,0.5-12.8,1.5-19.4,2.1c-3.3,0.2-6.6,0.3-10,0.1c-3.3-0.2-6.6-0.5-9.9-1s-6.6-1.1-9.9-2.5c-1.6-0.7-3.2-1.6-4.6-2.8
								s-2.6-2.8-3.2-4.6c-0.6-1.7-1-3.4-1.2-5.1c-0.2-1.7-0.2-3.4-0.1-5.1s0.6-3.5,0.9-4.9c0.3-1.5,0.4-3,0.5-4.7
								c0.2-3.2-0.2-6.3-1.8-9C48.7,445.2,47.6,442.1,46.9,438.9z"/>
						</g>
					</g>
				</g>
			</g>
			<g>
				<g>
					<g>
						<g>
							<path class="st1" d="M105.2,488.7c4.4,0.2,8.8,1.5,13,3.5c4,2.1,7.7,4.9,10.8,8.3c1.6,1.7,3,3.5,4.2,5.5
								c1.2,1.9,2.3,4,3.2,6.1c1.8,4.3,2.8,8.9,2.8,13.7c-0.1,2.4-0.6,4.8-1.3,7c-0.6,2.2-1.2,4.1-1.3,6.1c-0.1,2,0,4.1,0.4,6.1
								c0.3,2,1.2,3.8,2,6s1.2,4.6,1.3,6.9c0.1,2.3-0.1,4.6-0.6,6.9c-1.1,4.4-3,8.6-5.6,12.2c1.7-4.1,3.2-8.3,3.6-12.6
								c0.5-4.2,0.1-8.6-1.6-12.3c-0.4-0.9-0.9-1.9-1.4-3s-0.9-2.2-1.1-3.4c-0.5-2.3-0.8-4.6-0.7-7.1c0.1-2.4,0.7-4.8,1.3-6.9
								c0.6-2.1,0.9-4,0.9-6.1c0.2-4.1-0.6-8.3-2.1-12.2c-0.8-2-1.7-3.8-2.8-5.7c-1.1-1.8-2.2-3.6-3.6-5.3c-2.6-3.3-5.8-6.3-9.4-8.6
								C113.6,491.6,109.5,489.9,105.2,488.7z"/>
						</g>
					</g>
				</g>
			</g>
			<g>
				<g>
					<g>
						<g>
							<path class="st1" d="M108.6,266.1c-5.1,0.7-10.2,0.8-15.3,0.9c-5.1-0.1-10.2-0.5-15.3-1.2c-5.1-0.7-10.1-1.8-15.1-3.2
								c-2.5-0.7-5-1.6-7.4-2.6c-2.4-1.1-4.9-2.4-7-4.4c-2.1-2-3.6-4.6-4.4-7.3c-0.4-1.3-0.7-2.6-1-3.8c-0.3-1.2-0.6-2.3-1-3.4
								c-0.8-2.2-2.1-4.3-3.4-6.2c-1.4-1.9-3.1-3.4-5.1-5.1s-3.8-3.8-5.2-6.1c-1.4-2.3-2.3-4.8-2.9-7.4c-1.1-5.2-0.9-10.4,0-15.4
								c0,5.1,0.3,10.2,1.9,14.8c0.7,2.3,1.8,4.6,3.2,6.5c1.4,2,3,3.6,5,5.1s4.2,3.3,5.9,5.4c1.7,2.1,3.1,4.4,4.1,7
								c1.1,2.5,1.5,5.3,2.2,7.4s2,4.1,3.5,5.5c1.6,1.5,3.6,2.8,5.8,3.8c2.2,1,4.5,1.8,6.9,2.6c4.8,1.5,9.6,2.7,14.5,3.7
								s9.9,1.8,14.9,2.3C98.5,265.6,103.5,265.9,108.6,266.1z"/>
						</g>
					</g>
				</g>
			</g>
			<g>
				<g>
					<g>
						<g>
							<path class="st1" d="M28.4,198.1c6,0,12-0.2,17.9-0.9c5.9-0.5,11.8-1.5,17.6-2.9c5.8-1.4,11.5-3.1,17.4-4.4
								c5.9-1.3,11.9-2.4,18-3.1c6.1-0.5,12.1-0.7,18.2-0.7c6,0,12,0,18.1,0.4c6,0.4,12,0.9,18,1.7c6,0.9,11.9,1.8,17.8,3.2
								c-6-0.4-12-1-18-1.2c-6-0.4-11.9-0.5-17.9-0.5s-11.9,0.1-17.9,0.2c-6,0.1-11.9,0.4-17.8,1c-5.9,0.5-11.8,1.4-17.6,2.6
								c-5.8,1.2-11.6,2.7-17.6,3.8s-12.1,1.7-18.1,1.8C40.4,199.2,34.3,199,28.4,198.1z"/>
						</g>
					</g>
				</g>
			</g>
			<g>
				<g>
					<g>
						<g>
							<path class="st1" d="M115.4,281.9c-0.8,2.6-1.4,5.2-1.7,7.9c-0.3,2.7-0.5,5.3-0.2,8c0.2,2.6,0.6,5.2,1.3,7.7
								c0.8,2.5,1.8,4.9,3.2,7c2.6,4.4,6.4,8.1,10.8,10.8c1.1,0.7,2.2,1.3,3.4,1.8c0.6,0.3,1.2,0.5,1.8,0.8l0.9,0.3l0.6,0.2l0.6,0.3
								c2.4,1.3,4.9,2.6,7.2,4c1.7,1.1,3.5,2.3,5.1,3.6c0.9,0.7,1.7,1.5,2.4,2.2c0.4,0.4,0.7,0.8,1.1,1.2l0.5,0.6
								c0.2,0.2,0.3,0.4,0.5,0.7c2,3,3.6,6.4,4.2,10c0.3,1.8,0.4,3.7,0.2,5.5c-0.2,1.8-0.6,3.7-1.3,5.4c-0.5,1.3-1.1,2.6-1.5,3.7
								s-0.4,2,0,2.9c0.1,0.2,0.2,0.3,0.3,0.5c0.1,0.1,0.4,0.3,0.6,0.5c0.5,0.4,1.1,0.7,1.7,1.1c1.1,0.7,2.3,1.5,3.4,2.2
								c1.1,0.8,2.2,1.6,3.3,2.4c1.1,0.8,2.1,1.7,3.2,2.5c0.5,0.4,1.1,0.7,1.6,0.7c0.6,0.1,1.2,0.1,1.8-0.1c1.2-0.3,2.3-1.2,3.2-2.2
								c-0.7,1.2-1.7,2.2-3,2.8c-0.7,0.3-1.4,0.4-2.1,0.4c-0.8,0-1.5-0.3-2.1-0.7c-1.2-0.7-2.3-1.5-3.5-2.1c-1.1-0.7-2.3-1.3-3.5-2
								s-2.3-1.3-3.5-1.9c-0.6-0.3-1.2-0.6-1.8-1c-0.3-0.2-0.6-0.4-1-0.7c-0.4-0.3-0.7-0.7-0.9-1.1c-0.4-0.8-0.7-1.6-0.8-2.5
								c-0.1-0.9,0-1.7,0.2-2.5c0.4-1.5,0.9-2.7,1.3-4c1-3,1.1-6.1,0.5-9.2c-0.6-3-2-5.9-3.8-8.5l-0.4-0.5l-0.4-0.5
								c-0.3-0.4-0.6-0.7-0.9-1c-0.7-0.7-1.3-1.3-2.1-1.8c-1.5-1.1-3.2-2.2-4.9-3.2c-2.2-1.4-4.5-2.8-6.9-4
								c-0.4-0.2-0.2-0.1-0.7-0.3l-1-0.4c-0.7-0.3-1.3-0.6-1.9-0.9c-1.3-0.6-2.5-1.3-3.7-2.1c-4.8-3.1-8.9-7.3-11.5-12.4
								c-1.4-2.5-2.3-5.2-2.9-7.9c-0.6-2.8-0.9-5.6-0.8-8.3c0.1-2.8,0.5-5.5,1.2-8.2C113.2,286.9,114.1,284.3,115.4,281.9z"/>
						</g>
					</g>
				</g>
			</g>
		</g>
		<g id="Fata_1_">
			<g>
				<g>
					<g>
						<g>
							<g>
								<path class="st3" d="M292.8,263c3,3.8,5.3,8.1,7.3,12.5c1.8,4.5,3.2,9.3,3.9,14.1c0.7,4.9,0.7,9.7,1,14.4
									c0.3,4.7,0.8,9.4,1.6,14.1c0.6,4.7,1.1,9.5,2.2,13.9c0.6,2.2,1.4,4.1,2.7,6l0.4,0.7l0.5,0.7l1,1.3c0.8,0.8,1.5,1.7,2.4,2.4
									c3.3,3.1,7.4,5.5,11.7,7.3c4.3,1.9,8.9,3.1,13.6,4.2c-4.8-0.1-9.6-1-14.3-2.3c-4.6-1.5-9.2-3.6-13.1-6.8
									c-1-0.7-1.9-1.7-2.8-2.6l-1.2-1.4l-0.6-0.7l-0.5-0.8l-1.1-1.6c-0.3-0.6-0.7-1.1-0.9-1.7c-0.6-1.2-1-2.4-1.4-3.6
									c-1.4-4.9-1.9-9.7-2.7-14.4c-0.6-4.8-1.1-9.6-1.2-14.5c-0.2-4.8-0.1-9.6-0.4-14.3c-0.2-4.7-1.2-9.3-2.6-13.8
									C296.9,271.7,295,267.3,292.8,263z"/>
							</g>
						</g>
					</g>
				</g>
				<g>
					<g>
						<g>
							<g>
								<path class="st3" d="M345.6,358.5c1,1.2,1.7,2.7,2.1,4.3c0.2,1.7,0,3.4-0.6,5.1c-0.6,1.6-1.6,3-2.7,4.2
									c-1.1,1.2-2.2,2.3-3.2,3.4c-1.2,1-2.5,2-3.8,2.8c-1.3,0.9-2.6,1.6-3.1,2.2c-0.3,0.3-0.5,0.8-0.6,1.4s0,1.2,0.1,1.8
									c0.2,1.4,0.9,2.7,1.5,4.1c-1.3-0.8-2.4-2-3.4-3.4c-0.8-1.5-1.3-3.5-0.4-5.5c0.5-1,1.2-1.7,1.8-2.2c0.6-0.6,1.2-1,1.8-1.5
									c1.1-0.9,2.2-1.8,3.2-2.9c2.3-1.9,4.4-3.8,5.8-5.9c0.7-1.1,1.2-2.3,1.4-3.6C346,361.5,345.8,360,345.6,358.5z"/>
							</g>
						</g>
					</g>
				</g>
				<g>
					<g>
						<g>
							<g>
								<path class="st3" d="M338.3,390c1.4-0.2,2.9,0.3,4.1,1.5c1.1,1.2,1.6,2.9,1.8,4.4s0,3-0.4,4.4c-0.3,1.4-0.8,2.8-1.5,4.2
									c-1.6,2.6-3.7,4.7-6.1,6.1c-1.2,0.7-2.5,1.4-3.8,1.9c-1.4,0.4-2.7,0.7-4.1,0.8c1.1-0.9,2.2-1.6,3.1-2.5
									c1-0.8,1.9-1.6,2.8-2.6c1.8-1.8,3.5-3.5,4.5-5.6c0.6-1,1.1-2,1.5-3.2c0.4-1.1,0.7-2.3,0.8-3.4c0.2-1.1,0.2-2.2-0.2-3.2
									C340.5,391.6,339.5,390.7,338.3,390z"/>
							</g>
						</g>
					</g>
				</g>
				<g>
					<g>
						<g>
							<g>
								<path class="st3" d="M331.5,412.7c1.4-1,3.2-1.5,5.1-1.6c1.9,0,3.8,0.5,5.5,1.5s3,2.6,4,4.2c0.9,1.5,1.8,3.3,2.2,5.3
									c0.1,1,0.1,2.1,0,3.1c-0.1,0.5-0.2,1-0.4,1.6c-0.2,0.5-0.4,1-0.6,1.4c-0.9,1.8-2.3,3.3-3.9,4.3c-1.6,1-3.3,1.7-5.1,2.1
									c-1.8,0.2-3.6,0.2-5.3-0.3c1.7-0.4,3.3-0.8,4.7-1.6c1.4-0.7,2.7-1.6,3.8-2.6s1.9-2.2,2.4-3.5c0.1-0.3,0.2-0.6,0.3-1
									c0.1-0.3,0.1-0.6,0.2-0.9c0.1-0.6,0-1.3-0.1-1.9c-0.1-1.3-0.7-2.7-1.4-4.1c-0.7-1.3-1.5-2.5-2.5-3.4c-1-1-2.4-1.7-3.9-2.1
									C334.9,412.6,333.2,412.6,331.5,412.7z"/>
							</g>
						</g>
					</g>
				</g>
				<g>
					<g>
						<g>
							<g>
								<path class="st3" d="M335.8,438.1c1,4.8,0.8,9.8,0.1,14.7c-0.8,4.9-2.4,9.7-5,14.1c-1.3,2.2-3,4.2-5.1,5.9
									c-1,0.9-2.2,1.7-3.4,2.2c-1.2,0.6-2.5,1-3.8,1.3c-2.5,0.6-5,0.9-7.5,1.2c-2.5,0.2-4.9,0.4-7.3,0.6
									c-9.8,0.5-19.6,0.3-29.3-0.7c-4.9-0.5-9.7-1.2-14.5-1.9c-4.8-0.9-9.6-1.8-14.3-3c4.9,0.3,9.7,0.8,14.5,1
									c4.8,0.4,9.7,0.6,14.5,0.8c9.7,0.3,19.3,0.6,28.9-0.2c4.8-0.2,9.7-0.4,14.2-1.3c2.2-0.5,4.2-1.2,5.8-2.6
									c1.8-1.3,3.3-3,4.7-4.9c2.7-3.7,4.5-8.2,5.7-12.8C335.3,447.7,335.9,442.9,335.8,438.1z"/>
							</g>
						</g>
					</g>
				</g>
				<g>
					<g>
						<g>
							<g>
								<path class="st3" d="M157.4,190.9c7.8,0.6,15.6,1.2,23.5,1.5c7.8,0.4,15.6,0.4,23.5,0.5c15.7,0,31.4,0.6,47.1,2.5
									c3.9,0.6,7.8,1.1,11.8,2c4,1,7.8,2.5,11.4,4.5c1.8,1,3.5,2.2,5.1,3.5s3.1,2.7,4.4,4.2c2.7,3,5.1,6.4,6.9,10.1
									c1.7,3.7,2.8,7.7,3.2,11.8c0.4,4,0.2,8.1-0.5,12c-0.8,3.9-2,7.7-3.5,11.4c-1.5,3.6-3.3,7.2-5.6,10.4
									c1.8-3.5,3.3-7.1,4.5-10.8c1.2-3.7,2.1-7.5,2.5-11.3c1-7.6,0-15.5-3.5-22.1c-1.7-3.3-4-6.3-6.6-9.1
									c-1.3-1.4-2.7-2.6-4.2-3.8c-1.4-1.1-3-2.2-4.6-3.1c-3.3-1.8-6.8-3.1-10.5-4c-3.6-0.9-7.5-1.3-11.4-1.8
									c-15.4-2.2-31-2.7-46.7-3.5c-7.8-0.4-15.7-0.8-23.5-1.6C172.9,193.5,165.1,192.4,157.4,190.9z"/>
							</g>
						</g>
					</g>
				</g>
				<g>
					<g>
						<g>
							<g>
								<path class="st3" d="M292.6,229.9c1,2.7,1.6,5.5,2.2,8.2c0.5,2.8,0.9,5.6,1.2,8.4c0.7,5.6,0.8,11.4,0.2,17.2
									c-0.9,5.7-2.5,11.4-5.2,16.6c-1.4,2.6-2.9,5-4.6,7.3c-1.8,2.2-3.7,4.4-5.9,6.2c1.5-2.4,2.9-4.8,4.2-7.3
									c1.3-2.4,2.5-4.9,3.4-7.5c2-5.1,3.4-10.4,4-15.8c0.9-5.4,0.7-10.9,0.7-16.5c0-2.8,0-5.6-0.1-8.4
									C292.9,235.5,292.7,232.7,292.6,229.9z"/>
							</g>
						</g>
					</g>
				</g>
				<g>
					<g>
						<g>
							<g>
								<path class="st3" d="M241.8,572c-2.5-3.4-4.4-7.2-6.2-11.1c-1.7-3.9-3-8-4-12.2c-0.9-4.2-1.5-8.5-1.6-12.8s0.2-8.6,0.8-12.9
									c0.7-4.2,1.6-8.4,2.5-12.5c0.9-4.2,2-8.3,3.4-12.3s3-8,4.7-11.9c1.9-3.8,3.7-7.6,6-11.2c-1.4,4-2.9,7.9-4.1,11.9
									c-1.3,4-2.5,8-3.5,12s-2,8.1-2.8,12.2c-0.8,4.1-1.6,8.2-2.2,12.3c-1.4,8.1-1.4,16.4-0.2,24.5c0.6,4.1,1.5,8.1,2.7,12.1
									C238.6,564.2,240.1,568.1,241.8,572z"/>
							</g>
						</g>
					</g>
				</g>
			</g>
			<g>
				<g>
					<g>
						<g>
							<path class="st3" d="M282.2,205.7c4.9,7,8.6,15,10.2,23.5c0.8,4.3,1.1,8.6,0.8,12.9c-0.3,4.3-1.2,8.6-2.5,12.8
								c-2.7,8.3-6.7,15.9-10.6,23.6s-8,15.2-12.6,22.5c-2.3,3.6-4.7,7.2-7.2,10.8c-2.6,3.4-5.1,6.9-7.7,10.3
								c-5.2,6.8-10.6,13.5-16.3,20c-11.2,13.1-23.8,24.8-33.3,38.8c-4.8,6.9-9.2,14.2-13,21.8c-3.9,7.5-7,15.4-9.8,23.4
								c-5.5,16-8.9,32.8-11,49.7c-0.2,2.1-0.5,4.2-0.5,6.3c0,1-0.1,2.1-0.1,3.1v3.2c0.1,4.2,0.5,8.4,1.1,12.6
								c1.1,8.4,2.8,16.9,2.9,25.6c0.1,4.3-0.3,8.7-0.9,12.9l-0.6,3.2c-0.2,1.1-0.4,2.1-0.7,3.2l-0.8,3.1l-0.4,1.6l-0.5,1.5
								c-2.5,8.2-5.9,16.2-10.1,23.6c3.8-7.7,6.9-15.7,9.1-23.9l0.4-1.5l0.3-1.6l0.7-3.1c0.3-1,0.4-2.1,0.5-3.1l0.5-3.1
								c0.4-4.2,0.7-8.4,0.4-12.7c-0.3-8.5-2.1-16.8-3.4-25.3c-0.7-4.2-1.2-8.6-1.4-12.9l-0.1-3.3c0-1.1,0-2.2,0-3.3
								c0-2.2,0.2-4.4,0.4-6.5c1.8-17.1,5.1-34.1,10.6-50.5c2.8-8.2,6-16.2,9.9-24c3.9-7.7,8.3-15.2,13.2-22.4
								c5-7.1,10.6-13.7,16.5-20c5.8-6.3,11.7-12.5,17.3-18.9c5.6-6.4,11-13,16.3-19.7c2.7-3.3,5.2-6.8,7.8-10.1
								c2.5-3.4,4.9-6.9,7.3-10.5c4.7-7.1,9-14.4,13-22c4-7.5,8.1-15,10.9-23c2.9-7.9,3.9-16.5,2.6-24.9
								C290.1,221,286.7,213,282.2,205.7z"/>
						</g>
					</g>
				</g>
			</g>
		</g>
	</g>
	<g id="Coronita_1_">
		<g>
			
				<linearGradient id="SVGID_1_" gradientUnits="userSpaceOnUse" x1="50.7543" y1="561.1365" x2="290.0102" y2="561.1365" gradientTransform="matrix(1 0 0 -1 0 667.2756)">
				<stop  offset="0" style="stop-color:#B4B4B8"/>
				<stop  offset="0.221" style="stop-color:#B3B2B6"/>
				<stop  offset="0.3006" style="stop-color:#B1ABB0"/>
				<stop  offset="0.3574" style="stop-color:#AEA0A5"/>
				<stop  offset="0.4032" style="stop-color:#A98F95"/>
				<stop  offset="0.4425" style="stop-color:#A37980"/>
				<stop  offset="0.4767" style="stop-color:#9B5E68"/>
				<stop  offset="0.5" style="stop-color:#944752"/>
				<stop  offset="0.5513" style="stop-color:#92384C"/>
				<stop  offset="0.6223" style="stop-color:#902D47"/>
				<stop  offset="0.7223" style="stop-color:#8F2644"/>
				<stop  offset="1" style="stop-color:#8F2443"/>
			</linearGradient>
			<path class="st4" d="M73.2,99.8c1.5,2.4,3,4.7,4.9,6.6c1.8,2,3.8,3.8,6,5.2c2.3,1.5,4.5,2.9,6.9,3.8c2.3,0.9,4.8,1.2,7.1,0.7
				c2.3-0.3,4.6-1.4,6.5-3s3.6-3.6,5.1-5.8s2.7-4.6,3.6-7.1c1-2.5,1.5-5.2,1.8-8c0.6,2.7,0.5,5.6,0.1,8.5c-0.6,2.8-1.5,5.5-2.9,8.1
				c-1.3,2.6-3.1,5-5.4,7c-2.2,2-5.1,3.5-8.2,4.1c-3.1,0.5-6.4-0.1-9.1-1.2c-2.8-1.2-5.2-2.9-7.3-4.7c-2.2-1.9-4.2-4.1-5.8-6.4
				C75.1,105.1,73.9,102.5,73.2,99.8z"/>
		</g>
		<g>
			
				<linearGradient id="SVGID_2_" gradientUnits="userSpaceOnUse" x1="50.7543" y1="573.8839" x2="290.0102" y2="573.8839" gradientTransform="matrix(1 0 0 -1 0 667.2756)">
				<stop  offset="0" style="stop-color:#B4B4B8"/>
				<stop  offset="0.221" style="stop-color:#B3B2B6"/>
				<stop  offset="0.3006" style="stop-color:#B1ABB0"/>
				<stop  offset="0.3574" style="stop-color:#AEA0A5"/>
				<stop  offset="0.4032" style="stop-color:#A98F95"/>
				<stop  offset="0.4425" style="stop-color:#A37980"/>
				<stop  offset="0.4767" style="stop-color:#9B5E68"/>
				<stop  offset="0.5" style="stop-color:#944752"/>
				<stop  offset="0.5513" style="stop-color:#92384C"/>
				<stop  offset="0.6223" style="stop-color:#902D47"/>
				<stop  offset="0.7223" style="stop-color:#8F2644"/>
				<stop  offset="1" style="stop-color:#8F2443"/>
			</linearGradient>
			<path class="st5" d="M118.3,90.4c1.7,2.4,3.6,4.6,5.8,6.3c2.1,1.9,4.5,3.4,7,4.6c5,2.3,10.6,3.1,15.8,1.7c2.6-0.5,5.2-1.6,7.5-3
				c2.4-1.5,4.5-3.1,6.3-5.1s3.2-4.4,4-7.1c0.9-2.6,1.2-5.5,1.1-8.5c1,2.8,1.2,5.9,0.8,8.9c-0.5,3-1.7,6-3.5,8.6s-4.2,4.6-6.8,6.3
				c-2.6,1.7-5.5,3-8.5,3.8c-3.1,0.6-6.3,0.8-9.4,0.3s-6.1-1.5-8.7-3.1s-4.9-3.6-6.9-5.9C120.9,95.7,119.3,93.2,118.3,90.4z"/>
		</g>
		<g>
			
				<linearGradient id="SVGID_3_" gradientUnits="userSpaceOnUse" x1="50.7543" y1="584.7966" x2="290.0102" y2="584.7966" gradientTransform="matrix(1 0 0 -1 0 667.2756)">
				<stop  offset="0" style="stop-color:#B4B4B8"/>
				<stop  offset="0.221" style="stop-color:#B3B2B6"/>
				<stop  offset="0.3006" style="stop-color:#B1ABB0"/>
				<stop  offset="0.3574" style="stop-color:#AEA0A5"/>
				<stop  offset="0.4032" style="stop-color:#A98F95"/>
				<stop  offset="0.4425" style="stop-color:#A37980"/>
				<stop  offset="0.4767" style="stop-color:#9B5E68"/>
				<stop  offset="0.5" style="stop-color:#944752"/>
				<stop  offset="0.5513" style="stop-color:#92384C"/>
				<stop  offset="0.6223" style="stop-color:#902D47"/>
				<stop  offset="0.7223" style="stop-color:#8F2644"/>
				<stop  offset="1" style="stop-color:#8F2443"/>
			</linearGradient>
			<path class="st6" d="M118.3,90.4c1.5-1.7,2.4-3.7,2.4-5.7c0.2-2-0.4-4-1.5-5.4c-1.1-1.5-2.7-2.5-4.4-3c-1.7-0.5-3.5-0.2-5,0.6
				c-1.6,0.7-2.9,2.1-3.6,3.7s-0.8,3.5-0.3,5.2c0.3,0.9,0.7,1.8,1.2,2.6c0.3,0.4,0.6,0.8,0.9,1.1c0.4,0.3,0.7,0.6,1.1,0.9
				c1.6,1.2,3.8,1.7,6,1.7c-2.1,0.9-4.6,0.8-6.9,0c-0.6-0.2-1.1-0.5-1.6-0.9c-0.6-0.4-1-0.8-1.4-1.2c-0.9-0.9-1.6-1.9-2.2-3.1
				c-1.1-2.3-1.2-5.3-0.2-7.7c0.9-2.5,2.8-4.6,5.2-5.9c2.5-1.2,5.3-1.4,7.9-0.6c2.5,0.8,4.7,2.5,6,4.8s1.5,5,0.9,7.4
				C121.9,87.4,120.4,89.4,118.3,90.4z"/>
		</g>
		<g>
			
				<linearGradient id="SVGID_4_" gradientUnits="userSpaceOnUse" x1="50.7543" y1="595.3356" x2="290.0102" y2="595.3356" gradientTransform="matrix(1 0 0 -1 0 667.2756)">
				<stop  offset="0" style="stop-color:#B4B4B8"/>
				<stop  offset="0.221" style="stop-color:#B3B2B6"/>
				<stop  offset="0.3006" style="stop-color:#B1ABB0"/>
				<stop  offset="0.3574" style="stop-color:#AEA0A5"/>
				<stop  offset="0.4032" style="stop-color:#A98F95"/>
				<stop  offset="0.4425" style="stop-color:#A37980"/>
				<stop  offset="0.4767" style="stop-color:#9B5E68"/>
				<stop  offset="0.5" style="stop-color:#944752"/>
				<stop  offset="0.5513" style="stop-color:#92384C"/>
				<stop  offset="0.6223" style="stop-color:#902D47"/>
				<stop  offset="0.7223" style="stop-color:#8F2644"/>
				<stop  offset="1" style="stop-color:#8F2443"/>
			</linearGradient>
			<path class="st7" d="M165.8,79.3c-0.7,0.8-1.6,1.4-2.5,2s-1.8,1.1-2.9,1.6c-2,0.8-4.4,1.2-6.8,0.8c-2.4-0.4-4.5-1.6-6.2-3.4
				c-1.7-1.7-2.9-4-3.3-6.5c-0.3-2.5,0.2-5,1.2-7.1c1-2.2,2.8-4,4.9-5.2c2.1-1.1,4.4-1.7,6.8-1.4c2.3,0.4,4.4,1.7,5.4,3.6
				c-1.7-1.2-3.7-1.9-5.5-1.6c-1.8,0.1-3.6,0.9-5,2.1c-1.5,1.1-2.5,2.5-3.2,4.1s-0.9,3.4-0.6,5c0.2,1.7,0.9,3.3,2,4.6
				c1.1,1.3,2.7,2.3,4.4,2.9c1.7,0.6,3.6,0.7,5.5,0.3c1-0.1,2-0.4,3-0.7C163.9,80.1,164.9,79.7,165.8,79.3z"/>
		</g>
		<g>
			
				<linearGradient id="SVGID_5_" gradientUnits="userSpaceOnUse" x1="50.7543" y1="622.6756" x2="290.0102" y2="622.6756" gradientTransform="matrix(1 0 0 -1 0 667.2756)">
				<stop  offset="0" style="stop-color:#B4B4B8"/>
				<stop  offset="0.221" style="stop-color:#B3B2B6"/>
				<stop  offset="0.3006" style="stop-color:#B1ABB0"/>
				<stop  offset="0.3574" style="stop-color:#AEA0A5"/>
				<stop  offset="0.4032" style="stop-color:#A98F95"/>
				<stop  offset="0.4425" style="stop-color:#A37980"/>
				<stop  offset="0.4767" style="stop-color:#9B5E68"/>
				<stop  offset="0.5" style="stop-color:#944752"/>
				<stop  offset="0.5513" style="stop-color:#92384C"/>
				<stop  offset="0.6223" style="stop-color:#902D47"/>
				<stop  offset="0.7223" style="stop-color:#8F2644"/>
				<stop  offset="1" style="stop-color:#8F2443"/>
			</linearGradient>
			<path class="st8" d="M172,25.5c-0.9,1.5-1.9,3-2.6,4.5c-0.9,1.5-1.7,2.9-2.3,4.5c-1.4,3-2.7,6-3.4,9.3c-1,3.1-1.4,6.4-1.6,9.7
				c-0.1,1.7-0.2,3.3,0,5c0,0.9,0.1,1.7,0.2,2.6c0.1,0.8,0.2,1.7,0.3,2.6c-0.5-0.7-0.9-1.5-1.3-2.3s-0.7-1.6-1-2.5
				c-0.5-1.7-0.9-3.5-1.1-5.3c-0.4-3.6,0.1-7.3,0.8-10.8c1.1-3.5,2.5-6.9,4.6-9.8c1.1-1.5,2.2-2.8,3.4-4.1
				C169.1,27.6,170.5,26.4,172,25.5z"/>
		</g>
		<g>
			
				<linearGradient id="SVGID_6_" gradientUnits="userSpaceOnUse" x1="50.7543" y1="575.5177" x2="290.0102" y2="575.5177" gradientTransform="matrix(1 0 0 -1 0 667.2756)">
				<stop  offset="0" style="stop-color:#B4B4B8"/>
				<stop  offset="0.221" style="stop-color:#B3B2B6"/>
				<stop  offset="0.3006" style="stop-color:#B1ABB0"/>
				<stop  offset="0.3574" style="stop-color:#AEA0A5"/>
				<stop  offset="0.4032" style="stop-color:#A98F95"/>
				<stop  offset="0.4425" style="stop-color:#A37980"/>
				<stop  offset="0.4767" style="stop-color:#9B5E68"/>
				<stop  offset="0.5" style="stop-color:#944752"/>
				<stop  offset="0.5513" style="stop-color:#92384C"/>
				<stop  offset="0.6223" style="stop-color:#902D47"/>
				<stop  offset="0.7223" style="stop-color:#8F2644"/>
				<stop  offset="1" style="stop-color:#8F2443"/>
			</linearGradient>
			<path class="st9" d="M68.1,92.8c-0.3-1.5,0-3,0.6-4.5c0.8-1.4,2-2.6,3.4-3.5c1.4-0.8,3.3-1.2,5.1-0.9c1.8,0.4,3.4,1.3,4.7,2.6
				c1.1,1.4,1.8,3.2,1.8,5.1c0,1-0.2,1.9-0.6,2.8c-0.4,0.9-0.9,1.6-1.6,2.1c-1.2,1.1-2.6,1.8-4,2.4c-1.4,0.5-2.9,0.9-4.4,0.8
				c1.3-0.8,2.4-1.4,3.4-2.4c1.1-0.9,2-1.8,2.7-2.8c0.6-1,0.9-1.9,0.8-2.8c-0.1-1-0.5-1.9-1.2-2.6c-0.6-0.8-1.5-1.4-2.4-1.7
				s-2-0.2-3.1,0.1s-2.2,0.9-3.1,1.8C69.3,90.2,68.6,91.4,68.1,92.8z"/>
		</g>
		<g>
			
				<linearGradient id="SVGID_7_" gradientUnits="userSpaceOnUse" x1="50.7543" y1="548.5756" x2="290.0102" y2="548.5756" gradientTransform="matrix(1 0 0 -1 0 667.2756)">
				<stop  offset="0" style="stop-color:#B4B4B8"/>
				<stop  offset="0.221" style="stop-color:#B3B2B6"/>
				<stop  offset="0.3006" style="stop-color:#B1ABB0"/>
				<stop  offset="0.3574" style="stop-color:#AEA0A5"/>
				<stop  offset="0.4032" style="stop-color:#A98F95"/>
				<stop  offset="0.4425" style="stop-color:#A37980"/>
				<stop  offset="0.4767" style="stop-color:#9B5E68"/>
				<stop  offset="0.5" style="stop-color:#944752"/>
				<stop  offset="0.5513" style="stop-color:#92384C"/>
				<stop  offset="0.6223" style="stop-color:#902D47"/>
				<stop  offset="0.7223" style="stop-color:#8F2644"/>
				<stop  offset="1" style="stop-color:#8F2443"/>
			</linearGradient>
			<path class="st10" d="M49.8,84.3c9.7,9.2,18.2,19.6,25.6,30.7c3.6,5.6,6.9,11.3,9.9,17.2c1.5,3,2.9,6,4.2,9
				c0.7,1.5,1.3,3.1,1.9,4.6l1.4,3.6h0.1l19.2-0.2l20-0.1l39.9-0.2l39.9,0.2l20,0.1l19.2,0.2h0.1l1.4-3.6c0.6-1.5,1.3-3.1,1.9-4.6
				c1.3-3,2.7-6,4.2-9c3-5.9,6.3-11.7,9.9-17.2c7.4-11.2,15.9-21.6,25.6-30.7c-9,9.8-17.2,20.4-23.9,31.8
				c-3.4,5.6-6.5,11.4-9.3,17.3c-1.4,3-2.7,6-3.9,9c-0.6,1.5-1.2,3-1.8,4.6c-0.6,1.7-1,2.6-2,5.6h-0.7l-20.7,0.2l-20,0.1l-39.9,0.2
				l-39.9-0.2l-20-0.1l-20.7-0.2h-0.7c-1.1-3-1.4-4-2-5.6c-0.6-1.5-1.2-3.1-1.8-4.6c-1.2-3-2.5-6-3.9-9c-2.8-5.9-5.9-11.7-9.3-17.3
				C66.9,104.7,58.8,94.1,49.8,84.3z"/>
		</g>
		<g>
			
				<linearGradient id="SVGID_8_" gradientUnits="userSpaceOnUse" x1="50.7543" y1="561.1294" x2="290.0102" y2="561.1294" gradientTransform="matrix(1 0 0 -1 0 667.2756)">
				<stop  offset="0" style="stop-color:#B4B4B8"/>
				<stop  offset="0.221" style="stop-color:#B3B2B6"/>
				<stop  offset="0.3006" style="stop-color:#B1ABB0"/>
				<stop  offset="0.3574" style="stop-color:#AEA0A5"/>
				<stop  offset="0.4032" style="stop-color:#A98F95"/>
				<stop  offset="0.4425" style="stop-color:#A37980"/>
				<stop  offset="0.4767" style="stop-color:#9B5E68"/>
				<stop  offset="0.5" style="stop-color:#944752"/>
				<stop  offset="0.5513" style="stop-color:#92384C"/>
				<stop  offset="0.6223" style="stop-color:#902D47"/>
				<stop  offset="0.7223" style="stop-color:#8F2644"/>
				<stop  offset="1" style="stop-color:#8F2443"/>
			</linearGradient>
			<path class="st11" d="M271,99.8c-0.6,2.7-1.9,5.3-3.3,7.8c-1.6,2.4-3.5,4.6-5.8,6.4c-2.1,1.8-4.5,3.5-7.3,4.7s-6,1.7-9.1,1.2
				c-3.1-0.6-6-2.1-8.2-4.1c-2.3-2-4.1-4.4-5.4-7s-2.3-5.3-2.9-8.1c-0.4-2.9-0.5-5.7,0.1-8.5c0.3,2.8,0.8,5.5,1.8,8
				c0.9,2.5,2.1,4.9,3.6,7.1c1.5,2.2,3.1,4.2,5.1,5.8c1.9,1.6,4.2,2.7,6.5,3c2.3,0.5,4.8,0.2,7.1-0.7c2.4-0.9,4.6-2.3,6.9-3.8
				c2.2-1.4,4.3-3.1,6-5.2C268,104.5,269.5,102.2,271,99.8z"/>
		</g>
		<g>
			
				<linearGradient id="SVGID_9_" gradientUnits="userSpaceOnUse" x1="50.7543" y1="573.9694" x2="290.0102" y2="573.9694" gradientTransform="matrix(1 0 0 -1 0 667.2756)">
				<stop  offset="0" style="stop-color:#B4B4B8"/>
				<stop  offset="0.221" style="stop-color:#B3B2B6"/>
				<stop  offset="0.3006" style="stop-color:#B1ABB0"/>
				<stop  offset="0.3574" style="stop-color:#AEA0A5"/>
				<stop  offset="0.4032" style="stop-color:#A98F95"/>
				<stop  offset="0.4425" style="stop-color:#A37980"/>
				<stop  offset="0.4767" style="stop-color:#9B5E68"/>
				<stop  offset="0.5" style="stop-color:#944752"/>
				<stop  offset="0.5513" style="stop-color:#92384C"/>
				<stop  offset="0.6223" style="stop-color:#902D47"/>
				<stop  offset="0.7223" style="stop-color:#8F2644"/>
				<stop  offset="1" style="stop-color:#8F2443"/>
			</linearGradient>
			<path class="st12" d="M225.9,90.4c-0.9,2.8-2.6,5.4-4.5,7.7c-2,2.2-4.3,4.3-6.9,5.9c-2.6,1.6-5.6,2.7-8.7,3.1
				c-3.1,0.5-6.3,0.4-9.4-0.3c-3.1-0.8-5.9-2.1-8.5-3.8c-2.5-1.7-5-3.7-6.8-6.3s-3-5.5-3.5-8.6c-0.4-3-0.2-6.1,0.8-8.9
				c-0.1,2.9,0.2,5.8,1.1,8.5c0.8,2.7,2.2,5.1,4,7.1s4,3.7,6.3,5.1c2.3,1.4,4.9,2.5,7.5,3c5.2,1.4,10.8,0.6,15.8-1.7
				c2.5-1.1,4.9-2.7,7-4.6C222.3,95,224.2,92.8,225.9,90.4z"/>
		</g>
		<g>
			
				<linearGradient id="SVGID_10_" gradientUnits="userSpaceOnUse" x1="50.7543" y1="584.6781" x2="290.0102" y2="584.6781" gradientTransform="matrix(1 0 0 -1 0 667.2756)">
				<stop  offset="0" style="stop-color:#B4B4B8"/>
				<stop  offset="0.221" style="stop-color:#B3B2B6"/>
				<stop  offset="0.3006" style="stop-color:#B1ABB0"/>
				<stop  offset="0.3574" style="stop-color:#AEA0A5"/>
				<stop  offset="0.4032" style="stop-color:#A98F95"/>
				<stop  offset="0.4425" style="stop-color:#A37980"/>
				<stop  offset="0.4767" style="stop-color:#9B5E68"/>
				<stop  offset="0.5" style="stop-color:#944752"/>
				<stop  offset="0.5513" style="stop-color:#92384C"/>
				<stop  offset="0.6223" style="stop-color:#902D47"/>
				<stop  offset="0.7223" style="stop-color:#8F2644"/>
				<stop  offset="1" style="stop-color:#8F2443"/>
			</linearGradient>
			<path class="st13" d="M225.9,90.4c-2-1-3.6-3-4.4-5.4c-0.6-2.4-0.4-5.1,0.9-7.4s3.4-4,6-4.8c2.5-0.8,5.4-0.6,7.9,0.6
				c2.4,1.3,4.2,3.4,5.2,5.9s0.9,5.4-0.2,7.7c-0.6,1.2-1.3,2.2-2.2,3.1c-0.4,0.4-0.9,0.9-1.4,1.2s-1.1,0.7-1.6,0.9
				c-2.3,0.9-4.8,0.9-6.9,0c2.2,0,4.4-0.5,6-1.7c0.4-0.3,0.8-0.6,1.1-0.9c0.3-0.3,0.6-0.7,0.9-1.1c0.6-0.8,1-1.7,1.2-2.6
				c0.5-1.8,0.4-3.6-0.3-5.2c-0.7-1.6-2-3-3.6-3.7c-1.5-0.8-3.3-1.1-5-0.6c-1.7,0.4-3.3,1.5-4.4,3c-1.1,1.4-1.7,3.4-1.5,5.4
				C223.5,86.7,224.4,88.7,225.9,90.4z"/>
		</g>
		<g>
			
				<linearGradient id="SVGID_11_" gradientUnits="userSpaceOnUse" x1="50.7543" y1="595.3356" x2="290.0102" y2="595.3356" gradientTransform="matrix(1 0 0 -1 0 667.2756)">
				<stop  offset="0" style="stop-color:#B4B4B8"/>
				<stop  offset="0.221" style="stop-color:#B3B2B6"/>
				<stop  offset="0.3006" style="stop-color:#B1ABB0"/>
				<stop  offset="0.3574" style="stop-color:#AEA0A5"/>
				<stop  offset="0.4032" style="stop-color:#A98F95"/>
				<stop  offset="0.4425" style="stop-color:#A37980"/>
				<stop  offset="0.4767" style="stop-color:#9B5E68"/>
				<stop  offset="0.5" style="stop-color:#944752"/>
				<stop  offset="0.5513" style="stop-color:#92384C"/>
				<stop  offset="0.6223" style="stop-color:#902D47"/>
				<stop  offset="0.7223" style="stop-color:#8F2644"/>
				<stop  offset="1" style="stop-color:#8F2443"/>
			</linearGradient>
			<path class="st14" d="M178.4,79.3c1,0.4,1.9,0.8,2.9,1.1c1,0.3,2,0.5,3,0.7c1.9,0.4,3.8,0.3,5.5-0.3c1.7-0.6,3.2-1.6,4.4-2.9
				c1.1-1.3,1.9-2.9,2-4.6c0.3-1.6,0.1-3.4-0.6-5s-1.8-3-3.2-4.1c-1.4-1.1-3.2-2-5-2.1c-1.9-0.3-3.8,0.4-5.5,1.6
				c1-1.9,3.1-3.2,5.4-3.6c2.3-0.3,4.7,0.3,6.8,1.4c2.1,1.1,3.8,3,4.9,5.2s1.5,4.7,1.2,7.1c-0.4,2.4-1.6,4.7-3.3,6.5
				c-1.7,1.7-3.9,2.9-6.2,3.4c-2.4,0.4-4.8,0-6.8-0.8c-1-0.5-1.9-1-2.9-1.6C180,80.7,179.1,80.1,178.4,79.3z"/>
		</g>
		<g>
			
				<linearGradient id="SVGID_12_" gradientUnits="userSpaceOnUse" x1="50.7543" y1="622.7256" x2="290.0102" y2="622.7256" gradientTransform="matrix(1 0 0 -1 0 667.2756)">
				<stop  offset="0" style="stop-color:#B4B4B8"/>
				<stop  offset="0.221" style="stop-color:#B3B2B6"/>
				<stop  offset="0.3006" style="stop-color:#B1ABB0"/>
				<stop  offset="0.3574" style="stop-color:#AEA0A5"/>
				<stop  offset="0.4032" style="stop-color:#A98F95"/>
				<stop  offset="0.4425" style="stop-color:#A37980"/>
				<stop  offset="0.4767" style="stop-color:#9B5E68"/>
				<stop  offset="0.5" style="stop-color:#944752"/>
				<stop  offset="0.5513" style="stop-color:#92384C"/>
				<stop  offset="0.6223" style="stop-color:#902D47"/>
				<stop  offset="0.7223" style="stop-color:#8F2644"/>
				<stop  offset="1" style="stop-color:#8F2443"/>
			</linearGradient>
			<path class="st15" d="M172.2,25.5c1.5,0.9,2.8,2.1,4.2,3.3c1.2,1.3,2.4,2.7,3.4,4.1c2.1,2.9,3.5,6.3,4.6,9.8
				c0.8,3.5,1.3,7.2,0.8,10.8c-0.2,1.8-0.6,3.6-1.1,5.3c-0.3,0.8-0.7,1.7-1,2.5c-0.4,0.8-0.8,1.6-1.3,2.3c0.1-0.9,0.2-1.8,0.3-2.6
				c0.1-0.9,0.2-1.7,0.2-2.6c0.1-1.7,0.1-3.4,0-5c-0.2-3.3-0.6-6.6-1.6-9.7c-0.7-3.2-2-6.2-3.4-9.3c-0.7-1.5-1.5-3-2.3-4.5
				C174.1,28.5,173.1,27.1,172.2,25.5z"/>
		</g>
		<g>
			
				<linearGradient id="SVGID_13_" gradientUnits="userSpaceOnUse" x1="50.7543" y1="579.4811" x2="290.0102" y2="579.4811" gradientTransform="matrix(1 0 0 -1 0 667.2756)">
				<stop  offset="0" style="stop-color:#B4B4B8"/>
				<stop  offset="0.221" style="stop-color:#B3B2B6"/>
				<stop  offset="0.3006" style="stop-color:#B1ABB0"/>
				<stop  offset="0.3574" style="stop-color:#AEA0A5"/>
				<stop  offset="0.4032" style="stop-color:#A98F95"/>
				<stop  offset="0.4425" style="stop-color:#A37980"/>
				<stop  offset="0.4767" style="stop-color:#9B5E68"/>
				<stop  offset="0.5" style="stop-color:#944752"/>
				<stop  offset="0.5513" style="stop-color:#92384C"/>
				<stop  offset="0.6223" style="stop-color:#902D47"/>
				<stop  offset="0.7223" style="stop-color:#8F2644"/>
				<stop  offset="1" style="stop-color:#8F2443"/>
			</linearGradient>
			<path class="st16" d="M294.5,84.3c-0.9,0.3-1.8,0.5-2.7,0.8c-0.8,0.2-1.7,0.4-2.4,0.7c-1.6,0.6-3.1,1-4.5,1.8
				c-1.5,0.5-2.8,1.4-4.3,2.3c-0.7,0.4-1.4,0.9-2.1,1.4c-0.8,0.4-1.5,1-2.3,1.5c0.1-1,0.5-1.9,0.8-2.8c0.5-0.8,1-1.6,1.6-2.4
				c1.2-1.5,2.9-2.6,4.6-3.6c1.8-0.7,3.8-1.3,5.7-1.2c1,0,1.9,0.2,2.9,0.3C292.7,83.5,293.6,83.7,294.5,84.3z"/>
		</g>
		<g>
			
				<linearGradient id="SVGID_14_" gradientUnits="userSpaceOnUse" x1="50.7543" y1="575.4454" x2="290.0102" y2="575.4454" gradientTransform="matrix(1 0 0 -1 0 667.2756)">
				<stop  offset="0" style="stop-color:#B4B4B8"/>
				<stop  offset="0.221" style="stop-color:#B3B2B6"/>
				<stop  offset="0.3006" style="stop-color:#B1ABB0"/>
				<stop  offset="0.3574" style="stop-color:#AEA0A5"/>
				<stop  offset="0.4032" style="stop-color:#A98F95"/>
				<stop  offset="0.4425" style="stop-color:#A37980"/>
				<stop  offset="0.4767" style="stop-color:#9B5E68"/>
				<stop  offset="0.5" style="stop-color:#944752"/>
				<stop  offset="0.5513" style="stop-color:#92384C"/>
				<stop  offset="0.6223" style="stop-color:#902D47"/>
				<stop  offset="0.7223" style="stop-color:#8F2644"/>
				<stop  offset="1" style="stop-color:#8F2443"/>
			</linearGradient>
			<path class="st17" d="M276.2,92.8c-0.6-1.3-1.2-2.5-2.2-3.4c-0.8-0.9-1.9-1.5-3.1-1.8c-1.1-0.3-2.2-0.4-3.1-0.1
				c-0.9,0.3-1.8,0.9-2.4,1.7c-0.7,0.7-1.1,1.6-1.2,2.6c-0.1,0.9,0.2,1.8,0.8,2.8c0.6,1,1.6,1.9,2.7,2.8c1,1,2.1,1.7,3.4,2.4
				c-1.5,0.1-3-0.3-4.4-0.8c-1.3-0.6-2.7-1.3-4-2.4c-0.6-0.6-1.2-1.3-1.6-2.1s-0.6-1.8-0.6-2.8c0-1.8,0.7-3.6,1.8-5.1
				c1.2-1.3,2.9-2.3,4.7-2.6c1.8-0.4,3.7,0,5.1,0.9c1.4,0.8,2.7,2,3.4,3.5C276.2,89.8,276.5,91.3,276.2,92.8z"/>
		</g>
		<g>
			
				<linearGradient id="SVGID_15_" gradientUnits="userSpaceOnUse" x1="50.7543" y1="579.2811" x2="290.0102" y2="579.2811" gradientTransform="matrix(1 0 0 -1 0 667.2756)">
				<stop  offset="0" style="stop-color:#B4B4B8"/>
				<stop  offset="0.221" style="stop-color:#B3B2B6"/>
				<stop  offset="0.3006" style="stop-color:#B1ABB0"/>
				<stop  offset="0.3574" style="stop-color:#AEA0A5"/>
				<stop  offset="0.4032" style="stop-color:#A98F95"/>
				<stop  offset="0.4425" style="stop-color:#A37980"/>
				<stop  offset="0.4767" style="stop-color:#9B5E68"/>
				<stop  offset="0.5" style="stop-color:#944752"/>
				<stop  offset="0.5513" style="stop-color:#92384C"/>
				<stop  offset="0.6223" style="stop-color:#902D47"/>
				<stop  offset="0.7223" style="stop-color:#8F2644"/>
				<stop  offset="1" style="stop-color:#8F2443"/>
			</linearGradient>
			<path class="st18" d="M49.8,84.5c0.8-0.6,1.7-0.8,2.7-1.2c0.9-0.2,1.9-0.3,2.9-0.3c2-0.1,3.9,0.5,5.7,1.2c1.7,1,3.4,2.1,4.6,3.6
				c0.6,0.8,1.1,1.6,1.6,2.4c0.4,0.9,0.7,1.8,0.8,2.8c-0.9-0.5-1.5-1.1-2.3-1.5c-0.7-0.5-1.4-1-2.1-1.4c-1.4-0.8-2.8-1.7-4.3-2.3
				C58,87,56.5,86.5,54.9,86c-0.8-0.3-1.6-0.5-2.4-0.7C51.6,84.9,50.7,84.8,49.8,84.5z"/>
		</g>
		
			<linearGradient id="SVGID_16_" gradientUnits="userSpaceOnUse" x1="92.8053" y1="501.2256" x2="251.2299" y2="501.2256" gradientTransform="matrix(1 0 0 -1 0 667.2756)">
			<stop  offset="0" style="stop-color:#B4B4B8"/>
			<stop  offset="0.221" style="stop-color:#B3B2B6"/>
			<stop  offset="0.3006" style="stop-color:#B1ABB0"/>
			<stop  offset="0.3574" style="stop-color:#AEA0A5"/>
			<stop  offset="0.4032" style="stop-color:#A98F95"/>
			<stop  offset="0.4425" style="stop-color:#A37980"/>
			<stop  offset="0.4767" style="stop-color:#9B5E68"/>
			<stop  offset="0.5" style="stop-color:#944752"/>
			<stop  offset="0.5513" style="stop-color:#92384C"/>
			<stop  offset="0.6223" style="stop-color:#902D47"/>
			<stop  offset="0.7223" style="stop-color:#8F2644"/>
			<stop  offset="1" style="stop-color:#8F2443"/>
		</linearGradient>
		<polygon class="st19" points="172.5,158.4 171.8,158.4 94.2,158.4 98.9,173.7 172.5,173.7 177.3,173.7 244.7,173.7 249.8,158.4 		
			"/>
	</g>
</g>
</svg>
