module gitlab.com/claudio.vergaramo/labsd

go 1.15

require (
	github.com/golang/protobuf v1.4.2
	github.com/streadway/amqp v1.0.0
	golang.org/x/net v0.0.0-20201010224723-4f7140c49acb
	google.golang.org/grpc v1.33.0
	google.golang.org/protobuf v1.25.0
)
