16384.0, 0.16286500399396467, 392.0420632878827, 2320, 8727.546407736903, 46644, 3670, 22534, 279, 15.350642
16384.0, 0.11163454675231978, 218.83168994795946, 1051, 1418.8382107138843, 7302, 782, 7005, 2, 15.107467
16384.0, 0.17003819493563446, 230.35574134106807, 1244, 1933.2771836491277, 11722, 1202, 7069, 5, 15.133248
16384.0, 0.11204379562043795, 220.29359799323808, 2221, 1454.4667501144127, 9169, 921, 8220, 5, 15.21721
16384.0, 0.13661093418259024, 315.88464154536797, 2100, 5063.612149038522, 22053, 2059, 15072, 23, 15.119965
16384.0, 0.13537080934642737, 276.51004126547457, 1617, 2888.280469698628, 18175, 1599, 11812, 30, 15.466363
16384.0, 0.12018981880931838, 257.78713531697696, 1623, 1734.0645312459346, 17241, 1393, 11590, 18, 15.491349
16384.0, 0.13361503715576278, 282.33342284282134, 1556, 2433.86965953392, 22344, 1834, 13726, 45, 15.681338
16384.0, 0.16126126126126125, 216.8544061302682, 1409, 1704.6463971891087, 10962, 1074, 6660, 32, 15.925689
16384.0, 0.17325177715324847, 214.41159420289856, 1317, 1480.4468464464408, 10350, 1048, 6049, 50, 15.543835
32768.0, 0.20107946715663758, 264.08822405415737, 1597, 3301.938388819609, 18317, 1751, 8708, 23, 15.110357
32768.0, 0.12021668171400791, 292.275507620639, 2145, 3161.6084192784456, 19749, 1731, 14399, 58, 15.694938
32768.0, 0.1824212271973466, 284.45348954651047, 1963, 3349.7389418247285, 19802, 1870, 10251, 15, 15.323591
32768.0, 0.11641651031894934, 264.41578059690545, 1388, 2580.9677103348836, 13637, 1241, 10660, 0, 15.236217
32768.0, 0.12357142857142857, 213.802102210946, 1408, 1575.7839094422238, 8277, 865, 7000, 22, 15.127297
32768.0, 0.1169905462184874, 219.71822732267123, 1228, 1645.889371784145, 8191, 891, 7616, 22, 15.21167
32768.0, 0.15204129516658846, 255.7693884723524, 1755, 3143.827329800695, 17072, 1620, 10655, 66, 15.225393
32768.0, 0.19318687843253673, 318.2171187086494, 1794, 4569.3963288866335, 28869, 2603, 13474, 44, 15.830633
32768.0, 0.17742815569297926, 271.892672910302, 1722, 3750.1663154576854, 19967, 1951, 10996, 28, 15.129177
32768.0, 0.22063650635079207, 257.4521564189614, 1608, 3325.8998173231685, 15906, 1546, 7007, 37, 15.425717
