32.0, 0.155467720685112, 96.95641646489103, 299, 190.70153789727186, 3717, 472, 3036, 0, 15.272254
32.0, 0.16055962691538975, 96.09751536200909, 199, 150.4194449132731, 3743, 482, 3002, 0, 15.168441
32.0, 0.16, 97.11538461538461, 272, 193.54580184173042, 3744, 480, 3000, 0, 15.132518
32.0, 0.16332085743450153, 96.8484133228429, 230, 173.23857019352943, 3813, 480, 2939, 0, 15.350783
32.0, 0.16442141623488774, 97.49015957446808, 287, 217.08457285557407, 3760, 476, 2895, 0, 15.273498
32.0, 0.17238886881098664, 97.1474428726877, 252, 202.20503764659006, 3676, 477, 2767, 0, 15.79219
32.0, 0.15001556178026768, 98.04380341880342, 255, 193.777512940354, 3744, 482, 3213, 0, 15.485041
32.0, 0.1593586387434555, 96.88473205257836, 235, 169.09935515884794, 3956, 487, 3056, 0, 15.184208
32.0, 0.15464251051439665, 97.95715806279937, 267, 232.96188942471102, 3758, 478, 3091, 0, 15.72328
32.0, 0.15676567656765678, 98.11266469481043, 259, 192.51667634045518, 3719, 475, 3030, 0, 15.400192
32.0, 0.15903696168192608, 97.49401754852433, 247, 162.62568322757542, 3761, 469, 2949, 0, 15.360003
32.0, 0.14388059701492537, 97.45383789586688, 240, 194.8303331245413, 3726, 482, 3350, 0, 15.393253
32.0, 0.17437591776798825, 97.81867704280155, 240, 208.6821900921943, 3855, 475, 2724, 0, 15.558468
32.0, 0.13787234042553193, 98.33494404883011, 255, 233.73223312887802, 3932, 486, 3525, 0, 15.253386
32.0, 0.21002592912705273, 96.68100078186083, 236, 195.19837654076133, 3837, 486, 2314, 0, 15.111429
32.0, 0.16016016016016016, 97.8676393955185, 235, 210.4445000649481, 3838, 480, 2997, 0, 15.107563
32.0, 0.15484483850538316, 96.13380281690141, 240, 203.0742943455691, 3834, 489, 3158, 0, 15.48976
32.0, 0.1504396984924623, 96.9016868740116, 230, 173.12151298673174, 3794, 479, 3184, 0, 15.428916
32.0, 0.17752499138228198, 97.00231421959373, 240, 108.11098306859869, 3889, 515, 2901, 0, 16.65021
32.0, 0.14596554850407978, 96.93391953104184, 220, 191.64860329597965, 3753, 483, 3309, 0, 15.132705
32.0, 0.15226986128625472, 97.476927110645, 259, 188.70251663272688, 3814, 483, 3172, 0, 15.511576
32.0, 0.16848783926683117, 96.35856681034483, 230, 189.20452172219643, 3712, 478, 2837, 0, 15.294698
32.0, 0.17290228841264074, 97.36664856056491, 240, 220.54424065463903, 3682, 476, 2753, 0, 15.339455
32.0, 0.17642698295033357, 95.98528610354224, 272, 154.92262346904306, 3670, 476, 2698, 0, 15.523096
32.0, 0.1514958625079567, 98.82912723449002, 241, 243.65935236215074, 3804, 476, 3142, 0, 15.111102
32.0, 0.1776218611521418, 95.70136839280923, 223, 176.6424842738448, 3727, 481, 2708, 0, 15.12254
32.0, 0.15894701766077973, 96.28416365154467, 230, 149.44359836991254, 3593, 477, 3001, 0, 15.219173
32.0, 0.15172413793103448, 96.64963119072708, 267, 195.46371715180032, 3796, 484, 3190, 0, 15.4978
32.0, 0.1653434587504315, 98.54384105960266, 264, 227.2780949511817, 3775, 479, 2897, 0, 15.519586
32.0, 0.1546692607003891, 97.13639968279143, 245, 196.2755398506441, 3783, 477, 3084, 0, 15.321098
64.0, 0.2810937959423699, 96.38051323175621, 240, 173.85419214740176, 7482, 956, 3401, 0, 15.183266
64.0, 0.294756438101148, 97.26607118689944, 255, 197.1023403279705, 7389, 950, 3223, 0, 15.471346
64.0, 0.35664335664335667, 97.00052652362774, 279, 202.04403648946533, 7597, 969, 2717, 0, 15.167197
64.0, 0.2951622780159216, 97.32677423586514, 319, 189.2157346191734, 7623, 964, 3266, 0, 15.153007
64.0, 0.279090113735783, 97.12018654230513, 262, 191.5997986706233, 7505, 957, 3429, 0, 15.229107
64.0, 0.308527626956244, 97.39830394400323, 284, 218.67829958206508, 7429, 966, 3131, 0, 15.122583
64.0, 0.2558767900567414, 96.79536784741144, 247, 178.02319942076426, 7340, 947, 3701, 0, 15.365164
64.0, 0.2912121212121212, 96.9208604435002, 311, 216.73392800740817, 7531, 961, 3300, 0, 15.143084
64.0, 0.2955955334987593, 96.67493333333333, 232, 182.3503504099705, 7500, 953, 3224, 0, 15.193941
64.0, 0.2696503496503497, 97.50065240083508, 280, 202.47820334757006, 7664, 964, 3575, 0, 15.148061
64.0, 0.24863742538281858, 97.99528116397956, 341, 224.8683551035521, 7629, 958, 3853, 0, 15.168559
64.0, 0.2596941561987985, 96.44126226465129, 272, 174.26253070570235, 7542, 951, 3662, 0, 15.608058
64.0, 0.2825007303534911, 95.93757408139075, 230, 165.94732021571278, 7593, 967, 3423, 0, 15.137586
64.0, 0.2730131503716409, 96.53134648946167, 240, 177.03945995883572, 7449, 955, 3498, 0, 15.446197
64.0, 0.2832301797819039, 96.52740097666847, 240, 190.00921294138612, 7372, 961, 3393, 0, 15.396225
64.0, 0.2607512248230811, 95.72540106951871, 250, 177.82536170075463, 7480, 958, 3674, 0, 15.121111
64.0, 0.2949069838365355, 95.99637486573577, 235, 157.54307487102275, 7448, 967, 3279, 0, 15.229987
64.0, 0.27931831311380706, 96.67408987865049, 255, 203.6725430086242, 7499, 967, 3462, 0, 15.107412
64.0, 0.2824808935920047, 96.07865779106099, 245, 214.46118513625083, 7361, 961, 3402, 0, 15.55286
64.0, 0.28739091182666265, 97.00384456954552, 267, 206.97420031350111, 7283, 955, 3323, 0, 15.193752
64.0, 0.2962507682851875, 96.14824725715815, 250, 186.7481883631732, 7474, 964, 3254, 0, 15.254528
64.0, 0.31587615283267456, 96.81327855817652, 237, 191.42735648478393, 7546, 959, 3036, 0, 15.653217
64.0, 0.22948473282442747, 96.71916432302129, 245, 180.42805019163487, 7467, 962, 4192, 0, 15.127572
64.0, 0.30965450435905717, 96.94731240021288, 282, 237.3748458973387, 7516, 959, 3097, 0, 15.579265
64.0, 0.2831677381648159, 96.3048395581273, 240, 195.33341092365345, 7604, 969, 3422, 0, 15.224104
64.0, 0.28686567164179105, 96.59838056680162, 288, 189.96800701495823, 7410, 961, 3350, 0, 15.137882
64.0, 0.25596816976127323, 96.60387485272942, 240, 181.87780374284242, 7639, 965, 3770, 0, 16.128322
64.0, 0.22667295004712534, 96.78823839662448, 260, 209.5837041008622, 7584, 962, 4244, 0, 15.126542
64.0, 0.28431952662721893, 95.51865271068169, 267, 170.9863077063252, 7452, 961, 3380, 0, 15.280048
64.0, 0.26464870869203, 96.00333778371161, 273, 177.8984841383058, 7490, 953, 3601, 0, 15.249506
128.0, 0.5525707683419988, 95.58147651006712, 267, 178.78276517611798, 14900, 1913, 3462, 0, 15.576037
128.0, 0.5634665888532244, 95.50809168373077, 272, 166.64645718559393, 15139, 1931, 3427, 0, 15.319948
128.0, 0.45254277009608623, 95.08647508568416, 294, 168.10098675235642, 15172, 1931, 4267, 0, 15.229668
128.0, 0.5188602442333785, 95.8792081874495, 314, 185.71018117002444, 14852, 1912, 3685, 0, 15.459069
128.0, 0.5295566502463054, 96.24130621977876, 257, 184.757176393823, 15097, 1935, 3654, 0, 15.218947
128.0, 0.5216333153055706, 96.03519545694664, 294, 190.91844297193197, 15144, 1929, 3698, 0, 15.259601
128.0, 0.5771188978736148, 96.07859860910642, 262, 189.259560786289, 15242, 1927, 3339, 0, 15.1165
128.0, 0.5331300249514832, 95.74877137802241, 306, 166.65186010023916, 15261, 1923, 3607, 0, 15.482204
128.0, 0.4778276033881415, 95.95426648188477, 257, 180.73864085740604, 15153, 1918, 4014, 0, 15.168206
128.0, 0.4858728557013118, 95.95947834187238, 309, 195.17285174363516, 15029, 1926, 3964, 0, 15.183815
128.0, 0.4862824062421344, 95.66251332622602, 245, 172.29056578613427, 15008, 1932, 3973, 0, 15.178015
128.0, 0.4838138593829034, 95.0644097455916, 282, 167.8574437259549, 14858, 1913, 3954, 0, 15.728079
128.0, 0.5258953168044077, 95.66991803833909, 253, 187.85639543558102, 14763, 1909, 3630, 0, 15.233603
128.0, 0.44681839294008363, 95.41410129096326, 262, 168.9112782137738, 15105, 1924, 4306, 0, 15.918346
128.0, 0.5194489465153971, 95.98027560118886, 262, 195.40663076002502, 14804, 1923, 3702, 0, 15.228977
128.0, 0.5061923583662714, 95.5764956411792, 260, 181.83495545300667, 15027, 1921, 3795, 0, 15.401041
128.0, 0.5214440825190011, 95.53333780071031, 272, 173.21411478083368, 14923, 1921, 3684, 0, 15.397921
128.0, 0.5703309692671394, 95.5650495774273, 262, 191.93993606845166, 15027, 1930, 3384, 0, 15.580275
128.0, 0.49147799542101245, 95.74359482303223, 262, 170.62902316575298, 15144, 1932, 3931, 0, 15.606182
128.0, 0.5154944758825114, 95.95829434567571, 250, 186.8989444837854, 14962, 1913, 3711, 0, 15.351205
128.0, 0.49805548353642726, 95.97728029848757, 272, 190.38946319322002, 15009, 1921, 3857, 0, 15.41696
128.0, 0.43381535038932145, 94.90951969707035, 272, 163.83526426264658, 15053, 1950, 4495, 0, 15.188439
128.0, 0.49768637532133675, 95.74616751102046, 279, 188.4593252535791, 15199, 1936, 3890, 0, 15.102477
128.0, 0.5488157134604275, 95.93978249194414, 269, 185.52577546115526, 14896, 1900, 3462, 0, 15.112539
128.0, 0.4774707493154095, 95.98866000134201, 333, 189.2388250416342, 14903, 1918, 4017, 0, 15.334359
128.0, 0.5450692285956484, 96.47013487475915, 262, 192.1824300303973, 15051, 1929, 3539, 0, 15.121606
128.0, 0.46077269495141027, 96.7071465900183, 304, 213.4900729277649, 15308, 1944, 4219, 0, 15.355269
128.0, 0.5455324007993149, 94.65197372875618, 267, 156.17352442072985, 14769, 1911, 3503, 0, 15.677669
128.0, 0.5249105422515827, 95.72767350210407, 299, 169.24907719860138, 14971, 1907, 3633, 0, 15.244795
128.0, 0.5660322108345535, 96.40482429617684, 272, 207.81527752436944, 14883, 1933, 3415, 0, 15.405545
256.0, 0.9121372031662269, 95.8278771896779, 277, 158.1503218172684, 26545, 3457, 3790, 0, 15.158139
256.0, 0.9324141659908083, 96.981097262492, 319, 181.96644190520905, 26557, 3449, 3699, 0, 15.300234
256.0, 0.9503293084522503, 96.41750476688975, 282, 161.70084564502778, 26747, 3463, 3644, 0, 15.364963
256.0, 0.9810320781032078, 97.59877318749538, 309, 200.64414091762825, 27062, 3517, 3585, 0, 15.223606
256.0, 0.9123937129605771, 97.24523011942907, 267, 179.76188113516733, 27464, 3541, 3881, 0, 15.425759
256.0, 0.9368958109559613, 96.45413936867183, 283, 160.69512781512134, 26864, 3489, 3724, 0, 15.315026
256.0, 1.0204262877442274, 97.01093161213296, 300, 173.87262851375365, 26803, 3447, 3378, 0, 15.208588
256.0, 0.9953407105416424, 96.77943027113602, 294, 174.81959756519268, 26223, 3418, 3434, 0, 15.107358
256.0, 0.9424766977363516, 96.9775908332729, 309, 211.94634431070244, 27578, 3539, 3755, 0, 15.423439
256.0, 0.957372654155496, 96.80566609470264, 294, 169.7401213743086, 27391, 3571, 3730, 0, 15.531949
256.0, 1.0469580626107502, 97.53843375234793, 274, 189.30989412057866, 27684, 3545, 3386, 0, 15.420027
256.0, 0.8803743045017703, 97.0309201167927, 300, 186.63635857725018, 26714, 3481, 3954, 0, 15.259782
256.0, 0.9174262734584451, 96.62746875118009, 336, 186.3641459562384, 26481, 3422, 3730, 0, 15.1366
256.0, 0.9034933400351847, 97.0505065070839, 282, 195.91549937387182, 27739, 3595, 3979, 0, 15.640056
256.0, 0.9663750683433571, 96.21009574819325, 359, 150.53120599097258, 27259, 3535, 3658, 0, 15.365563
256.0, 0.9532989410806407, 96.9038618640921, 304, 184.189522465058, 26930, 3511, 3683, 0, 15.374673
256.0, 1.0146272855133616, 96.58245399214896, 267, 185.48942925145198, 27767, 3607, 3555, 0, 15.698315
256.0, 0.9516895459345301, 98.5625962123653, 273, 196.12141200052093, 27933, 3605, 3788, 0, 15.649782
256.0, 1.0065508402164625, 96.34783086618789, 267, 161.42890624520945, 27292, 3534, 3511, 0, 15.466776
256.0, 1.0554896142433234, 97.21165409423855, 279, 173.0493078792178, 27441, 3557, 3370, 0, 15.390227
256.0, 0.8994572240889118, 96.0518211982254, 277, 162.6885278564105, 26823, 3480, 3869, 0, 15.27774
256.0, 0.878147029204431, 96.70367474589523, 398, 183.42446267313449, 26859, 3488, 3972, 0, 15.439478
256.0, 0.9727223131478451, 96.87583357494925, 258, 173.758139409981, 27592, 3566, 3666, 0, 15.549588
256.0, 0.9955030916245081, 97.49950713738089, 282, 197.28039503859398, 27391, 3542, 3558, 0, 15.505605
256.0, 0.9278820375335121, 97.74876242230245, 298, 196.2964027538868, 26867, 3461, 3730, 0, 15.26433
256.0, 0.9508771929824561, 97.19201876213859, 282, 191.22540041281175, 27289, 3523, 3705, 0, 15.501348
256.0, 0.9356153219233904, 97.22492482204713, 284, 169.2366393788355, 26271, 3444, 3681, 0, 15.379246
256.0, 0.894790085988872, 96.93276793157189, 300, 192.87667946875055, 27591, 3538, 3954, 0, 15.43221
256.0, 0.9041525202402716, 97.2760513931426, 284, 179.4144756695354, 26774, 3462, 3829, 0, 15.147913
256.0, 0.919831223628692, 96.66238134389715, 272, 167.8280157320399, 26758, 3488, 3792, 0, 15.328638
512.0, 1.1301879404855129, 135.5365312315985, 551, 1064.6971359798563, 44154, 5773, 5108, 0, 15.310452
512.0, 1.116184184962114, 126.55608827307763, 540, 702.4474793812246, 43592, 5745, 5147, 0, 15.446228
512.0, 1.141498447204969, 134.23681782378756, 641, 945.9639101163817, 44435, 5881, 5152, 0, 15.359958
512.0, 0.9458881578947368, 133.68032636596993, 666, 1005.2109804837621, 43632, 5751, 6080, 0, 15.223758
512.0, 1.1426341463414633, 133.76721065891914, 595, 976.4960402893726, 44057, 5856, 5125, 0, 15.367194
512.0, 1.1312330885195208, 138.27087544356107, 555, 1087.1539321110126, 44526, 5853, 5174, 0, 15.55871
512.0, 1.0256226482709192, 133.95094270125924, 646, 1017.6267588399888, 43439, 5724, 5581, 0, 15.178382
512.0, 1.1780738946093277, 134.22041689422903, 678, 993.4474264845038, 43944, 5835, 4953, 0, 15.476587
512.0, 1.1337325349301397, 128.32737147673004, 675, 796.1920457045774, 42716, 5680, 5010, 0, 15.13581
512.0, 0.97654404319946, 138.07110112563544, 595, 1135.0780224662228, 44064, 5787, 5926, 0, 15.215629
512.0, 0.9654594232059021, 133.23854530511608, 634, 984.6308720520453, 43803, 5758, 5964, 0, 15.365301
512.0, 0.9975111996017919, 135.87192247824086, 567, 1070.9201252928126, 45613, 6012, 6027, 0, 15.633303
512.0, 1.0591025173294417, 133.36277424877235, 635, 913.2879761475983, 44394, 5806, 5482, 0, 15.453024
512.0, 1.0215994287754373, 135.989804138185, 638, 1055.3736728953181, 43449, 5723, 5602, 0, 15.294677
512.0, 1.1510621557828482, 130.1672528860029, 571, 820.0427333132502, 44352, 5852, 5084, 0, 15.692972
512.0, 1.1085587254538718, 136.0937095464818, 596, 1072.88825731584, 45577, 5984, 5398, 0, 15.852756
512.0, 1.1382978723404256, 132.90002742105023, 664, 935.817329984131, 43762, 5778, 5076, 0, 15.356667
512.0, 1.0582832921229248, 134.1829740671846, 618, 955.7342351641676, 45695, 5992, 5662, 0, 16.026389
512.0, 1.2232608695652174, 131.56244430896214, 554, 891.3196665130012, 42646, 5627, 4600, 0, 15.2248
512.0, 1.1493506493506493, 135.5863425764243, 542, 1020.2315834382649, 42951, 5664, 4928, 0, 15.1175
512.0, 0.9684246458440007, 134.68002584158188, 593, 1002.8309425126926, 43341, 5674, 5859, 0, 15.117586
512.0, 1.024968106433388, 131.99865516601744, 643, 1016.0096636763494, 43128, 5624, 5487, 0, 15.396531
512.0, 1.1054747320061256, 135.6634785769458, 672, 1054.8689865186834, 44018, 5775, 5224, 0, 15.366654
512.0, 1.2436179577464788, 135.0916583008428, 544, 971.7809522406968, 42833, 5651, 4544, 0, 15.14274
512.0, 1.03821542836829, 134.1241200361011, 600, 953.0034909699456, 44320, 5841, 5626, 0, 15.498414
512.0, 1.0642167780252412, 134.71990313653137, 552, 1026.8351023409998, 43360, 5734, 5388, 0, 15.106425
512.0, 1.0066561569451742, 135.2452890890707, 671, 1076.7830990258976, 43516, 5747, 5709, 0, 15.396304
512.0, 0.9905394190871369, 136.41685316079855, 597, 1132.3872348173743, 45131, 5968, 6025, 0, 15.659571
512.0, 1.00627068454973, 133.0938563823711, 545, 1011.2585763163125, 43769, 5777, 5741, 0, 15.62245
512.0, 1.2019774011299436, 133.14903909582657, 611, 920.2544301476473, 45478, 5957, 4956, 0, 15.951237
1024.0, 0.9122367101303912, 178.74066909841198, 891, 2818.1388015976613, 54282, 7276, 7976, 0, 15.662442
1024.0, 0.9195755018539828, 180.61061484810622, 938, 2919.091632440072, 53623, 7192, 7821, 0, 15.356003
1024.0, 1.0192821121328983, 175.27181019263972, 810, 2597.2557817836605, 51547, 6872, 6742, 0, 15.52117
1024.0, 0.9607454401268835, 177.4610454819332, 746, 2594.999476442167, 54769, 7269, 7566, 0, 15.583253
1024.0, 0.9662199124726477, 175.57293824720125, 710, 2632.035956018778, 52613, 7065, 7312, 0, 15.511729
1024.0, 1.0812983467313817, 174.52124465130245, 815, 2655.7146089087014, 53284, 7129, 6593, 0, 15.349665
1024.0, 0.9488636363636364, 175.43640602449764, 848, 2619.466362728565, 54046, 7181, 7568, 0, 15.785983
1024.0, 0.9617282304307241, 176.755525117536, 976, 2633.8970140589863, 54026, 7212, 7499, 0, 15.444331
1024.0, 0.9394149452377651, 177.6144649738168, 968, 2718.225447851871, 50605, 6776, 7213, 0, 15.176187
1024.0, 0.9897197577805943, 176.6084322476498, 756, 2556.405187415896, 52655, 7028, 7101, 0, 15.219222
1024.0, 1.0170975813177647, 180.90172445089854, 1047, 2871.6632401759116, 55090, 7317, 7194, 0, 15.90101
1024.0, 0.9127508090614886, 179.62663441916712, 960, 2789.343629943756, 52924, 7051, 7725, 0, 15.418234
1024.0, 0.9891505689335803, 178.84821412521796, 783, 2713.2531928131934, 55631, 7476, 7558, 0, 15.981484
1024.0, 0.9986977471024873, 178.57589262489813, 900, 2827.4909447883924, 57667, 7669, 7679, 0, 16.23639
1024.0, 1.087195379630934, 181.33236146603323, 901, 2949.230117581281, 58307, 7718, 7099, 0, 16.380397
1024.0, 0.9716018748276812, 179.4274586539728, 809, 2882.2053919517134, 53149, 7048, 7254, 0, 15.452089
1024.0, 0.8679004467134652, 175.108277360727, 827, 2516.7720457941655, 50620, 6800, 7835, 0, 15.224017
1024.0, 0.9852920962199313, 173.23707588369228, 759, 2503.877988007283, 53582, 7168, 7275, 0, 15.625021
1024.0, 1.0532859680284192, 175.18133363151813, 838, 2468.510988960314, 53658, 7116, 6756, 0, 15.290111
1024.0, 1.0596430126251632, 178.18058959072457, 820, 2670.876316488439, 54682, 7302, 6891, 0, 15.618883
1024.0, 0.9533745492014426, 184.19150270580224, 887, 2992.7278820409038, 55806, 7402, 7764, 0, 15.523117
1024.0, 0.9598066298342541, 173.12802741666826, 788, 2406.2230639201407, 52231, 6949, 7240, 0, 15.254285
1024.0, 0.873622244488978, 175.60662315223652, 853, 2673.52135918309, 52090, 6975, 7984, 0, 15.153092
1024.0, 0.835465372739303, 180.7855480710349, 1007, 2881.4066773775953, 57155, 7576, 9068, 0, 16.419836
1024.0, 1.03738446682301, 179.08279004556607, 793, 2827.809538167527, 57060, 7520, 7249, 0, 15.964122
1024.0, 1.0173228346456693, 174.04723995493805, 839, 2543.353306299416, 53260, 7106, 6985, 0, 15.381014
1024.0, 0.9367877020938246, 177.4081081081081, 863, 2843.771558396261, 52910, 7069, 7546, 0, 15.381621
1024.0, 1.0471658502449266, 177.91628509565896, 991, 2729.2511922457256, 56346, 7482, 7145, 0, 16.029699
1024.0, 1.0926007975188303, 176.089628959276, 776, 2639.391106668989, 55250, 7398, 6771, 0, 15.719615
1024.0, 0.9470580167329584, 177.00735463111928, 945, 2661.7390706308524, 52212, 6905, 7291, 0, 15.168274
2048.0, 0.806397472603416, 229.86966891365918, 1250, 5242.913837355883, 60377, 8168, 10129, 0, 15.453707
2048.0, 0.6136270909832722, 162.18536990856194, 671, 1265.8231046054022, 20451, 3008, 4902, 0, 15.340082
2048.0, 0.982028241335045, 229.007140335676, 1092, 5105.820402089241, 62322, 8415, 8569, 0, 16.073889
2048.0, 0.9136944613511868, 222.72802493211103, 1051, 4588.811844341, 54869, 7506, 8215, 15, 15.471845
2048.0, 0.8513527629792124, 226.50896763635149, 1055, 4857.662777551788, 59882, 8150, 9573, 0, 15.611828
2048.0, 0.9357307739035354, 221.56947877674978, 1169, 4939.8116653884435, 56636, 7702, 8231, 0, 15.405735
2048.0, 0.9372521576860275, 228.542204886615, 1043, 5065.992989381612, 59223, 8036, 8574, 0, 15.239007
2048.0, 0.8336992316136114, 232.80124447002123, 1053, 5159.102662857666, 55606, 7595, 9110, 37, 15.554172
2048.0, 0.7009828419123771, 182.68646464646466, 778, 2101.1035068636497, 29700, 4208, 6003, 0, 15.175719
2048.0, 0.939484126984127, 233.4323589719136, 1096, 5308.693574233353, 62913, 8523, 9072, 0, 16.081326
2048.0, 0.983684794672586, 240.59080090353683, 1061, 6209.499928447248, 65963, 8863, 9010, 1, 17.000988
2048.0, 0.9079258010118044, 234.1751800312222, 1183, 5640.165545796167, 59573, 8076, 8895, 0, 15.253111
2048.0, 0.9276018099547512, 228.05350241747945, 1099, 4950.06295299746, 59773, 8200, 8840, 13, 15.7631
2048.0, 0.9124659771366358, 233.41735195367622, 1232, 5395.743099157835, 61653, 8381, 9185, 0, 15.764835
2048.0, 0.9064853321344273, 227.51773073666385, 1129, 5138.970899792016, 59050, 8065, 8897, 9, 15.426328
2048.0, 0.7962962962962963, 200.52008099094806, 1040, 3148.678638504205, 41980, 5805, 7290, 0, 15.8439
2048.0, 0.5310871183916605, 159.33911760215764, 688, 1228.1097592023366, 19651, 2853, 5372, 0, 15.36276
2048.0, 0.812212335072108, 191.14384025858922, 763, 2460.1737195291043, 38362, 5294, 6518, 0, 16.035206
2048.0, 0.9449116904962153, 237.13787283616867, 1150, 5944.126480360221, 66953, 8988, 9512, 0, 16.367774
2048.0, 0.8500545256270448, 234.13248042505592, 1167, 5272.7662776654115, 57216, 7795, 9170, 18, 15.59714
2048.0, 0.5579326413895361, 156.22513207975913, 743, 1066.9525672219409, 17603, 2634, 4721, 0, 15.338689
2048.0, 0.8844793278797258, 229.84449943223225, 1129, 5337.6047363886055, 59003, 8001, 9046, 8, 15.730999
2048.0, 0.9403943661971831, 232.6338430570436, 991, 4985.758666998387, 61602, 8346, 8875, 0, 15.812999
2048.0, 0.9437229437229437, 232.20536731438986, 1072, 5262.306862104434, 61446, 8284, 8778, 0, 15.199667
2048.0, 0.9455266138165346, 225.2739108334563, 991, 4919.718460993376, 60987, 8349, 8830, 0, 15.527262
2048.0, 0.9088771969103325, 226.7022479360764, 1016, 5040.043005593011, 60322, 8119, 8933, 0, 15.275392
2048.0, 0.7689619344479078, 229.72193078018938, 1104, 5293.225418713006, 59665, 8141, 10587, 0, 15.700837
2048.0, 0.9625529910504004, 229.5240878322602, 1116, 5419.857731976217, 60570, 8174, 8492, 0, 15.508457
2048.0, 0.7912706468579865, 232.66534066595875, 1094, 5474.394033132631, 63097, 8575, 10837, 0, 16.033762
2048.0, 0.7951807228915663, 199.05040008592448, 1058, 2903.0434638482275, 37242, 5214, 6557, 0, 15.207646
4096.0, 0.7377631245244738, 227.15562373682033, 1024, 4516.971164957903, 41067, 5818, 7886, 0, 15.152706
4096.0, 0.8753654574986465, 258.2461310956737, 1304, 6220.214713560803, 58156, 8084, 9235, 36, 15.350237
4096.0, 0.5327001942585797, 174.52924092409242, 928, 1737.6175463978295, 15150, 2468, 4633, 0, 15.122748
4096.0, 0.8102554609403925, 264.848552792499, 1438, 7059.588802757533, 63778, 8754, 10804, 0, 15.475666
4096.0, 0.9333615400888513, 263.63514413618975, 1237, 7117.619013432594, 64557, 8824, 9454, 0, 15.228897
4096.0, 0.7118329466357308, 232.9673026406747, 1146, 4937.47386367927, 43398, 6136, 8620, 0, 15.108816
4096.0, 0.8698865410638077, 266.78157532901196, 1312, 7440.193270337687, 61092, 8357, 9607, 2, 15.249307
4096.0, 0.7728021978021978, 261.9303754827048, 1335, 6556.335908954251, 60855, 8439, 10920, 11, 15.548232
4096.0, 0.7532338308457711, 222.6719722997638, 1082, 4077.435923404903, 37256, 5299, 7035, 0, 15.147374
4096.0, 0.7512105365097811, 257.6913393397671, 1233, 5865.322337123215, 56162, 7757, 10326, 9, 15.163253
4096.0, 0.5261101243339253, 183.6939419001344, 989, 2157.187258065325, 19346, 2962, 5630, 0, 15.707554
4096.0, 0.8682227339334311, 262.6967398294883, 1348, 6489.9526782155335, 60641, 8295, 9554, 13, 15.456991
4096.0, 0.5627947598253276, 190.8164262782117, 807, 2341.1620948363698, 20869, 3222, 5725, 0, 15.1734
4096.0, 0.8045007032348804, 267.20226755187787, 1153, 7265.238722868283, 62358, 8580, 10665, 0, 15.401822
4096.0, 0.6525557011795544, 219.43116743210297, 997, 3688.9795061837854, 35274, 4979, 7630, 0, 15.112195
4096.0, 0.7535907479947771, 264.95616330579645, 1330, 6967.753042514304, 58467, 8080, 10722, 56, 15.294532
4096.0, 0.654786150712831, 211.58837009452878, 949, 3715.593810370528, 31419, 4501, 6874, 0, 15.120293
4096.0, 1.1430091508831666, 273.6103667358621, 1438, 8576.616191039433, 79485, 10742, 9398, 0, 15.115812
4096.0, 0.5336025848142165, 191.55962598247356, 856, 2585.7024704991986, 22138, 3303, 6190, 0, 15.214096
4096.0, 0.865626874625075, 267.7171512176704, 1314, 7312.198222286093, 63564, 8658, 10002, 1, 15.501034
4096.0, 0.8774394166845378, 264.1591799667009, 1261, 7011.046245859068, 59461, 8183, 9326, 22, 15.414683
4096.0, 0.8441076399628827, 263.7798403160203, 1247, 6633.522694236796, 59743, 8187, 9699, 43, 15.187221
4096.0, 0.7350673265047761, 242.11645547419653, 1164, 5351.052250982125, 45614, 6387, 8689, 0, 15.444672
4096.0, 0.7885057471264367, 263.7928799907188, 1303, 7135.357604166915, 60337, 8232, 10440, 27, 15.122666
4096.0, 0.8371959942775393, 266.3921827853299, 1164, 7187.0180030407055, 64294, 8778, 10485, 0, 15.183458
4096.0, 0.3928914505283381, 165.47351385489856, 776, 1323.6121299826927, 12667, 2045, 5205, 0, 15.125483
4096.0, 0.8350100603621731, 242.85021556234565, 1291, 5334.777524621129, 47782, 6640, 7952, 0, 15.157382
4096.0, 0.5623117469879518, 185.32522022506237, 788, 2184.588491454401, 19639, 2987, 5312, 0, 15.647843
4096.0, 0.44501684168813155, 168.28164244391138, 784, 1383.7069904063007, 14174, 2246, 5047, 0, 15.248984
4096.0, 0.6085520597948896, 189.85441201570234, 914, 2297.721197794091, 23436, 3501, 5753, 0, 15.811335
8192.0, 0.5978072079895788, 243.1901171436771, 1111, 4731.183155732478, 38329, 5507, 9212, 1, 15.688025
8192.0, 0.38443546672336804, 177.20309794111986, 870, 1602.8118356898376, 10394, 1808, 4703, 0, 15.34082
8192.0, 0.43754702784048155, 195.52142381410493, 876, 2248.5824370561445, 13513, 2326, 5316, 0, 15.14246
8192.0, 0.8294047509859671, 293.39361077222, 1491, 8821.654948598169, 66393, 9043, 10903, 72, 16.418505
8192.0, 0.6857744994731296, 257.7519503814319, 1224, 5850.904613149472, 46273, 6508, 9490, 3, 15.452489
8192.0, 0.6985312737401874, 242.95929489686824, 1204, 5228.650263499195, 38349, 5517, 7898, 0, 15.71359
8192.0, 0.7742667314859828, 300.8845690001723, 1601, 9736.277694537295, 69652, 9556, 12342, 0, 16.207821
8192.0, 0.7753616595396233, 286.61348223678885, 1435, 7723.480419599626, 61785, 8522, 10991, 43, 15.790245
8192.0, 0.41593500196566635, 207.14176039119803, 1225, 3243.9380632786583, 20450, 3174, 7631, 0, 15.188467
8192.0, 0.6912570475661082, 287.5636989905755, 1571, 8251.007537183832, 62709, 8705, 12593, 3, 15.508749
8192.0, 0.7460682777138473, 276.7890138455151, 1386, 8079.91864541349, 55397, 7780, 10428, 0, 15.635002
8192.0, 0.3830608120521771, 185.12214291442777, 856, 2124.361687662279, 12469, 2085, 5443, 0, 15.2143
8192.0, 0.6689720963510613, 244.8997886265821, 1214, 5411.641415649862, 39267, 5610, 8386, 0, 15.819594
8192.0, 0.7710892295198457, 276.48138120317486, 1713, 7042.850976528169, 53924, 7596, 9851, 62, 15.33599
8192.0, 0.6674356483729966, 246.37070866141732, 1177, 5547.923096832098, 38100, 5497, 8236, 0, 15.289774
8192.0, 0.46381457280236715, 216.00474860335194, 975, 3580.808947842606, 25060, 3762, 8111, 0, 15.305185
8192.0, 0.6637584663069682, 256.71155919247354, 1315, 6603.933058192252, 40816, 5782, 8711, 0, 15.14815
8192.0, 0.7540010789426362, 286.84558618082605, 1335, 8198.510011783976, 60843, 8386, 11122, 45, 15.48803
8192.0, 0.470508576587421, 204.03421633554083, 1075, 2988.02068211901, 19932, 3127, 6646, 0, 15.22928
8192.0, 0.7541325909170001, 287.48340810028316, 1461, 8320.321567849813, 62862, 8668, 11494, 17, 15.506692
8192.0, 0.7234640283376084, 243.8903582998888, 1330, 5435.573194410938, 41362, 5923, 8187, 3, 15.539168
8192.0, 0.6326791313436302, 241.37130232312006, 1183, 5011.417463697778, 37794, 5448, 8611, 0, 15.296651
8192.0, 0.7089339908952959, 271.302917593406, 1289, 6509.980187796089, 53503, 7475, 10544, 6, 15.45693
8192.0, 0.37621772073604454, 190.6867469879518, 1007, 2233.0934737480493, 15023, 2433, 6467, 0, 15.178038
8192.0, 0.7358310083698685, 294.87207207207206, 1351, 9260.531851592168, 67155, 9231, 12545, 0, 15.911982
8192.0, 0.35118807893677, 177.7357071213641, 963, 1794.3178311818253, 9970, 1744, 4966, 0, 15.19444
8192.0, 0.3302425106990014, 177.4511250797121, 838, 1619.9739425294451, 10977, 1852, 5608, 0, 15.112417
8192.0, 0.7249339724151423, 270.2097550843137, 1285, 6832.463681135757, 52957, 7411, 10223, 11, 15.717731
8192.0, 0.8224507616183176, 281.94586403908255, 1337, 8147.847950950988, 60385, 8477, 10307, 11, 15.258988
8192.0, 0.21117727897388913, 152.1805347593583, 704, 706.9215157331913, 4675, 922, 4366, 0, 15.284971
16384.0, 0.7548757470902799, 309.31156454797815, 1718, 10901.993340343024, 69886, 9599, 12716, 4, 15.863757
16384.0, 0.6918177364037237, 269.6617242279951, 1310, 7248.433950637534, 49773, 7060, 10205, 0, 15.378913
16384.0, 0.4508906481939634, 224.33729799612152, 1248, 4292.946193986932, 23205, 3645, 8084, 0, 15.531482
16384.0, 0.817110710115699, 280.5325942511787, 1382, 7549.553517124179, 54933, 7698, 9421, 19, 15.131729
16384.0, 0.7957822638788753, 301.1857261775746, 1452, 9269.278073862602, 63669, 8830, 11096, 54, 15.834045
16384.0, 0.8983548766157462, 296.96160048225454, 1306, 9319.077248811995, 66355, 9174, 10212, 2, 15.533697
16384.0, 0.7400932400932401, 296.618249345826, 1392, 8032.82981355476, 59235, 8255, 11154, 105, 15.54833
16384.0, 0.7869328493647912, 295.29788126027927, 1645, 9101.712836252336, 62018, 8672, 11020, 0, 15.30381
16384.0, 0.7540606924966325, 305.04964682430773, 1450, 9624.491134327123, 69229, 9517, 12621, 49, 16.196954
16384.0, 0.7002085103096765, 298.50317994190493, 1495, 9171.695791837132, 65410, 9067, 12949, 42, 15.83073
16384.0, 0.9369296288785236, 299.26743242024236, 1523, 9366.94333131778, 66514, 9240, 9862, 35, 15.937948
16384.0, 0.7181935207037117, 273.7819560079211, 1204, 7575.852368521998, 46963, 6695, 9322, 1, 15.17422
16384.0, 0.36086572438162545, 201.14585802713026, 850, 2423.9666554867904, 15186, 2451, 6792, 0, 15.324974
16384.0, 0.8560170016824582, 314.94754689444994, 1519, 10071.988498618859, 69891, 9667, 11293, 144, 17.390923
16384.0, 0.8106252554147936, 320.047119249665, 1784, 10681.286532872906, 71648, 9918, 12235, 108, 17.961263
16384.0, 0.7924294431731502, 297.83815408445014, 1582, 9116.949004540345, 59396, 8311, 10488, 78, 15.702963
16384.0, 0.5949881002379952, 235.41904061109358, 1326, 5020.823809697822, 28539, 4250, 7143, 0, 15.489714
16384.0, 0.7827273613412613, 288.5737209708399, 1467, 7850.068842755004, 57270, 8030, 10259, 81, 15.618745
16384.0, 0.6197839960726559, 248.51081190174145, 1099, 5635.455927332406, 34684, 5050, 8148, 0, 15.290123
16384.0, 0.6121886835762653, 250.36102620087337, 1128, 5755.43329876778, 36640, 5334, 8713, 0, 15.397169
16384.0, 0.612767789858973, 258.09482386954426, 1324, 6376.571273175409, 39431, 5692, 9289, 0, 15.954625
16384.0, 0.5829551185073122, 240.57969364857394, 1073, 4859.413506179618, 30749, 4624, 7932, 0, 15.132207
16384.0, 0.73120367102012, 294.96974690994705, 1328, 8643.529341650717, 59465, 8286, 11332, 74, 15.179302
16384.0, 0.7802714932126696, 300.9431076442052, 1577, 9518.478532141666, 62047, 8622, 11050, 52, 15.360624
16384.0, 0.7290806438021404, 289.4779020191457, 1328, 8411.321077266468, 62155, 8652, 11867, 10, 15.521836
16384.0, 0.759237077305814, 294.5577436525347, 1340, 8543.031817419958, 58803, 8240, 10853, 30, 15.275929
16384.0, 0.8071385978362723, 305.74806115991936, 1590, 9600.001218065305, 67953, 9475, 11739, 37, 16.84839
16384.0, 0.5337407850797051, 295.7446491779417, 1359, 8081.181197718869, 60458, 8471, 15871, 57, 15.564789
16384.0, 0.40272199910754125, 182.30740485790147, 880, 1841.8411939263883, 10169, 1805, 4482, 0, 15.171315
16384.0, 0.5084140744518103, 213.05459571527297, 945, 3514.525493438356, 18811, 2991, 5883, 0, 15.198955
