32.0, 0.21165770979743695, 87.70247395833333, 134, 23.15099941375412, 3072, 512, 2419, 0, 15.100678
32.0, 0.21431561322729176, 87.43001302083333, 144, 22.548759985618297, 3072, 512, 2389, 0, 15.100609
32.0, 0.21035332785538208, 87.45735677083333, 139, 21.193429600402073, 3072, 512, 2434, 0, 15.100556
32.0, 0.21096003296250515, 87.14388020833333, 144, 20.59205736319856, 3072, 512, 2427, 0, 15.100602
32.0, 0.21315570358034971, 87.11588541666667, 144, 25.011894338042453, 3072, 512, 2402, 0, 15.100425
32.0, 0.2082147214314762, 87.12272135416667, 134, 19.105184927523915, 3072, 512, 2459, 0, 15.100511
32.0, 0.2129783693843594, 87.615234375, 144, 28.58682633594678, 3072, 512, 2404, 0, 15.1006
32.0, 0.21360033375052148, 87.798828125, 139, 30.404428394790486, 3072, 512, 2397, 0, 15.100476
32.0, 0.21227197346600332, 87.84765625, 139, 24.490819822311785, 3072, 512, 2412, 0, 15.100548
32.0, 0.2107863318237958, 88.06477864583333, 139, 29.274859395847102, 3072, 512, 2429, 0, 15.10054
32.0, 0.21183285064129084, 87.71647135416667, 139, 26.425975823355962, 3072, 512, 2417, 0, 15.100634
32.0, 0.21035332785538208, 87.57975260416667, 144, 21.393744683563742, 3072, 512, 2434, 0, 15.100588
32.0, 0.2107863318237958, 87.16048177083333, 139, 17.360907385366186, 3072, 512, 2429, 0, 15.100678
32.0, 0.21467505241090146, 87.59505208333333, 139, 23.01196699506787, 3072, 512, 2385, 0, 15.100684
32.0, 0.2134222592746978, 86.99609375, 134, 16.853599212235054, 3072, 512, 2399, 0, 15.100466
32.0, 0.21183285064129084, 87.24283854166667, 144, 27.271994277661484, 3072, 512, 2417, 0, 15.100557
32.0, 0.21315570358034971, 87.55826822916667, 134, 17.43690764348203, 3072, 512, 2402, 0, 15.100599
32.0, 0.21096003296250515, 88.11555989583333, 144, 29.8085954330611, 3072, 512, 2427, 0, 15.100555
32.0, 0.21431561322729176, 87.8369140625, 139, 26.247666548787357, 3072, 512, 2389, 0, 15.10051
32.0, 0.21122112211221122, 87.34244791666667, 134, 23.15440586250261, 3072, 512, 2424, 0, 15.100547
32.0, 0.21386800334168754, 86.939453125, 134, 19.957340583258024, 3072, 512, 2394, 0, 15.10058
32.0, 0.21122112211221122, 87.52994791666667, 134, 26.2879427475853, 3072, 512, 2424, 0, 15.100495
32.0, 0.2099220992209922, 87.01692708333333, 139, 17.021753120533248, 3072, 512, 2439, 0, 15.100636
32.0, 0.2140468227424749, 87.29264322916667, 134, 21.596703148296996, 3072, 512, 2392, 0, 15.100558
32.0, 0.21122112211221122, 87.79752604166667, 139, 22.642297667490425, 3072, 512, 2424, 0, 15.100506
32.0, 0.2107863318237958, 87.0439453125, 139, 18.820551466525416, 3072, 512, 2429, 0, 15.100584
32.0, 0.21386800334168754, 87.98307291666667, 139, 32.69960620182516, 3072, 512, 2394, 0, 15.100521
32.0, 0.21227197346600332, 87.52571614583333, 139, 26.562770768303572, 3072, 512, 2412, 0, 15.100544
32.0, 0.212096106048053, 87.49967447916667, 139, 22.548044929809272, 3072, 512, 2414, 0, 15.100618
32.0, 0.21165770979743695, 87.14778645833333, 139, 18.880772700605704, 3072, 512, 2419, 0, 15.10048
64.0, 0.3448275862068966, 86.62754590984974, 144, 24.069842163489735, 5990, 1000, 2900, 0, 15.103207
64.0, 0.3344437041972019, 85.9733865602129, 134, 13.696415846670991, 6012, 1004, 3002, 0, 15.102754
64.0, 0.3467128027681661, 86.69543485504832, 139, 19.1125641862938, 6002, 1002, 2890, 0, 15.10253
64.0, 0.34289617486338797, 87.04427430093209, 149, 22.09321500144502, 6008, 1004, 2928, 0, 15.102129
64.0, 0.34186284544524054, 86.50149750415973, 139, 16.895211334965694, 6010, 1002, 2931, 0, 15.102423
64.0, 0.3461007591442374, 86.78093339976748, 139, 21.570642301029242, 6021, 1003, 2898, 0, 15.102807
64.0, 0.3412887828162291, 86.32200566383474, 134, 15.559274612181406, 6003, 1001, 2933, 0, 15.102071
64.0, 0.34456671251719395, 86.32616666666667, 139, 19.102700079682815, 6000, 1002, 2908, 0, 15.100604
64.0, 0.341646737273659, 86.41425241425242, 144, 20.36336894411332, 6006, 1000, 2927, 0, 15.102437
64.0, 0.3409400544959128, 86.41670835417709, 134, 16.811987362085677, 5997, 1001, 2936, 0, 15.10367
64.0, 0.33918918918918917, 86.4229873586161, 134, 15.754130314602923, 6012, 1004, 2960, 0, 15.105621
64.0, 0.33466666666666667, 86.13996010638297, 149, 16.437041803192816, 6016, 1004, 3000, 0, 15.102436
64.0, 0.337947332883187, 87.04902451225612, 144, 22.08187216677404, 5997, 1001, 2962, 0, 15.102553
64.0, 0.3463397790055249, 86.3459297486266, 144, 18.985786699877153, 6007, 1003, 2896, 0, 15.102016
64.0, 0.34187158469945356, 86.49941715237303, 139, 19.82791480022951, 6005, 1001, 2928, 0, 15.102671
64.0, 0.34187158469945356, 86.2980464184338, 144, 17.773535852361597, 5989, 1001, 2928, 0, 15.102781
64.0, 0.3467128027681661, 86.5004995004995, 144, 20.269981336643866, 6006, 1002, 2890, 0, 15.102428
64.0, 0.3427887901572112, 86.31003494757863, 139, 17.390065779466045, 6009, 1003, 2926, 0, 15.102011
64.0, 0.3436319945073807, 86.61247290311823, 139, 17.193913823170394, 5997, 1001, 2913, 0, 15.102134
64.0, 0.3452544704264099, 86.87529098769538, 139, 16.058458983088794, 6014, 1004, 2908, 0, 15.104748
64.0, 0.34659287443791076, 86.4771818787475, 139, 19.605405719742503, 6004, 1002, 2891, 0, 15.102388
64.0, 0.3432887058015791, 86.55739072405738, 139, 16.708105491677504, 5994, 1000, 2913, 0, 15.102375
64.0, 0.3455425017277125, 86.6692256341789, 139, 20.802512953247007, 5992, 1000, 2894, 0, 15.103362
64.0, 0.34397528321318227, 86.64973351099268, 139, 16.44232498562622, 6004, 1002, 2913, 0, 15.102162
64.0, 0.3439643347050754, 86.57459576596099, 134, 19.79088130384691, 5999, 1003, 2916, 0, 15.102437
64.0, 0.343385880740233, 86.36592271818787, 139, 18.80932952134951, 6004, 1002, 2918, 0, 15.10216
64.0, 0.3397631133671743, 86.46425008313935, 144, 15.512739168043202, 6014, 1004, 2955, 0, 15.101332
64.0, 0.3359008707300737, 86.36303080766028, 139, 19.7615807355539, 6005, 1003, 2986, 0, 15.102634
64.0, 0.3435245620061834, 86.49165554072096, 139, 17.7195698424535, 5992, 1000, 2911, 0, 15.102934
64.0, 0.34114848793747876, 86.36448287329564, 134, 15.653547295227252, 6014, 1004, 2943, 0, 15.102024
128.0, 0.4674302075876879, 86.01830566198382, 134, 17.575085313073348, 11745, 1959, 4191, 0, 15.10098
128.0, 0.46587395957193817, 85.44786790365137, 149, 11.762273259576547, 11749, 1959, 4205, 0, 15.101575
128.0, 0.4644212523719165, 85.60652247956403, 139, 15.780444387807147, 11744, 1958, 4216, 0, 15.101097
128.0, 0.47065897065897067, 85.77702990542728, 158, 17.673593509572193, 11737, 1957, 4158, 0, 15.101238
128.0, 0.46365143263083114, 85.70638297872341, 139, 13.050848957963401, 11750, 1958, 4223, 0, 15.101326
128.0, 0.4648956356736243, 85.60720367847412, 139, 13.78478486191119, 11744, 1960, 4216, 0, 15.101199
128.0, 0.4550313734603765, 85.42137989778534, 129, 10.998311663345506, 11740, 1958, 4303, 0, 15.101027
128.0, 0.45444006492000927, 85.45725476839237, 158, 19.13029016746173, 11744, 1960, 4313, 0, 15.100814
128.0, 0.4611581920903955, 85.85539194825091, 144, 13.988631606784933, 11749, 1959, 4248, 0, 15.101528
128.0, 0.46561979538424936, 85.8078397954836, 148, 13.09069265590004, 11735, 1957, 4203, 0, 15.101339
128.0, 0.46521016385656616, 85.6573373032752, 139, 12.371263233135478, 11755, 1959, 4211, 0, 15.100599
128.0, 0.4693045563549161, 85.74704129416773, 134, 15.59149383850436, 11745, 1957, 4170, 0, 15.10149
128.0, 0.45638992537313433, 85.34037658686206, 134, 11.507775658711298, 11737, 1957, 4288, 0, 15.101179
128.0, 0.4611581920903955, 85.71915183513583, 149, 13.588504954613954, 11743, 1959, 4248, 0, 15.101457
128.0, 0.4607773851590106, 86.00008514986376, 134, 17.366734359905823, 11744, 1956, 4245, 0, 15.100966
128.0, 0.46365143263083114, 85.9428182437032, 149, 13.985288368164538, 11752, 1958, 4223, 0, 15.100772
128.0, 0.4694464414090582, 85.5225048923679, 139, 14.669899020232032, 11753, 1959, 4173, 0, 15.100951
128.0, 0.46896716990174936, 85.34384320409033, 134, 12.368816997892852, 11735, 1957, 4173, 0, 15.101503
128.0, 0.45649139134481154, 85.16573224600748, 134, 10.34428120845709, 11772, 1962, 4298, 0, 15.101768
128.0, 0.46492890995260666, 86.11743197278912, 139, 16.156776295098002, 11760, 1962, 4220, 0, 15.101162
128.0, 0.46625475285171103, 85.79969418960245, 139, 13.160672041666428, 11772, 1962, 4208, 0, 15.100713
128.0, 0.4671115347950429, 86.01915871934605, 144, 18.056039838149903, 11744, 1960, 4196, 0, 15.101562
128.0, 0.4609429978888107, 85.32111026228674, 139, 15.432859961619828, 11781, 1965, 4263, 0, 15.100615
128.0, 0.45978363123236127, 85.76557838206462, 144, 18.608949044304072, 11731, 1955, 4252, 0, 15.101491
128.0, 0.4663495838287753, 85.53915483377264, 139, 17.759035405702033, 11761, 1961, 4205, 0, 15.100503
128.0, 0.4584206848357792, 85.48432734666216, 144, 13.670719048793146, 11804, 1968, 4293, 0, 15.100511
128.0, 0.4653206650831354, 85.6292670469056, 139, 14.21221258660832, 11747, 1959, 4210, 0, 15.101075
128.0, 0.46736541210100047, 85.72143828629717, 139, 16.611024549401247, 11764, 1962, 4198, 0, 15.1008
128.0, 0.47283264911857037, 85.63882733935571, 134, 16.243387415064955, 11734, 1958, 4141, 0, 15.100463
128.0, 0.45665814547989775, 85.5900483994226, 144, 11.90639464563502, 11777, 1965, 4303, 0, 15.102426
256.0, 0.5666666666666667, 85.17620520752772, 149, 12.542224608646206, 23274, 3876, 6840, 0, 15.100709
256.0, 0.5572003449267031, 85.52827105817603, 173, 14.94989693114658, 23257, 3877, 6958, 0, 15.100744
256.0, 0.5765511084660021, 85.31009418949722, 161, 11.98597873927955, 23251, 3875, 6721, 0, 15.100897
256.0, 0.5621825569583515, 85.13274526678141, 152, 11.353965093058878, 23240, 3874, 6891, 0, 15.100915
256.0, 0.5613958876339415, 84.74117090377253, 161, 10.950175149983785, 23247, 3877, 6906, 0, 15.100901
256.0, 0.5622641509433962, 85.36888066764175, 155, 11.911796645837656, 23246, 3874, 6890, 0, 15.10102
256.0, 0.563490909090909, 85.10907369146005, 141, 11.89163252726568, 23232, 3874, 6875, 0, 15.100867
256.0, 0.5602488065962679, 85.33139659995696, 158, 10.656427078259615, 23235, 3873, 6913, 0, 15.100722
256.0, 0.5657126168224299, 85.15178110480124, 148, 11.142145395626617, 23244, 3874, 6848, 0, 15.10072
256.0, 0.559324480369515, 85.29154656915466, 147, 10.816897382418322, 23245, 3875, 6928, 0, 15.101278
256.0, 0.5647419072615923, 85.20201368271589, 158, 10.759179361388794, 23241, 3873, 6858, 0, 15.100879
256.0, 0.5687628563032618, 85.14314004046666, 144, 9.740052634142057, 23229, 3871, 6806, 0, 15.101025
256.0, 0.5659163987138264, 85.57702900421722, 145, 18.42468003999169, 23238, 3872, 6842, 0, 15.100907
256.0, 0.567785431628316, 85.37549492167327, 158, 13.33988816016775, 23236, 3874, 6823, 0, 15.100682
256.0, 0.5551575931232091, 84.82571293388963, 143, 10.323052649369217, 23249, 3875, 6980, 0, 15.100837
256.0, 0.5651539471764191, 85.33617387561868, 160, 12.52972861396382, 23235, 3873, 6853, 0, 15.100922
256.0, 0.5682451253481894, 85.36972982274996, 163, 12.113170627494954, 23244, 3876, 6821, 0, 15.100658
256.0, 0.5711337166445526, 85.42296436563953, 158, 12.741912713881685, 23236, 3874, 6783, 0, 15.100838
256.0, 0.5555396096440872, 85.34448606984455, 149, 9.871274224465823, 23223, 3871, 6968, 0, 15.101105
256.0, 0.5633905205001454, 85.43507247623553, 170, 13.351490141133384, 23249, 3875, 6878, 0, 15.100636
256.0, 0.564065230052417, 84.98756454388985, 148, 11.147785103176503, 23240, 3874, 6868, 0, 15.100587
256.0, 0.5646407229266871, 85.14930316586373, 143, 11.811573930875808, 23248, 3874, 6861, 0, 15.10083
256.0, 0.5632267441860465, 85.01734153793193, 156, 12.174733102915107, 23239, 3875, 6880, 0, 15.101247
256.0, 0.5616299303944315, 85.20572166057217, 151, 11.153565633633328, 23245, 3873, 6896, 0, 15.100973
256.0, 0.5549348230912476, 85.32184353214562, 153, 10.152811379393217, 23238, 3874, 6981, 0, 15.100698
256.0, 0.5688693098384728, 85.26777108433735, 143, 10.289586098365401, 23240, 3874, 6810, 0, 15.100636
256.0, 0.5618743652981285, 85.26954688239597, 145, 12.388400714330203, 23239, 3873, 6893, 0, 15.100535
256.0, 0.564494971578487, 85.24828980768403, 148, 13.066909015594813, 23243, 3873, 6861, 0, 15.100729
256.0, 0.566661788379921, 85.31687898089172, 166, 11.516406603412147, 23236, 3872, 6833, 0, 15.100895
256.0, 0.5590823834944453, 85.01742610042596, 147, 10.44694778874323, 23241, 3875, 6931, 0, 15.100646
512.0, 0.6408871905632165, 107.2786407137765, 685, 642.934092805586, 46289, 7715, 12038, 0, 15.100504
512.0, 0.6153723489076702, 108.40677380335234, 691, 674.7175274834898, 46296, 7718, 12542, 0, 15.10065
512.0, 0.6256589084421377, 109.26179005811316, 807, 715.8174151260705, 46289, 7715, 12331, 0, 15.100759
512.0, 0.6276535176901179, 108.93668589203551, 780, 718.4267890034678, 46293, 7717, 12295, 0, 15.100655
512.0, 0.6154091561652576, 107.15410041479433, 705, 595.3927404678659, 46288, 7716, 12538, 0, 15.1006
512.0, 0.6159865846841811, 106.98049254698638, 694, 667.0862978288555, 46290, 7714, 12523, 0, 15.100773
512.0, 0.6448215330602691, 108.692196344467, 796, 861.7572166854712, 46286, 7714, 11963, 0, 15.10091
512.0, 0.6243728758698819, 104.11363636363636, 690, 564.8497298190777, 46288, 7716, 12358, 0, 15.100918
512.0, 0.6145941209272684, 107.1229283260226, 665, 711.614896173028, 46279, 7715, 12553, 0, 15.100545
512.0, 0.6391120682514703, 106.69989631485721, 762, 643.3333488510407, 46294, 7716, 12073, 0, 15.100836
512.0, 0.6371067624473619, 108.52680808779054, 747, 806.6006673010767, 46292, 7716, 12111, 0, 15.100824
512.0, 0.639459728206828, 105.96189653310293, 665, 547.3421423494137, 46295, 7717, 12068, 0, 15.100817
512.0, 0.6184558646676822, 108.71997752906097, 694, 680.7140619334917, 46282, 7714, 12473, 0, 15.100705
512.0, 0.6327183271832718, 109.5689379536813, 705, 700.9572485824036, 46288, 7716, 12195, 0, 15.100819
512.0, 0.6392709196354598, 115.09873423189909, 700, 1000.9658886033841, 46296, 7716, 12070, 0, 15.100799
512.0, 0.6374452615054119, 109.28049597131316, 717, 747.9322177743206, 46293, 7715, 12103, 0, 15.100624
512.0, 0.6398009950248756, 107.66372121159746, 718, 768.6629348149816, 46286, 7716, 12060, 0, 15.100682
512.0, 0.6296205630354957, 108.66765315821308, 720, 673.4228526893186, 46292, 7716, 12255, 0, 15.10038
512.0, 0.6211865088947919, 107.3617237282644, 684, 602.3063301156462, 46295, 7717, 12423, 0, 15.100818
512.0, 0.6158020750199521, 102.88870166342623, 725, 534.7804743115307, 46290, 7716, 12530, 0, 15.100902
512.0, 0.6162753553745408, 115.58435751776572, 805, 1138.6254222471837, 46297, 7717, 12522, 0, 15.100671
512.0, 0.6223584449104694, 107.88052963538966, 689, 650.7109038477581, 46296, 7716, 12398, 0, 15.100561
512.0, 0.6154582435989471, 111.31688771763079, 795, 815.3449509538844, 46294, 7716, 12537, 0, 15.100889
512.0, 0.6156546716667997, 101.00438539641391, 619, 336.66284165930983, 46290, 7716, 12533, 0, 15.100712
512.0, 0.636116376823539, 109.85381657954987, 752, 789.6665343785197, 46298, 7718, 12133, 0, 15.100494
512.0, 0.6283481234226166, 111.57075288324478, 674, 809.8527320693622, 46302, 7718, 12283, 0, 15.100724
512.0, 0.639393185774683, 107.99414497137302, 815, 764.8580126597179, 46285, 7713, 12063, 0, 15.100773
512.0, 0.6392709196354598, 110.30353362996242, 730, 786.6511024292446, 46298, 7716, 12070, 0, 15.100798
512.0, 0.629907762631622, 108.40142138120234, 725, 740.6362457331138, 46293, 7717, 12251, 0, 15.100782
512.0, 0.639217960400961, 108.4127316714909, 664, 693.1969712597433, 46294, 7716, 12071, 0, 15.10081
1024.0, 0.4319258848140716, 740.498452012384, 5131, 128922.88872329764, 59755, 10117, 23423, 0, 15.109885
1024.0, 0.45183722912647495, 733.7811361308414, 4894, 124416.7349469326, 59553, 10071, 22289, 0, 15.12428
1024.0, 0.4519420239085694, 712.8970580996604, 4896, 123972.81051616957, 60947, 10321, 22837, 0, 15.135476
1024.0, 0.4350475054322355, 718.4972874326006, 4994, 126068.73443312805, 60275, 10211, 23471, 0, 15.115369
1024.0, 0.4494530117305918, 717.0618665960125, 5031, 123243.41226445534, 60388, 10230, 22761, 0, 15.114497
1024.0, 0.4548781576363474, 718.0168806546035, 4865, 121530.77904820394, 60128, 10192, 22406, 0, 15.150596
1024.0, 0.44207422823447795, 730.2650237786424, 5015, 124960.83842807532, 60138, 10196, 23064, 0, 15.134301
1024.0, 0.424674993627326, 744.2022610517778, 5051, 126864.65823490557, 59176, 9996, 23538, 0, 15.125512
1024.0, 0.44219665726069024, 731.2689043466685, 4954, 126615.19016217753, 60092, 10186, 23035, 0, 15.114105
1024.0, 0.45286885245901637, 725.9311474864425, 4959, 120885.62216557555, 60114, 10166, 22448, 0, 15.140833
1024.0, 0.4317052270779777, 735.4123869101671, 5193, 127241.23363273112, 59466, 10076, 23340, 0, 15.110268
1024.0, 0.4434328033108255, 724.955546309395, 4962, 124189.6364827852, 60085, 10179, 22955, 0, 15.115036
1024.0, 0.4258141314514072, 755.4334513572753, 5109, 125374.78213747562, 59310, 10016, 23522, 0, 15.109882
1024.0, 0.45529634023109705, 718.9275513701425, 4961, 122406.90253521343, 61271, 10363, 22761, 0, 15.110014
1024.0, 0.42971273159952406, 741.0071832825424, 5165, 129216.62816422548, 59722, 10112, 23532, 0, 15.130578
1024.0, 0.4416312584870121, 738.3997412025678, 5025, 121635.54391258076, 59506, 10082, 22829, 0, 15.109342
1024.0, 0.43374164810690424, 722.597043626574, 4970, 122981.04955583323, 59803, 10127, 23348, 0, 15.114974
1024.0, 0.4344599811272197, 719.4829333556318, 5003, 122678.50359671265, 59795, 10129, 23314, 0, 15.120031
1024.0, 0.43795934155671123, 721.3650274131916, 4969, 121996.24545407406, 60190, 10190, 23267, 0, 15.110229
1024.0, 0.43463155185725316, 735.5214745465184, 5166, 127658.3605573919, 59815, 10133, 23314, 0, 15.115016
1024.0, 0.4361779722830051, 712.1536834038583, 5026, 123029.54628679377, 60026, 10166, 23307, 0, 15.130431
1024.0, 0.4463755458515284, 725.705166319823, 5077, 127696.976514766, 60546, 10222, 22900, 0, 15.130365
1024.0, 0.43946188340807174, 733.5004149928621, 5007, 128558.58993744814, 60242, 10192, 23192, 0, 15.180712
1024.0, 0.44739619985925405, 728.2039484607976, 4928, 125714.66647828279, 60226, 10172, 22736, 0, 15.109911
1024.0, 0.4555678059536935, 714.1802392266098, 4809, 123085.77715676509, 61030, 10330, 22675, 0, 15.11037
1024.0, 0.448008028974124, 725.2118564433966, 4985, 127858.03098203099, 60659, 10267, 22917, 0, 15.135522
1024.0, 0.4432710769767848, 736.9662148661249, 4894, 125332.0272109823, 60056, 10158, 22916, 0, 15.156177
1024.0, 0.44743900328776604, 720.2888761561758, 5064, 125730.29229902172, 61085, 10343, 23116, 0, 15.115521
1024.0, 0.4379874533740251, 717.3159944367177, 5140, 124139.92611961481, 61115, 10333, 23592, 0, 15.115111
1024.0, 0.4551556635018768, 707.1005989006482, 4956, 121030.34723408868, 60945, 10307, 22645, 0, 15.109559
2048.0, 0.18528237042541335, 1344.887664898681, 9336, 358986.10518146254, 51471, 7979, 43064, 3457, 15.120218
2048.0, 0.27515338953459373, 1434.952177401932, 8538, 430233.8876501905, 64802, 11032, 40094, 0, 15.130516
2048.0, 0.29578406719811673, 1445.639614346317, 8181, 417071.0621318801, 64825, 11057, 37382, 0, 15.130507
2048.0, 0.28737676194461154, 1431.5176343588557, 8213, 421415.67853893293, 64845, 10989, 38239, 0, 15.135766
2048.0, 0.2964000747204654, 1440.1752827510418, 8248, 415273.32224902965, 65517, 11107, 37473, 0, 15.145345
2048.0, 0.21853030415155775, 1344.1753645503125, 8575, 321534.5738137104, 55205, 8859, 40539, 2218, 15.114948
2048.0, 0.21251685393258427, 1375.210856661227, 9623, 442036.7018847041, 55763, 9457, 44500, 2343, 15.115697
2048.0, 0.2618811041368781, 1424.6998997839091, 8406, 416368.9847974908, 63862, 10806, 41263, 0, 15.134995
2048.0, 0.30211563263178115, 1419.318930805922, 8250, 395236.6329170473, 64572, 11010, 36443, 0, 15.408592
2048.0, 0.2620656601965013, 1422.360900503387, 8461, 426885.27727364475, 64364, 10936, 41730, 0, 15.110291
2048.0, 0.24279400932973239, 1359.2543887434774, 8819, 343856.73848540004, 59983, 9889, 40730, 1051, 15.151007
2048.0, 0.27712252160650735, 1413.7484089286268, 7945, 399391.90619926754, 64422, 10902, 39340, 0, 15.109884
2048.0, 0.2770485078453492, 1407.4969448818897, 8439, 417166.55935159064, 63500, 10806, 39004, 0, 15.105453
2048.0, 0.28214688968831236, 1408.249663707291, 8056, 390286.1357224928, 63189, 10745, 38083, 30, 15.110544
2048.0, 0.2804076265614727, 1438.9440496385616, 8108, 415185.47123372316, 65433, 11089, 39546, 0, 15.130048
2048.0, 0.19919206024637176, 1361.9141689900866, 9596, 356215.7134263545, 51648, 7988, 40102, 3594, 15.119965
2048.0, 0.2568290215349039, 1424.5246893553515, 8890, 451987.187521448, 61646, 10662, 41514, 823, 15.211543
2048.0, 0.25156495954899877, 1118.4162527661667, 6205, 221947.88317705278, 40670, 6872, 27317, 1277, 15.148749
2048.0, 0.29250739664685343, 1415.750775819265, 7963, 393960.7619190529, 64448, 10974, 37517, 0, 15.110179
2048.0, 0.27885829104304594, 1417.1846226193275, 7999, 408365.66982885404, 63795, 10825, 38819, 0, 15.105537
2048.0, 0.2875332672337317, 1438.7064806563624, 8038, 409991.6112536263, 65086, 11020, 38326, 0, 15.119819
2048.0, 0.28671165929718406, 1451.6113713603381, 8511, 413860.7838185516, 65322, 11088, 38673, 0, 15.210839
2048.0, 0.2988845767633729, 1419.2656108109773, 8830, 422219.4658166152, 64971, 11013, 36847, 0, 15.125233
2048.0, 0.288093083387201, 1432.368653589214, 8231, 414614.08728236327, 65864, 11142, 38675, 0, 15.170844
2048.0, 0.2881228438772599, 1442.3797487745098, 8167, 442344.9398490782, 65280, 11108, 38553, 0, 15.175655
2048.0, 0.2673550786698314, 1444.0308149855189, 8587, 428156.64067718806, 64222, 10926, 40867, 0, 15.114802
2048.0, 0.20266421897432277, 1335.5558404190567, 8997, 341289.5701407005, 54217, 8611, 42489, 2445, 15.115371
2048.0, 0.204673173617273, 1327.1157950303534, 9029, 333477.8283700995, 53042, 8304, 40572, 3286, 15.150878
2048.0, 0.2922386553729322, 1416.384430547426, 7884, 404456.5431069395, 64922, 11006, 37661, 0, 15.12003
2048.0, 0.2614326772656165, 1118.3208031258828, 6637, 192076.28767315974, 42484, 7186, 27487, 1151, 15.103238
4096.0, 0.23131925726265348, 1151.482876999079, 6695, 222390.6206235231, 35829, 6179, 26712, 1487, 15.106687
4096.0, 0.16034166260817442, 1648.4112373225153, 11515, 567487.0407335354, 49300, 8560, 53386, 3970, 15.155699
4096.0, 0.22838318033757773, 1217.7307586586037, 6886, 260406.20621312325, 36380, 6170, 27016, 1322, 15.121656
4096.0, 0.128211778218262, 1645.9880645510668, 12035, 484839.21615753457, 46165, 6921, 53981, 5451, 15.124818
4096.0, 0.11967887742022533, 1522.1930603808435, 11698, 411304.8998340775, 45478, 7096, 59292, 5481, 15.135027
4096.0, 0.11175358264701746, 1640.9892205094566, 12535, 490366.08023236506, 45735, 7151, 63989, 5929, 15.120534
4096.0, 0.24982292404483147, 1079.9222818412877, 5630, 141818.9011530195, 35410, 5996, 24001, 1003, 15.152202
4096.0, 0.12985610841198042, 1862.7414087557795, 12758, 578820.4580923953, 48014, 6976, 53721, 5700, 15.135758
4096.0, 0.1154633683474555, 1740.9717528588496, 13434, 535633.7959230749, 46872, 6936, 60071, 5471, 15.403247
4096.0, 0.14992385743373884, 1778.0385252533035, 11537, 702994.7762066132, 51914, 8762, 58443, 3581, 15.135891
4096.0, 0.23859154026232243, 1231.7575057208237, 6851, 244271.76615825863, 43700, 7440, 31183, 829, 15.140688
4096.0, 0.08038932350058964, 1678.0293228346457, 13839, 580328.1123342362, 31750, 4840, 60207, 9643, 15.196366
4096.0, 0.1280506329113924, 1897.384739399802, 12646, 855225.1201792754, 43419, 7587, 59250, 5686, 15.181261
4096.0, 0.15732246007475365, 1804.3369223953619, 11127, 774305.4780305191, 51917, 8797, 55917, 3596, 15.191428
4096.0, 0.15289052423943555, 1640.336299035184, 10780, 477565.2263770377, 51927, 8061, 52724, 3461, 15.125722
4096.0, 0.24104258176933968, 1194.025244588635, 7633, 260432.06853025104, 39454, 6640, 27547, 774, 15.117144
4096.0, 0.0811766670208406, 1909.73314678852, 13511, 547634.0758668261, 38954, 5348, 65881, 8158, 15.196377
4096.0, 0.11361035785381758, 1674.2583399174787, 13337, 611240.7021881595, 45564, 7248, 63797, 5414, 15.105334
4096.0, 0.23942549371633753, 1237.3332406049265, 6856, 246165.511365135, 39542, 6668, 27850, 1292, 15.111341
4096.0, 0.10711142842910987, 1965.7479238474173, 12651, 661952.4305205165, 43229, 6451, 60227, 6849, 15.125648
4096.0, 0.08566500282395323, 1831.8659201268456, 12736, 491141.3643032281, 40364, 5612, 65511, 7302, 15.110654
4096.0, 0.10792385719931498, 1666.2839073232078, 14056, 539095.8407737351, 41348, 6554, 60728, 7150, 15.1508
4096.0, 0.225725406935598, 1222.3067147746267, 6335, 201164.06128823958, 37693, 6379, 28260, 1419, 15.283236
4096.0, 0.2570774681004483, 1295.0902210175145, 7295, 241863.15762059466, 47960, 8200, 31897, 737, 15.112648
4096.0, 0.09371362048894064, 1792.4982438408085, 12051, 440341.3468785441, 39575, 5635, 60130, 7416, 15.100577
4096.0, 0.1183204647962694, 1466.2689594577632, 11633, 341815.95894751983, 39835, 6191, 52324, 6447, 15.125364
4096.0, 0.2521714265289345, 1204.2078283616117, 6172, 242653.75254174724, 41669, 7055, 27977, 988, 15.11468
4096.0, 0.17275843836878102, 1764.4178898051623, 12194, 650276.9482952754, 57843, 10129, 58631, 2613, 15.221863
4096.0, 0.17998940271509747, 1613.1174054857954, 11517, 491453.05146816344, 59171, 9851, 54731, 1850, 15.333094
4096.0, 0.11856206748729255, 1858.2932825056666, 12870, 623985.3613061184, 48530, 7744, 65316, 5520, 15.115447
8192.0, 0.10397953901896903, 1545.3287151977302, 12672, 419150.038116326, 45112, 6830, 65686, 5909, 15.186284
8192.0, 0.16710848896773037, 1637.7448263050344, 11038, 480070.26750530646, 53830, 8384, 50171, 4238, 15.163972
8192.0, 0.12290542084996396, 1957.111714700394, 12740, 632286.9095705663, 48230, 6990, 56873, 6108, 15.125624
8192.0, 0.12535602932501896, 1773.2951845906903, 12105, 579477.18869593, 49840, 7438, 59335, 5270, 15.115735
8192.0, 0.2324326517364492, 1018.8516719485827, 6588, 175928.70623294008, 33763, 5729, 24648, 734, 15.163354
8192.0, 0.1106317160534028, 1846.258059600775, 12227, 621252.4008500716, 45939, 6795, 61420, 6247, 15.105546
8192.0, 0.21628784836559312, 1074.0051221684907, 6177, 189480.10141473322, 31432, 5386, 24902, 1077, 15.106382
8192.0, 0.12351610031161893, 1856.9666355930367, 11775, 510662.20027640497, 46127, 6659, 53912, 6256, 15.100475
8192.0, 0.20396583157506606, 1690.4944851998152, 10863, 640720.1700468669, 58479, 9957, 48817, 2166, 15.12043
8192.0, 0.09468966767172492, 1730.4366089418245, 12595, 469229.27337219677, 39209, 5747, 60693, 7710, 15.130556
8192.0, 0.11428304355954384, 1923.0169770624116, 12749, 485436.1903892567, 43117, 6113, 53490, 7101, 15.196279
8192.0, 0.2567149988115046, 1179.3117702321836, 6790, 220036.4177198942, 44706, 7560, 29449, 324, 15.109472
8192.0, 0.18541039086615344, 1737.6283100541525, 11173, 679519.1299254677, 57061, 9971, 53778, 2742, 15.150954
8192.0, 0.10007201678304162, 1847.1129291722204, 13356, 573874.9918382915, 43514, 6392, 63874, 7023, 15.115544
8192.0, 0.2215432995641184, 1822.508175069454, 10947, 770856.650407699, 65871, 11131, 50243, 1484, 15.377019
8192.0, 0.08265794193848403, 1513.820046771854, 12891, 288073.1537109243, 33781, 4977, 60212, 9612, 15.120215
8192.0, 0.2620148850750123, 1676.0648433448243, 8662, 571151.9502838836, 65558, 11160, 42593, 17, 15.125766
8192.0, 0.1268431202830547, 1815.9139945515085, 13429, 923191.524111145, 49555, 8353, 65853, 5419, 15.120484
8192.0, 0.12400741994272325, 1630.807007611499, 13555, 575327.3854655038, 47691, 7621, 61456, 6140, 15.115645
8192.0, 0.16799908447365408, 2033.5223373312854, 13571, 1054748.5800886876, 61198, 10276, 61167, 4201, 15.129914
8192.0, 0.1695808501206718, 1809.6741012654306, 12004, 640923.8426778022, 64563, 10329, 60909, 2643, 15.120421
8192.0, 0.11255404546792915, 2043.7788157029897, 12914, 669369.8073680898, 50207, 7263, 64529, 7050, 15.110316
8192.0, 0.15664627268687836, 1699.105808978171, 12183, 556629.5009316832, 55156, 9166, 58514, 4526, 15.150981
8192.0, 0.1709856589216509, 1992.8229561827864, 11681, 850411.753795032, 57466, 9574, 55993, 4229, 15.145903
8192.0, 0.11377294005215673, 1779.5752266757054, 13657, 508974.1673282206, 47204, 7024, 61737, 7461, 15.109239
8192.0, 0.16799188857463046, 1654.9428290835117, 12926, 508661.59487114666, 57022, 9444, 56217, 4096, 15.13538
8192.0, 0.11025690785054262, 1889.379138506288, 14246, 692242.3341977954, 46756, 7386, 66989, 7711, 15.150538
8192.0, 0.18938860810781993, 1630.432664756447, 9231, 561459.4464676888, 52001, 8881, 46893, 1475, 15.107745
8192.0, 0.24977077196199693, 1951.0315518945633, 10336, 742654.8617886618, 75875, 12803, 51259, 114, 15.110235
8192.0, 0.2514786296172302, 2007.609691100852, 10593, 811006.721352532, 79929, 13521, 53766, 20, 15.125716
16384.0, 0.1864167674324869, 860.2003894574767, 5192, 89238.32561708872, 22082, 3700, 19848, 1102, 15.136198
16384.0, 0.10706950846606728, 1935.2831049231843, 13073, 582197.5747920921, 45824, 7038, 65733, 7448, 15.264537
16384.0, 0.22981881685221567, 910.40516519611, 5682, 107343.73438533868, 31054, 5264, 22905, 242, 15.104712
16384.0, 0.14407902315401452, 1232.618760730451, 7479, 239630.28695088878, 32035, 5003, 34724, 2359, 15.120267
16384.0, 0.10786643841308359, 1994.935461303017, 13584, 594648.59438623, 45740, 6490, 60167, 7021, 15.12522
16384.0, 0.1531513374862587, 1781.6632517029163, 12366, 589700.1464695216, 54759, 8359, 54580, 4352, 15.226228
16384.0, 0.08553569979010356, 1897.7444937955036, 15915, 914989.0834576512, 43678, 7376, 86233, 7560, 15.176143
16384.0, 0.22607363233527974, 1741.229192623972, 10471, 561485.8084815174, 64208, 10918, 48294, 958, 15.120496
16384.0, 0.26034195696721313, 1310.0560437947017, 6908, 298734.54428082175, 47677, 8131, 31232, 139, 15.107656
16384.0, 0.12098582209731915, 1703.533743553421, 13168, 494469.177962051, 45179, 7663, 63338, 5693, 15.120006
16384.0, 0.07894425025179216, 1720.249719699518, 13854, 497838.57616635965, 35676, 5330, 67516, 9163, 15.140783
16384.0, 0.10751470122773993, 1946.5782843963452, 13165, 567357.8965320351, 45092, 6454, 60029, 6866, 15.11539
16384.0, 0.12948403784630044, 1710.9696777333418, 11782, 528545.5962734136, 47259, 7609, 58764, 4777, 15.166122
16384.0, 0.10910967741935484, 1822.8811598005773, 12325, 725902.2977513334, 38110, 6342, 58125, 7286, 15.125195
16384.0, 0.2196125736181083, 643.3737284873811, 3897, 45435.18457779398, 18187, 3095, 14093, 239, 15.1434
16384.0, 0.12248500428449015, 1953.1925930442912, 12639, 651567.9410518593, 49197, 7147, 58350, 6432, 15.408329
16384.0, 0.12489288440864403, 1827.5213312190886, 12497, 624539.2570904365, 52974, 8016, 64183, 5114, 15.110284
16384.0, 0.12217103945523733, 1949.9507603186098, 12985, 701572.8286337481, 52478, 8540, 69902, 5036, 15.115653
16384.0, 0.20155675366872566, 2021.0372970125202, 12220, 984305.9417482726, 64536, 11290, 56014, 1761, 15.119819
16384.0, 0.22954202022550274, 1339.630475818525, 7752, 326853.41659181076, 46089, 7899, 34412, 998, 15.362854
16384.0, 0.10130890052356022, 2137.829637220742, 13409, 714037.8801493646, 48790, 6966, 68760, 7825, 15.110167
16384.0, 0.2511777565661853, 2311.672213979644, 12422, 1157433.1308376822, 96383, 16315, 64954, 9, 15.113043
16384.0, 0.14178752320130872, 1966.652928922889, 12243, 806119.0991007306, 55686, 9014, 63574, 3945, 15.155993
16384.0, 0.11645574082560722, 2016.2114643648965, 12897, 551832.7375783508, 46457, 6607, 56734, 7235, 15.130677
16384.0, 0.22894668325281337, 1294.7890726469825, 7113, 292462.43160565634, 46196, 7914, 34567, 82, 15.130567
16384.0, 0.1026614828046895, 1898.2923785210883, 14379, 689750.7472627688, 45831, 6839, 66617, 7208, 15.272175
16384.0, 0.10770729595150466, 1682.5949348341233, 13233, 590265.6012113878, 47264, 7960, 73904, 4966, 15.145772
16384.0, 0.20001529168896703, 1754.5094743075201, 10980, 637701.1066231552, 60796, 10464, 52316, 2118, 15.287604
16384.0, 0.2613354658136745, 652.406286256724, 3472, 59567.69519755236, 18962, 3268, 12505, 304, 15.115633
16384.0, 0.08460138441341448, 1787.3177580023907, 14011, 580845.3115455324, 37645, 5671, 67032, 8537, 15.180794
