32.0, 0.15647921760391198, 102.220703125, 238, 183.91409463148608, 6144, 512, 3272, 0, 15.178915
32.0, 0.15143448683821353, 101.82177734375, 223, 169.26178202853936, 6144, 512, 3381, 0, 15.59357
32.0, 0.15945188414824044, 103.220703125, 238, 205.70197011653744, 6144, 512, 3211, 0, 15.167293
32.0, 0.15356928614277143, 101.92919921875, 218, 175.85471136647226, 6144, 512, 3334, 0, 15.208908
32.0, 0.14759296627270108, 102.21256510416667, 228, 175.79869076570884, 6144, 512, 3469, 0, 15.288803
32.0, 0.17262306136210384, 101.47135416666667, 228, 170.17868549745796, 6144, 512, 2966, 0, 15.283706
32.0, 0.15454271053425897, 101.51497395833333, 233, 191.5747854676074, 6144, 512, 3313, 0, 15.365025
32.0, 0.1658568189180434, 103.2734375, 228, 198.78866762013612, 6144, 512, 3087, 0, 15.127806
32.0, 0.15343122565178305, 102.51025390625, 233, 176.93551154950075, 6144, 512, 3337, 0, 15.299957
32.0, 0.154077640686127, 101.88264973958333, 233, 199.16345943096516, 6144, 512, 3323, 0, 15.290696
32.0, 0.15421686746987953, 102.84130859375, 223, 229.59522614158988, 6144, 512, 3320, 0, 15.138094
32.0, 0.1693121693121693, 102.5546875, 238, 237.57294241340603, 6144, 512, 3024, 0, 15.281022
32.0, 0.1703260146373919, 102.42366536458333, 243, 212.47871549013746, 6144, 512, 3006, 0, 15.665449
32.0, 0.1566228204343836, 103.11490885416667, 233, 224.11528136584124, 6144, 512, 3269, 0, 15.299217
32.0, 0.178397212543554, 102.44970703125, 233, 200.219329699472, 6144, 512, 2870, 0, 15.111568
32.0, 0.15557581282285018, 103.85514322916667, 253, 211.02283308423281, 6144, 512, 3291, 0, 15.27482
32.0, 0.13916825224245719, 104.06819661458333, 248, 245.768078007157, 6144, 512, 3679, 0, 15.335017
32.0, 0.14570290267501423, 101.517578125, 223, 192.8912303520072, 6144, 512, 3514, 0, 15.158619
32.0, 0.16131064902331443, 103.6904296875, 228, 220.07771243491763, 6144, 512, 3174, 0, 15.408793
32.0, 0.15950155763239876, 101.93831380208333, 233, 184.8722839601765, 6144, 512, 3210, 0, 15.122432
32.0, 0.1517037037037037, 102.12630208333333, 238, 205.87411129945033, 6144, 512, 3375, 0, 15.248946
32.0, 0.15965076395385094, 102.57405598958333, 223, 183.78113787543717, 6144, 512, 3207, 0, 15.315304
32.0, 0.15449607724803863, 102.05257161458333, 243, 219.3117373641006, 6144, 512, 3314, 0, 15.163137
32.0, 0.15005861664712777, 102.30208333333333, 233, 193.09820488805292, 6144, 512, 3412, 0, 15.544282
32.0, 0.16192283364958887, 102.3603515625, 228, 186.20961016715023, 6144, 512, 3162, 0, 15.173487
32.0, 0.15482310250982764, 102.41845703125, 228, 188.6944761315648, 6144, 512, 3307, 0, 15.199203
32.0, 0.1650016113438608, 101.5419921875, 238, 176.75166058252623, 6144, 512, 3103, 0, 15.111452
32.0, 0.17367706919945725, 102.05322265625, 223, 202.7409557461356, 6144, 512, 2948, 0, 15.29045
32.0, 0.1562881562881563, 102.67154947916667, 218, 175.29660520688114, 6144, 512, 3276, 0, 15.371029
32.0, 0.16607200778462536, 101.86783854166667, 223, 182.04827916416616, 6144, 512, 3083, 0, 15.131733
64.0, 0.2616249361267246, 102.38077799479167, 238, 199.39593996879515, 12288, 1024, 3914, 0, 15.628435
64.0, 0.2665972403020047, 101.89762369791667, 238, 193.85648798345827, 12288, 1024, 3841, 0, 15.340004
64.0, 0.25428358579587784, 101.53605143229167, 238, 202.33947894761576, 12288, 1024, 4027, 0, 15.944824
64.0, 0.2654224987039917, 101.89542643229167, 233, 187.11057059505558, 12288, 1024, 3858, 0, 15.107635
64.0, 0.34076539101497505, 101.272705078125, 238, 208.9273946300654, 12288, 1024, 3005, 0, 15.121385
64.0, 0.2598984771573604, 102.55403645833333, 238, 212.5310860431813, 12288, 1024, 3940, 0, 15.413129
64.0, 0.27350427350427353, 100.94140625, 238, 195.05718526237843, 12288, 1024, 3744, 0, 15.107467
64.0, 0.2603610475464022, 100.85563151041667, 233, 168.2752869827232, 12288, 1024, 3933, 0, 15.178792
64.0, 0.2574157868275515, 101.84163411458333, 248, 192.12262764464361, 12288, 1024, 3978, 0, 15.290048
64.0, 0.2579994960947342, 101.826416015625, 233, 181.54556235912167, 12288, 1024, 3969, 0, 15.224092
64.0, 0.27475181110812985, 101.87052408854167, 233, 200.76102673229298, 12288, 1024, 3727, 0, 15.61246
64.0, 0.269828722002635, 101.107666015625, 243, 191.14252318889535, 12288, 1024, 3795, 0, 15.439784
64.0, 0.2746347941567065, 101.9219685931682, 258, 153.95889056041239, 12354, 1034, 3765, 0, 16.698795
64.0, 0.2740899357601713, 102.01359049479167, 238, 179.64323436114586, 12288, 1024, 3736, 0, 15.230326
64.0, 0.270042194092827, 101.32112630208333, 233, 176.7238568493857, 12288, 1024, 3792, 0, 15.157746
64.0, 0.26009652019304036, 101.37548828125, 248, 204.37676612930886, 12288, 1024, 3937, 0, 15.132791
64.0, 0.26364572605561276, 101.29410807291667, 243, 177.4530494243971, 12288, 1024, 3884, 0, 15.533451
64.0, 0.27321237993596587, 102.431396484375, 243, 219.18705212002067, 12288, 1024, 3748, 0, 15.310848
64.0, 0.27571351642434033, 102.392333984375, 243, 192.52677353482125, 12288, 1024, 3714, 0, 15.283983
64.0, 0.2741633199464525, 101.74894205729167, 243, 176.22586792618415, 12288, 1024, 3735, 0, 15.731546
64.0, 0.2804711038071761, 101.97810872395833, 238, 185.84850791011883, 12288, 1024, 3651, 0, 15.34046
64.0, 0.28062482872019734, 102.04581705729167, 238, 198.28532048290154, 12288, 1024, 3649, 0, 15.514109
64.0, 0.25728643216080405, 101.9931640625, 228, 182.37598877880114, 12288, 1024, 3980, 0, 15.380815
64.0, 0.27350427350427353, 100.8232421875, 238, 208.04048158251865, 12288, 1024, 3744, 0, 15.390894
64.0, 0.27856365614798695, 102.22477213541667, 233, 216.13466908802684, 12288, 1024, 3676, 0, 15.465106
64.0, 0.2733582487987186, 101.92000325520833, 233, 191.903020530113, 12288, 1024, 3746, 0, 15.656871
64.0, 0.26680562793121415, 101.78971354166667, 248, 207.4251678658495, 12288, 1024, 3838, 0, 15.204434
64.0, 0.26269881990764493, 101.68082682291667, 233, 201.62762965829717, 12288, 1024, 3898, 0, 15.218694
64.0, 0.2661814400831817, 102.51936848958333, 248, 203.57608930105263, 12288, 1024, 3847, 0, 15.142977
64.0, 0.26209367801382133, 100.908203125, 228, 192.64273373417444, 12288, 1024, 3907, 0, 15.717089
128.0, 0.485632866302541, 101.5220741103094, 228, 198.06204473530752, 24531, 2045, 4211, 0, 15.18383
128.0, 0.5108722819295176, 101.92947462881384, 233, 210.07478271681333, 24516, 2044, 4001, 0, 15.214304
128.0, 0.48738695859114706, 101.41158040364583, 238, 201.00748139287063, 24576, 2048, 4202, 0, 15.659563
128.0, 0.5411702409319565, 102.03413539967373, 238, 198.34650155378273, 24520, 2044, 3777, 0, 15.142539
128.0, 0.5104685942173479, 102.0654296875, 248, 213.08645941244518, 24576, 2048, 4012, 0, 15.20103
128.0, 0.5098332088623351, 101.66597493489583, 233, 197.9426332185217, 24576, 2048, 4017, 0, 15.173237
128.0, 0.5246027678113788, 101.86372704694435, 253, 193.98126183705054, 24561, 2047, 3902, 0, 15.223599
128.0, 0.5203562340966921, 100.4291189301586, 263, 192.90612808489215, 24527, 2045, 3930, 0, 15.244497
128.0, 0.5045600197190042, 101.55262407882415, 243, 207.37926085575012, 24561, 2047, 4057, 0, 15.408353
128.0, 0.5152201257861635, 102.1134033203125, 263, 206.00670517215477, 24576, 2048, 3975, 0, 15.16808
128.0, 0.5127691537305958, 101.52266438802083, 248, 206.04363070232654, 24576, 2048, 3994, 0, 15.415124
128.0, 0.5183870149632259, 101.0911985630307, 233, 189.50725431282203, 24496, 2044, 3943, 0, 15.203837
128.0, 0.5621740323908866, 101.53955078125, 238, 191.86286653746205, 24576, 2048, 3643, 0, 15.372939
128.0, 0.4801875732708089, 101.91853841145833, 243, 192.5831787938818, 24576, 2048, 4265, 0, 15.701551
128.0, 0.558799454297408, 101.69966634114583, 253, 189.7013835047574, 24576, 2048, 3665, 0, 15.580737
128.0, 0.5107285429141717, 102.44876022963234, 238, 213.75939413636218, 24561, 2047, 4008, 0, 15.3526
128.0, 0.5161290322580645, 102.1693115234375, 258, 214.6668298598058, 24576, 2048, 3968, 0, 15.293652
128.0, 0.511872031992002, 102.23604329427083, 233, 199.66610992530292, 24576, 2048, 4001, 0, 15.746618
128.0, 0.5271977313740654, 101.13883340806261, 243, 194.82887919718823, 24533, 2045, 3879, 0, 15.255289
128.0, 0.5160070582304008, 101.84502340728679, 248, 205.11710157244445, 24565, 2047, 3967, 0, 15.137941
128.0, 0.4834593572778828, 101.44763224386665, 258, 203.7021760201017, 24538, 2046, 4232, 0, 15.193854
128.0, 0.5056762092793682, 101.54228875961108, 253, 193.5518791616615, 24581, 2049, 4052, 0, 16.176649
128.0, 0.48062925569382486, 100.52697146114075, 258, 177.20364720731328, 24563, 2047, 4259, 0, 15.313554
128.0, 0.504061038641398, 100.84183756510417, 243, 180.26027872658034, 24576, 2048, 4063, 0, 15.355729
128.0, 0.49890163534293386, 100.02140934670908, 233, 193.19415718190552, 24522, 2044, 4097, 0, 15.25485
128.0, 0.5066831683168317, 100.19194592613705, 233, 175.14605178980688, 24559, 2047, 4040, 0, 15.260001
128.0, 0.5194113169246384, 102.18715140658715, 243, 211.97929811507052, 24563, 2047, 3941, 0, 15.386147
128.0, 0.5126598144898471, 101.64075176321904, 248, 200.770106385054, 24529, 2045, 3989, 0, 15.11149
128.0, 0.5095794973874098, 100.49247233072917, 233, 179.87691292076588, 24576, 2048, 4019, 0, 15.879477
128.0, 0.4946782776971456, 101.96832837402683, 238, 204.24997441081607, 24533, 2045, 4134, 0, 15.198208
256.0, 0.8143408981168517, 104.53518523144562, 301, 154.25817573249066, 40031, 3373, 4142, 0, 15.137386
256.0, 0.9208963282937365, 105.38598612927906, 301, 169.44554030746713, 40517, 3411, 3704, 0, 15.289006
256.0, 0.9351145038167938, 105.07368421052631, 312, 162.0943352182878, 40660, 3430, 3668, 0, 15.564042
256.0, 0.8413284132841329, 105.79660349495447, 300, 175.95811569450865, 40630, 3420, 4065, 0, 15.542563
256.0, 0.8754270696452037, 105.20254480014194, 321, 164.84031894202047, 39453, 3331, 3805, 0, 15.171705
256.0, 0.8000971581248482, 104.99984604331314, 307, 162.21427684808336, 38972, 3294, 4117, 0, 15.12598
256.0, 0.8066003397233681, 105.33153194296443, 296, 156.09333451134634, 39414, 3324, 4121, 0, 15.300311
256.0, 0.8148788927335641, 105.56425810745093, 307, 157.70222701472406, 39069, 3297, 4046, 0, 15.178549
256.0, 0.9138545953360768, 104.3613087851698, 291, 154.68268180641522, 39487, 3331, 3645, 0, 15.142328
256.0, 0.8267447535383113, 105.63607909379968, 306, 173.3134540027479, 40256, 3388, 4098, 0, 15.208834
256.0, 0.8729591836734694, 105.59870821418006, 296, 165.4576520024153, 40564, 3422, 3920, 0, 15.583176
256.0, 0.8568538189175519, 104.99240537848605, 291, 155.43686986792207, 40160, 3388, 3954, 0, 15.208861
256.0, 0.8393034825870647, 105.2038351917596, 287, 153.27143502189094, 39998, 3374, 4020, 0, 15.223984
256.0, 0.8619441571871769, 105.20410848006476, 290, 173.92463272073135, 39528, 3334, 3868, 0, 15.168535
256.0, 0.8908413205537806, 104.73676929268538, 336, 164.02471457305205, 39756, 3346, 3756, 0, 15.121371
256.0, 0.8443512580167736, 104.80729819388131, 332, 153.03503428084542, 40695, 3423, 4054, 0, 15.643029
256.0, 0.8676281225856297, 104.562213137368, 298, 157.71015107044397, 39871, 3369, 3883, 0, 15.147096
256.0, 0.8221509620128269, 105.5520535103499, 305, 164.92553265372413, 39469, 3333, 4054, 0, 15.402753
256.0, 0.7859334434741563, 105.44585713563521, 306, 164.62644685936772, 39562, 3330, 4237, 0, 15.276417
256.0, 0.8668043366029943, 105.15256615878107, 287, 160.30551360988846, 39904, 3358, 3874, 0, 15.158213
256.0, 0.829728370221328, 105.6095986887597, 302, 156.89171062394269, 39047, 3299, 3976, 0, 15.179033
256.0, 0.8192710933599601, 105.38391482811699, 328, 154.7619355853414, 38980, 3282, 4006, 0, 15.143047
256.0, 0.8414183698596405, 105.11569211089518, 324, 161.62127436386504, 40651, 3417, 4061, 0, 15.516043
256.0, 0.8476523476523476, 106.21504389663211, 296, 175.64195778086972, 40322, 3394, 4004, 0, 15.44828
256.0, 0.8793532338308457, 104.86639357927076, 341, 158.33414221930974, 41989, 3535, 4020, 0, 16.011699
256.0, 0.8249878463782208, 105.98343351050619, 361, 163.9723730147615, 40262, 3394, 4114, 0, 15.2288
256.0, 0.8365935114503816, 105.72406833417429, 338, 160.7961862533319, 41619, 3507, 4192, 0, 15.651871
256.0, 0.8229595543715186, 105.61453067697492, 294, 176.72667647285084, 40356, 3398, 4129, 0, 15.516607
256.0, 0.8263093788063337, 106.33045490742585, 309, 161.5905375216557, 40184, 3392, 4105, 0, 15.426507
256.0, 0.8600590260698475, 104.62869613180172, 301, 158.20940851719686, 41699, 3497, 4066, 0, 15.565606
512.0, 0.49114942528735633, 168.94128970163618, 778, 1489.6458759843943, 48833, 4273, 8700, 0, 15.396879
512.0, 0.6053528810092056, 156.01428395820528, 687, 1026.1106705348311, 40675, 3551, 5866, 0, 15.239041
512.0, 0.5104895104895105, 171.60043272202762, 789, 1624.2230934055556, 48530, 4234, 8294, 0, 15.553224
512.0, 0.5902287489409771, 169.0479959793944, 719, 1436.2103735849703, 47754, 4180, 7082, 0, 15.249339
512.0, 0.5758843666793457, 176.83339112343967, 836, 1734.6233069433129, 51912, 4542, 7887, 0, 16.310101
512.0, 0.5556551812475983, 168.8339911397503, 723, 1468.2114557118634, 49660, 4338, 7807, 0, 15.761645
512.0, 0.6111744583808438, 165.37541399190417, 869, 1296.9386707953538, 48914, 4288, 7016, 0, 15.199181
512.0, 0.5076136093266714, 168.3725361231579, 778, 1429.6330571006097, 48653, 4267, 8406, 0, 15.555313
512.0, 0.5684382050639258, 169.71091990529538, 808, 1501.356480944198, 51951, 4535, 7978, 0, 16.082302
512.0, 0.5829172851167184, 167.92849044379656, 738, 1482.2194000617108, 49392, 4320, 7411, 0, 15.406806
512.0, 0.5790914066776136, 168.24204634316993, 788, 1556.4878138851466, 48594, 4232, 7308, 0, 15.431838
512.0, 0.5384615384615384, 170.14383547968453, 828, 1543.011908885642, 50085, 4375, 8125, 0, 15.623171
512.0, 0.5886868686868687, 168.78295919385414, 757, 1586.2608730354114, 50115, 4371, 7425, 0, 15.525077
512.0, 0.5731409001956947, 172.65650277705296, 830, 1513.4480275235155, 53654, 4686, 8176, 0, 16.37352
512.0, 0.5167095115681234, 172.96516171266083, 753, 1564.9519823336116, 48883, 4221, 8169, 0, 15.750445
512.0, 0.6053295932678822, 167.56123068209402, 744, 1416.1172487205, 49436, 4316, 7130, 0, 15.366751
512.0, 0.5388139475693561, 167.00372964236874, 752, 1404.8259406926306, 48262, 4234, 7858, 0, 15.335757
512.0, 0.5217498459642637, 167.45416889914685, 841, 1400.9784314398694, 48526, 4234, 8115, 0, 15.223857
512.0, 0.5992846924177396, 165.26693842258044, 739, 1334.708763982698, 48573, 4189, 6990, 0, 15.378736
512.0, 0.5579377233282287, 169.5169731540947, 812, 1560.7565762077556, 50138, 4372, 7836, 0, 15.572912
512.0, 0.5629590766002098, 169.5552150998897, 900, 1528.2514229073956, 48954, 4292, 7624, 0, 15.38484
512.0, 0.6038761851645287, 174.53531042016468, 806, 1614.695867803998, 49433, 4331, 7172, 0, 15.792663
512.0, 0.6033045977011494, 165.03176620076238, 763, 1376.394102489988, 48007, 4199, 6960, 0, 15.116493
512.0, 0.5376277099426863, 171.48875916537057, 789, 1463.5227200717181, 49507, 4315, 8026, 0, 15.366244
512.0, 0.5547631176770249, 171.96541913768232, 773, 1509.508836689281, 49912, 4356, 7852, 0, 15.814551
512.0, 0.5333843017329256, 167.45802613941018, 832, 1489.1632202190378, 47744, 4186, 7848, 0, 15.538024
512.0, 0.5153329260843006, 164.07725676513118, 763, 1449.3151304648827, 48410, 4218, 8185, 0, 15.295291
512.0, 0.4834855145981287, 170.23885837943777, 779, 1423.5380403086772, 48983, 4289, 8871, 0, 15.628069
512.0, 0.567842430484037, 169.39763430261212, 786, 1572.10255723111, 50725, 4411, 7768, 0, 15.962079
512.0, 0.5579388855602156, 175.01393113289024, 835, 1635.4707141514684, 53262, 4656, 8345, 0, 16.909094
1024.0, 0.3852656003977791, 243.55655357858, 1232, 4886.309600174649, 52437, 4649, 12067, 0, 15.885273
1024.0, 0.3871283255086072, 242.03769581508735, 1260, 5087.946606352486, 44302, 3958, 10224, 0, 15.422599
1024.0, 0.37459043250327656, 247.36390135836297, 1269, 5663.777594113521, 51459, 4573, 12208, 0, 15.922623
1024.0, 0.37447325769854134, 250.06167484325573, 1303, 5225.2956025628355, 52793, 4621, 12340, 0, 15.952706
1024.0, 0.4267161410018553, 252.4475816944868, 1273, 5485.193712815719, 53798, 4830, 11319, 0, 15.401558
1024.0, 0.36579225209128563, 246.81975650036486, 1201, 4770.230282861199, 52074, 4504, 12313, 0, 15.894329
1024.0, 0.39206321639458147, 242.33007546946737, 1097, 4821.153145275487, 50749, 4515, 11516, 0, 15.183453
1024.0, 0.3677781115450085, 215.53332839762098, 1008, 3290.1690515688456, 40521, 3673, 9987, 0, 15.446495
1024.0, 0.37273489932885906, 249.05267619517002, 1307, 5011.514349714448, 50725, 4443, 11920, 1, 15.931659
1024.0, 0.3161094224924012, 179.6205595724615, 929, 1613.0887614358162, 25448, 2288, 7238, 0, 15.298929
1024.0, 0.3262339418526031, 167.88422883649014, 826, 1335.2913966419387, 20696, 1930, 5916, 0, 15.148187
1024.0, 0.42908357606990816, 221.99850951074097, 1112, 3895.518693347719, 42268, 3830, 8926, 0, 15.176152
1024.0, 0.3450255102040816, 244.82612339372656, 1275, 4667.097576402667, 50116, 4328, 12544, 5, 15.25492
1024.0, 0.3172039063073647, 241.20838056680162, 1232, 4378.045104088146, 49400, 4320, 13619, 2, 16.030886
1024.0, 0.4267877412031782, 254.99517903867522, 1315, 5436.7866203905205, 55798, 4888, 11453, 0, 16.20393
1024.0, 0.4155177074885104, 246.87875673309352, 1232, 4889.955783205351, 52539, 4611, 11097, 0, 15.597962
1024.0, 0.3480263846717621, 214.41550774075046, 1085, 3343.5925226945283, 38110, 3324, 9551, 4, 15.273988
1024.0, 0.37398142884214514, 234.74570233854732, 1221, 4203.16725363302, 45199, 3947, 10554, 0, 15.667414
1024.0, 0.37341280124384557, 245.38778894781024, 1524, 5543.806886566389, 48841, 4323, 11577, 0, 15.400579
1024.0, 0.35460259368287056, 241.10025186918668, 1275, 5051.276870202179, 50423, 4457, 12569, 0, 15.30006
1024.0, 0.3724344933884968, 248.33610329094262, 1254, 5138.296133832835, 51505, 4591, 12327, 0, 15.919876
1024.0, 0.41876430205949655, 253.32984738184103, 1263, 5210.336675695752, 54122, 4758, 11362, 0, 15.725562
1024.0, 0.41018888485288774, 246.32645675691367, 1096, 4698.017744237139, 51673, 4517, 11012, 0, 15.449331
1024.0, 0.4746185586795893, 257.27690530344057, 1414, 5851.50567896385, 55398, 4946, 10421, 1, 15.890566
1024.0, 0.3746127366609294, 253.43753186186584, 1280, 4821.036488291622, 52963, 4353, 11620, 43, 15.620664
1024.0, 0.353204172876304, 198.94045004705816, 1475, 2351.633841777559, 35063, 3081, 8723, 0, 15.128617
1024.0, 0.4011016524787181, 255.83213843802315, 1336, 5264.2628477335265, 54956, 4806, 11982, 5, 16.417367
1024.0, 0.4066139590240585, 255.90919533942343, 1325, 5819.788544221552, 54843, 4783, 11763, 0, 16.212542
1024.0, 0.39073404523669386, 248.13776712985145, 1242, 5402.722108920777, 52175, 4647, 11893, 0, 15.688588
1024.0, 0.41371116782539824, 246.62154680310812, 1477, 5065.410800867898, 52379, 4701, 11363, 0, 15.269142
2048.0, 0.2975268548588559, 288.86794757602746, 1484, 5822.14810891624, 39295, 3573, 12009, 2, 15.873069
2048.0, 0.27864214992927866, 335.2113910186199, 1644, 9472.681141484198, 52954, 4728, 16968, 11, 15.563245
2048.0, 0.19976927513939627, 187.04514419647407, 770, 1572.021367932851, 9813, 1039, 5201, 0, 15.526596
2048.0, 0.327250852215761, 323.9401499908542, 1595, 8939.100963876219, 54670, 4896, 14961, 9, 15.463152
2048.0, 0.21140444920932724, 293.0069385333643, 1494, 4927.0530311474695, 38769, 3155, 14924, 12, 15.224498
2048.0, 0.2509234178773701, 331.04036697247705, 1802, 7314.776018969606, 50140, 4076, 16244, 148, 16.802371
2048.0, 0.3045326854452965, 309.03677599882184, 2140, 7064.278089787074, 47531, 4011, 13171, 63, 15.352851
2048.0, 0.31120637685042535, 340.3061308144716, 1594, 8112.749013473252, 56110, 4646, 14929, 31, 16.794937
2048.0, 0.27252703243892673, 305.69908776865316, 1783, 6478.337155523219, 48343, 4083, 14982, 25, 15.17853
2048.0, 0.2607565011820331, 328.41252730361623, 2380, 9195.497591187399, 49444, 4412, 16920, 42, 16.092951
2048.0, 0.2370010894325047, 255.30818226359628, 1170, 4180.137145081118, 26533, 2393, 10097, 9, 15.293944
2048.0, 0.2788177339901478, 330.85957268202986, 1966, 9219.205202946976, 50033, 4245, 15225, 42, 15.645282
2048.0, 0.29057078903189704, 322.89914499745066, 1699, 6869.9710542427265, 50994, 4154, 14296, 53, 15.708066
2048.0, 0.2508429969569866, 263.05421405657626, 1329, 4647.623246088808, 34290, 3050, 12159, 0, 15.310284
2048.0, 0.25133559980573095, 222.88799265842349, 998, 3128.8698904168323, 20704, 2070, 8236, 0, 15.168327
2048.0, 0.2302245470783363, 312.24750819452805, 1700, 6448.700367075679, 44847, 3609, 15676, 85, 15.26992
2048.0, 0.28376562290014784, 311.1008246592186, 1689, 8184.8927685814, 47171, 4223, 14882, 20, 15.359193
2048.0, 0.2903333556015766, 325.1734743496231, 2036, 8747.74599215148, 49356, 4346, 14969, 31, 15.38217
2048.0, 0.34496857726962976, 316.6012843891223, 1814, 8169.115079113949, 50452, 4556, 13207, 6, 15.984745
2048.0, 0.26809573602881376, 330.6858352941176, 1693, 8984.492105609164, 53125, 4615, 17214, 5, 15.587948
2048.0, 0.214497528830313, 192.00382614018977, 907, 1803.2142272627368, 13068, 1302, 6070, 0, 15.168231
2048.0, 0.25960622419815815, 278.4299689356368, 1364, 4923.493128439006, 36698, 3270, 12596, 7, 15.892799
2048.0, 0.364695537480765, 324.0884987699219, 1757, 9680.107045794704, 74792, 6636, 18196, 1, 15.116376
2048.0, 0.5314820228003507, 375.5019290688702, 2123, 15536.706812305096, 102381, 9091, 17105, 1, 16.524922
2048.0, 0.4895285454719327, 286.6799625501245, 1626, 8773.593179241112, 56609, 5119, 10457, 1, 15.109455
2048.0, 0.3628050975592195, 323.3333092915487, 1735, 9980.199319218413, 55459, 5039, 13889, 0, 15.71569
2048.0, 0.2599317406143345, 314.17780724213605, 1995, 7253.431841659551, 43744, 3808, 14650, 70, 15.580747
2048.0, 0.2479912579546185, 327.5075601090639, 1669, 7436.306624135094, 48412, 3858, 15557, 78, 15.843195
2048.0, 0.37769811608572956, 341.3864321964723, 2133, 9353.107122323525, 56354, 4952, 13111, 13, 16.206506
2048.0, 0.2897553038362851, 322.2519222071461, 1708, 8404.479640696924, 53064, 4630, 15979, 22, 15.832066
4096.0, 0.12000743080066877, 183.99180613668062, 1003, 1082.9938918594078, 5736, 646, 5383, 0, 15.680051
4096.0, 0.16294879966008072, 246.71809511015584, 1374, 3225.869579460911, 14888, 1534, 9414, 5, 15.337234
4096.0, 0.1923219814241486, 244.1204889031843, 1278, 3160.846838638475, 15545, 1553, 8075, 2, 15.2636
4096.0, 0.234476673651704, 370.56713042729154, 2085, 10754.330069118654, 46432, 4252, 18134, 66, 15.304758
4096.0, 0.23080708661417323, 357.8397028720957, 1976, 9712.848137451763, 47387, 4221, 18288, 23, 15.269253
4096.0, 0.27147409768027864, 330.311998141024, 1808, 8519.934324000636, 38731, 3663, 13493, 8, 15.420095
4096.0, 0.21969832468848746, 357.49392351177534, 2535, 8906.757753022728, 43693, 3685, 16773, 61, 15.183426
4096.0, 0.26719650752784463, 380.96822718460544, 2071, 10701.1096230383, 55708, 4774, 17867, 58, 16.353567
4096.0, 0.24584153103201575, 307.2809108760809, 1534, 6282.174070940463, 29027, 2749, 11182, 9, 15.269818
4096.0, 0.3055028462998102, 357.7532962393644, 2168, 11969.949749727572, 46189, 4347, 14229, 9, 15.532021
4096.0, 0.17792524885744695, 305.49664689192673, 1711, 5685.865278256071, 31016, 2842, 15973, 4, 15.330925
4096.0, 0.2613575628006414, 331.43308250102615, 1603, 8339.687281581791, 36545, 3423, 13097, 16, 15.33948
4096.0, 0.2489264884958021, 361.5332845647403, 1904, 8478.230996591274, 46478, 3884, 15603, 68, 15.274599
4096.0, 0.1930590085747628, 370.7028605828187, 2568, 8344.980152436168, 44851, 3805, 19709, 117, 15.899402
4096.0, 0.2486099609606057, 364.5764071782936, 2263, 9098.739134831176, 48981, 4203, 16906, 30, 15.370674
4096.0, 0.19812006395658704, 374.0892794593369, 2639, 9658.559269074385, 48533, 4089, 20639, 78, 15.649226
4096.0, 0.11190476190476191, 187.1954529432499, 1039, 1155.6798589920268, 5674, 658, 5880, 0, 15.214456
4096.0, 0.2806046093983837, 347.52031451651453, 2464, 8065.568497027469, 41842, 3750, 13364, 11, 15.219933
4096.0, 0.1616202287002738, 272.06038723653927, 1369, 4139.818220526736, 22157, 2007, 12418, 4, 15.328546
4096.0, 0.15482762851183904, 233.937510714898, 1255, 3000.687268660159, 11666, 1262, 8151, 0, 15.345096
4096.0, 0.14638228683468033, 369.9511679951721, 2163, 7113.017998609103, 39769, 3061, 20911, 211, 15.70101
4096.0, 0.16399286987522282, 230.4131587403599, 1383, 2671.1546025902403, 12448, 1288, 7854, 0, 15.21388
4096.0, 0.22964394148495723, 370.71011657456336, 2660, 10480.185158381406, 49582, 4160, 18115, 56, 16.089884
4096.0, 0.23852968398783553, 338.3731931668857, 1727, 7898.347105698302, 39572, 3608, 15126, 10, 15.133132
4096.0, 0.1438076515953425, 213.13839845084863, 1493, 2424.675517220788, 8779, 951, 6613, 1, 15.537644
4096.0, 0.27598752598752596, 372.0570719129023, 1880, 12283.943517337042, 52355, 4779, 17316, 39, 15.401278
4096.0, 0.20905158069883528, 327.0305579542606, 1654, 6662.796323564321, 35899, 3141, 15025, 29, 15.432012
4096.0, 0.14615722441809398, 262.9711807800043, 1420, 2786.9332361482952, 18564, 1664, 11385, 6, 15.219312
4096.0, 0.2119349722442506, 372.85304723411, 2153, 9367.738118670251, 50472, 4276, 20176, 76, 15.578284
4096.0, 0.08921471172962227, 160.33478115603074, 787, 787.2496492373986, 2993, 359, 4024, 0, 15.511473
8192.0, 0.09212218649517685, 225.96466114963096, 1180, 1527.3677345658753, 4471, 573, 6220, 0, 15.47985
8192.0, 0.05272438723329219, 198.34262948207171, 1182, 1071.5532136598113, 2259, 299, 5671, 0, 15.305825
8192.0, 0.13721277788156175, 278.37577412266097, 1679, 3396.8348925916735, 15017, 1469, 10706, 7, 16.201371
8192.0, 0.1907619467077736, 407.39424008316206, 2513, 10119.273420930309, 42327, 3465, 18164, 148, 15.173179
8192.0, 0.17933643474260008, 393.47660539508234, 3008, 8914.615208698808, 41890, 3508, 19561, 186, 15.15363
8192.0, 0.2621542690259406, 400.4707624883334, 2011, 10523.148111528773, 49286, 4578, 17463, 20, 15.417928
8192.0, 0.19158833685018223, 390.0850550154898, 2136, 8893.983940767584, 46805, 3995, 20852, 91, 15.416423
8192.0, 0.21858954207272346, 425.8377755214283, 2735, 13693.683265614058, 47274, 4172, 19086, 87, 15.940411
8192.0, 0.1454388053240991, 288.49646017699115, 1632, 4659.9454185333925, 12430, 1344, 9241, 1, 15.464289
8192.0, 0.17745521119393226, 338.64840330104056, 2233, 9052.24855435051, 27870, 2714, 15294, 8, 15.107637
8192.0, 0.2238200400595758, 422.2706961249809, 2541, 11815.300157064034, 52232, 4358, 19471, 93, 16.610265
8192.0, 0.24928985342574708, 431.4888993414864, 2027, 12496.68538590315, 53150, 4388, 17602, 128, 16.280575
8192.0, 0.22153792011261658, 390.2586687833088, 2009, 10297.39083364206, 44095, 3777, 17049, 121, 15.269645
8192.0, 0.10913575172130305, 276.3521022607226, 1256, 3409.7783611329255, 9466, 1062, 9731, 2, 15.218914
8192.0, 0.14182311694186836, 275.5697885695408, 1539, 3390.8724891671527, 12108, 1254, 8842, 4, 15.423078
8192.0, 0.16356457980823463, 281.1134641105662, 1476, 3861.2186755424773, 13458, 1450, 8865, 4, 15.319779
8192.0, 0.21083402317880795, 393.43545312399596, 2037, 10594.658525951587, 46687, 4075, 19328, 48, 15.238129
8192.0, 0.1660530756250959, 305.0466443099168, 1821, 5266.814345771682, 22961, 2165, 13038, 9, 15.608379
8192.0, 0.19701225740551584, 352.1150822893638, 1726, 9126.151114522825, 32568, 3086, 15664, 13, 15.289749
8192.0, 0.20544390459363956, 394.01580846028355, 2648, 11307.325408339608, 43521, 3721, 18112, 131, 15.18338
8192.0, 0.17088251826869028, 361.248942211335, 2210, 8780.637606509716, 35924, 3040, 17790, 91, 15.42639
8192.0, 0.12246678948899448, 265.7399019170754, 1350, 3271.618584600339, 11215, 1263, 10313, 0, 15.132887
8192.0, 0.23167109582616852, 419.4099804711846, 2357, 13989.17989459896, 48134, 4446, 19191, 67, 15.962427
8192.0, 0.26087685004188776, 410.10099109757755, 2389, 13613.033410202836, 51559, 4671, 17905, 70, 16.151038
8192.0, 0.07163070392642377, 216.44399323181048, 922, 1199.8229273315717, 2955, 405, 5654, 0, 15.469473
8192.0, 0.24202969092236554, 408.37831935709295, 3269, 11537.967752550163, 45792, 3978, 16436, 99, 15.523931
8192.0, 0.17839728118997192, 407.7153458727046, 2474, 10313.098297390701, 44872, 3622, 20303, 168, 15.623407
8192.0, 0.21882966739787751, 396.1223451177309, 2175, 9749.174846653863, 44211, 3691, 16867, 152, 15.608557
8192.0, 0.22278451894876072, 398.05171061233386, 2020, 9610.226614229083, 45890, 3874, 17389, 96, 15.134196
8192.0, 0.1438112832172801, 324.58353557907, 1711, 5954.028704433163, 20602, 2024, 14074, 11, 15.302171
16384.0, 0.11684701677752407, 285.653889223878, 1477, 2862.1461141948644, 11609, 1177, 10073, 2, 15.360834
16384.0, 0.21019777503090234, 403.6812205211984, 2115, 10575.590717786708, 37951, 3401, 16180, 46, 15.271218
16384.0, 0.22770957558751315, 373.4871347334047, 1961, 8450.622295852443, 35522, 3246, 14255, 20, 15.178699
16384.0, 0.11286407766990292, 308.16487131522933, 1974, 4535.055219014077, 15503, 1581, 14008, 3, 15.11582
16384.0, 0.09921295595580445, 303.3534525408156, 1671, 3172.3235781675885, 14149, 1311, 13214, 9, 15.257782
16384.0, 0.181297272518909, 437.26318774815655, 2359, 12846.615539954611, 47601, 3955, 21815, 117, 15.705818
16384.0, 0.2019064529694874, 432.0469922207486, 2642, 12399.652349587337, 50519, 4321, 21401, 98, 15.860402
16384.0, 0.18419285021270243, 352.1253328535444, 1886, 6860.372184750544, 27790, 2468, 13399, 9, 15.332358
16384.0, 0.06645608067063541, 261.2297832673037, 1385, 1848.8637367156255, 4291, 547, 8231, 2, 15.530696
16384.0, 0.13250433187238814, 290.4741059379217, 1804, 4013.62469163981, 11856, 1300, 9811, 3, 15.477474
16384.0, 0.1916407692654146, 464.3083258489232, 2848, 12280.468898993706, 52331, 4255, 22203, 236, 17.078034
16384.0, 0.1844632653888236, 425.80346538521644, 2157, 11923.758930608068, 51192, 4552, 24677, 46, 15.289663
16384.0, 0.21917737789203084, 437.0704133444809, 2841, 12978.577577539001, 49039, 4263, 19450, 139, 16.047678
16384.0, 0.2381972971363934, 417.4813654317174, 2334, 11481.144286943552, 45319, 4001, 16797, 141, 15.346007
16384.0, 0.24485853880240882, 432.7004366272604, 2270, 12660.925738476328, 48554, 4310, 17602, 53, 15.482507
16384.0, 0.16146297948260482, 329.08479397293974, 1646, 6034.7101757925075, 13008, 1448, 8968, 3, 15.448688
16384.0, 0.23254173524570892, 414.23533235479135, 2057, 11022.779907982995, 47690, 3956, 17012, 78, 15.236289
16384.0, 0.17390132111081155, 332.4232658883195, 1645, 6332.3007289461275, 18929, 1935, 11127, 2, 15.461973
16384.0, 0.12855018587360595, 322.6107481679259, 1791, 4634.395471535197, 17603, 1729, 13450, 10, 15.188322
16384.0, 0.21654430891959073, 416.1185567010309, 2626, 10822.098538590417, 43068, 3746, 17299, 198, 16.564065
16384.0, 0.2615789191219879, 456.5461721944571, 2343, 16668.498892007872, 52824, 4874, 18633, 50, 15.961775
16384.0, 0.17080120683875294, 340.5955720296534, 1895, 6271.146439408984, 19964, 2038, 11932, 11, 15.209499
16384.0, 0.06263865326895472, 225.81978452497552, 1018, 1429.5398056552979, 4084, 480, 7663, 2, 15.183694
16384.0, 0.22046259637424465, 458.17728793206965, 3587, 16380.051876368414, 46636, 4232, 19196, 115, 15.790591
16384.0, 0.16042573778422836, 406.63413389080654, 2276, 8526.338619889628, 41138, 3316, 20670, 179, 15.274476
16384.0, 0.15983647422474823, 308.49122567429157, 1537, 5576.989751789022, 14645, 1603, 10029, 0, 15.182921
16384.0, 0.0752980054290098, 275.422954725973, 1104, 2325.967976645489, 5036, 638, 8473, 0, 15.163309
16384.0, 0.19866358262657416, 402.75246917635724, 2250, 10188.259065316806, 45663, 3865, 19455, 102, 15.17809
16384.0, 0.18855828521092297, 434.2557632062223, 2217, 11635.457803558034, 46285, 3853, 20434, 121, 15.529689
16384.0, 0.1778477277198505, 411.96862037871955, 2372, 9232.051554649794, 44360, 3616, 20332, 168, 15.357039
