32.0, 0.270042194092827, 85.91390205371248, 134, 49.40967800287626, 1266, 512, 1896, 0, 15.993287
32.0, 0.2815587266739846, 86.34958739684922, 151, 53.19667868233915, 1333, 513, 1822, 0, 16.059348
32.0, 0.3311772315653299, 85.57987711213518, 126, 26.44517253238659, 1302, 512, 1546, 0, 15.626538
32.0, 0.3436241610738255, 85.8255033557047, 131, 33.08616707995376, 1341, 512, 1490, 0, 15.147544
32.0, 0.2809450436569081, 86.19917864476386, 158, 51.865769076971084, 1461, 547, 1947, 0, 16.277315
32.0, 0.29578278451761986, 86.39615668883961, 156, 35.6903372561836, 1353, 512, 1731, 0, 15.481553
32.0, 0.29421673217293653, 86.11580480699199, 156, 46.83466216040904, 1373, 524, 1781, 0, 16.124832
32.0, 0.3333333333333333, 86.55845070422535, 129, 59.388217181129335, 1420, 512, 1536, 0, 15.188755
32.0, 0.29927007299270075, 86.40308370044053, 146, 34.04964977223747, 1362, 533, 1781, 0, 16.116239
32.0, 0.3413333333333333, 85.82781954887218, 141, 35.476593626049734, 1330, 512, 1500, 0, 15.251806
64.0, 0.4180929095354523, 86.09442836468885, 156, 51.4448837653715, 2764, 1026, 2454, 0, 18.975515
64.0, 0.4785046728971963, 84.7367824773414, 156, 28.68622457083385, 2648, 1024, 2140, 0, 15.620093
64.0, 0.4785046728971963, 85.24292719728405, 156, 44.308977653025536, 2651, 1024, 2140, 0, 15.832897
64.0, 0.43529411764705883, 85.5813097866078, 198, 52.61128478247956, 2718, 1036, 2380, 0, 16.18492
64.0, 0.4387317909168809, 84.81465968586387, 146, 31.188513773798846, 2865, 1024, 2334, 0, 15.701618
64.0, 0.4481245011971269, 84.71358543417367, 156, 37.58480578728491, 2856, 1123, 2506, 0, 16.566412
64.0, 0.44912280701754387, 84.83931297709924, 141, 26.86351972783654, 2620, 1024, 2280, 0, 15.993858
64.0, 0.40214576396596374, 84.67077727952167, 131, 26.078944291021458, 2676, 1087, 2703, 0, 16.401279
64.0, 0.5662148070907195, 84.92565860700108, 151, 31.253686329613807, 2771, 1086, 1918, 0, 16.435606
64.0, 0.4545051043053706, 84.98384673178062, 158, 40.07645684335645, 2662, 1024, 2253, 0, 15.736499
128.0, 0.8587002096436058, 84.28686946476704, 156, 20.94364618198453, 5194, 2048, 2385, 0, 15.795636
128.0, 0.8773504273504273, 84.14154200230149, 129, 20.646656554984503, 5214, 2053, 2340, 0, 16.142903
128.0, 0.8441879637262985, 84.04501194194378, 138, 20.486734016955623, 5443, 2048, 2426, 0, 15.571636
128.0, 0.8386568386568387, 84.22377622377623, 141, 24.721018518030554, 5291, 2048, 2442, 0, 15.737991
128.0, 0.8162614587485054, 84.6307517515622, 160, 27.703066169565744, 5281, 2048, 2509, 0, 15.642372
128.0, 0.8278092158447857, 84.15244940419898, 156, 20.720265649081277, 5287, 2048, 2474, 0, 15.714584
128.0, 0.8785928785928786, 84.39814814814815, 156, 27.262608837674737, 5184, 2048, 2331, 0, 15.167075
128.0, 0.9134701159678859, 84.2642029784887, 156, 23.3991755044056, 5439, 2048, 2242, 0, 15.458589
128.0, 0.7904284060208414, 84.33216331054868, 156, 24.416539933747806, 5413, 2048, 2591, 0, 16.028565
128.0, 0.8839015968925334, 84.17357561991292, 156, 26.72474079653654, 5283, 2048, 2317, 0, 16.063286
256.0, 1.5680885972108285, 84.00311106502126, 156, 21.76718747350062, 9643, 3823, 2438, 0, 15.110249
256.0, 1.8668280871670702, 84.19369966357426, 156, 25.25921507615736, 9809, 3855, 2065, 0, 15.517503
256.0, 1.5345368916797488, 83.88504363526934, 156, 17.104335997509693, 9969, 3910, 2548, 0, 15.584264
256.0, 1.4870768110666182, 84.04813035697467, 156, 24.033591770521, 10617, 4085, 2747, 0, 16.181053
256.0, 1.6144425675675675, 83.82247051520794, 136, 19.998879759666018, 9666, 3823, 2368, 0, 15.261415
256.0, 1.5641547861507128, 84.18670979123787, 156, 22.611422489672552, 10203, 3840, 2455, 0, 15.30592
256.0, 1.6363636363636365, 84.09404834450538, 192, 24.28757798481156, 9846, 3852, 2354, 0, 15.330424
256.0, 1.49585144211774, 86.45094823167607, 215, 56.11688588010237, 9755, 3786, 2531, 0, 16.66156
256.0, 1.6926070038910506, 84.04172420595778, 198, 23.8771614931118, 10138, 3915, 2313, 0, 15.451427
256.0, 1.706308610400682, 84.30076424494534, 156, 21.70365957489239, 10337, 4003, 2346, 0, 16.110484
512.0, 1.4216867469879517, 96.87370848708487, 303, 342.35619834755147, 10840, 4366, 3071, 0, 19.54589
512.0, 1.9923751429660694, 92.27712983702789, 334, 158.8808758077604, 12947, 5226, 2623, 0, 16.807957
512.0, 3.039426523297491, 86.20741981323589, 166, 45.54106998983752, 19704, 7632, 2511, 0, 16.432946
512.0, 3.1100768919465804, 86.10139442231076, 225, 48.091278354201584, 20080, 7685, 2471, 0, 16.536679
512.0, 2.9457831325301207, 86.16101067766148, 193, 46.52521214135588, 18918, 7335, 2490, 0, 15.826171
512.0, 1.6370093457943926, 92.6776, 259, 179.1462895261219, 11250, 4379, 2675, 0, 17.212994
512.0, 3.052065404475043, 86.2677458834001, 188, 49.91314301561981, 17976, 7093, 2324, 0, 15.3051
512.0, 1.651660516605166, 90.89930898321816, 242, 139.3198491914822, 11143, 4476, 2710, 0, 16.341195
512.0, 2.6017863788611835, 85.93025763250482, 225, 43.23295182030238, 17622, 6991, 2687, 0, 15.213469
512.0, 2.9783603828547647, 86.06041862263213, 175, 49.16842856627154, 18107, 7157, 2403, 0, 15.587145
1024.0, 4.658012533572068, 95.36940110719678, 254, 164.37977020299996, 25831, 10406, 2234, 0, 15.867848
1024.0, 4.527049180327869, 94.22958353956021, 220, 140.18068354838306, 28286, 11046, 2440, 0, 15.717729
1024.0, 4.06203007518797, 94.25262099669682, 222, 147.5814767176214, 20889, 8644, 2128, 0, 15.461192
1024.0, 4.110304789550073, 93.19126369408974, 225, 137.92679866366493, 28662, 11328, 2756, 0, 15.891304
1024.0, 4.022433460076045, 95.5036252300988, 262, 175.7889788112296, 26619, 10579, 2630, 0, 16.154704
1024.0, 4.439952437574316, 93.26319270398218, 207, 130.5091636710589, 28728, 11202, 2523, 0, 15.772423
1024.0, 3.7278752436647173, 94.80127590376517, 318, 156.46282426125234, 23983, 9562, 2565, 0, 15.127505
1024.0, 4.2537808926595355, 94.07556571896652, 235, 152.27204542689233, 29299, 11532, 2711, 0, 17.09234
1024.0, 2.826264880952381, 102.15432976164443, 335, 495.2350282029118, 18292, 7597, 2688, 0, 16.596876
1024.0, 4.957464908549554, 93.04690977572334, 256, 141.99287519173592, 29205, 11655, 2351, 0, 15.988228
2048.0, 4.498139727159984, 105.84676992822062, 304, 318.1333698839443, 26470, 10881, 2419, 0, 16.02896
2048.0, 3.4475319926873857, 107.43629327026446, 287, 321.18367064091353, 23255, 9429, 2735, 0, 16.929423
2048.0, 4.921370967741935, 103.91091269175254, 276, 282.8061970313313, 29791, 12205, 2480, 0, 16.896987
2048.0, 1.1983676366217175, 102.84063688882627, 303, 408.7192891489821, 7097, 3377, 2818, 0, 15.858488
2048.0, 4.742333731581043, 102.70614182773251, 319, 262.65023748999994, 29698, 11908, 2511, 0, 15.539855
2048.0, 4.4929322218195, 105.13558443241843, 307, 327.9457876960413, 30859, 12396, 2759, 0, 15.648472
2048.0, 4.611513534121236, 104.27784012146016, 358, 304.5711353811715, 30298, 12096, 2623, 0, 15.847002
2048.0, 2.3795875567983225, 111.53746888510415, 401, 828.2176736743851, 15266, 6808, 2861, 0, 16.902527
2048.0, 4.53158953722334, 105.86543507170327, 276, 324.6321372527235, 27823, 11261, 2485, 0, 15.396541
2048.0, 4.270325203252033, 104.58696067809572, 261, 294.4213920724308, 31382, 12606, 2952, 0, 18.145016
4096.0, 3.044537230340988, 127.49623739125794, 643, 1564.9445769300585, 18737, 8750, 2874, 0, 15.840321
4096.0, 3.3066871637202153, 130.75890834760511, 576, 1675.5415461840917, 18101, 8604, 2602, 0, 15.617567
4096.0, 2.5280649926144756, 120.87874819052871, 454, 1126.7238665716702, 14507, 6846, 2708, 0, 16.170147
4096.0, 6.018518518518518, 112.76326889279437, 312, 448.3963563778803, 39830, 15925, 2646, 0, 15.964773
4096.0, 1.6774537695590328, 112.65067714256178, 372, 701.4538728974334, 9673, 4717, 2812, 0, 15.265948
4096.0, 4.871984435797665, 112.88892501788385, 360, 446.8340301460518, 30754, 12521, 2570, 0, 15.610076
4096.0, 4.130872483221476, 112.06875949032812, 341, 407.0615500229747, 30294, 12310, 2980, 0, 17.449281
4096.0, 4.6844539309854145, 111.2685108851638, 316, 423.1559503483513, 32751, 13168, 2811, 0, 16.308209
4096.0, 4.655222790357925, 111.47405053233751, 345, 422.4145473339028, 31465, 12746, 2738, 0, 16.903992
4096.0, 2.8480651731160895, 116.99223768736617, 395, 862.7777297687405, 14944, 6992, 2455, 0, 17.128529
8192.0, 5.532901833872708, 117.17852621584555, 343, 540.2356162041249, 37916, 15387, 2781, 0, 16.865059
8192.0, 2.256253813300793, 127.18184201901016, 519, 1459.9251727361082, 15255, 7396, 3278, 0, 17.760804
8192.0, 5.62062404870624, 117.97146313300709, 378, 548.7167006575337, 36374, 14771, 2628, 0, 16.030777
8192.0, 3.42462482946794, 113.23045602605863, 325, 448.7936546107055, 24560, 10041, 2932, 0, 16.777494
8192.0, 2.6389164188965974, 129.6474837323145, 581, 1548.7072133841823, 16751, 7988, 3027, 0, 19.764506
8192.0, 4.966923076923077, 117.97344797066633, 343, 549.0268065625908, 31636, 12914, 2600, 0, 15.781634
8192.0, 1.8235294117647058, 114.49948601973684, 473, 727.260390667352, 9728, 4805, 2635, 0, 15.507745
8192.0, 5.659689642728257, 119.24902733761047, 347, 584.7884122357259, 38811, 15683, 2771, 0, 16.953319
8192.0, 1.8302174742464707, 115.21871800122875, 377, 795.5656008226488, 9766, 4797, 2621, 0, 17.09101
8192.0, 4.687144019528072, 123.78415540810616, 480, 1111.1555752389297, 25018, 11521, 2458, 0, 16.078399
16384.0, 5.593232541396688, 121.05663044901165, 433, 615.5596105600391, 38195, 15538, 2778, 0, 16.54102
16384.0, 4.055666003976143, 116.20451985115898, 410, 513.9134660101728, 29293, 12240, 3018, 0, 18.796562
16384.0, 5.038686131386862, 119.20361693873288, 399, 586.6260625747183, 33509, 13806, 2740, 0, 16.784773
16384.0, 4.04337899543379, 117.03044349294889, 323, 537.7621689447167, 25457, 10626, 2628, 0, 15.92625
16384.0, 3.15343258891646, 110.60068669527897, 304, 355.1484924662132, 17475, 7625, 2418, 0, 16.361609
16384.0, 4.3050628829409865, 119.40069241982508, 347, 580.3504660537984, 32928, 13350, 3101, 0, 16.483952
16384.0, 4.364439324116743, 117.2828937782311, 382, 526.1042509039629, 27452, 11365, 2604, 0, 16.592912
16384.0, 2.2626886145404663, 128.95411524191715, 464, 1270.5462761859187, 13207, 6598, 2916, 0, 17.064415
16384.0, 4.833276740237691, 119.43655229741738, 399, 599.9402558308017, 34887, 14234, 2945, 0, 15.380143
16384.0, 4.457918898240245, 115.79099474222802, 294, 474.6863691139151, 28339, 11653, 2614, 0, 16.993204
