16384.0, 3.5460821539523644, 116.10377625774072, 306, 509.3400924809186, 24707, 10273, 2897, 0, 15.64616
16384.0, 2.5821561338289962, 130.089001447178, 536, 1487.4934022268312, 13820, 6946, 2690, 0, 15.589518
16384.0, 5.992595479345285, 120.69543458006123, 334, 607.0973241978941, 37565, 15377, 2566, 0, 17.481082
16384.0, 2.375296912114014, 128.54117229129662, 567, 1403.6874512653194, 14075, 7000, 2947, 0, 19.327341
16384.0, 5.2155172413793105, 119.26237936037343, 410, 576.8798396573974, 31706, 13310, 2552, 0, 16.16639
16384.0, 2.5674334686513305, 123.41023594110342, 423, 1020.7366357589551, 11274, 5692, 2217, 0, 15.724957
16384.0, 5.429378531073446, 122.67736362684536, 404, 659.4714629462578, 38204, 15376, 2832, 0, 16.654628
16384.0, 3.9179608372721133, 117.34666335191959, 334, 529.8872065442895, 28157, 11605, 2962, 0, 16.413819
16384.0, 2.9412644968200525, 125.48091979532704, 434, 1225.5074950960707, 16221, 7862, 2673, 0, 15.52996
16384.0, 5.781224489795918, 121.91166804789529, 397, 663.2562143573228, 34993, 14164, 2450, 0, 15.553872
32768.0, 3.2832154819501302, 113.9673023211018, 340, 509.15871353860587, 20766, 8822, 2687, 0, 16.778887
32768.0, 3.109926168990976, 133.7234510326449, 600, 1661.8708209644126, 15010, 7582, 2438, 0, 15.774473
32768.0, 5.566326530612245, 124.32532928614017, 398, 692.0936327683844, 36898, 15274, 2744, 0, 15.114125
32768.0, 4.381710477600889, 118.95105619218556, 391, 552.6895490397093, 28972, 11835, 2701, 0, 17.08738
32768.0, 2.1219512195121952, 119.08323292242099, 460, 925.020845345472, 10789, 5394, 2542, 0, 19.217526
32768.0, 4.439125910509886, 119.30582230020737, 351, 593.9209912092706, 31345, 12798, 2883, 0, 17.536719
32768.0, 2.492270697354861, 129.8777671494944, 494, 1478.4310236177203, 14636, 7255, 2911, 0, 19.805615
32768.0, 5.189667128987518, 124.11631325366797, 375, 673.0880916246799, 36737, 14967, 2884, 0, 17.452346
32768.0, 1.3575638506876229, 106.9300597406382, 312, 419.4521966519305, 6863, 3455, 2545, 0, 15.13355
32768.0, 3.533284023668639, 134.91983037156703, 565, 1867.9739140605693, 19808, 9554, 2704, 0, 16.110015
