<?xml version="1.0" encoding="UTF-8" standalone="no"?>
<svg
   xmlns:dc="http://purl.org/dc/elements/1.1/"
   xmlns:cc="http://creativecommons.org/ns#"
   xmlns:rdf="http://www.w3.org/1999/02/22-rdf-syntax-ns#"
   xmlns:svg="http://www.w3.org/2000/svg"
   xmlns="http://www.w3.org/2000/svg"
   xmlns:sodipodi="http://sodipodi.sourceforge.net/DTD/sodipodi-0.dtd"
   xmlns:inkscape="http://www.inkscape.org/namespaces/inkscape"
   inkscape:export-ydpi="96"
   inkscape:export-xdpi="96"
   inkscape:export-filename="X:\nuevo repositorio\Voxeroz\Assets\UI\panel jugador.png"
   sodipodi:docname="panel jugador.svg"
   inkscape:version="1.0 (4035a4fb49, 2020-05-01)"
   id="svg8"
   version="1.1"
   viewBox="0 0 210 297"
   height="297mm"
   width="210mm">
  <defs
     id="defs2" />
  <sodipodi:namedview
     inkscape:window-maximized="1"
     inkscape:window-y="-8"
     inkscape:window-x="-8"
     inkscape:window-height="1017"
     inkscape:window-width="1920"
     showgrid="false"
     inkscape:document-rotation="0"
     inkscape:current-layer="layer2"
     inkscape:document-units="mm"
     inkscape:cy="1051.1024"
     inkscape:cx="594.62751"
     inkscape:zoom="1"
     inkscape:pageshadow="2"
     inkscape:pageopacity="0.0"
     borderopacity="1.0"
     bordercolor="#666666"
     pagecolor="#ffffff"
     id="base" />
  <metadata
     id="metadata5">
    <rdf:RDF>
      <cc:Work
         rdf:about="">
        <dc:format>image/svg+xml</dc:format>
        <dc:type
           rdf:resource="http://purl.org/dc/dcmitype/StillImage" />
        <dc:title></dc:title>
      </cc:Work>
    </rdf:RDF>
  </metadata>
  <g
     id="layer1"
     inkscape:groupmode="layer"
     inkscape:label="manto">
    <rect
       ry="2.4885883"
       y="231.3159"
       x="1.0020165"
       height="64.925003"
       width="306.61444"
       id="rect833"
       style="fill:#ffeead;fill-opacity:1;stroke:#823c00;stroke-width:2.54729;stroke-linejoin:bevel;stroke-miterlimit:4;stroke-dasharray:none;stroke-opacity:1" />
  </g>
  <g
     inkscape:label="mapa"
     id="layer2"
     inkscape:groupmode="layer">
    <circle
       r="24.118565"
       cy="265.69556"
       cx="276.81503"
       id="path836"
       style="fill:#ffeead;fill-opacity:1;stroke:#823c00;stroke-width:1.92925;stroke-linejoin:bevel;stroke-miterlimit:4;stroke-dasharray:none;stroke-opacity:1" />
    <text
       id="text840"
       y="239.27339"
       x="275.02728"
       style="font-style:normal;font-weight:normal;font-size:3.95488px;line-height:1.25;font-family:sans-serif;fill:#000000;fill-opacity:1;stroke:none;stroke-width:0.0988722"
       xml:space="preserve"><tspan
         style="stroke-width:0.0988722"
         y="239.27339"
         x="275.02728"
         id="tspan838"
         sodipodi:role="line">N</tspan></text>
    <text
       xml:space="preserve"
       style="font-style:normal;font-weight:normal;font-size:3.95489px;line-height:1.25;font-family:sans-serif;fill:#000000;fill-opacity:1;stroke:none;stroke-width:0.0988721"
       x="275.36557"
       y="293.89676"
       id="text840-2"><tspan
         sodipodi:role="line"
         id="tspan838-4"
         x="275.36557"
         y="293.89676"
         style="stroke-width:0.0988721">S</tspan></text>
    <text
       id="text840-2-0"
       y="266.56909"
       x="303.30051"
       style="font-style:normal;font-weight:normal;font-size:3.95489px;line-height:1.25;font-family:sans-serif;fill:#000000;fill-opacity:1;stroke:none;stroke-width:0.0988721"
       xml:space="preserve"><tspan
         style="stroke-width:0.0988721"
         y="266.56909"
         x="303.30051"
         id="tspan838-4-8"
         sodipodi:role="line">E</tspan></text>
    <text
       xml:space="preserve"
       style="font-style:normal;font-weight:normal;font-size:3.95489px;line-height:1.25;font-family:sans-serif;fill:#000000;fill-opacity:1;stroke:none;stroke-width:0.0988721"
       x="246.95914"
       y="267.8353"
       id="text840-2-0-9"><tspan
         sodipodi:role="line"
         id="tspan838-4-8-4"
         x="246.95914"
         y="267.8353"
         style="stroke-width:0.0988721">O</tspan></text>
    <rect
       ry="3.7089028"
       y="226.33212"
       x="104.24583"
       height="9.0714283"
       width="88.257446"
       id="rect896"
       style="fill:#ffeead;fill-opacity:1;stroke:#823c00;stroke-width:2.031;stroke-linejoin:bevel;stroke-miterlimit:4;stroke-dasharray:none;stroke-opacity:1" />
    <path
       id="path900"
       d="m 58.019343,232.19077 v 64.14256"
       style="fill:none;stroke:#823c00;stroke-width:0.998513;stroke-linecap:butt;stroke-linejoin:miter;stroke-miterlimit:4;stroke-dasharray:none;stroke-opacity:1" />
    <path
       style="fill:none;stroke:#823c00;stroke-width:0.99645;stroke-linecap:butt;stroke-linejoin:miter;stroke-miterlimit:4;stroke-dasharray:none;stroke-opacity:1"
       d="m 244.96636,232.28526 v 63.87798"
       id="path900-7" />
  </g>
  <g
     inkscape:label="espacio para reinos"
     id="layer3"
     inkscape:groupmode="layer">
    <circle
       r="1.9377041"
       cy="292.5704"
       cx="63.25985"
       id="path983"
       style="fill:#e2deca;fill-opacity:1;stroke:#823c00;stroke-width:0;stroke-linejoin:bevel;stroke-miterlimit:4;stroke-dasharray:none;stroke-opacity:1" />
    <circle
       style="fill:#e2deca;fill-opacity:1;stroke:#823c00;stroke-width:0;stroke-linejoin:bevel;stroke-miterlimit:4;stroke-dasharray:none;stroke-opacity:1"
       id="path983-0"
       cx="99.634521"
       cy="268.55209"
       r="1.9377041" />
    <circle
       r="1.9377041"
       cy="244.4561"
       cx="61.421135"
       id="path983-0-8"
       style="fill:#e2deca;fill-opacity:1;stroke:#823c00;stroke-width:0;stroke-linejoin:bevel;stroke-miterlimit:4;stroke-dasharray:none;stroke-opacity:1" />
    <circle
       r="1.9377041"
       cy="268.45758"
       cx="183.11057"
       id="path983-0-9"
       style="fill:#e2deca;fill-opacity:1;stroke:#823c00;stroke-width:0;stroke-linejoin:bevel;stroke-miterlimit:4;stroke-dasharray:none;stroke-opacity:1" />
    <circle
       r="1.9377041"
       cy="292.27008"
       cx="214.29361"
       id="path983-0-1"
       style="fill:#e2deca;fill-opacity:1;stroke:#823c00;stroke-width:0;stroke-linejoin:bevel;stroke-miterlimit:4;stroke-dasharray:none;stroke-opacity:1" />
    <circle
       r="1.9377041"
       cy="244.17262"
       cx="215.12515"
       id="path983-0-85"
       style="fill:#e2deca;fill-opacity:1;stroke:#823c00;stroke-width:0;stroke-linejoin:bevel;stroke-miterlimit:4;stroke-dasharray:none;stroke-opacity:1" />
    <circle
       style="fill:#e2deca;fill-opacity:1;stroke:#823c00;stroke-width:0;stroke-linejoin:bevel;stroke-miterlimit:4;stroke-dasharray:none;stroke-opacity:1"
       id="path983-0-9-7"
       cx="139.45433"
       cy="244.45609"
       r="1.9377041" />
    <circle
       style="fill:#e2deca;fill-opacity:1;stroke:#823c00;stroke-width:0;stroke-linejoin:bevel;stroke-miterlimit:4;stroke-dasharray:none;stroke-opacity:1"
       id="path983-0-9-71"
       cx="137.9613"
       cy="292.45908"
       r="1.9377041" />
  </g>
</svg>
