<?xml version="1.0" encoding="UTF-8" standalone="no"?>
<svg
   xmlns:dc="http://purl.org/dc/elements/1.1/"
   xmlns:cc="http://creativecommons.org/ns#"
   xmlns:rdf="http://www.w3.org/1999/02/22-rdf-syntax-ns#"
   xmlns:svg="http://www.w3.org/2000/svg"
   xmlns="http://www.w3.org/2000/svg"
   xmlns:sodipodi="http://sodipodi.sourceforge.net/DTD/sodipodi-0.dtd"
   xmlns:inkscape="http://www.inkscape.org/namespaces/inkscape"
   sodipodi:docname="panel jugador.svg"
   inkscape:version="1.0 (4035a4fb49, 2020-05-01)"
   id="svg8"
   version="1.1"
   viewBox="0 0 210 297"
   height="297mm"
   width="210mm">
  <defs
     id="defs2" />
  <sodipodi:namedview
     inkscape:window-maximized="1"
     inkscape:window-y="-8"
     inkscape:window-x="-8"
     inkscape:window-height="1017"
     inkscape:window-width="1920"
     showgrid="false"
     inkscape:document-rotation="0"
     inkscape:current-layer="layer3"
     inkscape:document-units="mm"
     inkscape:cy="606.10313"
     inkscape:cx="620.23818"
     inkscape:zoom="0.7"
     inkscape:pageshadow="2"
     inkscape:pageopacity="0.0"
     borderopacity="1.0"
     bordercolor="#666666"
     pagecolor="#ffffff"
     id="base" />
  <metadata
     id="metadata5">
    <rdf:RDF>
      <cc:Work
         rdf:about="">
        <dc:format>image/svg+xml</dc:format>
        <dc:type
           rdf:resource="http://purl.org/dc/dcmitype/StillImage" />
        <dc:title></dc:title>
      </cc:Work>
    </rdf:RDF>
  </metadata>
  <g
     id="layer1"
     inkscape:groupmode="layer"
     inkscape:label="manto">
    <rect
       ry="2.3077753"
       y="236.23993"
       x="0.79523045"
       height="60.20776"
       width="210.19051"
       id="rect833"
       style="fill:#ffeead;fill-opacity:1;stroke:#823c00;stroke-width:2.031;stroke-opacity:1;stroke-miterlimit:4;stroke-dasharray:none;stroke-linejoin:bevel" />
  </g>
  <g
     inkscape:label="mapa"
     id="layer2"
     inkscape:groupmode="layer">
    <circle
       r="24.118565"
       cy="267.01849"
       cx="179.97752"
       id="path836"
       style="fill:#ffeead;fill-opacity:1;stroke:#823c00;stroke-width:1.92925;stroke-linejoin:bevel;stroke-miterlimit:4;stroke-dasharray:none;stroke-opacity:1" />
    <text
       id="text840"
       y="240.5963"
       x="178.18977"
       style="font-style:normal;font-weight:normal;font-size:3.95488px;line-height:1.25;font-family:sans-serif;fill:#000000;fill-opacity:1;stroke:none;stroke-width:0.0988722"
       xml:space="preserve"><tspan
         style="stroke-width:0.0988722"
         y="240.5963"
         x="178.18977"
         id="tspan838"
         sodipodi:role="line">N</tspan></text>
    <text
       xml:space="preserve"
       style="font-style:normal;font-weight:normal;font-size:3.95489px;line-height:1.25;font-family:sans-serif;fill:#000000;fill-opacity:1;stroke:none;stroke-width:0.0988721"
       x="178.52808"
       y="295.2197"
       id="text840-2"><tspan
         sodipodi:role="line"
         id="tspan838-4"
         x="178.52808"
         y="295.2197"
         style="stroke-width:0.0988721">S</tspan></text>
    <text
       id="text840-2-0"
       y="268.95035"
       x="150.10675"
       style="font-style:normal;font-weight:normal;font-size:3.95489px;line-height:1.25;font-family:sans-serif;fill:#000000;fill-opacity:1;stroke:none;stroke-width:0.0988721"
       xml:space="preserve"><tspan
         style="stroke-width:0.0988721"
         y="268.95035"
         x="150.10675"
         id="tspan838-4-8"
         sodipodi:role="line">E</tspan></text>
    <text
       xml:space="preserve"
       style="font-style:normal;font-weight:normal;font-size:3.95489px;line-height:1.25;font-family:sans-serif;fill:#000000;fill-opacity:1;stroke:none;stroke-width:0.0988721"
       x="206.74248"
       y="269.42282"
       id="text840-2-0-9"><tspan
         sodipodi:role="line"
         id="tspan838-4-8-4"
         x="206.74248"
         y="269.42282"
         style="stroke-width:0.0988721">O</tspan></text>
    <rect
       ry="3.7089028"
       y="231.88838"
       x="58.208332"
       height="9.0714283"
       width="88.257446"
       id="rect896"
       style="fill:#ffeead;fill-opacity:1;stroke:#823c00;stroke-width:2.031;stroke-linejoin:bevel;stroke-miterlimit:4;stroke-dasharray:none;stroke-opacity:1" />
    <path
       id="path900"
       d="m 58.019343,236.4241 v 59.90923"
       style="fill:none;stroke:#823c00;stroke-width:0.965;stroke-linecap:butt;stroke-linejoin:miter;stroke-opacity:1;stroke-miterlimit:4;stroke-dasharray:none" />
    <path
       style="fill:none;stroke:#823c00;stroke-width:0.964999;stroke-linecap:butt;stroke-linejoin:miter;stroke-miterlimit:4;stroke-dasharray:none;stroke-opacity:1"
       d="m 147.5997,236.5186 v 59.90923"
       id="path900-7" />
  </g>
  <g
     inkscape:label="espacio para reinos"
     id="layer3"
     inkscape:groupmode="layer">
    <circle
       r="1.9377041"
       cy="292.5704"
       cx="63.25985"
       id="path983"
       style="fill:#e2deca;fill-opacity:1;stroke:#823c00;stroke-width:0;stroke-linejoin:bevel;stroke-miterlimit:4;stroke-dasharray:none;stroke-opacity:1" />
    <circle
       style="fill:#e2deca;fill-opacity:1;stroke:#823c00;stroke-width:0;stroke-linejoin:bevel;stroke-miterlimit:4;stroke-dasharray:none;stroke-opacity:1"
       id="path983-0"
       cx="75.028275"
       cy="268.55209"
       r="1.9377041" />
    <circle
       r="1.9377041"
       cy="244.4561"
       cx="61.421135"
       id="path983-0-8"
       style="fill:#e2deca;fill-opacity:1;stroke:#823c00;stroke-width:0;stroke-linejoin:bevel;stroke-miterlimit:4;stroke-dasharray:none;stroke-opacity:1" />
    <circle
       r="1.9377041"
       cy="268.45758"
       cx="121.99181"
       id="path983-0-9"
       style="fill:#e2deca;fill-opacity:1;stroke:#823c00;stroke-width:0;stroke-linejoin:bevel;stroke-miterlimit:4;stroke-dasharray:none;stroke-opacity:1" />
    <circle
       r="1.9377041"
       cy="292.27008"
       cx="143.91444"
       id="path983-0-1"
       style="fill:#e2deca;fill-opacity:1;stroke:#823c00;stroke-width:0;stroke-linejoin:bevel;stroke-miterlimit:4;stroke-dasharray:none;stroke-opacity:1" />
    <circle
       r="1.9377041"
       cy="244.17262"
       cx="144.4814"
       id="path983-0-85"
       style="fill:#e2deca;fill-opacity:1;stroke:#823c00;stroke-width:0;stroke-linejoin:bevel;stroke-miterlimit:4;stroke-dasharray:none;stroke-opacity:1" />
    <circle
       style="fill:#e2deca;fill-opacity:1;stroke:#823c00;stroke-width:0;stroke-linejoin:bevel;stroke-miterlimit:4;stroke-dasharray:none;stroke-opacity:1"
       id="path983-0-9-7"
       cx="99.502235"
       cy="244.45609"
       r="1.9377041" />
    <circle
       style="fill:#e2deca;fill-opacity:1;stroke:#823c00;stroke-width:0;stroke-linejoin:bevel;stroke-miterlimit:4;stroke-dasharray:none;stroke-opacity:1"
       id="path983-0-9-71"
       cx="99.596725"
       cy="292.45908"
       r="1.9377041" />
  </g>
</svg>
