{
  "visualization_settings": {
    "graph.colors": [
      "#F1B556"
    ],
    "graph.dimensions": [
      "segnalazione.sa.regione"
    ],
    "graph.series_labels": [
      "numero di Segnalazioni"
    ],
    "graph.metrics": [
      "count"
    ]
  },
  "description": null,
  "archived": false,
  "collection_position": null,
  "result_metadata": [
    {
      "description": null,
      "semantic_type": "type/Category",
      "coercion_strategy": null,
      "name": "segnalazione.sa.regione",
      "settings": null,
      "field_ref": [
        "field",
        944,
        null
      ],
      "effective_type": "type/Text",
      "id": 944,
      "display_name": "Regione",
      "fingerprint": {
        "global": {
          "distinct-count": 7,
          "nil%": 0.7165354330708661
        },
        "type": {
          "type/Text": {
            "percent-json": 0,
            "percent-url": 0,
            "percent-email": 0,
            "percent-state": 0,
            "average-length": 3.283464566929134
          }
        }
      },
      "base_type": "type/Text"
    },
    {
      "display_name": "Conteggio",
      "semantic_type": "type/Quantity",
      "field_ref": [
        "aggregation",
        0
      ],
      "name": "count",
      "base_type": "type/BigInteger",
      "effective_type": "type/BigInteger",
      "fingerprint": {
        "global": {
          "distinct-count": 5,
          "nil%": 0
        },
        "type": {
          "type/Number": {
            "min": 1,
            "q1": 1.0851457844873238,
            "q3": 3.25,
            "max": 9,
            "sd": 2.1750331562459526,
            "avg": 2.5
          }
        }
      }
    }
  ],
  "enable_embedding": false,
  "embedding_params": null,
  "dataset_query": {
    "database": 2,
    "query": {
      "aggregation": [
        [
          "count"
        ]
      ],
      "breakout": [
        [
          "field",
          944,
          null
        ]
      ],
      "filter": [
        "and",
        [
          "=",
          [
            "field",
            915,
            null
          ],
          "Appalto"
        ],
        [
          "=",
          [
            "field",
            957,
            null
          ],
          "Carbone"
        ]
      ],
      "order-by": [
        [
          "desc",
          [
            "aggregation",
            0
          ]
        ]
      ],
      "source-table": 7
    },
    "type": "query"
  },
  "id": {
    "dev": 3,
    "stage": 8
  },
  "display": "row",
  "name": "Stazioni Appaltanti REGIONE",
  "collection_id": {
    "dev": "root",
    "stage": "root"
  }
}