{
	"deleted" : null,
	"roles" : [ ],
	"data" : {
		"nome" : "Claudio",
		"cognome" : "Biancalana",
		"ufficio" : "usiUfficioServiziInformaticiInterni",
		"obiettivi_da_compilare" : 1,
		"uffici_coinvolti" : [ "SG1", "UCOG", "UGARE" ],
		"area_strategica" : "contratti",
		"obiettivo_strategico_2" : 2,
		"obiettivo_operativo" : "obiettivo operativo",
		"grado" : "Media Significativitą",
		"rilevanza" : 2,
		"complessita" : 2,
		"descrizione_prodotto" : "descrizione dell'obiettivo",
		"calcolo_prodotto" : "metodo di calcolo",
		"target_prodotto" : 90,
		"descrizionie_efficacia" : "klj",
		"calcolo_efficacia" : "kljlkj",
		"target_efficacia" : 9998,
		"descrizione_efficienza" : "lkjlj",
		"calcolo_efficienza" : "bun",
		"target_efficienza" : 9909,
		"data_inizio" : "giugno2022",
		"data_fine" : "luglio2022",
		"responsabili" : [
			{
				"nome" : "Sorrentino Ilario",
				"qualifica" : "Dirigente"
			}
		],
		"fasi" : [
			{
				"descrizione_fase" : "ii",
				"responsabile" : {
					"nome" : "Sorrentino Ilario",
					"qualifica" : "Dirigente"
				},
				"mese_inizio" : 1,
				"mese_fine" : 1,
				"peso_fase" : 0,
				"risultati_attesi" : "ooo",
				"risorse_umane" : [
					{
						"nominativo" : {
							"nome" : "Berrocal Brigita Lily",
							"qualifica" : "Funzionario"
						},
						"categoria" : "dirigente",
						"partecipazione_fase" : 0
					},
					{
						"nominativo" : {
							"nome" : "Alonzi Claudia",
							"qualifica" : "Funzionario"
						},
						"categoria" : "funzionario",
						"partecipazione_fase" : 0.6
					},
					{
						"nominativo" : {
							"nome" : "Alonzi Claudia",
							"qualifica" : "Funzionario"
						},
						"categoria" : "funzionario",
						"partecipazione_fase" : 0.4
					}
				]
			}
		]
	},
	"access" : [ ],
	"metadata" : {
		"headers" : {
			"content-length" : "137",
			"accept" : "application/json",
			"user-agent" : "Mozilla/5.0 (Windows NT 10.0; Win64; x64) AppleWebKit/537.36 (KHTML, like Gecko) Chrome/99.0.4844.51 Safari/537.36",
			"content-type" : "application/json; charset=UTF-8",
			"origin" : "http://obiettivi-ril.apps.ocp.premaster.local",
			"referer" : "http://obiettivi-ril.apps.ocp.premaster.local/formgen/",
			"accept-encoding" : "gzip, deflate",
			"accept-language" : "it-IT,it;q=0.9,en-US;q=0.8,en;q=0.7",
			"cookie" : "32af123ce50e259fe96f7133da5c8f4d=f899503641ec6928a7bd6608b1196066",
			"host" : "obiettivi-ril.apps.ocp.premaster.local",
			"x-forwarded-host" : "obiettivi-ril.apps.ocp.premaster.local",
			"x-forwarded-port" : "80",
			"x-forwarded-proto" : "http",
			"forwarded" : "for=10.130.72.235;host=obiettivi-ril.apps.ocp.premaster.local;proto=http",
			"x-forwarded-for" : "10.130.72.235"
		},
		"selectData" : {
			"ufficio" : {
				"label" : "UWHIB - Ufficio per la Vigilanza sulle segnalazioni dei Whistleblowers"
			},
			"ufficicoinvoltinellobiettivo" : {
				"label" : "UESA - Ufficio Gestione Elenchi e Qualificazione Stazioni Appaltanti"
			},
			"area_strategica" : {
				"label" : "Contratti pubblici"
			},
			"obiettivo_strategico" : {
				"label" : "test 3"
			},
			"dataGrid[0].dataGridRisorseUmane[0].dataGridRisorseUmaneNominativo" : {
				"label" : "Vicenzo Bonetti"
			},
			"ufficicoinvoltinellobiettivo2" : {
				"label" : "UWHIB - Ufficio per la Vigilanza sulle segnalazioni dei Whistleblowers"
			},
			"area_strategica2" : {
				"label" : "test_3"
			},
			"obiettivo_strategico2" : {
				"label" : "test 3"
			},
			"dataGrid2[0].dataGridRisorseUmane2[0].nominativo" : {
				"label" : "Vicenzo Bonetti"
			},
			"uffici_coinvolti" : {
				"label" : "UGARE - Ufficio Gare e Logistica"
			},
			"data_inizio" : {
				"label" : "Giugno 2022"
			},
			"data_fine" : {
				"label" : "Luglio 2022"
			},
			"obiettivo_strategico_2" : {
				"label" : "OBIETTIVO STRATEGICO 2.2 Potenziamento della Banca Dati Nazionale dei Contratti Pubblici (BDNCP)"
			},
			"fasi[0].mese_inizio" : {
				"label" : "Dicembre 2022"
			},
			"fasi[0].mese_fine" : {
				"label" : "Dicembre 2022"
			},
			"fasi[0].risorse_umane[0].categoria" : {
				"label" : "Dirigente"
			},
			"fasi[0].risorse_umane[1].categoria" : {
				"label" : "Funzionario"
			},
			"fasi[0].risorse_umane[2].categoria" : {
				"label" : "Impiegato"
			}
		},
		"timezone" : "Europe/Rome",
		"offset" : 60,
		"origin" : "http://obiettivi-ril.apps.ocp.premaster.local",
		"referrer" : "http://obiettivi-ril.apps.ocp.premaster.local/",
		"browserName" : "Netscape",
		"userAgent" : "Mozilla/5.0 (Windows NT 10.0; Win64; x64) AppleWebKit/537.36 (KHTML, like Gecko) Chrome/99.0.4844.51 Safari/537.36",
		"pathName" : "/start",
		"onLine" : true
	},

	"__v" : 0
}