<?xml version="1.0" encoding="UTF-8"?>
<svg id="Calque_1" data-name="Calque 1" xmlns="http://www.w3.org/2000/svg" viewBox="0 0 20.91 48">
  <defs>
    <style>
      .cls-1 {
        fill: #fff;
      }

      .cls-2 {
        fill: #e84231;
      }

      .cls-3 {
        fill: #bbd6f1;
      }
    </style>
  </defs>
  <path class="cls-1" d="M14.43,27.88V3.98c0-2.2-1.78-3.98-3.98-3.98s-3.98,1.78-3.98,3.98V27.88c-3.8,1.57-6.48,5.3-6.48,9.67,0,5.77,4.68,10.45,10.45,10.45s10.45-4.68,10.45-10.45c0-4.37-2.68-8.1-6.48-9.67Z"/>
  <path class="cls-3" d="M10.45,46.09c-4.71,0-8.55-3.83-8.55-8.55,0-3.48,2.08-6.58,5.3-7.9l1.18-.49V3.98c0-1.14,.93-2.07,2.07-2.07s2.07,.93,2.07,2.07V29.16l1.18,.49c3.22,1.33,5.3,4.43,5.3,7.9,0,4.71-3.83,8.55-8.55,8.55Z"/>
  <path class="cls-2" d="M13.7,29.64l-1.18-.49V7.64h-4.13V29.16l-1.18,.49c-3.22,1.33-5.3,4.43-5.3,7.9,0,4.71,3.83,8.55,8.55,8.55s8.55-3.83,8.55-8.55c0-3.48-2.08-6.58-5.3-7.9Z"/>
  <path class="cls-1" d="M10.46,42.14c-6.45,0-1.52-7.81-1.52-7.81v1.81l1.52-3.62,1.51,3.62v-1.81s4.93,7.81-1.51,7.81Z"/>
</svg>