d6b12d87ca71220cd8c0c004159f153f9de16a35c88b1a5304bcb7e34e62deabb864850eb4ca09f92b47fbd10005635bc9fc67d9af5dbb0b5c80a050aeb05605  ../grade.sh
fab91e721f66b926fff34a0009bb0c5be85d8c1ab5ecd4e526f65b4ae1810642f0dbc1e4c109f342986d93803fe845b44a2b5363e953f01b92cd65e9709735c0  files_to_protect_with_assigner_gpg2.txt
1387d55bceb5d39346c33af481b5ffd482a42e945d2cb2bbf1348f1c13e7f7723e04089910c367c9d6aaf877f6772ea99cd047966283b7b0746191aa4f865c6d  fuzzydiffer.py
63c50d4b3e994dcc95b1cf5a971a28454ca77382c004ca725745cc7ee77121b272c1dd1ff84f5fe7b29fff2de5522a762322b0cabbcf75eea83696901f0dc753  grade_backend.sh
f8403a5dfe19943699667eba121144ec7c836ee614060e01528ea282a0f0c20d14a70289987cc6f602c05a0f618388979a53b2db7f6ef3f93f3a189e8222cf0e  hash_gen.sh
37e2cd9dd141834f7072edebb2c9ff9b55d1b8a611dea4d6920034bd6f35b75f14476de8f463c440b19ba67746d084edf5fb4e0422df70be86539aab509d6cb0  run-clang-format.py
23ac1f8379980ccf6b97ef464cb0b1f267ed564deeb854dbc1b01858f6b35c20bcf4b19b9a6854870f05081ef13f758fe69bd61f8acfeb9ff4a46d7e49612155  setup.sh
688ffa890a492edfca77917ff491bdf219492f102400c1cc9df2ab7fbdad28be747c496bd3853c07696dba8cecf5f1460c8efb44a7ef27e531832d2f0412341d  test_utils.hpp
bc98e0778b4ead7efcb072ac9ce20cec52c5a0b3392ceb4975e166a898353d554880f1fc18c05d3028de7508f4ffdb9d1f6eefc4a6739d793c525d1322976822  test_utils.py
674946a25d28ee1fbc4b20f7046a28ed09a6a9c95e56b75d278fcf9c730bfb7b080a7193c5e058619ad209f07947d48f4e14c74981f85f16c8271236d5cfeed2  ../.gitlab-ci.yml
48d49441ff9a5ebe34e70c2e804cb08095415890207fae7b99f294df254a2cfed8777c261c4d2faea99cc9ddd020b762aa8b428cb3cb032cac8f14b3623ca432  ../Cargo.toml
e7767c417ce7d9300c8e843cd274974d78f4a332ea9ffaeb1e0e73ab79773cc773bc0c06e85174b653ab705006e8911f027881799530598b59fdb2e53fc69cc3  ../tests/stdio_tests/goals/test_10_output.txt
3abb6677af34ac57c0ca5828fd94f9d886c26ce59a8ce60ecf6778079423dccff1d6f19cb655805d56098e6d38a1a710dee59523eed7511e5a9e4b8ccb3a4686  ../tests/stdio_tests/goals/test_1_output.txt
3c11e4f316c956a27655902dc1a19b925b8887d59eff791eea63edc8a05454ec594d5eb0f40ae151df87acd6e101761ecc5bb0d3b829bf3a85f5432493b22f37  ../tests/stdio_tests/inputs/test_10_input.txt
3abb6677af34ac57c0ca5828fd94f9d886c26ce59a8ce60ecf6778079423dccff1d6f19cb655805d56098e6d38a1a710dee59523eed7511e5a9e4b8ccb3a4686  ../tests/stdio_tests/inputs/test_1_input.txt
fab0b28d8f6b0765a89fd76748bf250485ddca2edd59e4098553ff5f3f43895e5f5e780dff1c0aad99dd80476cfe77da19ae4a74f1ea00e98e729875401051bb  ../tests/arg_tests/args/test_10_args.txt
4ccecbd878c7353225d489d4a8ca604bb6fc3fb869babd5f64f321e140a99667f85dc56a743f40fae8a372381f8ed36b8b3c1cca9a770158c3765bfeba5f1b2f  ../tests/arg_tests/args/test_1_args.txt
e7767c417ce7d9300c8e843cd274974d78f4a332ea9ffaeb1e0e73ab79773cc773bc0c06e85174b653ab705006e8911f027881799530598b59fdb2e53fc69cc3  ../tests/arg_tests/goals/test_10_output.txt
3abb6677af34ac57c0ca5828fd94f9d886c26ce59a8ce60ecf6778079423dccff1d6f19cb655805d56098e6d38a1a710dee59523eed7511e5a9e4b8ccb3a4686  ../tests/arg_tests/goals/test_1_output.txt
3c11e4f316c956a27655902dc1a19b925b8887d59eff791eea63edc8a05454ec594d5eb0f40ae151df87acd6e101761ecc5bb0d3b829bf3a85f5432493b22f37  ../tests/arg_tests/files/test_10_input.txt
3abb6677af34ac57c0ca5828fd94f9d886c26ce59a8ce60ecf6778079423dccff1d6f19cb655805d56098e6d38a1a710dee59523eed7511e5a9e4b8ccb3a4686  ../tests/arg_tests/files/test_1_input.txt
fa3695a188504b874355eba73dd2478f6ba2ec3f393556d633b5bb14e449872a34cfe8c8e8f27940ef506f78f55bdc25f770cc536b4f1ef37e1e0474cb1a0646  ../tests/unit_tests/unit_test_1.rs
51ec15a5bb521fdb859689928ef3b838610b90446c217a73ebd85f1fa1df7ec61ad23bcc954640658112a6e19781c318b8d681b2729845c6003bd73b4695eb38  ../tests/unit_tests/unit_test_10.rs
