954fc8f22576595c055db0cc61e90fc8904bdf027f6bc12c4c1c283dab6d26b0e51e5d76c6f0a2d3aa60fd78f543dd340baf9b4ec8d00271b887bd5501e73428  ../grade.sh
fab91e721f66b926fff34a0009bb0c5be85d8c1ab5ecd4e526f65b4ae1810642f0dbc1e4c109f342986d93803fe845b44a2b5363e953f01b92cd65e9709735c0  files_to_protect_with_assigner_gpg2.txt
1387d55bceb5d39346c33af481b5ffd482a42e945d2cb2bbf1348f1c13e7f7723e04089910c367c9d6aaf877f6772ea99cd047966283b7b0746191aa4f865c6d  fuzzydiffer.py
63c50d4b3e994dcc95b1cf5a971a28454ca77382c004ca725745cc7ee77121b272c1dd1ff84f5fe7b29fff2de5522a762322b0cabbcf75eea83696901f0dc753  grade_backend.sh
f8403a5dfe19943699667eba121144ec7c836ee614060e01528ea282a0f0c20d14a70289987cc6f602c05a0f618388979a53b2db7f6ef3f93f3a189e8222cf0e  hash_gen.sh
37e2cd9dd141834f7072edebb2c9ff9b55d1b8a611dea4d6920034bd6f35b75f14476de8f463c440b19ba67746d084edf5fb4e0422df70be86539aab509d6cb0  run-clang-format.py
23ac1f8379980ccf6b97ef464cb0b1f267ed564deeb854dbc1b01858f6b35c20bcf4b19b9a6854870f05081ef13f758fe69bd61f8acfeb9ff4a46d7e49612155  setup.sh
688ffa890a492edfca77917ff491bdf219492f102400c1cc9df2ab7fbdad28be747c496bd3853c07696dba8cecf5f1460c8efb44a7ef27e531832d2f0412341d  test_utils.hpp
bc98e0778b4ead7efcb072ac9ce20cec52c5a0b3392ceb4975e166a898353d554880f1fc18c05d3028de7508f4ffdb9d1f6eefc4a6739d793c525d1322976822  test_utils.py
674946a25d28ee1fbc4b20f7046a28ed09a6a9c95e56b75d278fcf9c730bfb7b080a7193c5e058619ad209f07947d48f4e14c74981f85f16c8271236d5cfeed2  ../.gitlab-ci.yml
52690e6790e4e3c209ea210ccbc3b036df662a0988914e268231717f45e266fcaa8303544581409eeb5a95193f8a4acea47474db287df886e001b1e13a02dd40  ../Makefile
e7767c417ce7d9300c8e843cd274974d78f4a332ea9ffaeb1e0e73ab79773cc773bc0c06e85174b653ab705006e8911f027881799530598b59fdb2e53fc69cc3  ../tests/stdio_tests/goals/test_10_output.txt
3abb6677af34ac57c0ca5828fd94f9d886c26ce59a8ce60ecf6778079423dccff1d6f19cb655805d56098e6d38a1a710dee59523eed7511e5a9e4b8ccb3a4686  ../tests/stdio_tests/goals/test_1_output.txt
3c11e4f316c956a27655902dc1a19b925b8887d59eff791eea63edc8a05454ec594d5eb0f40ae151df87acd6e101761ecc5bb0d3b829bf3a85f5432493b22f37  ../tests/stdio_tests/inputs/test_10_input.txt
3abb6677af34ac57c0ca5828fd94f9d886c26ce59a8ce60ecf6778079423dccff1d6f19cb655805d56098e6d38a1a710dee59523eed7511e5a9e4b8ccb3a4686  ../tests/stdio_tests/inputs/test_1_input.txt
fab0b28d8f6b0765a89fd76748bf250485ddca2edd59e4098553ff5f3f43895e5f5e780dff1c0aad99dd80476cfe77da19ae4a74f1ea00e98e729875401051bb  ../tests/arg_tests/args/test_10_args.txt
4ccecbd878c7353225d489d4a8ca604bb6fc3fb869babd5f64f321e140a99667f85dc56a743f40fae8a372381f8ed36b8b3c1cca9a770158c3765bfeba5f1b2f  ../tests/arg_tests/args/test_1_args.txt
e7767c417ce7d9300c8e843cd274974d78f4a332ea9ffaeb1e0e73ab79773cc773bc0c06e85174b653ab705006e8911f027881799530598b59fdb2e53fc69cc3  ../tests/arg_tests/goals/test_10_output.txt
3abb6677af34ac57c0ca5828fd94f9d886c26ce59a8ce60ecf6778079423dccff1d6f19cb655805d56098e6d38a1a710dee59523eed7511e5a9e4b8ccb3a4686  ../tests/arg_tests/goals/test_1_output.txt
3c11e4f316c956a27655902dc1a19b925b8887d59eff791eea63edc8a05454ec594d5eb0f40ae151df87acd6e101761ecc5bb0d3b829bf3a85f5432493b22f37  ../tests/arg_tests/files/test_10_input.txt
3abb6677af34ac57c0ca5828fd94f9d886c26ce59a8ce60ecf6778079423dccff1d6f19cb655805d56098e6d38a1a710dee59523eed7511e5a9e4b8ccb3a4686  ../tests/arg_tests/files/test_1_input.txt
7031c0adac584268d7c5ebb24a110355a62291aedbc3194147a2864f8cb510f555c23ee549ae4ce7065eae1dec0c1e271ca508d90ab2a0e80b466c5f8f114e64  ../tests/unit_tests/Makefile
8193f0a536fe1ceb7e579a084ebe1e0a1cf38aeee26216ba7ca9b567934171abcc653da94b708ec6e8db0a19c08fa7b410c613d796694a15914513d1a5c2732f  ../tests/unit_tests/unit_test_1.cpp
536476597c24aad5524c1ac97be3b6a9f77ed5b06ea2e6d9fcf11a99ce48145a393e8f03f049c919a401b0e66d882723cf4a32d988721864e77807430768b9cc  ../tests/unit_tests/unit_test_10.cpp
4d16569df7f2770a26f4d7de2c318dba592a937b28eaf6dbbf31cbd4d7650d8adf09dfdbcbcb4a469d0e1828d41706e365acd7bd02b0ed2aadd9c1f8fcb451a1  ../tests/unit_tests/unit_test_better.cpp_fixme
