{
  "assignee": {
    "avatar_url": "string",
    "id": "string",
    "name": "string",
    "state": "string",
    "username": "string",
    "web_url": "string"
  },
  "author": {
    "avatar_url": "string",
    "id": "string",
    "name": "string",
    "state": "string",
    "username": "string",
    "web_url": "string"
  },
  "confidential": "string",
  "created_at": "string",
  "description": "string",
  "downvotes": "string",
  "due_date": "string",
  "id": "string",
  "iid": "string",
  "labels": "string",
  "milestone": {
    "created_at": "string",
    "description": "string",
    "due_date": "string",
    "id": "string",
    "iid": "string",
    "project_id": "string",
    "start_date": "string",
    "state": "string",
    "title": "string",
    "updated_at": "string"
  },
  "project_id": "string",
  "state": "string",
  "subscribed": "string",
  "title": "string",
  "updated_at": "string",
  "upvotes": "string",
  "user_notes_count": "string",
  "web_url": "string"
}