[
  {
    "id": 1,
    "application_id": "5832fc6e14300a0d962240a8144466eef4ee93ef0d218477e55f11cf12fc3737",
    "application_name": "MyApplication",
    "callback_url": "http://redirect.uri"
  },
  {
    "id": 1,
    "application_id": "5832fc6e14300a0d962240a8144466eef4ee93ef0d218477e55f11cf12fc3737",
    "application_name": "MyApplication",
    "callback_url": "http://redirect.uri"
  },
  {
    "id": 1,
    "application_id": "5832fc6e14300a0d962240a8144466eef4ee93ef0d218477e55f11cf12fc3737",
    "application_name": "MyApplication",
    "callback_url": "http://redirect.uri"
  },
  {
    "id": 1,
    "application_id": "5832fc6e14300a0d962240a8144466eef4ee93ef0d218477e55f11cf12fc3737",
    "application_name": "MyApplication",
    "callback_url": "http://redirect.uri"
  }
]