{
  "actions": [
    {
      "name": "getV4BroadcastMessage",
      "protocol": "REST",
      "method": "GET",
      "entitypath": "{base_path}/{version}/broadcast_messages?{query}",
      "requestSchema": "schema.json",
      "responseSchema": "schema.json",
      "timeout": 0,
      "sendEmpty": false,
      "sendGetBody": false,
      "requestDatatype": "JSON",
      "responseDatatype": "JSON",
      "headers": {},
      "responseObjects": [
        {
          "type": "default",
          "key": "",
          "mockFile": "mockdatafiles/getV4BroadcastMessage-default.json"
        }
      ]
    },
    {
      "name": "postV4BroadcastMessage",
      "protocol": "REST",
      "method": "POST",
      "entitypath": "{base_path}/{version}/broadcast_messages?{query}",
      "requestSchema": "schema.json",
      "responseSchema": "schema.json",
      "timeout": 0,
      "sendEmpty": false,
      "sendGetBody": false,
      "requestDatatype": "JSON",
      "responseDatatype": "JSON",
      "headers": {},
      "responseObjects": [
        {
          "type": "default",
          "key": "",
          "mockFile": "mockdatafiles/postV4BroadcastMessage-default.json"
        }
      ]
    },
    {
      "name": "getV4BroadcastMessageId",
      "protocol": "REST",
      "method": "GET",
      "entitypath": "{base_path}/{version}/broadcast_messages/{pathv1}?{query}",
      "requestSchema": "schema.json",
      "responseSchema": "schema.json",
      "timeout": 0,
      "sendEmpty": false,
      "sendGetBody": false,
      "requestDatatype": "JSON",
      "responseDatatype": "JSON",
      "headers": {},
      "responseObjects": [
        {
          "type": "default",
          "key": "",
          "mockFile": "mockdatafiles/getV4BroadcastMessageId-default.json"
        }
      ]
    },
    {
      "name": "putV4BroadcastMessageId",
      "protocol": "REST",
      "method": "PUT",
      "entitypath": "{base_path}/{version}/broadcast_messages/{pathv1}?{query}",
      "requestSchema": "schema.json",
      "responseSchema": "schema.json",
      "timeout": 0,
      "sendEmpty": false,
      "sendGetBody": false,
      "requestDatatype": "JSON",
      "responseDatatype": "JSON",
      "headers": {},
      "responseObjects": [
        {
          "type": "default",
          "key": "",
          "mockFile": "mockdatafiles/putV4BroadcastMessageId-default.json"
        }
      ]
    },
    {
      "name": "deleteV4BroadcastMessageId",
      "protocol": "REST",
      "method": "DELETE",
      "entitypath": "{base_path}/{version}/broadcast_messages/{pathv1}?{query}",
      "requestSchema": "schema.json",
      "responseSchema": "schema.json",
      "timeout": 0,
      "sendEmpty": false,
      "sendGetBody": false,
      "requestDatatype": "JSON",
      "responseDatatype": "JSON",
      "headers": {},
      "responseObjects": [
        {
          "type": "default",
          "key": "",
          "mockFile": ""
        }
      ]
    }
  ]
}