{
  "allow_failure": "string",
  "author": {
    "avatar_url": "string",
    "id": "string",
    "name": "string",
    "state": "string",
    "username": "string",
    "web_url": "string"
  },
  "created_at": "string",
  "description": "string",
  "finished_at": "string",
  "id": "string",
  "name": "string",
  "ref": "string",
  "sha": "string",
  "started_at": "string",
  "status": "string",
  "target_url": "string"
}