[
  {
    "key": "TEST_VARIABLE_1",
    "variable_type": "env_var",
    "value": "TEST_1"
  },
  {
    "key": "TEST_VARIABLE_1",
    "variable_type": "env_var",
    "value": "TEST_1"
  },
  {
    "key": "TEST_VARIABLE_1",
    "variable_type": "env_var",
    "value": "TEST_1"
  },
  {
    "key": "TEST_VARIABLE_1",
    "variable_type": "env_var",
    "value": "TEST_1"
  }
]