{
  "actions": [
    {
      "name": "getV4Hooks",
      "protocol": "REST",
      "method": "GET",
      "entitypath": "{base_path}/{version}/hooks?{query}",
      "requestSchema": "schema.json",
      "responseSchema": "schema.json",
      "timeout": 0,
      "sendEmpty": false,
      "sendGetBody": false,
      "requestDatatype": "JSON",
      "responseDatatype": "JSON",
      "headers": {},
      "responseObjects": [
        {
          "type": "default",
          "key": "",
          "mockFile": "mockdatafiles/getV4Hooks-default.json"
        }
      ]
    },
    {
      "name": "postV4Hooks",
      "protocol": "REST",
      "method": "POST",
      "entitypath": "{base_path}/{version}/hooks?{query}",
      "requestSchema": "schema.json",
      "responseSchema": "schema.json",
      "timeout": 0,
      "sendEmpty": false,
      "sendGetBody": false,
      "requestDatatype": "JSON",
      "responseDatatype": "JSON",
      "headers": {},
      "responseObjects": [
        {
          "type": "default",
          "key": "",
          "mockFile": "mockdatafiles/postV4Hooks-default.json"
        }
      ]
    },
    {
      "name": "getV4HooksId",
      "protocol": "REST",
      "method": "GET",
      "entitypath": "{base_path}/{version}/hooks/{pathv1}?{query}",
      "requestSchema": "schema.json",
      "responseSchema": "schema.json",
      "timeout": 0,
      "sendEmpty": false,
      "sendGetBody": false,
      "requestDatatype": "JSON",
      "responseDatatype": "JSON",
      "headers": {},
      "responseObjects": [
        {
          "type": "default",
          "key": "",
          "mockFile": "mockdatafiles/getV4HooksId-default.json"
        }
      ]
    },
    {
      "name": "deleteV4HooksId",
      "protocol": "REST",
      "method": "DELETE",
      "entitypath": "{base_path}/{version}/hooks/{pathv1}?{query}",
      "requestSchema": "schema.json",
      "responseSchema": "schema.json",
      "timeout": 0,
      "sendEmpty": false,
      "sendGetBody": false,
      "requestDatatype": "JSON",
      "responseDatatype": "JSON",
      "headers": {},
      "responseObjects": [
        {
          "type": "default",
          "key": "",
          "mockFile": "mockdatafiles/deleteV4HooksId-default.json"
        }
      ]
    }
  ]
}