{
  "id": 5,
  "iid": 4,
  "group_id": 5,
  "title": "string",
  "description": "string",
  "due_date": "string",
  "start_date": "string",
  "state": "string",
  "updated_at": "string",
  "created_at": "string"
}