{
  "id": 4,
  "project_id": 10,
  "commit_message_regex": "string",
  "branch_name_regex": "string",
  "deny_delete_tag": false,
  "created_at": "string",
  "member_check": false,
  "prevent_secrets": false,
  "author_email_regex": "string",
  "file_name_regex": "string",
  "max_file_size": 10,
  "commit_committer_check": true
}