{
  "$id": "schema.json",
  "type": "object",
  "schema": "http://json-schema.org/draft-07/schema#",
  "translate": false,
  "dynamicfields": true,
  "properties": {
    "ph_request_type": {
      "type": "string",
      "description": "type of request (internal to adapter)",
      "default": "getV4TemplatesDockerfiles",
      "enum": [
        "getV4TemplatesDockerfiles",
        "getV4TemplatesGitignores",
        "getV4TemplatesGitlabCiYmls",
        "getV4TemplatesLicenses",
        "getV4TemplatesDockerfilesKey",
        "getV4TemplatesGitignoresKey",
        "getV4TemplatesGitlabCiYmlsKey",
        "getV4TemplatesLicensesKey"
      ],
      "external_name": "ph_request_type"
    }
  },
  "definitions": {}
}