....
----------------------------------------------------------------------
Ran 4 tests in 0.001s

OK
Name               Stmts   Miss Branch BrPart  Cover   Missing
--------------------------------------------------------------
Diplomacy.py          78      0     50      2    98%   17->16, 53->52
TestDiplomacy.py      27      0      2      1    97%   42->exit
--------------------------------------------------------------
TOTAL                105      0     52      3    98%
