.....
----------------------------------------------------------------------
Ran 5 tests in 0.001s

OK
Name               Stmts   Miss Branch BrPart  Cover   Missing
--------------------------------------------------------------
Diplomacy.py         108      1     92      4    98%   32->13, 57->99, 66->67, 67, 75->91
TestDiplomacy.py      29      0      0      0   100%
--------------------------------------------------------------
TOTAL                137      1     92      4    98%
