....
----------------------------------------------------------------------
Ran 4 tests in 0.001s

OK
Name               Stmts   Miss Branch BrPart  Cover   Missing
--------------------------------------------------------------
Diplomacy.py          60      3     42      3    94%   38->39, 39, 46->42, 57->58, 58-59
TestDiplomacy.py      26      0      0      0   100%
--------------------------------------------------------------
TOTAL                 86      3     42      3    95%
